##TITLE=C13_DE-78oil5_TFA
 CDCl3, 22400sc

 24.12.2024
##JCAMPDX= 6.0         $$ Bruker NMR JCAMP-DX V2.0
##DATA TYPE= NMR SPECTRUM
##DATA CLASS= NTUPLES
##ORIGIN= UXNMR, Bruker Analytische Messtechnik GmbH
##OWNER= root
$$ XWIN-NMR		Version 3.5
$$ Wed Dec 25 12:20:25 2024 Russian Standard Time (UT+4h)  she@DPX200
##.OBSERVE FREQUENCY= 50.327896
##.OBSERVE NUCLEUS= ^13C
##.ACQUISITION MODE= SIMULTANEOUS
##.ACQUISITION SCHEME= undefined
##.AVERAGES= 20801
##.DIGITISER RES= 17
##SPECTROMETER/DATA SYSTEM= spect
##.PULSE SEQUENCE= zgpg30
##.SOLVENT NAME= CDCl3
##.SHIFT REFERENCE= (INTERNAL, CDCl3, 0, 222.565)
##AUDIT TRAIL= $$ (NUMBER, WHEN, WHO, WHERE, WHAT)
$$ ##TITLE= Audit trail, XWIN-NMR		Version 3.5
$$ ##JCAMPDX= 5.01
$$ ##ORIGIN= Bruker BioSpin GmbH
$$ ##OWNER= she
$$ F:/spectra/data/she/nmr/c13/1/pdata/1/auditp.txt
$$ ##AUDIT TRAIL=  $$ (NUMBER, WHEN, WHO, WHERE, WHAT)
(   1,<2024-12-25 12:18:17.01 +0400>,<she>,<DPX200>,
      <created by zg, POWCHK disabled, PULCHK disabled
       terminated by command 'halt'
       configuration hash MD5:
       00 E9 B6 7A A2 85 ED C7 34 08 36 98 17 FE 4E 26
       data hash MD5: 32K
       A1 36 70 49 52 0D 90 21 2A 21 E0 3A 02 D2 73 0D>)
(   2,<2024-12-25 12:18:20.12 +0400>,<she>,<DPX200>,
      <Start of raw data processing
       efp BC_mod = 2 LB = 2 FT_mod = 6 PKNL = 1 PHC0 = -405.4754 PHC1 = 35.08833 SI = 32K 
       data hash MD5: 32K
       DF 89 C0 7E 0C 95 AB 30 4E 80 E6 63 D5 6B 40 3E>)
(   3,<2024-12-25 12:18:24.15 +0400>,<she>,<DPX200>,
      <abs ABSG = 5 
       data hash MD5: 32K
       A7 22 31 79 FF 92 03 47 67 7B 45 97 45 3A 88 54>)
(   4,<2024-12-25 12:19:36.79 +0400>,<she>,<DPX200>,
      <pk PHC0 = 4.37946 PHC1 = -7.2 
       data hash MD5: 32K
       3D 7C 97 D5 1D 80 A2 05 0B 57 F1 61 DA 4A 84 83>)
(   5,<2024-12-25 12:19:40.96 +0400>,<she>,<DPX200>,
      <abs ABSG = 5 
       data hash MD5: 32K
       56 F9 BA DA 75 2B 16 65 56 C7 26 5C 1F F7 52 0B>)
$$ ##END=
$$ 
$$ hash MD5
$$ 10 48 33 9A D7 E3 EA ED 17 B4 38 D3 47 8C D0 28
##$RELAX= 
##$RELAX= 
##$RELAX= 
##$RELAX= 
##$RELAX= 
##$RELAX= 
##$RELAX= 
##$RELAX= 
$$ Bruker specific parameters
$$ --------------------------
##$DU= <F:/spectra>
##$EXPNO= 1
##$NAME= <c13>
##$PROCNO= 1
##$TYPE= <nmr>
##$USER= <she>
##$AMP= (0..31)
100 100 100 100 100 100 100 100 100 100 100 100 100 100 100 100 100 100 
100 100 100 100 100 100 100 100 100 100 100 100 100 100 
##$AQSEQ= 0
##$AQ_mod= 1
##$AUNM= <au_zg>
##$AUTOPOS= <>
##$BF1= 50.322709
##$BF2= 200.13
##$BF3= 50.322709
##$BF4= 500.13
##$BF5= 500.13
##$BF6= 500.13
##$BF7= 500.13
##$BF8= 500.13
##$BYTORDA= 1
##$CFDGTYP= 0
##$CFRGTYP= 5
##$CHEMSTR= <none>
##$CNST= (0..31)
1 1 145 1 1 1 1 1 1 1 1 1 1 1 1 1 1 1 1 1 1 1 1 1 1 1 1 1 1 1 1 1 
##$CPDPRG= <waltz16>
##$CPDPRG1= <>
##$CPDPRG2= <waltz16>
##$CPDPRG3= <>
##$CPDPRG4= <mlev>
##$CPDPRG5= <mlev>
##$CPDPRG6= <mlev>
##$CPDPRG7= <mlev>
##$CPDPRG8= <mlev>
##$CPDPRGB= <>
##$CPDPRGT= <>
##$D= (0..31)
$$ [...]
##$SUBNAM4= <"">
##$SUBNAM5= <"">
##$SUBNAM6= <"">
##$SUBNAM7= <"">
##$SUBNAM8= <"">
##$SUBNAM9= <"">
##$SW= 239.972175391363
##$SWIBOX= (0..15)
0 1 3 0 0 0 0 0 0 0 0 0 0 0 0 0 
##$SW_h= 12077.2946859903
##$TD= 32768
##$TD0= 1
##$TE= 0
##$TE2= 300
##$TE3= 300
##$TEG= 300
##$TL= (0..7)
120 120 120 120 120 120 120 120 
##$TP= (0..7)
150 150 150 150 150 150 150 150 
##$TP07= 0
##$TPNAME0= <>
##$TPNAME1= <>
##$TPNAME2= <>
##$TPNAME3= <>
##$TPNAME4= <>
##$TPNAME5= <>
##$TPNAME6= <>
##$TPNAME7= <>
##$TPOAL= (0..7)
0.5 0.5 0.5 0.5 0.5 0.5 0.5 0.5 
##$TPOFFS= (0..7)
0 0 0 0 0 0 0 0 
##$TUNHIN= 0
##$TUNHOUT= 0
##$TUNXOUT= 0
##$USERA1= <user>
##$USERA2= <user>
##$USERA3= <user>
##$USERA4= <user>
##$USERA5= <user>
##$V9= 5
##$VALIST= <valist>
##$VCLIST= <CCCCCCCCCCCCCCC>
##$VD= 0
##$VDLIST= <DDDDDDDDDDDDDDD>
##$VPLIST= <PPPPPPPPPPPPPPP>
##$VTLIST= <TTTTTTTTTTTTTTT>
##$WBST= 1024
##$WBSW= 4
##$XGAIN= (0..3)
0 0 0 0 
##$XL= 0
##$YL= 0
##$YMAX_a= 99687077
##$YMIN_a= -31894295
##$ZGOPTNS= <>
##$ZL1= 120
##$ZL2= 120
##$ZL3= 120
##$ZL4= 120
##$ABSF1= 222.5654
##$ABSF2= -17.4314
##$ABSG= 5
##$ABSL= 3
##$ALPHA= 0
##$AQORDER= 0
##$ASSFAC= 0
##$ASSFACI= 0
##$ASSFACX= 0
##$ASSWID= 0
##$AUNMP= <proc_1d>
##$AZFE= 0.1
##$AZFW= 0.5
##$BCFW= 0
##$BC_mod= 2
##$BYTORDP= 0
##$COROFFS= 0
##$CY= -3
##$DATMOD= 1
##$DC= 0
##$DFILT= <>
##$DTYPP= 0
##$F1P= 0
##$F2P= 0
##$FCOR= 0.5
##$FTSIZE= 32768
##$FT_mod= 6
##$GAMMA= 0
##$GB= 0
##$INTBC= 1
##$INTSCL= 4.134877e-10
##$ISEN= 128
##$LB= 2
##$LEV0= 0
##$LPBIN= 0
##$MAXI= 10000
##$MC2= 0
##$MEAN= 0
##$ME_mod= 0
##$MI= 0.1934396
##$NCOEF= 0
##$NC_proc= 2
##$NLEV= 6
##$NOISF1= 120.0001
##$NOISF2= 80.00006
##$NSP= 0
##$NTH_PI= 0
##$NZP= 0
##$OFFSET= 222.5654
##$PC= 1.4
##$PHC0= -401.0959
##$PHC1= 27.88833
##$PH_mod= 1
##$PKNL= yes
##$PPARMOD= 0
##$PSCAL= 0
##$PSIGN= 0
##$REVERSE= no
##$SF= 50.3227345484362
##$SI= 32768
##$SIGF1= 140
##$SIGF2= 120
##$SINO= 11.81781
##$SIOLD= 32768
##$SREGLST= <13C.CDCl3>
##$SSB= 0
##$STSI= 32768
##$STSR= 0
##$SW_p= 12077.2946859903
##$SYMM= 0
##$S_DEV= 0
##$TDeff= 32768
##$TDoff= 0
##$TI= <>
##$TILT= no
##$TM1= 0
##$TM2= 0
##$TOPLEV= 0
##$USERP1= <user>
##$USERP2= <user>
##$USERP3= <user>
##$USERP4= <user>
##$USERP5= <user>
##$WDW= 1
##$XDIM= 32768
##$YMAX_p= 272044004
##$YMIN_p= -1933562
$$ End of Bruker specific parameters
$$ ---------------------------------
##NTUPLES= NMR SPECTRUM
##VAR_NAME=  FREQUENCY,     SPECTRUM/REAL,   SPECTRUM/IMAG
##SYMBOL=    X,             R,               I
##VAR_TYPE=  INDEPENDENT,   DEPENDENT,       DEPENDENT
##VAR_FORM=  AFFN,          ASDF,            ASDF
##VAR_DIM=   32768,         32768,           32768
##UNITS=     HZ,            ARBITRARY UNITS, ARBITRARY UNITS
##FACTOR=    0.368581032318806, 1,           1
##FIRST=     11200.0995020947, 0,            0
##LAST=      -877.195183895579, 0,           0
##MIN=       -877.195183895579, -1933562,    0
##MAX=       11200.0995020947, 272044004,    0
$$ Real data points
##PAGE= N=1
##DATA TABLE= (X++(R..R)), XYDATA
$$ [...]
16032I15720K23097J96830J06235L0319k1427m8475o4689j00432j07446r6040
16022A033692j17476j27634j04509q3210k3987r452l8742j2844k384o6800j44426
16011C02228j90161j87076j38716p6901n4654q6867j21136j22364p8674M344J42599
16000f07378K76558K71530J20438j124j2251K3366L6957M0421N1568N7174Q1247
15989C38506Q1493K6348o3083j48318j89374j86222j20607n7836n8177q2212p2269
15978e31751n021Q9213J57753J66091J35517P2654l2215r9103j15756j05540r4078
15967c62236q3741n3297n7158o3509J4824P8721L4895l2865l9514L1784J69256
15956c62840K64171J95819J1111r2899n2952j5991j9327k5568k9977m3134n3886
$$ y = [915720, 1138817, 1335647, 1441882, 1472201, 1450774, 1402299, 1337610, 1237178, 1129732, 1033692, 916216, 788582, 684073, 600863, 576876, 567424, 528682, 515838, 513454, 446654, 302228, 112067, -75009, -213725, -290626, -345280, -432147, -553283, -675647, -754321, -749977, -607378, -330820, -59290, 61148, 60024, 47773, 71139, 108096, 148517, 200085, 257259, 338506, 419999, 446347, 383264, 234946, 45572, -140650, -261257, -319093, -377270, -459482, -531751, -536772, -447559, -289806, -123715, 11802, 84456, 52241, -46862, -162618, -268158, -362236, -445977, -499274, -556432, -619941, -605117, -526396, -491501, -524366, -563880, -532096, -362840, -98669, 97150, 108261, 15362, -37590, -53581, -72908, -98476, -128453, -171587, -225473]
15945b25473L177P7320J10125P8678n769j07211j70547j54124j17834j12091o9714
15934f93463L2197P3339j16r0654j37581j23899o3893K0269R5332J58157K21594
15923e08718K22017J55547R7002O3837M5274L6219k1093j04433j03629l2934K0747
15912a30164K0561j9162n9144q1824r4839p5695k1702J2554J1211q861j2327J3750
15900d45642O9729J18156J39218J69334J74747Q3986n3075j21934j28171j43186
15890a36838j54827q0772P2206J56351J12437K7998j7262J349K0811p492n6761
15879f2800n6795K937L8748J6227J5502R3010J61913J33414L2367k8113j8482
15868C27928k8534k5719N2826J34925J59975Q3772n3070j43177j67904j55846
$$ y = [-225473, -222296, -144976, -34851, 43827, 38058, -69153, -239700, -393824, -511658, -623749, -693463, -661266, -587927, -588043, -678697, -816278, -940177, -1004070, -983801, -888469, -730312, -508718, -286701, -131154, -34152, 29685, 74959, 111178, 90085, -14348, -117977, -150911, -130164, -109603, -128765, -187909, -269733, -364572, -440267, -461969, -449415, -438204, -447065, -459392, -445642, -375913, -257757, -118539, 50795, 225542, 309528, 256453, 134519, 6348, -136838, -291665, -372437, -300231, -143880, -31443, -3445, -20707, -19358, 1453, -6039, -62800, -119595, -116658, -77910, -61683, -46181, 46829, 208742, 342156, 374523, 346410, 327928, 299394, 273675, 326501, 461426, 621401, 705173, 652103, 508926, 341022, 185176]
15858A85176j12085n2723k3303j9361L1K4094k5562j25565j78506j67852j58970
15847f54626j34240o1526L0318J14242Q2732o1906j48265p9210M5371R9888J04122
15836f63100J06924R8440P5506M0419R15Q510P9394J28424R4241K2937j4884P070
15824a5204L6390J2236m6630m8301K6047O0310m1748j52360j70760j13896l364
15813d57280M9434O607M62L3902J6427k501O1941J89588K70721K12043N2233q9612
15801C43965j44191p3104N777K8045P3413J18003O3134o1248j13267o6476K8346
15790B02397R3497P3307R379k2032J4363M3918J749n8299n4656l1685p0456j15704
15778H5778o5981J0215K8403J6852k6302q0650r0603l7207j3093l2454p7178j17316
$$ y = [185176, 73091, 20368, -2935, -22296, -22265, 1829, -23733, -149298, -327804, -495656, -654626, -788866, -850392, -820074, -705832, -623100, -685006, -833271, -912481, -867110, -767222, -663100, -556176, -457736, -382230, -341811, -340896, -332386, -252992, -124568, -30327, -7390, -22274, -15204, 21186, 33422, -13208, -61509, -35462, 24848, -16900, -169260, -340020, -453916, -457280, -407846, -401239, -400777, -366875, -350448, -352949, -291008, -101420, 169301, 381344, 433577, 343965, 199774, 126670, 132447, 160492, 233905, 351908, 415042, 353794, 240527, 174051, 202397, 295894, 369201, 378580, 356548, 370911, 414829, 416578, 358279, 303623, 271938, 201482, 85778, 19797, 30012, 58415, 75267, 48965, -31685, -122288, -159495, -172588, -205042, -282220, -399536]
15766c99536r4045l1262N7274R6287N5083N466k9584n3573n7538p9136j00188
15755f30752j5386J39328K31704K64706K30688J19626M723n8037p411J07865J69029
15744E56083J55466P0115k7350n9101n6426j29898k59625l44749l40261k43781
15734f79527o5194Q8972J02955O907p1752j02337r6550o3508l0556L1922O5320
15723h13348K1747K6085R1417J71177K48203K68544K36984J86393J19340M6618
15713F03160k8728q3834j31011k15140k54321j97933j30053p9172p1883j06838
15703f95753j21279j31140j60573j89636j87689r8349N9899J25766O5551M4856
15693a288347J27070J84356J18170K460j6678J4498J6320K2945o895q4418j03769
$$ y = [-399536, -493581, -524843, -467569, -371282, -316199, -310733, -340317, -393890, -451428, -530564, -630752, -646138, -506810, -275106, -10400, 220288, 339914, 344637, 286600, 279189, 387054, 556083, 711549, 781664, 754314, 695213, 638787, 508889, 249264, -95485, -435746, -679527, -744721, -655749, -552794, -545887, -617639, -719976, -816526, -880034, -910590, -878668, -813348, -791601, -765516, -674099, -502922, -254719, 13825, 250809, 437202, 556542, 603160, 574432, 490598, 359587, 144447, -109874, -307807, -437860, -517032, -588915, -695753, -817032, -948172, -1108745, -1298381, -1486070, -1584419, -1524520, -1398754, -1333203, -1288347, -1161277, -976921, -858751, -856291, -872969, -858471, -842151, -819206, -826101, -910519, -1014288]
15682a014288J4252J70949K26808J93183J43327J00731R2724J23317R2662l4181
15672A09484j48622j90815j74046j12903m9869k6241n7171r9166n9648N9121J04035
15661f45841L4165o9682j26474p6612M5866J78675K45118J98260P2595K1215R0313
15650c2402J26872J5578j01632j02897p4563n8441j6846O1557J06539R0505L6851
15639E1121n0529j20016j70781k20973k15111j26581J9601J55882K25495K07271
15629b44621J14729q49p4187p0146J2491J15121J23952O3621N2244J19357J86597
15618C98309K12284J99707J12978k2094j31748j80957j12967M243N0174K8657
15608E58586o1865j80226k55029k93893l03320k68163k10547j86464j36369L5010
$$ y = [-1014288, -1000036, -829087, -602279, -409096, -265769, -165038, -72314, 51003, 143665, 109484, -39138, -229953, -403999, -516902, -566771, -593012, -650183, -749349, -808997, -749876, -645841, -611676, -681358, -807832, -884444, -838578, -659903, -414785, -216525, -143930, -122715, -32402, 94470, 110048, 8416, -94481, -169044, -227485, -244331, -182774, -76235, 14270, 51121, 592, -119424, -290205, -511178, -726289, -852870, -833269, -677387, -451892, -244621, -129892, -130741, -204928, -275074, -262583, -147462, -23510, 40111, 92355, 211712, 398309, 610593, 810300, 923278, 901184, 769436, 588479, 475512, 479755, 529929, 558586, 496721, 316495, 61466, -232427, -535747, -803910, -1014457, -1200921, -1337290, -1302280]
15598a302280K45261L12662K22455J46014J64548J53653M6290n1507j22884j71003
15588c56791j35319n1286K7836O6972P6257P7233J4311p0704o4613L9323J62352
15577b14429K31171J86030O9939m5157j27637j47743j30333q4290J9197J19644
15567a23608J53138J26563Q4824J8523m7437m2534j2040q558l6730o4453r3442
15556d5754j19963q8777L5956J90406K74209K37573J29937J2669q7282j63133
15546C75841k41640k07537l0695J60237K22319J26613K2786k8600o3710j03105
15536B32509j38329j49304j29111p8348m1416j5498M7915J08751R0205K02j35311
15525b07735k38334k06339l2109J15442J69944K06167J74736J03255O8160K9713
$$ y = [-1302280, -1057019, -744357, -521902, -375888, -211340, -57687, -11397, -62904, -185788, -356791, -492110, -543396, -515560, -448588, -372331, -295098, -280787, -351491, -416104, -376781, -214429, 16742, 202772, 272711, 227554, 99917, -47826, -178159, -262449, -243252, -123608, 29530, 156093, 240917, 259440, 212003, 169469, 157429, 148871, 112141, 47688, -45754, -165717, -254494, -218538, -28132, 246077, 483650, 613587, 626256, 538974, 375841, 134201, -73336, -104031, 56206, 278525, 405138, 427924, 399324, 335614, 232509, 94180, -55124, -184235, -262583, -303999, -319497, -271582, -162831, -72626, -72424, -207735, -446069, -652408, -684517, -569075, -399131, -192964, -18228, 85027, 153187, 182900]
15515A82900J2538N2400P9376K1989k3613M2926J36935J62051K05169L17605L92685
15504A582961M06407L69130K55605J48714J19273J19559J11750L5377j07421k03271
15494B838084k40250k38332k31833k26631k29062k34368j99153j21084m2427j6170
15484A058774l2023l7898o1811j28932j46415p2961l5038j16278k15870k18550
15474g002j44954o6366k2165J4759L6761L7318Q2281J30656J56734J99462K10180
15463F27664J49733M3775q9620j84430j86020j38937o2357N1177J13435N1877
15453C76297m3932j06655j04705l6261Q420k6204j11952j58374j03593J7146J27851
15442a61962J95416K08521J97032J78865J58840J16554K4951j21917k77707l32368
$$ y = [182900, 195438, 247838, 327214, 349203, 325590, 368516, 505451, 667502, 872671, 1190276, 1582961, 1989368, 2358498, 2614103, 2762817, 2882090, 3001649, 3113399, 3148776, 3041355, 2838084, 2597834, 2359502, 2127669, 1901038, 1671976, 1437608, 1238455, 1117371, 1074944, 1058774, 1026751, 988853, 927042, 798110, 651695, 578734, 543696, 427418, 211548, -7002, -151956, -218322, -240487, -225728, -188967, -151649, -69368, 61288, 218022, 417484, 627664, 777397, 821172, 731552, 547122, 361102, 222165, 159808, 210985, 324420, 376297, 332365, 225710, 121005, 84744, 93164, 66960, -44992, -203366, -306959, -289813, -161962, 33454, 241975, 439007, 617872, 776712, 893266, 918217, 796300, 518593, 186225]
15432A86225k45135r5551J0670O0285P9551M6212l3521q9287o6909k3969m6528
15421b17957j09678j82786k14568j81363r3519K3757Q1875Q7321Q4009P8279J7622
15410f27008o4346m6582M1233Q6434M2676j2674o2009j15812j39768j27187n6730
15399a081773P5194J87361K30139K05956J57927J40372R7189n0231j69798j36249
15389c43913l1236J7128r957k5500L1863J53409J78070L6112p3855m0668j6914
15378a25461n6077o3250n1545n1126K894J11742K23015K44986J77233J43376J46687
15367G02474Q2335k4144q5398j05008j03591q6060r3025j21685j31127j13275
15357g8504r4958j29126j66717j59670j41017j04754J9791J78463K68001K67729
$$ y = [186225, -58910, -154461, -143791, -83506, -3955, 42257, 8736, -80551, -147460, -171429, -217957, -327635, -510421, -724989, -906352, -999871, -976114, -894239, -806918, -722909, -644630, -627008, -691354, -737936, -696703, -610269, -567593, -580267, -642276, -758088, -897856, -1025043, -1081773, -1006579, -819218, -589079, -383123, -225196, -84824, 12365, -37866, -207664, -343913, -375149, -358021, -367978, -393478, -361615, -208206, -30136, 5976, -67879, -108547, -125461, -181538, -244788, -296333, -347459, -344565, -232823, -9808, 235178, 412411, 555787, 702474, 784809, 760665, 675267, 570259, 466668, 380608, 287583, 165898, 34771, -78504, -173462, -302588, -469305, -628975, -769992, -874746, -854955, -676492, -408491, -140762]
15347a40762J73752L3004k3471L6034J10317P7438o5900j46893r8066J7610J34147
15336A07210J75058J72299J46619N7233p9901j87103k17470j63695m8254J2622
15326b5382L0052P0422Q3020O6845Q0571P8930M0929L3202N3039Q0168P2918n157
15314F59557j12087j13902m5372p1581j34009j37995o1110O4249J46728J33280
15304C27758O6731m7205k25415l16915k38338q8703M5726J20999J03985j5351
15294b66728j03382n7896K179j2082P089M2458o045j08528r9299M4450J19476
15283d38308M7583J7314N9568P3130N2611J0973j3980k4143p6087j59602j69175
15272f20116p6370M4900N8998l0442o9296l2609j4414m8571r0959k8347J03936
$$ y = [-140762, 32990, 65994, 42523, 78557, 188874, 266312, 200412, 53519, -44547, -26937, 107210, 282268, 454567, 601186, 658419, 578518, 391415, 173945, 10250, -38004, -25382, 4670, 75092, 158112, 224957, 305528, 384458, 425387, 458589, 511628, 591796, 664714, 659557, 547470, 433568, 388196, 316615, 182606, 44611, -16499, 47750, 194478, 327758, 394489, 347284, 121869, -195046, -433384, -522087, -476361, -355362, -251377, -266728, -370110, -428006, -425827, -437909, -430820, -388362, -394407, -502935, -602234, -557784, -438308, -390725, -373411, -313843, -240713, -188102, -177129, -191109, -215252, -291339, -450941, -620116, -696486, -651586, -592588, -623030, -692326, -724935, -739349, -787920, -878879, -907226, -803290]
15261h03290J66290J67050J33087Q1292K1468p0518j75323k01950j62164j18803
15251i62861j8917J44830K58431K85440K34809J11871j7468r8723j08166p8967
15241b49721l3700q761l9437n5661j1914L5165K7237n785m2573p0993p4583M97
15229e30229J04993J46662J08595O815p5046j24568j66658j25715m6019l1532
15219g32702l9965j1275K9974M2919K1562j9636k4753l583N2554J11828R5450
15208d77627K4206k9856m1386k8576m1723q7903j05132p6371m8707l2301j7240
15197i62616p317J0216K4336M8750R7855J40057J64151J74537J50142J05297N9677
15186E085r954p9373o0782N2899J62109J42303j8496j45317j63472j36442p3313
$$ y = [-803290, -637000, -469950, -336863, -255571, -234103, -304621, -479944, -681894, -844058, -962861, -981778, -836948, -578517, -293077, -58268, 53603, 36135, -62588, -170754, -249721, -283421, -292182, -331619, -387280, -399194, -364029, -336792, -342577, -385150, -456143, -530726, -530229, -425236, -278574, -169979, -163164, -238210, -362778, -529436, -655151, -701170, -732702, -772667, -783942, -753968, -711049, -689487, -709123, -733876, -737459, -684905, -573077, -477627, -453421, -483277, -524663, -553239, -594962, -682865, -787997, -864368, -913075, -945376, -962616, -969933, -959717, -935381, -886631, -788776, -648719, -484568, -310031, -159889, -54592, 5085, -4869, -84242, -145024, -92125, 69984, 212287, 193791, 48474, -114998, -251440, -324753]
15175c24753J927N0254J18707J75165J40428O3927k4400q5993q3900p9601j60313
15164b08552k30754j67756p1527O73M2395L6167R452r86J8078M5910L3301L7710
15152d55889R5759J35864J51227J62769J70961J72457J28602P2594K8614m9330
15142F13628j33155j54674j04088m814O5061Q6325P4143N7458J1284r4088k01073
15131B16007k53889k70244k58609j79428o3614J6532L4639K2216J3611L1735P6101
15120f14943J32333J38856P6007L2737M2614P0044L7538o5562j03455l5576K2692
15109b66715p51n0693m0501M1979R8725O4703l0575j09670p1251O9275J78655
15098a16819J56705M9830k1949M544O1825N0600Q290K5547P5096J00466O4255
$$ y = [-324753, -322826, -272572, -153865, 21300, 161728, 225655, 201255, 115262, 31362, -48239, -208552, -439306, -607062, -678589, -677916, -635521, -599354, -589902, -590888, -572810, -526900, -493599, -455889, -360130, -224266, -73039, 89730, 260691, 433148, 561750, 634344, 662958, 613628, 480473, 325799, 221711, 216897, 281958, 368283, 442426, 499884, 511168, 417080, 216007, -37882, -308126, -566735, -746163, -809777, -793245, -758606, -736390, -722779, -691044, -614943, -482610, -343754, -267747, -235010, -192396, -122352, -84814, -150376, -253831, -289407, -266715, -267466, -318159, -358660, -316681, -217956, -153253, -183828, -293498, -364749, -295474, -116819, 39886, 89716, 67767, 72311, 134136, 184736, 193026, 218573, 293669, 394135, 458390]
15087D58390o8813k27131l26438k99310j54019K0733R2578Q3784J13556J70793
15077a35877J77161J35551P5043J3015m0573q9505j31042k04620k94438l06569
15067h01854j80474J2633J26505J30830N5318J6401O7380J06469J04365J12378
15057b50049P1019m9333j61913j64898p0497L9518Q9418N1406m4849q9848j7153
15046e97179R8180J35493K0066q3841j0594J11824J52144R2754o396r0952j67073
15035c45574j85733j08371j8940J7418M1991R0800R1063K1676m927N4523J12505
15024b33569P2626q532n8996m2287J2451M7008J9667n9238j05471k0502J10019
15013b66824J60384J23362L755j17591j34080o4607J9566R7665J67203J89747
$$ y = [458390, 389577, 162446, -163992, -463302, -617321, -596588, -504010, -420226, -306670, -135877, 41284, 176835, 251878, 264893, 224320, 134815, 3773, -200847, -495285, -801854, -982328, -969695, -843190, -712360, -657042, -640641, -573261, -466792, -362427, -250049, -179030, -228363, -390276, -555174, -625671, -586153, -496735, -445329, -490178, -580026, -597179, -498999, -363506, -343440, -427281, -437875, -326051, -173907, -81153, -87549, -178501, -345574, -531307, -639678, -658618, -641200, -599209, -508409, -417346, -395670, -400597, -346074, -233569, -160943, -169475, -228471, -270758, -258307, -211299, -191632, -250870, -356341, -376843, -266824, -106440, 16922, 20677, -96914, -230994, -295601, -276035, -178370, -11167, 178580]
15003A78580J32646J8221j08176j83100j65196j14637n5162j2613k5720p0801
14993d05958o8044N2494J51003J17806O0427N4689R0798J40899J79032J39973
14983E13119M9244l17Q993P581l4153r4072j74589k01374j13471k2411J1259J3484
14971c6707N6307J00355K0572j03790j79663k01165j45173k0967J50044K79513
14961h0674K41768J26619K2519q3645j44792j40241r3796l9720j9333L1958J34173
14950d5164J77792J16268J480j04097j53767j76073j54104n7853L0452L7441P738
14939c19887K9839N2813K5609j9365p5968j11493m7458P5625Q6379k7356j03269
14928d34531p8136q43M1333K4840N682k782J9724J05556J79021J59536J06207
$$ y = [178580, 311226, 329447, 221271, 38171, -127025, -241662, -296824, -309437, -335157, -405958, -474002, -421508, -270505, -152699, -92272, -37583, 53215, 194114, 373146, 513119, 562363, 562046, 571039, 578620, 544467, 450395, 275806, 74432, -39039, -61450, -50191, -36707, 19600, 119955, 140527, 36737, -142926, -344091, -489264, -510231, -360187, -80674, 161094, 287713, 310232, 226587, 81795, -58446, -152242, -191962, -211295, -179337, -45164, 132628, 248896, 250376, 146279, -7488, -183561, -337665, -395518, -365066, -327625, -319887, -290048, -237235, -211626, -230991, -306959, -418452, -465910, -390285, -303906, -331262, -434531, -512667, -513510, -472177, -447337, -441655, -444437, -424713, -319157, -140136, 19400, 125607]
14917A25607J25785J11368m470r9751j13523p9516q1332j67512k60793k45577
14907f89714j54751p3155j5452O7853J82295K83832K49852J03179j1841p2052
14897a29954r1469n4459O74L3136K9992K782k4225o9986q3084n4109k0061N834
14885d54929L8462L5820J4829J02777K06661J45425n86n8197l0093j1337j2059
14874b3227R060r754q9169j48185j14323K8390J45426J14914K73l5243l663m4220
14862a69721j26178j01229O5903J98804J54938M061j17293j16217k2426P1385
14852a57973J29147J50186J11505J1246j08987j64897j23808o0098P451R3468
14842a12760J61101J74902Q4808m1055n1164L5588N6204j9343j01100j66503j58581
$$ y = [125607, 251392, 362760, 358290, 258539, 145016, 65500, -15832, -183344, -444137, -689714, -844465, -917620, -933072, -865219, -682924, -399092, -149240, -46061, -57902, -129954, -221423, -275882, -275208, -242072, -212080, -209298, -233523, -303509, -386593, -440702, -460763, -454929, -416467, -380647, -365818, -263041, -56380, 89045, 88459, 30262, 169, -11168, -23227, -14167, -23921, -113090, -261275, -375598, -347208, -201782, -86868, -86595, -121838, -125501, -169721, -295899, -397128, -331225, -132421, 22517, 26578, -90715, -206932, -229358, -157973, -28826, 121360, 232865, 244111, 135124, -29773, -153581, -213679, -206228, -112760, 48341, 223243, 308051, 266996, 215832, 251420, 307624, 288281, 187181, 20678, -137903]
14831a37903o4080K9175Q0831J20660J29830P8446l2495j68053k50746k43882
14821d58217j48781n9704m4220l2158L5448J16772J72611J83092J48069N9943
14811b7145n4865j27172j15890p3680j04792j13536l3233Q0966J24963M6955p065
14800d04494L5205P5364N6437Q33n9618j00321o6200K3962N8524J6009n2407r3535
14788e10241l6187J52926L35875L49734K63854J72455N5155n9644j00853r3213
14778E29861q7000o0997j9709l7339j15024j40544p3562J9645P2054M8768n3412
14767H2741j23357j16254j19048j52490j81737j34851n0044l8045n8108l3278
14757i24471M0653J01479J02650L8465J5785P7964J68608J78181J07472P2096
$$ y = [-137903, -201983, -172808, -91977, 28683, 158513, 236959, 204464, 36411, -214335, -458217, -606998, -666702, -710922, -743080, -707632, -590860, -418249, -235157, -87088, -27145, -82010, -209182, -325072, -398752, -503544, -617080, -650313, -569347, -444384, -397429, -404494, -369289, -293925, -237488, -236655, -296273, -396594, -462794, -438832, -380308, -364299, -416706, -510241, -546428, -393502, -57627, 292107, 555961, 728416, 783571, 723927, 623074, 529861, 442861, 381864, 362155, 324816, 209792, 69248, -4314, 15331, 87385, 136153, 82741, -40616, -156870, -275918, -428408, -610145, -744996, -795040, -833085, -891193, -924471, -883818, -782339, -679689, -641224, -625439, -547475, -378867, -200686, -93214, -21118]
14747b1118P0332L6821m9585j18623j46119j14019k4262L6507p264o8193n5387
14736d60910k5263j7797N5607J78703J96519L6791j56944k07007j18535m6234
14726e65070n2143o1611p2286n4939O1285J80081J29078K301j1822O9155J79745
14715a96226K48799J87631P2874j3586p0001n4593M4719J43964J70137J37278
14705F70996M8126p5081j81699k53087k49760j34753L2000J38576J40382R2470
14695B28170L7496m7146j22340r9499j8119n199n4125k0961J39840K91485L09012
14684F38614J76077k7682j59530j84516j77682j82684j73292j44444n5165K8891
14674b61413n0574j95065k39109j71511n5916P997l6848p7816j0316Q8493J78395
$$ y = [-21118, 49214, 86035, 36450, -82173, -228292, -342311, -366573, -330066, -337330, -405523, -460910, -486173, -503970, -448363, -269660, -73141, -36350, -193294, -400301, -518836, -565070, -617213, -678824, -751110, -806049, -744764, -564683, -435605, -433304, -445126, -375971, -196226, 52573, 240204, 313078, 299492, 229491, 174898, 219617, 363581, 533718, 670996, 719122, 644041, 462342, 209255, -40505, -175258, -143258, -4682, 135700, 228170, 265666, 218520, 96180, -3319, -21438, -26637, -80762, -101723, 38117, 329602, 638614, 814691, 787009, 627479, 442963, 265281, 82597, -90695, -235139, -290304, -261413, -311987, -507052, -746161, -917672, -973588, -965591, -1002439, -1080255, -1090571, -1002078, -823683]
14663h23683K21070J45525l231j17176j06418M3848J76531J74369J31891J00772
14653e6502K8760m9267n1254j9460m0128n2655k5792l9710j02510j15044n8321
14642e81883j7182K0227R6926Q3461p1485j90075j71557j25591q7736K0832J62991
14631h61072J84824N1869m9938j2330Q3146J47922J58667J02372J2839n0272q0141
14620c12114n3652J3573K8709l5600j11364j19600k3389R4113K08531L20838L36687
14609C46732K57932J64023O1124n5182j28381j42144j66089k14328k40771k54859
14599c71943k39745k08780j12805Q4420K42165K93356K60089J23389l4183r9830
14589f3867r6912q2429l1711N3883J00919N8527o817n7154j10325j10699o2083
$$ y = [-823683, -602613, -457088, -460319, -577495, -683913, -640065, -463534, -289165, -157274, -56502, -27742, -77009, -128263, -147723, -187851, -240506, -266298, -306008, -408518, -523562, -581883, -599065, -578838, -481912, -398451, -469936, -660011, -831568, -957159, -1044895, -1024063, -861072, -676248, -624379, -674317, -686647, -603501, -455579, -296912, -194540, -181701, -231973, -312114, -365766, -352193, -323484, -359084, -470448, -590048, -613437, -519324, -310793, 10045, 346732, 604664, 768687, 829811, 774629, 646248, 504104, 338015, 123687, -117084, -371943, -611688, -820468, -933273, -848853, -606688, -313332, -53243, 70146, 35963, -63867, -160779, -243208, -274919, -221036, -120117, -61590, -68407, -125561, -235886, -346585, -408668]
14578d08668m9187j21961k15455j83059k4606J18693J55805J23375R1514L3075
14568d80474J2914J27594K55340K61602J53678L4968j8371j6682l015P835L1276
14557C66665P0326J30476J92736J95686J39682O6132N049n3041j18128j04377
14547H91206k9314m1406j30881j75554j24721q4927j14391j52237j39785p8347
14537a80357p1809j40730j77275j60116j17059n9358r901L8513P2240P9606J10926
14526f15320J33924Q0994K7771N8650J16010J33082J18376J21706J16645P0903
14516C62741O493j04976k08888k21916j91259j38282k8342J13300K14277J66657
14506c0195J5758q6460q0847J4962J36551J78776J27026M1295m2361j46469k06453
$$ y = [-408668, -457855, -579816, -795271, -978330, -1002936, -884243, -728438, -605063, -513549, -480474, -467560, -339966, -84626, 176976, 330654, 365622, 347251, 330569, 327554, 335389, 366665, 436991, 567467, 760203, 955889, 1095571, 1161703, 1166752, 1113711, 995583, 891206, 861892, 820486, 689605, 514051, 389330, 304403, 190012, 37775, -102010, -180357, -252166, -392896, -570171, -730287, -847346, -906704, -916605, -878092, -805852, -726246, -615320, -481396, -400402, -372631, -313981, -197971, -64889, 53487, 175193, 291838, 362741, 369234, 264258, 55370, -166546, -357805, -496087, -524429, -411129, -196852, -30195, -14437, -100897, -181744, -166782, -30231, 148545, 275571, 316866, 274505, 128036, -78417]
14495g8417j57488l1707M2738J6115j368K3392N7063R1311N8871n0972r3003J9796
14483a03669J68286J52950r914r7550o2669k2475j2930j7592m0686n7442m2217
14472a45908l4532n1122q2848j16125j06971k2622Q2886J12465R0987Q2573J7436
14461a73781j11528j20760N4843J77667J53604J02425M1141p5659k01073k20359
14451c73480j65246q5113N4122K16013K30130J09565L4480j1934r2549j71269
14441b55281j26480N662M8414K0780K3664K4096j7480o2652n4141K369P3289J11425
14429b06335N4049l0865p5557j28049j64056j16056k2429O1580J11163Q8382N6425
14418c71748P8314Q2890K9995K6931J41641K05113R7896m1875r2273j26124j47908
$$ y = [-78417, -235905, -267612, -224874, -208759, -210127, -186735, -129672, -38361, 20510, -30462, -123465, -103669, 64617, 217567, 207653, 110103, 47434, 24959, 12029, -5563, -46249, -103691, -145908, -180440, -231562, -314410, -430535, -537506, -560128, -477242, -364777, -273790, -191217, -173781, -285309, -406069, -351226, -173559, -19955, 82470, 123611, 47952, -153121, -373480, -538726, -623839, -569717, -353704, -123574, -14009, 20471, 8537, -84012, -255281, -381761, -376099, -327685, -306905, -283241, -259145, -276625, -339277, -393418, -391049, -317760, -206335, -152286, -183151, -258708, -386757, -550813, -666869, -689298, -627718, -516555, -428173, -371748, -293434, -210544, -180549, -153618, -11977, 193136, 291032, 249157, 156884, 30760, -117148]
14407a17148j21910r7941j23086k01244l20304l58209k15540q542J15947J54917
14397a293060J75576J94058K05307J80445J55308J50671Q6643o5752j67137j19935
14387d97876r093L7491P2410J23039J21865O1445m9892j65402j82943q5573j1855
14376e86384k9879k2107P185M9231J03201J12536Q8915N5049k06m5848n4444p7796
14364d00547j55833k39510j84277K1116J47076Q9532K0298K3052L4008J1288j6136
14353f49933l7134l1140j1533r662N224N0969J12323R6076l7390j55808j45599
14342h13607o6955m2185q542J21669K12209K09765J66495J06678N8571M4335P9004
14331F7437Q5830M9437R3003J69992P8318r1601j74140k06443j44269L7943J27923
$$ y = [-117148, -239058, -336999, -460085, -661329, -981633, -1339842, -1555382, -1563924, -1447977, -1293060, -1117484, -923426, -718119, -537674, -382366, -231695, -145052, -210804, -377941, -497876, -506969, -469478, -397068, -274029, -152164, -90719, -140611, -306013, -488956, -574529, -586384, -616263, -638370, -631185, -581954, -478753, -366217, -277302, -222253, -222459, -268307, -322751, -400547, -556380, -795890, -980167, -959051, -811975, -722443, -702145, -679093, -645085, -633797, -649933, -687067, -718207, -729740, -739402, -734178, -683209, -570886, -474810, -512200, -668008, -813607, -880562, -922747, -931289, -809620, -597411, -387646, -221151, -114473, -55902, -11567, 67437, 153267, 202704, 295707, 465699, 544017, 452416, 278276, 71833, -72436, -34493, 93430]
14320I3430N3676k2059n7840j09369j71585j66326r1439j2737N5225J28175J49195
14309a51654J03588K9419o2333j10278j13843r2263k6514M6339Q0017J11147J83212
14298c163J89443Q7615P867K3823L5741m4305j25712j35218j10229o4338l937
14287a42413k5836j01799j23910j22652j28836n8002P5620J84965K12460J08428
14277a21975n0191j00981m5069L7842J33043J22894k0247j50019j92649j78826
14267e66178j63829j69233j68285j16544k6630N9167Q8734J1213o5218l5631L847
14256a148587P200M0141M9288J5788j3967l5772l0773k2325o7661q4204j885J00584
14244a192173K08671L00863K93589K20416J74903J36668M8116o5059j61024k08258
$$ y = [93430, 147106, 125047, 67207, -42162, -213747, -380073, -471512, -484249, -429024, -300849, -151654, -48066, -18647, -80980, -191258, -305101, -397364, -423878, -377539, -297522, -186375, -3163, 186280, 273895, 281762, 305585, 341326, 297021, 171309, 36091, -74138, -138476, -142413, -168249, -270048, -393958, -516610, -645446, -703448, -627828, -442863, -230403, -121975, -172166, -273147, -318216, -280374, -147331, -24437, -44684, -194703, -387352, -566178, -730007, -899240, -1067525, -1184069, -1210699, -1151532, -1062798, -1051585, -1116803, -1152434, -1148587, -1141387, -1101246, -1051958, -1036170, -1050137, -1085909, -1116682, -1139007, -1206668, -1290872, -1292757, -1192173, -983502, -682639, -389050, -168634, 6269, 142937, 191053, 125994, -35030, -243288]
14234b43288k01629j58801o3588L4611R9929J17795M6753o4457j35216j60319
14224g28210j76905j64442o3245R7605K09863K33581J61901L0925m9285n3179
14214e01391n125O9844J40605J10765k5117j12791o2310K3940O7613Q6128N8864
14203a48975k2975p1488n8543q966M2494O4943O2749M6121K9268M3359O8712J6767
14191F3466p6480r2295m985Q7654J08142Q3344K0756k0460l8969p0999m7960n713
14179E501j3200k3683m5373o1675k2703L1253J17909K03004J82361J04322M4338
14168E22054k7449j24837k22788k12340j13355l6909O402k142o6480j15370j29909
14157e23123j39817j60100j63445q2735N9751J71044J78509J42015J62774K01262
$$ y = [-243288, -444917, -603718, -667306, -632695, -532766, -414971, -368218, -432675, -567891, -728210, -905115, -1069557, -1132802, -1035197, -825334, -591753, -429852, -398927, -448212, -501391, -506516, -436672, -296067, -185302, -210419, -323210, -385520, -361580, -293967, -207839, -148975, -171950, -243438, -301981, -310947, -268453, -203510, -140761, -94640, -65372, -22013, 46699, 63466, -13014, -105309, -110294, -22640, 85502, 168846, 189602, 169142, 130173, 59174, 11214, 5501, -7699, -31382, -76755, -138430, -161133, -129880, -11971, 191033, 373394, 477716, 522054, 494605, 369768, 146980, -65360, -178715, -215624, -209222, -211364, -277844, -393214, -523123, -662940, -823040, -986485, -1069220, -1009469, -838425, -659916, -517901, -355127, -153865]
14147a53865K04680J55497R1778M6096r777p0862r8728p7591Q879J18070J81837
14136C96014K09147J69933M2866n4114q5174j13753j45922k10355k77042k45455
14126c13855j62364j28742j04896m6020J0094N7609Q9899J12771J01162K9589
14116c54753o7026j18426q3495m734K6904j9491l5676k826Q037J402q427O4420
14104e94091J84784K32322J91826Q8088o1965k13348k66853k02705j30326q1189
14094h53457j234R030l3228k7353p730O1421J65379J97172J57060J25745J12882
14083i4313J11121J19501J31285J11158M3431n370k9022l6827o3436j13355j30086
14072D4087j06764o9590n1927k7285R380R885j0223J6483P3559J02771Q8966M3599
$$ y = [-153865, 50815, 206312, 298090, 344186, 334409, 263547, 164819, 87228, 96107, 214177, 396014, 605161, 775094, 817960, 763846, 678672, 564919, 418997, 208642, -68400, -313855, -476219, -604961, -709857, -755877, -745783, -688174, -598275, -485504, -384342, -354753, -421779, -540205, -623700, -628434, -601530, -621021, -656697, -659523, -651486, -650084, -658511, -594091, -409307, -176985, 14841, 102929, 40964, -172384, -439237, -641942, -772268, -853457, -854691, -845661, -878889, -906242, -913972, -852551, -687172, -490000, -332940, -207195, -94313, 16808, 136309, 267594, 378752, 422183, 416813, 387791, 350964, 287528, 174173, 44087, -62677, -132267, -184194, -211479, -202099, -192214, -202437, -185954, -112395, -9624, 79342, 122941]
14060A22941m777n4761r4106j10412q4704j2061J07266J74610J25434N7921R9153
14049C26504J82408J96669J75093J54580J14459O19j81556l18403l47331k98762
14039D280k05139j10454n1933r864j1242m8855n2439j7505m830p696j7181l6150
14027e69008J7475J19076J39048Q6844N7189R4121J45516J28728Q9727J14092
14017D22808J40553Q5532m2421j76728k95231l15939k41781j89960j53098o7227
14007h33492L035j6951n9247q0113o4599M7529J80656K55134K80188K11962J06857
13996C0959O6602L2574O771L0569L6115Q116l2271o0022p4115r2147r7381q0191
13984b24421o8373j10012j43606o7942N9239J10081Q7714O9513N8117P1049Q6598
$$ y = [122941, 118164, 63403, -30703, -141115, -225819, -237880, -130614, 43996, 169430, 227351, 326504, 508912, 705581, 880674, 1035254, 1149713, 1150332, 968776, 650373, 303042, 4280, -200859, -311313, -363246, -373110, -384352, -433207, -485646, -503151, -507981, -515677, -532858, -569008, -551533, -432457, -293409, -206565, -149376, -55255, 90261, 218989, 308716, 422808, 563361, 648893, 606472, 429744, 134513, -181426, -423207, -613167, -766265, -833492, -830457, -847408, -906655, -986768, -1051367, -1003838, -823182, -568048, -287860, -75898, 30959, 97561, 130135, 136906, 167475, 203590, 211706, 179435, 119413, 45298, -46849, -144230, -224421, -292794, -402806, -546412, -614354, -555115, -445034, -357320, -287807, -229690, -158641, -72043]
13973g2043O2069R6998J26428L1861q6090j10393k2021Q0109R4307O6250Q2973
13962C50448J33894J62036J09613P140p8864j11402j31646j85999k56062k57139
13952b57981j37645j3501k2288j08708j54073j28668l6601J07925K21648J70550
13942c59342j7775q4870M2492K01043K33410J50009J04809J41269K05310K23358
13932H39713J82689J29922K8464p6663j10664j16376j06331q0927q4989j22333
13922D82505j46111j20863p5580n4380j02011j57647j35752q6906p7787n1481
13912e26013P868M7799M9523N5857N7428M8157O9020R8891J23622Q7476m3505
13901G6123r3337L0821J28230Q5421J6735j1905j2517R164O352n4534j21056j46644
$$ y = [-72043, -9974, 87024, 213452, 245313, 159223, 48830, 26809, 106918, 201225, 267475, 350448, 484342, 646378, 755991, 763131, 684267, 572865, 441219, 255220, -842, -257981, -395626, -409127, -431415, -540123, -694196, -822864, -859465, -751540, -529892, -359342, -377117, -461987, -419495, -218452, 14958, 164967, 269776, 411045, 616355, 839713, 1022402, 1152324, 1180788, 1104125, 993461, 877085, 770754, 689827, 604838, 482505, 336394, 215531, 139951, 85571, -16440, -174087, -309839, -396745, -474532, -526013, -518145, -470346, -420823, -364966, -307538, -259381, -190361, -91470, 32152, 119628, 76123, -17214, 13607, 141837, 227258, 243993, 232088, 219571, 228735, 235087, 180553, 59497, -87147]
13889h7147j73978j75662j11450l9239j2132m726K6825P2750P7366J0201o7378
13878d84570j10957j11058n2966p376q869O9124J90670J98107J22570M7155J8981
13867a29189J5370K4367Q7383J09723L2197n2805p9927l4022N7386J12432J08532
13856B51447P4939K6618n1508j57956k11502j57666p3548k6211k4852L751K4841
13845c21647j5941o4675n4403L5995J45192J75483J40029J06302N6998o491j8381
13834A78461K6599P8238Q8428L8130P235J2388j8353p1525o9435n8788p5461j24856
13822A1061j72689j51196q2708l4666k7553j7206N149K4079P4724R4195J2116
13811b64694n2902j146J02226J67114J73139J17444O065p1447o3235j7206J4482
$$ y = [-87147, -261125, -436787, -548237, -587476, -599608, -604334, -577509, -504759, -427393, -417192, -484570, -595527, -706585, -759551, -766927, -775796, -706672, -516002, -317895, -195325, -148170, -129189, -113819, -89452, -2069, 107654, 139851, 87046, 7119, -26903, 30483, 142915, 251447, 326386, 353004, 301496, 143540, -67962, -225628, -299176, -325387, -350239, -346488, -321647, -337588, -402263, -456666, -420671, -275479, -99996, 40033, 146335, 203333, 196842, 178461, 205060, 283298, 371726, 409856, 417091, 429479, 411126, 339601, 270166, 211378, 135917, 11061, -161628, -312824, -395532, -430198, -457751, -474957, -469808, -445729, -371005, -276810, -264694, -317596, -318742, -216516, -49402, 123737, 241181, 247246, 175799, 112564, 95358, 109840]
13800A09840R581N627R215J2047R200L923k1022r8215j52265j36053o4383J3055
13788b99450O2182J39916K60593L37642K79423J11646o0130j42164j34820q7930
13778D66908q0492j51623k14599j47654j2749P360r1940j37259n7462K8796O2648
13767c28066J02216J54936J44197P0330K0762K0811K16k2469j7030n502J8721
13756A59122M9497N2802Q623n4979q6877r0763r6808r9450r6832p5481l2116P649
13744c55613J6305L3972Q1490Q9528N1927q77q6166j48317j48266j36144j24764
13733g26925j14974o9965N620N2978N0315P3246O8043K4443Q6995K21902K84604
13722d3718K39234J84619J64330J30827K2416p7633j25189j90421k45360j95703
$$ y = [109840, 119421, 125048, 134263, 146310, 155510, 159433, 138411, 40196, -112069, -248122, -312505, -299450, -237268, -97352, 163241, 500883, 780306, 891952, 831822, 689658, 554838, 466908, 386416, 234793, 20194, -127460, -140209, -132849, -224789, -362048, -419510, -390714, -328066, -225850, -70914, 73283, 143613, 164375, 185186, 185402, 162933, 145903, 140401, 159122, 208619, 261421, 270044, 215065, 128188, 37425, -59383, -158833, -255665, -331146, -363262, -355613, -339308, -305336, -223846, -134318, -82391, -83268, -169434, -317751, -466017, -602161, -726925, -841899, -911864, -906244, -853266, -802951, -729705, -661662, -637219, -550224, -328322, -43718, 195516, 380135, 544465, 675292, 697708, 620075, 494886, 304465, 59105, -136598]
13712a36598m7207P5155R9522O6613M7003L8677L2767K6280J748o4125j29683
13701A0152j50597j07513k4873k3331q1985p1240o368O1481J19038J35699J12444
13690b7093N9402j5275o3960m9845p503K0109L1489j6396j35742j92538j55152
13679e52504p6849K9646Q4354R4357O4068k7311p2670l995Q5792J01075M6834
13668b27203J1614k053m7655j30862j94170j73288j02922n2908l3480j0159O1555
13657i01531J37863J42116J00170Q2406N9796p283m9354K6599J43367J56778M3503
13646f5570q0321q6962k1906P160k1895j04982j74842j31263K800R3975O9399
13635e14407J3475o135O073M1818R9426J59840K02829K11345J66279N3885m3338
$$ y = [-136598, -183805, -108650, -9128, 57485, 104488, 143165, 175932, 202212, 203960, 139835, 10152, -140445, -247958, -272831, -296162, -378147, -449387, -455755, -394274, -275236, -139537, -27093, 32309, 17034, -46926, -96771, -104274, -84165, -52676, -69072, -204814, -397352, -552504, -629353, -599707, -515353, -420996, -356928, -384239, -456909, -460904, -375112, -274037, -227203, -215589, -217642, -265297, -396159, -590329, -763617, -866539, -919447, -952927, -963086, -901531, -763668, -621552, -521382, -438976, -379180, -386463, -435817, -409218, -265851, -109073, -65570, -145891, -232853, -254759, -247599, -269494, -374476, -549318, -680581, -677781, -583806, -514407, -500932, -507067, -500994, -459176, -359750, -199910, 2919, 214264, 380543, 434428, 391090]
13624C91090r6034j31079j34806q9707k6060n1023j73251k58433k32128j07519
13614i08950P4371J72192J27786L6159k6067k9952Q791L1010k7123q2140n1906
13603f75829n149l2376j05709j29552j04182m1970N7559J69185K83038L00430
13593b84555J98083R0083L8503O9958J03784O5074J8266K8776O4441M4208m8768
13582C87853j32185j86043k39624k35831j75763j22931j01160n1152R0034K43585
13572e23217K67758J61077N3368J0795j6792k9646k6811l8907j1976L1372L9363
13561h3616j8848j35270k76593l74260l23657j52463J9434R3026O4003M8930Q1414
13550a057900J32181J76184J87889J91968J99291J95716J70776J55001J11910
$$ y = [391090, 295056, 163977, 29171, -60536, -86596, -137619, -310870, -569303, -801431, -908950, -834579, -662387, -534601, -498442, -524509, -554461, -545670, -514660, -541783, -623923, -675829, -680978, -713354, -819063, -948615, -1052797, -1094767, -1037208, -868023, -584985, -284555, -86472, 3611, 42114, 112072, 215856, 280930, 299196, 327972, 392413, 436621, 387853, 255668, 69625, -169999, -405830, -581593, -704524, -805684, -856836, -766802, -523217, -255459, -94382, -41014, -30219, -47011, -76657, -103468, -142375, -154351, -122979, -83616, -102464, -237734, -514327, -888587, -1212244, -1364707, -1345273, -1252247, -1188244, -1139314, -1057900, -925719, -749535, -561646, -369678, -170387, 25329, 196105, 351106, 463016]
13541D63016k8788j65612j92721j43138r6135p1052l0626J8921K7574M1716J04925
13530g1920J16262L4372p6160j27937p2385J1717P6417J44007J92013J38497J2742
13519C77625l1632j7445k0009l4761q9382j40398j54595j68655j62618j19599
13509e61469m0411K5438L9503P6165J27241J21858O8874Q813l4456p7643j22757
13498c68844j46338r7525m7387l9746K042N5410L9437M820L4028J10333J29605
13487c24165M6513l0392k042P9155O1195p4311j89162j77127p2962j633K9381
13476f55550L4697j2971p2151j09514j26280o7133K8678O1788N2207K2250l7756
13465h81735r1623o6921j779J7980j2766j981R7050K03039K56881K59556J98165
$$ y = [463016, 434228, 268616, 75895, -67243, -163378, -234430, -265056, -246135, -218561, -176845, -71920, 44342, 78714, 2554, -125383, -197768, -186051, -109634, 34373, 226386, 364883, 377625, 345993, 328548, 308539, 273778, 184396, 43998, -110597, -279252, -441870, -561469, -601880, -576442, -536939, -460774, -333533, -211675, -142801, -133988, -168444, -246087, -368844, -515182, -612707, -660094, -699840, -697798, -642388, -602951, -598131, -564103, -453770, -324165, -277652, -308044, -310086, -230931, -169736, -244047, -433209, -610336, -683298, -684931, -655550, -620853, -633824, -705975, -815489, -941769, -1008902, -980224, -918436, -866229, -843979, -881735, -973358, -1040279, -1042058, -1024078, -1036844, -1038825, -941775, -738736, -481855, -222299, -24134]
13454b4134P0424l9266n5544K0534Q1417N6080k3581p3436q833R5114J30134R3888
13442C22797M297j11324k00124j83772n2817Q0457J86513K63144K77489K16295
13432H02955J42409J02459P6035P8719K6272p9981j55395k20381k08863q7702
13422D76527J2758n498j01449j73250j30823r965P6447J09614J35419J80791J77753
13411G48324Q4135k0180k1564N8261P0258k4284j12435j25709j10583j06588r2430
13400C47205p5515q7424j29048j42906j23533r9859n5029L175j5818r6346j15959
13389e91057m2118J05404K65911L07010K14861L1382j11777r1348m603J8991k0869
13378H1787r5230j64768j91484j77583j40116p2340K2834P2110P5077O8000M9756
$$ y = [-24134, 46290, 7024, -48520, -27986, 53431, 109511, 85930, 12494, 3661, 98775, 228909, 322797, 327094, 215770, 15646, -168126, -220943, -140486, 46027, 309171, 586660, 802955, 945364, 1047823, 1123858, 1202577, 1228849, 1148868, 993473, 773092, 564229, 476527, 489285, 483787, 382338, 209088, 78265, 68300, 144747, 254361, 389780, 570571, 748324, 832459, 812279, 790715, 848976, 919234, 894950, 782515, 656806, 546223, 439635, 347205, 271690, 184266, 55218, -87688, -211221, -311080, -366109, -362934, -378752, -475098, -591057, -633175, -527771, -261860, 45150, 260011, 291393, 179616, 88268, 83665, 102656, 81787, -13443, -178211, -369695, -547278, -687394, -759734, -736900, -664790, -589713, -521713, -471957]
13367d71957R346l4813m9871r540L7981L5058K2877P7864J21362P0929J514l0796
13355b20046n9852q6105m2807L5422M1355J8539K8129O1758R9696J09235N6039
13344D1363p075l7400q9051j44218j14642L804P1858L977p7663n2387K2914P1257
13332c07263J30887J74260J28276K8149o8520r8406o6415o2236r9558j02017k3268
13321c66111O8202J12709J69671K05971J31788l746j08293j45534j21127n5782
13311a12252L6122J09151Q4766P34p169L3684L4519K4139N7092J19828J20366
13300E00980L6299k2797q2M2455J1123r8731j88892j37693J1263J00702R6592
13289C51219L0916m8225q6352o5104o460N4532Q9987J17276Q8683J4208j9445
$$ y = [-471957, -462611, -497424, -547295, -556835, -518854, -483796, -460919, -383055, -261693, -190764, -189250, -220046, -279898, -366003, -408810, -373388, -332033, -313494, -285365, -223607, -123911, -14676, 41363, 34288, -3112, -92163, -236381, -351023, -347219, -275361, -271384, -349047, -401434, -378520, -307263, -176376, -2116, 126160, 154309, 85789, -12617, -79032, -141268, -240826, -342843, -366111, -297909, -185200, -15529, 190442, 322230, 318484, 210191, 64657, -56470, -112252, -76130, 33021, 117787, 118521, 111352, 145036, 179555, 203694, 260786, 380614, 500980, 537279, 514482, 514400, 556855, 567978, 469247, 280355, 142662, 153925, 254627, 351219, 382135, 333910, 247558, 182454, 175994, 230526, 320513, 437789, 526472, 540680, 521235]
13278E21235q412K1847N6017P7300N9375L3560q525j9788M8510J11470J02429
13267I95018Q863r8124j65135j72263j23557p8722m4452L2218J45426J77424J25157
13256H01853J00384J04325N0025l5991m6914J7623O9964P5654P3180J04580J29086
13245A443769P5507m3779j43700j48124o4862Q137J1769p3962j78082j36898J9681
13234G69456J76110K56022K22487J24981L1603l6049l4082J1727R08n5243j30873
13223A337047j94210j70475m2529Q8429R6891K3930q2653j82328j94403o9840
13213F09859P6635Q4566n4645j85584j71079j6079J38780J75549J41075J22006
13203I21083J11590L6071n5103o7510l1940K3090Q8191J22390J28048J26877Q8887
$$ y = [521235, 512823, 534670, 590687, 667987, 727362, 760922, 752397, 732609, 781119, 892589, 995018, 1003881, 905757, 740622, 568359, 444802, 366080, 321628, 353846, 499272, 676696, 801853, 902237, 1006562, 1056587, 1020596, 973682, 991305, 1061269, 1136923, 1210103, 1314683, 1443769, 1519276, 1475497, 1331797, 1183673, 1118811, 1126948, 1138717, 1064755, 886673, 749775, 769456, 945566, 1201588, 1424075, 1549056, 1580659, 1544610, 1510528, 1522255, 1523163, 1467920, 1337047, 1142837, 972362, 929833, 1018262, 1115153, 1139083, 1056430, 874102, 679699, 609859, 686494, 771060, 716415, 530831, 359752, 343673, 482453, 658002, 799077, 921083, 1032673, 1068744, 1013641, 946131, 914191, 937281, 1025472, 1147862, 1275910, 1402787, 1491674]
13192A491674Q199o2428p5066m0059l872j491p3552j77525k11244j57243p9373
13181F18020n7214n9704o5105j1221J12969J88084K02739K05883J94029J58066
13171A486546J02659P2450P2495N9919N0924L8625M135m7090q5767q5108q8597
13160A581191r7528n4351p449k3410o7892m7058j1429j7881p767L4461O9218O8868
13148A418973P3298R1285J01980J26346J43761J40727J38773J10416J857j75191
13138B172225k87004k52340j34587J54Q2270R3998P4767N2069K9950k9149o3672
13127A738681N332J21508J56171J09762L3601l0915n5626o8540j14349j81437
13117A714188j44879K1225K40550L94921L77644K52944J50581L6740p3298j24915
$$ y = [1491674, 1499873, 1437445, 1362379, 1322320, 1318448, 1316957, 1243405, 1065880, 854636, 697393, 618020, 560806, 501102, 435997, 424776, 537745, 725829, 928568, 1134451, 1328480, 1486546, 1589205, 1661655, 1734150, 1794069, 1844993, 1883618, 1887753, 1840663, 1754896, 1669788, 1581191, 1483663, 1429312, 1421863, 1398453, 1330561, 1283503, 1272074, 1254193, 1246426, 1280887, 1350105, 1418973, 1492271, 1583556, 1685536, 1811882, 1955643, 2096370, 2235143, 2345559, 2347416, 2172225, 1885221, 1632881, 1498294, 1498448, 1580718, 1674716, 1749483, 1801552, 1831502, 1802353, 1738681, 1744013, 1865521, 2021692, 2131454, 2165055, 2134140, 2078514, 2009974, 1895625, 1714188, 1569309, 1590534, 1831084, 2226005, 2603649, 2856593, 3007174, 3043914, 2970616, 2845701]
13107B845701j67756k09976j82494q5471J6189J10355J81372J65678R2591J9937
13097B786126r2225k18807k27804r6405P2831J77786J92970J60823J14259L1816
13087B901370l8964l7465k1192j623K8286O1406N8233K0533J5147L2126M3964
13076C061821M7305Q3524J69154J95705J26034Q6798J34829J73605Q7954k4285
13066D142444p3921j10194j23664o9899q601J2279R512K0124O3786J04811J01650
13055D068327O9603R3138J66149J56752Q5514M6692M1879P9275J34372J79497
13045E121198K05814K16774K26128K16978K22133K52308K05194J15094J27534
13036F909155K08681K35381J89261J61367J24546L3548m959L3165N3326L9549
$$ y = [2845701, 2677945, 2467969, 2285475, 2200004, 2216193, 2326548, 2507920, 2673598, 2766189, 2786126, 2693901, 2475094, 2247290, 2150885, 2223716, 2401502, 2594472, 2755295, 2869554, 2901370, 2862406, 2824941, 2803749, 2802126, 2830412, 2891818, 2950051, 2970584, 2985731, 3017857, 3061821, 3109126, 3192650, 3361804, 3557509, 3683543, 3770341, 3905170, 4078775, 4166729, 4142444, 4068523, 3958329, 3834665, 3764766, 3756165, 3768444, 3777956, 3798080, 3861866, 3966677, 4068327, 4137930, 4231068, 4397217, 4553969, 4639483, 4686175, 4728054, 4807329, 4941701, 5121198, 5327012, 5543786, 5769914, 5986892, 6209025, 6461333, 6666527, 6781621, 6909155, 7117836, 7353217, 7542478, 7703845, 7828391, 7861939, 7856980, 7890145, 7943471, 7983020]
13026G983020Q774N432O4860J55014K87596M12037M02629K88838K21801K41452
13016A0071453K60547K07148J51598J56238K10680L01743M25841N02065N03740
13007A2791053N07734M79212M28794M56115N59824O72290P56876Q67739J016414
12998A8536051J123642J169016J168906J202469J354130J561862J732252J890775
12990B9739103K057144K233357K504219K898673L350788L885985M572723N426732
12982E6668724O399035P408903Q485648R735297J1238164J3034891J5087617J7324260
12974A45382539J9720997K2039857K3626676K3307301J9726931J2085310J098557
12967B66988168j0610606j9928103k5121520k6366572k4933898k2103296j8833584
$$ y = [7983020, 7991794, 7997226, 8062086, 8217100, 8504696, 8916733, 9319362, 9608200, 9830001, 10071453, 10332000, 10539148, 10690746, 10846984, 11057664, 11359407, 11785248, 12287313, 12791053, 13298787, 13777999, 14206793, 14662908, 15222732, 15895022, 16651898, 17519637, 18536051, 19659693, 20828709, 21997615, 23200084, 24554214, 26116076, 27848328, 29739103, 31796247, 34029604, 36533823, 39432496, 42783284, 46669269, 51241992, 56668724, 63067759, 70476662, 78962310, 88697607, 99935771, 112970662, 128058279, 145382539, 165103536, 187143393, 210770069, 234077370, 253804301, 265889611, 266988168, 256377562, 236449459, 211327939, 184961367, 160027469, 137924173, 119090589]
12960A19090589j5767557j3155149j1005679r225576p666791o318658n276809
12953E0674370m501460l897955l380371k938463k549161k191104j910857j744725
12945B7560274j675658j580845j348942j017774p51367n85128m95531m72148m49229
12936A9183652m04588l90138l67101k46211r1645j4321j4569L9377J83879L28670
12926A8207005M20080M27563L49773K70037K97313M56733O58711P64794P89255
12917B2641264Q63202J023253J261117J508512J643416J621665J452075J189683
12909C3204187R32069P76150P77018Q76800R65329J106114J362345J691386K087563
12900D3778961K572692L166556L872792M650079N451376O260704P157342Q311838
$$ y = [119090589, 103323032, 90167883, 79162204, 69936628, 62269837, 55951179, 50674370, 46172910, 42274955, 38894584, 35956121, 33406960, 31215856, 29304999, 27560274, 25884616, 24303771, 22954829, 21937055, 21185688, 20600560, 20105029, 19632881, 19183652, 18779064, 18388926, 18021825, 17775614, 17683969, 17669648, 17655079, 17694456, 17878335, 18207005, 18627085, 19054648, 19404421, 19674458, 19971771, 20428504, 21087215, 21852009, 22641264, 23504466, 24527719, 25788836, 27297348, 28940764, 30562429, 32014504, 33204187, 34136256, 34912406, 35689424, 36566224, 37531553, 38637667, 40000012, 41691398, 43778961, 46351653, 49518209, 53391001, 58041080, 63492456, 69753160, 76910502, 85222340]
12892H5222340R777967J1494159J3452738J5646055J8069361K0634265K2936112
12885A97232997K4166271K3090395J8298264R256077k668189j4375434k2789034
12878B32211347k6672044k6777185k4638385k1541666j8300439j5311868j2618906
12871H6350854j0269545q424811p047049o001884n173285m467680l866503l332541
12863C7767556k841360k425513k123118j926314j779256j633626j479137j316241
12855B2242991j127709r28976p75959o75959n28417l44359k24570j80027j81861
12846A7275154k01085k60721l41599l42794k41374j13108k5483l544k4962r889
12836A5710595Q9679K23644L22881L61388L85000M31704M78942N08438N03181
$$ y = [85222340, 95000307, 106494466, 119947204, 135593259, 153662620, 174296885, 197232997, 221399268, 244489663, 262787927, 272044004, 269375815, 255000381, 232211347, 205539303, 178762118, 154123733, 132582067, 114281628, 98969760, 86350854, 76081309, 67656498, 60609449, 54607565, 49434280, 44966600, 41100097, 37767556, 34926196, 32500683, 30377565, 28451251, 26671995, 25038369, 23559232, 22242991, 21115282, 20186306, 19410347, 18734388, 18205971, 17861612, 17637042, 17457015, 17275154, 17074069, 16813348, 16471749, 16128955, 15887581, 15774473, 15748990, 15745446, 15720484, 15710595, 15800274, 16023918, 16346799, 16708187, 17093187, 17524891, 18003833, 18512271, 19015452]
12827A9015452N13726O36845Q40826R93660J077177J160121J231512J280710J415964
12818B8165993J722365K081756K339191K516923K727310L074596L549314M102428
12810E0279876M753166N540215O482778P558401Q849606J0392029J2140706J4121343
12802A20118120J6334725J8731643K1115027K3013822K3516613K1469484J5749568
12795B60049002O036907n899770j6773167k3936953k6706105k6102823k3611402
12788A43055689k0398815j7213955j4370673j1878392r806720q252473p117067
12781E4017594o129525n146035m232773l519276l061323k716611k374358k024819
12773B4812874j724215j561878j527195j517044j458762j330060j131087q81004
$$ y = [19015452, 19529178, 20166023, 21006849, 22000509, 23077686, 24237807, 25469319, 26750029, 28165993, 29888358, 31970114, 34309305, 36826228, 39553538, 42628134, 46177448, 50279876, 55033042, 60573257, 67056035, 74614436, 83464042, 93856071, 105996777, 120118120, 136452845, 155184488, 176299515, 199313337, 222829950, 244299434, 260049002, 266085909, 260186139, 243412972, 219476019, 192769914, 166667091, 143055689, 122656874, 105442919, 91072246, 79193854, 69387134, 61134661, 54017594, 47888069, 42742034, 38509261, 34989985, 31928662, 29212051, 26837693, 24812874, 23088659, 21526781, 19999586, 18482542, 17023780, 15693720, 14562633, 13681629]
12765A3681629p22907p30653p29083o04252m36228l44628l52108l95152m03201
12756H963417l60635l12042k92482k87829k79764k56762k78007l42696l73187
12747F180013l83769m24545m56292l73020j85109j9902J0265o3269o4194L3445
12737D253623M2628p2920j54105j69072j32582r2085j19302j92567k75604l44337
12727B743677l09513j70339k7708P2842J14335O3894l2966j25586j87742j97185
12717A943709j76416j41856r3920q0553q2896q120Q7466R4566K5224m5274l5848
12706A486082N6382J16292J07487P7583N662j25582k09736j76607j23056j54785
12696A059722k06776j46018n2300k9038k9196k1061k2032j3288N627l4776o8654
$$ y = [13681629, 12958722, 12228069, 11498986, 10894734, 10458506, 10113878, 9761770, 9366618, 8963417, 8602782, 8290740, 7998258, 7710429, 7430665, 7173903, 6895896, 6553200, 6180013, 5796244, 5371699, 4915407, 4542387, 4357278, 4337376, 4347641, 4284372, 4220178, 4253623, 4296251, 4223331, 4069226, 3900154, 3767572, 3675487, 3556185, 3363618, 3088014, 2743677, 2434164, 2263825, 2236117, 2308959, 2423294, 2487188, 2454222, 2328636, 2140894, 1943709, 1767293, 1625437, 1531517, 1450964, 1368068, 1359948, 1447414, 1541980, 1567204, 1521930, 1486082, 1542464, 1658756, 1766243, 1843826, 1849488, 1723906, 1514170, 1337563, 1214507, 1059722, 852946, 706928, 654628, 625590, 596394, 575333, 553301, 540013, 545640, 510864, 442210]
12685D42210k6483J3006J0432L7839J01611J47432J36416L6086n2027n0314k9702
12674G66506j6713M1247J49977J98401J30816R5235J47296J75211J27897j0810
12664A805063j06762q9706p6431r9596j26557j37630m9109Q8074J28735R3012
12654A429093L0258o8962j48487j67292j03526K2678R5941Q4784L2584k1550l5910
12643A149611o838L4975L6185N1582R0873L5233j15749k31383k11642j12920p4580
12632F45347j22153j45306j32840j46140j41553p7662J9272J03894J10597O8111
12622A81567L0335l2946q3063r6583j20295j07988l8739M8834R4609R5782M3162
12611A4675n4988n5623M8815J54098J99837J70944J15484J08904J39374J53423
$$ y = [442210, 415727, 428733, 439165, 477004, 578615, 726047, 862463, 898549, 846522, 796208, 766506, 749793, 791040, 941017, 1139418, 1270234, 1365469, 1512765, 1687976, 1815873, 1805063, 1698301, 1608595, 1532164, 1432568, 1306011, 1168381, 1119272, 1207346, 1336081, 1429093, 1459351, 1390389, 1241902, 1074610, 971084, 993762, 1089703, 1174487, 1207071, 1185521, 1149611, 1142773, 1177748, 1213933, 1265515, 1356388, 1391621, 1275872, 1044489, 832847, 719927, 645347, 523194, 377888, 245048, 98908, -42645, -120307, -101035, 2859, 113456, 181567, 211902, 178956, 95893, -690, -120985, -228973, -267712, -218878, -124269, -28487, 14675, -40313, -95936, -47121, 106977, 306814, 477758, 593242, 702146, 841520, 994943]
12601I94943J14276L8368p9300j95351k50761k34295j48344p1189l8033l4554
12591I5760m3741n0240k7282J0106N8634J06872J07302M8736m0194j34227j76333
12580d4607r1669Q4475K35323K88612K02966j3098k19736k84324k07149r7465
12570a46672j5208O3529J57801K43077K72104K21169J23599m751j46743k40477
12560E27428k20452j10209n2155r9253j96313k29515j10114K6203K4088k5575
12550d65867k2583j171K3018j410q1420j07396o8982K1522J11760J38517Q5899
12539c68113J042m1455K7553J41527J69541Q3347l0514o0211k5384L7458P5050
12528I841M8433n6776j44178j20112n4990l0679O631Q0897J03532L2277r4883
$$ y = [994943, 1109219, 1147587, 1068287, 872936, 622175, 387880, 239536, 168347, 130314, 95760, 52019, 1779, -25503, -15397, 43237, 150109, 257411, 306147, 265953, 131726, -44607, -136276, -51801, 183522, 472134, 675100, 662002, 442266, 157942, -49207, -146672, -161880, -98351, 59450, 302527, 574631, 795800, 919399, 914648, 767905, 527428, 306976, 196767, 144612, 45359, -150954, -380469, -490583, -464380, -440292, -465867, -488450, -489621, -466603, -468013, -549433, -656829, -725811, -704289, -592529, -454012, -368113, -367071, -408526, -380973, -239446, -69905, 13442, -17072, -77283, -102667, -65209, 9841, 58274, 1498, -142680, -262792, -317782, -348461, -341830, -260933, -157401, -125124, -220007]
12517b20007j70617j08289J0600P0017P2816R0641J11259J19405J90124K64877
12507D30826K24663P2881j09798k30198k10530j45699r1022m0210q965J5730j9803
12496a12125n5129o7894j21199j64819j58577j08877k3623K6593M7744N0815L2487
12485f54604N0225J16088J83150J43940j7897j34123q1100J7035R9932K28132
12475d9222K99962K47831J35982N4539L1187l759o2995p3299o6580q2319r4925
12464C36402q4311l8293L8622J38028K06896J86682O8401n8559j31437j81927
12454D80504k14611j79111q4675L7190J08394Q9864L5098m9583j03117p4156o5910
12443b0113j38420j49488j7256J32373J80958J29627L5761j3485l1807o1695o5521
$$ y = [-220007, -390624, -498913, -488313, -418296, -345480, -254839, -143580, -24175, 165949, 430826, 655489, 728370, 618572, 388374, 177844, 32145, -58877, -99087, -108052, -92322, -112125, -167254, -235148, -356347, -521166, -679743, -788620, -812243, -785650, -737906, -687091, -654604, -604379, -488291, -305141, -161201, -179098, -313221, -394321, -377286, -277354, -49222, 250740, 498571, 634553, 689092, 720279, 716520, 653525, 580226, 513646, 431327, 336402, 252091, 213798, 252420, 390448, 597344, 784026, 852427, 793868, 662431, 480504, 265893, 86782, 2107, 39297, 147691, 237555, 272653, 223070, 119953, 45797, -20113, -158533, -308021, -325277, -192904, -11946, 117681, 153442, 139957, 108150, 46455, -19066]
12432a9066q2870j22833j52099j35103m6463R1687J88452J63247N0816l3385l8678
12421a36295l1977n9892p1039l5591j7556K7396J12822J86107J83816O2094l6408
12410A83477l1768n2284j22142j54665j26806n2849p893k6779o024N3943O9223
12399b74567M019p7110j00481r4154j03457j04276n7245l0263l1137L7615J29855
12388g01201J46947J04838Q9065J15255R6177M2550J8209j5150p4886j53570j74991
12377e06757j19140o3661n1251L146J20154J67418J23238J8620j33380k00426
12367f42039j38559p6158l1818J1784n488l8815J7149J07458J38621J17211O4720
12356d75934J846j6778j3544j3244L831O0808J16531J54588K14476K36251J66308
$$ y = [-19066, -101936, -224769, -376868, -511971, -558434, -466747, -278295, -115048, -64232, -97617, -136295, -168272, -228164, -299203, -334794, -352350, -324954, -212132, -26025, 157791, 219885, 183477, 151709, 99425, -22717, -177382, -304188, -357037, -364930, -391709, -397733, -343790, -274567, -270548, -347658, -448139, -542293, -645750, -750026, -807271, -837534, -868671, -831056, -701201, -554254, -449416, -360351, -245096, -148919, -106369, -88160, -103310, -178196, -331766, -506757, -625897, -689558, -740809, -737663, -617509, -450091, -326853, -308233, -441613, -642039, -780598, -856756, -888574, -876790, -882278, -921093, -903944, -796486, -657865, -540654, -475934, -474088, -490866, -504410, -517654, -513823, -453015, -336484, -181896, 32580, 268831, 435139]
12345D35139N5236j7088l5754j7012L0811L6924q051m8378l7409M2354J19011
12334E55783N4097r7070j32774j2263J03051O8361o1395j01329n1520k1022j10953
12323A92966k75150l10276j99298q6332j6938M8485J10864R9852n550o0292K2004
12312d79665J46170K01493J76709J08870k354r6466j13235o7808j567K9182J369
12301i7302n0845q1510q4375r0725j04702r8450k7509J16812K51236K68275J93987
12290A94892O7602q1248j69707j33571l3101L217L803r065l4167q05Q2625J37395
12278B7870J27999N9594m5428j49569k10159j44219K2095J16621J19427O4591
12268a1178j6677o6567p3031o7504n9899j5131O3056J43538J44192N5514J8839
$$ y = [435139, 490375, 473287, 437533, 420521, 451332, 488256, 480205, 431827, 394418, 436772, 555783, 609880, 512810, 380036, 367773, 470824, 539185, 477790, 376461, 324941, 303919, 192966, -82184, -392460, -591758, -678090, -695028, -646543, -535679, -435827, -441377, -501669, -479665, -333495, -132002, 44707, 153577, 151223, 54757, -58478, -126286, -127853, -98671, -97302, -148147, -229657, -314032, -404757, -509459, -607909, -635418, -518606, -267370, 905, 194892, 262494, 181246, 11539, -122032, -155133, -151916, -148113, -157178, -191345, -192150, -109525, 27870, 155869, 215463, 170035, 20466, -189693, -333912, -311817, -195196, -75769, -11178, -27855, -94422, -167453, -234957, -294856, -309987, -246931, -103393, 40799, 96313, 115152]
12257A15152P4068J05367R5204P5705P871q7202j34289j08521r0790j00446p6860
12246a24741M002J37851K37664J92375J6180j56139k44789k14661q9021M6791
12236a94488Q5091j4818o0681J5877R5387Q4796J428j4263L4757M7052K4286M1052
12224A45476P9942M5175n4547j31547j12431n1036p715M8930P6460K5611m2761
12213B1557p3596r6265j49268j75308j22433J730J11086J58593J44199R9627O6306
12202a3772L2429J5969M900n749j9731J648J05438J82184J63014P8371k0400m7460
12190D76841R392N9514O1812R2635J74350J69751J3557j55496k04291j70810j53382
12179C73873j41296r9072m6985k436J1105j7056o9370q8542m9075k7788m2871
$$ y = [115152, 189220, 294587, 389791, 465496, 473367, 386165, 251876, 143355, 52565, -47881, -124741, -120739, 17112, 254776, 447151, 463331, 307192, 62403, -152258, -241279, -194488, -109397, -124215, -184896, -169019, -73632, 11164, 12592, -1671, 33086, 80138, 104424, 145476, 225418, 270593, 216046, 84499, -27932, -78968, -86683, -37753, 38707, 64318, 21557, -52039, -148304, -297572, -472880, -595313, -593583, -482497, -323904, -179705, -80078, -13772, 18657, 34626, 39526, 33777, 14046, 15694, 121132, 303316, 466330, 544701, 524301, 476841, 486233, 545747, 607559, 700194, 874544, 1044295, 1057852, 902356, 698065, 527255, 373873, 232577, 133505, 86520, 84084, 95189, 78133, 8763, -79779, -128854, -156642, -199513]
12168a99513m6650m627J03863J72719Q8590l7587q5783l7674P7085J46669O0713
12157B37805j00439k43587l31822l24687j52214J29635L09463L09778J92293R2504
12147A18729N6124j5092r8671j20593p9249j3895L1108J4381j9861j0721J586
12136a36154J0564Q167r154o6887j49844j69923j09329q1140q9189n8190M4674
12125h06405J32819J35634J04678R1441J44839J68553J05879M5142L4253N6243
12115B13076J24091J89801J60220J03883M5544k7095p8328j00796q2762n5946
12105D91688l9130m485N5192O4918K325p6361j90880k74349k41140j15837l798
12094c31857k8301j38396j71735j11370l9272J8534K6700l2824q5823m6583J03121
$$ y = [-199513, -246163, -250790, -146927, 25792, 114382, 76795, -8988, -46662, 30423, 177092, 237805, 137366, -106221, -438043, -762730, -914944, -785309, -475846, -166068, 26225, 118729, 174853, 159761, 61090, -59503, -138752, -152647, -121539, -107158, -127019, -137740, -136154, -125590, -117423, -126577, -193464, -343308, -513231, -622560, -703700, -792889, -851079, -806405, -673586, -537952, -433274, -341833, -196994, -28441, 77438, 122580, 156833, 213076, 337167, 526968, 687188, 791071, 836615, 809520, 731192, 630396, 547634, 491688, 452558, 448073, 503265, 568183, 570508, 494147, 303267, 28918, -212222, -328059, -331857, -360158, -498554, -670289, -781659, -820931, -802397, -775697, -808521, -894344, -940927, -837806]
12083h37806K57257K63860J35312j5183j11164j18458l4363N6569Q8319P2539
12073b43118J6041j17273k66203k07382p467P7634O6744M3924K7808K6425M7214
12062e35653Q1034O0849J7594P666k70m3994j23542j51026r4651k1392R950L1786
12050g61649O8613J12523J21581N2631l3633p4943l1361P1710J47540J55922J40551
12039c0515J21117Q9801M4986j1338o0660p9661j20121j96920k22226j40855o4717
12028f71109o4448n0890j1070J5980J0619l1086q0303j04239j13976j38027j61886
12017a400435j28663l283J44287K42390K54401J87360J59541J91841J61859O8892
12007a21810k5677o5710j2633J11259K10787K18085J40739J2585j35073k39224
$$ y = [-837806, -580549, -316689, -181377, -196560, -307724, -426182, -460545, -403976, -315657, -243118, -227077, -344350, -610553, -817935, -825402, -747768, -681024, -637100, -609292, -582867, -535653, -454619, -393770, -376176, -368510, -368780, -412774, -536316, -687342, -781993, -803385, -793435, -761649, -693036, -580513, -458932, -406301, -439934, -514877, -546238, -474528, -326988, -171066, -30515, 90602, 180403, 225389, 214051, 153391, 73730, -46391, -243311, -465537, -606392, -671109, -735557, -786447, -797517, -781537, -770918, -802004, -882307, -986546, -1100522, -1238549, -1400435, -1529098, -1532381, -1388094, -1145704, -891303, -703943, -544402, -352561, -190702, -121810, -147487, -213197, -225830, -114571, 96216, 314301, 455040, 467625, 332552, 93328]
11997I3328k48911j76238o8642j5873l1L5884N4686L4947r397p2756j00397m4334
11985e17734P1807J64655J41254n142j22313j48898j14854k1735N2589N2743J71
11974d47457q0103j51016j65920q6791O1334J77221J97229J47382J17086J36398
11964i4637Q5492m7878j27846r6342j1986J08985K15408K19562J51010P6626J1806
11953D90200n1843p6252j3883N9314L5225o0984j54063j90919j71500j28272m6955
11942c09932O4136J26174R7450N6285O8338P9831P5918Q1779N5415K7140N5430
11931D77964R8496J09145M1146n7190o3384k8995m3702o1022j8676M3266N3003
11920E50051j4742j13746j56000j59998k08988k70273k01890j814K23451L39196
$$ y = [93328, -155583, -331821, -400463, -416336, -416367, -380483, -325797, -290850, -300247, -373003, -473400, -517734, -445927, -281272, -140018, -145160, -267473, -416371, -531225, -552960, -500371, -447628, -447457, -527560, -678576, -844496, -931287, -869953, -692732, -495503, -348121, -231035, -94637, -9145, -57023, -184869, -281211, -293197, -184212, 31196, 250758, 401768, 478394, 490200, 438357, 362105, 348222, 407536, 442761, 381777, 227714, 36795, -134705, -262977, -309932, -245796, -119622, -22172, 34113, 102451, 182282, 258200, 339979, 395394, 422534, 477964, 576460, 685605, 726751, 669561, 606177, 577182, 533480, 472458, 453782, 497048, 550051, 535309, 421563, 265563, 105565, -103423, -373696, -575586, -577400, -353949, -14753]
11910a4753K79258J24009j640n7901q6883j07487r4177j1434P5004J01767J42028
11899C47791K14862J88546Q2594N6847P0429O7504O6785M8363P4120J30629J19833
11888A468303R0179J29798J85438J50881N1501M314J7255M5398P5330J01217R9121
11877B418735P1747L1127l388j8551k6250m7169p2656j08190j08599m4844L280
11866B095242J4682O9791J56367K11704K21525J78788J14546L4357k8992O009
11856C074019L1575p1482j56523j01263N6192J71193J86556J28110M7102k8732
11846C336747p8805o5604m2979j8472l494j3657j3689N9690K14537L04415K17489
11835C896178J02811J36533K15771K06847J35484K9251q5994k43621m68727o40705
$$ y = [-14753, 264505, 388514, 386874, 328973, 242090, 134603, 40426, 28992, 103996, 205763, 347791, 562653, 751199, 833793, 890640, 961069, 1028573, 1095358, 1143721, 1217841, 1348470, 1468303, 1558482, 1688280, 1873718, 2024599, 2076100, 2080414, 2097669, 2143067, 2218397, 2319614, 2418735, 2490482, 2521609, 2518221, 2499670, 2473420, 2426251, 2353595, 2245405, 2136806, 2091962, 2095242, 2109924, 2179715, 2336082, 2547786, 2769311, 2948099, 3062645, 3097002, 3068010, 3074019, 3105594, 3034112, 2877589, 2776326, 2832518, 3003711, 3190267, 3318377, 3365479, 3336747, 3257942, 3192338, 3149359, 3130887, 3127393, 3113736, 3100047, 3159737, 3374274, 3678689, 3896178, 3998989, 4135522, 4351293, 4558140, 4693624, 4722875, 4636881, 4393260, 3924533, 3283828]
11825C283828o58071m55173k15342j52006j54255j96990k85520k40156q299K22714
11815A140730L81403L91168K33601L652j82222j73507o9627k2616l1843p3116
11805A597623j45763j72608j17148k1647J00692J89624J54685P2899J2000k5190
11795A645167m0882j6541P6215J76162J81371J44306J32219J08174J14574J98467
11785B719232K94682L42508L32870L02499K84633K52510K32588K19844J83061
11776E164427K20967L54985M92005N47717N38656N04658M27238L07027J69180
11767H726860N1464p1774j99798k99151l51913l28239k53135j67525j08872r3311
11757F904606o6976q773L5065L1538k0641o7557p4377p2511j06005j66370k67819
$$ y = [3283828, 2625757, 2170584, 1955242, 1803236, 1648981, 1451991, 1166471, 926315, 918016, 1140730, 1522133, 1913301, 2146902, 2150554, 1968332, 1794825, 1725198, 1702582, 1670739, 1597623, 1451860, 1279252, 1162104, 1140457, 1241149, 1430773, 1585458, 1658357, 1670357, 1645167, 1604285, 1587744, 1663959, 1840121, 2021492, 2165798, 2298017, 2406191, 2520765, 2719232, 3013914, 3356422, 3689292, 3991791, 4276424, 4528934, 4761522, 4981366, 5164427, 5385394, 5740379, 6232384, 6780101, 7318757, 7823415, 8250653, 8557680, 8726860, 8778324, 8706550, 8506752, 8207601, 7855688, 7527449, 7274314, 7106789, 6997917, 6904606, 6837630, 6828857, 6863922, 6895460, 6874819, 6807262, 6732885, 6660374, 6554369, 6387999, 6120180]
11746F120180m20958m96968m25975l11014k77879l28882l83407l60395k71546
11737B843156j98426j32374o5176n6778o5021l1647J7550L0958l8817j30947j30433
11726B042045l524J38914J72655J23046R6290J39053K32293K92331K58654J62842
11716C654599J02516J68141L18190M41224M14383J73236j76208m62241n85430
11707D048410n82133n07554l86334l27710l48781l45409k98811k05956j25913
11698I19809j32825j39682o2021J8597k1183j37196j76227j26723o3881j3548
11688F5120N3551J31911J50437J10142Q9844Q7584R5125O2603k4665o2962P4568
11677H33258M39064Q61455P20852P1038l04186l31716k46066j94203k06544k51980
$$ y = [6120180, 5699222, 5202254, 4776279, 4465265, 4187386, 3858504, 3475097, 3114702, 2843156, 2644730, 2512356, 2447180, 2390402, 2325381, 2293734, 2311284, 2342242, 2303425, 2172478, 2042045, 2038521, 2177435, 2350090, 2473136, 2569426, 2708479, 2940772, 3233103, 3491757, 3654599, 3757115, 3925256, 4243446, 4684670, 5099053, 5272289, 5096081, 4633840, 4048410, 3466277, 2958723, 2572389, 2244679, 1895898, 1550489, 1251678, 1045722, 919809, 786984, 647302, 585281, 603878, 582695, 445499, 269272, 142549, 78668, 65120, 118671, 250582, 401019, 511161, 601005, 688589, 783714, 846317, 821652, 758690, 833258, 1272322, 2133777, 2854629, 2925667, 2621481, 2289765, 2043699, 1849496, 1642952, 1390972]
11667A390972l33151m23002m38352l41642j79120n9983p644P2741J55813J35056
11657b8312P3560L5970M7504R9336J19838N3115k3189l6074n7192j26187j67667
11646i298j10817L046J14587J50202J08521N4673l320q9005j32049o0876J0741
11635C6405j6883n9398o3989m7971k55M3362M2377O1727J26109J52688Q9990j2230
11623C51932l4522L840J7189J5364j9697r0776j13737q2973o0354j2304Q4412
11612E8374K41366L20809J95825l3997k48324l60118l06348j46972r223O1693
11602b26915N2065L5039O4633P3873N2046N2101Q5429Q7912N6523O6695J56300
11591E55701K92095L25629J62095r0678k59267k60054j42244p0173q8152j64511
$$ y = [1390972, 1057821, 634819, 196467, -145175, -324295, -384278, -391922, -319181, -163368, -28312, 45248, 81218, 128722, 228058, 347896, 401011, 377822, 341748, 284556, 158369, -9298, -120115, -117069, -2482, 147720, 256241, 310914, 307594, 218589, 86540, 25664, 36405, 19522, -39876, -103865, -151836, -152091, -108729, -66352, -4625, 121484, 274172, 364162, 351932, 317410, 321250, 338439, 353803, 334106, 243330, 129593, 46620, -13734, -26038, 58374, 299740, 620549, 816374, 782377, 534053, 173935, -132413, -279385, -288608, -226915, -174850, -139811, -75178, -1305, 50741, 102842, 188271, 276183, 332706, 399401, 555701, 847796, 1173425, 1335520, 1244842, 985575, 725521, 583277, 513104, 424952, 260441]
11581B60441j85417q8880J5202L1753q916n4800p7257r968P0477P5454N0250M7480
11569A25819K7725j5640j0072K5613R2035R2215j2534j23989j59357p5195J4675
11558a8705L704j8247J0409L0177P610m4066j05778j47417j55499j26670n6353
11547f20835R946J5681L9159J36630K40486K48613J49501L5194n3186j11562j26417
11536c6790j49029j79401j40220q1033n2457j5372L1684M3746K8682j6515q2482
11525f49187r2218k8244K0717r106j8811R3221J84712J41695O2800J0917o2577
11514c46081j15002o2081J9062O2069N1923J4814j353q022K1240P5739J10752
11503a76940J33302J03238j1684j27016j08305J5847R2136J29490K01887K23299
$$ y = [260441, 75024, -13856, 1346, 33099, 24183, -30617, -107874, -117842, -47365, 28089, 78339, 125819, 153544, 137904, 127832, 153445, 245480, 337695, 325161, 201172, 41815, -33380, -18705, -15001, -33248, -22839, 7338, 14948, -29118, -134896, -282313, -437812, -564482, -620835, -610889, -595208, -556049, -419419, -178933, 69680, 219181, 254375, 201189, 89627, -36790, -185819, -365220, -505440, -586473, -638930, -654302, -622618, -578872, -550190, -566705, -649187, -741405, -769649, -748932, -758038, -776849, -683628, -498916, -357221, -294421, -283504, -346081, -461083, -523164, -504102, -442033, -390110, -375296, -376649, -384671, -363431, -287692, -176940, -43638, 59600, 47916, -79100, -187405, -171558, -79422, 50068, 251955, 475254]
11493D75254J72644J41717J16806K6634j29903k42084k62898j97072j01805n9731
11483f0438j7421N5508O7811Rq4015j38959j22994j2945J22878J53291N5305r9524
11471h1494k14537j75030n0657K2365O6551J18984J36850J05936M8028j2118j7685
11460e2807M5231O9126L0186J073J1883M2749J00094J00752j506p4920m3122r157
11448B19582p1879j55502j74714j62435j29593q0532n4026o7786r3262q3864m2919
11437h96930j0675k6865n7043l6508K3371Q6387J31055J33928R0413L2013m0573
11426e71427j15468j00458o2425o0268J1305J40349J83503J17336K7184l8173
11416d68542l4789K7421J21438J87073J83329J58378J24317M5408p0781j47402
$$ y = [475254, 647898, 789615, 906421, 933055, 803152, 561068, 298170, 101098, -707, -60438, -77859, -22351, 45460, 45469, -38546, -177505, -300499, -313444, -190566, -37275, 18030, -81494, -296031, -471061, -521718, -499353, -432802, -313818, -176968, -71032, -23004, -35122, -52807, -7576, 61550, 91736, 92809, 104692, 147441, 247535, 348287, 346781, 271861, 228739, 219582, 147703, -7799, -182513, -344948, -474541, -555073, -609099, -676885, -770147, -854011, -896930, -907605, -934470, -991513, -1028021, -1004650, -918263, -787208, -653280, -562867, -530854, -571427, -686895, -787353, -849778, -910046, -898741, -758392, -574889, -457553, -430369, -468542, -503331, -475910, -354472, -167399, 15930, 174308, 298625, 344033, 273252, 125850]
11406A25850j16316l1296N9740J29583R3731j916l0533j0355O542J2742L04P865
11394B45941K2126K273l2325q7419j38029j00561k1549M9575J20509J27938M6320
11383B34799o5977j91410k40972j54994m7910J6602J12792K04690J77809N4157
11373I9586n9142l6741M9411O4930K0411n779K249J7102J0185p575j7705l8425
11361I8507m9980n0706r0722j06014l3373K1088J1327J6024N7236J15410J33041
11350A21838M2832o0528o2928m5733q4039j19376j20444j34128j77034j65968
11340h05508p1411R328J4792k5456k7221J01307K84036L83770L54290K05229P0116
11329D93272J4325j0747q0692j69831k02972k17698j67597m8813K4245J2483k8806
$$ y = [125850, 9534, -21762, 37978, 167561, 261292, 259376, 228843, 218488, 225030, 237772, 238076, 245941, 268067, 270340, 238015, 150596, 12567, -87994, -109543, -59968, 60541, 188479, 234799, 168822, -22588, -263560, -418554, -466464, -449862, -337070, -132380, 45429, 99586, 40444, 3703, 53114, 118044, 138455, 132676, 134925, 152027, 162212, 154637, 136932, 98507, 48527, -2179, -92901, -198915, -232288, -211200, -199873, -183849, -126613, -11203, 121838, 164670, 104142, 41214, -4519, -88558, -207934, -328378, -462506, -639540, -805508, -876919, -867591, -852799, -878255, -905476, -804169, -520133, -136363, 217927, 423156, 493272, 507597, 496850, 416158, 246327, 43355, -174343, -341940, -390753, -366508, -354025, -382831]
11318c82831j8900O7892J63074J91587J82507J37743M8907N801q101o7106j20867
11307A99706q9813j3008k639m478M8014J47415K34753K30436J30523K3601o5888
11296H38622j26907j34438q9020n7164m9330l255P0611P9625r838j31564k29027
11285A58315k36165j35520M8307K25616K73844J35774o4631j54806j32326r5636
11275B2772o7080p596Q7736J41561J15851Q5911P6354L5016m184k4475p6348j26017
11263B59501r6245k4143l2960q8612o9302J5809J01585J28762O4298j2964P83
11252B46512P8224J33239J45103Q5190p6521k26679k42643j91598j32147l0546
11242b11866P5209J20467M1452p5827j03286p0306k8502K3518R1773J53563J39820
$$ y = [-382831, -401731, -333839, -170765, 20822, 203329, 341072, 389979, 395780, 387679, 320573, 199706, 109893, 96885, 94246, 89768, 137782, 285197, 519950, 750386, 880909, 904510, 838622, 711715, 577277, 488257, 431093, 381763, 378508, 449119, 528744, 518906, 387342, 158315, -77850, -213370, -165063, 60553, 334397, 470171, 405540, 250734, 118408, 22772, -44308, -51904, 35832, 177393, 293244, 379155, 455509, 490525, 486341, 461866, 385518, 259501, 163256, 139113, 106153, 17541, -51761, -35952, 65633, 194395, 258693, 245729, 246512, 324736, 457975, 603078, 688268, 611747, 385068, 142425, -49173, -181320, -211866, -136657, -16190, 25262, -50565, -153851, -224157, -252659, -229141, -137368, 16195, 156015]
11231A56015O8479L282l3064j2416M0299M4556P527k3519o6808o9760k233L7897
11219A50255O861j3746J7397L6142L8429K2109k2204l2631Q696L7216L4472L4047
11207C17043N9256P8552N7105O8582J03621J30095J20385J8796r1623j35462j07923
11196F18427p8667r2225o6565O8601K48077L59017L75750K95998J43153J8245
11186A889811l7011J7867J07394O8924n1761j24125j09783o6886p0307j13043
11176A511080j10005l2670L0213M1194p901r6061j61566j57929r5354m4503j7775
11165H58723K5621N1499N6873O6963R9627J05706K9834o0480o7576m4385k5682
11154A096723k265o2667j82340k07840j16413j8599M5822R3946J45560J89280
$$ y = [156015, 224494, 227776, 194712, 182296, 222595, 267151, 274678, 251159, 184351, 114591, 112358, 150255, 157116, 143370, 160767, 196909, 235338, 257447, 235243, 202612, 211308, 248524, 282996, 317043, 376299, 454851, 511956, 580538, 684159, 814254, 934639, 953435, 861812, 726350, 618427, 539760, 447535, 380970, 449571, 697648, 1056665, 1432415, 1728413, 1871566, 1889811, 1852800, 1870667, 1978061, 2046985, 1995224, 1871099, 1761316, 1694430, 1624123, 1511080, 1401075, 1368405, 1398618, 1439812, 1431911, 1335850, 1174284, 1016355, 921001, 876498, 858723, 884344, 935843, 992716, 1059679, 1159306, 1265012, 1294846, 1234366, 1166790, 1122405, 1096723, 1094458, 1031791, 849451, 641611, 525198, 506599, 552421, 646367, 791927, 981207]
11144I81207J90362J78631J36034Q4749J09626J61444J53758P0733l7999j00261
11134A928284j31923j11552j6604P5574J31484J49176J76219J92835J12489k779
11124B503203l8534n2087l6676K1063K0373m3764k6306Q5092J36891J31789J15081
11113B816125P4851L0163O930k778r353J6448Q4937J18179Q6648P3163Q5155J03883
11101C484351Q9332J3709o0359j31128k25959k79008k41463j80433j31347r2222
11091B245473m1809M0868J01477J06006P2772M7905L3501L2259M8656Q322o8789
11080B626641j00143j18982j45691j47155j05443m5506j6491k0818l3540o1299
11070A831573r7337r6345k9719Q1882K01690L02029L18369K77325K68625K59606
$$ y = [981207, 1171569, 1350200, 1486234, 1570983, 1680609, 1842053, 1995811, 2066544, 2028545, 1928284, 1796361, 1684809, 1668205, 1743779, 1875263, 2024439, 2200658, 2393493, 2505982, 2503203, 2464669, 2412582, 2375906, 2396969, 2417342, 2373578, 2347272, 2432364, 2569255, 2701044, 2816125, 2890976, 2921139, 2928069, 2925291, 2915938, 2932386, 3017323, 3135502, 3222150, 3295313, 3380468, 3484351, 3573683, 3587392, 3527033, 3395905, 3169946, 2890938, 2649475, 2469042, 2337695, 2245473, 2203664, 2244532, 2346009, 2452015, 2524787, 2572692, 2606193, 2638452, 2687108, 2695430, 2626641, 2526498, 2407516, 2261825, 2114670, 2009227, 1963721, 1947230, 1926412, 1892872, 1831573, 1734236, 1637891, 1608172, 1690054, 1891744, 2193773, 2512142, 2789467, 3058092, 3317698]
11060C317698K25969K26226J81583J07789R7361Q8100K9385q355L6251P6103K3119
11049D401229l7853l9583m0945o1615n9063l5836o0328m1942O6591J70162K09554
11038D470371J67246O2645o9791j61146j58172o0532L1398l0689k12492l38283
11028C700555l69268l73626l62183l36067k89708k62894l03829l73560k89571
11019G39849k3000J56628O6341j13255j08645K5503O4593k5202r6864n3380N1735
11008F84303J42950J65693J12162L1524m1956m8049R714J4798l4741n1289j8847
10997I66262O3864J41205J19617N3667n786p5772j50488k22414k22169j09342
10987E58644O3564K54273L98848L68420K00164N4908j1971m7368o3370q773L3202
$$ y = [3317698, 3543667, 3769893, 3951476, 4059265, 4156626, 4244726, 4274111, 4265756, 4302007, 4378110, 4401229, 4363376, 4323793, 4282848, 4221233, 4162170, 4126334, 4066006, 4024064, 4090655, 4260817, 4470371, 4637617, 4700262, 4630471, 4469325, 4311153, 4250621, 4282019, 4251330, 4038838, 3700555, 3331287, 2957661, 2595478, 2259411, 1969703, 1706809, 1402980, 1029420, 739849, 716849, 873477, 939818, 826563, 717918, 743421, 808014, 782812, 685948, 632568, 684303, 827253, 992946, 1105108, 1136632, 1094676, 1046627, 1056341, 1071139, 1036398, 985109, 966262, 1030126, 1171331, 1290948, 1344615, 1338829, 1263057, 1112569, 890155, 667986, 558644, 622208, 876481, 1275329, 1643749, 1843913, 1898821, 1886850, 1839482, 1776112, 1767339, 1800541]
10976A800541j942p475K5409K2636L0113P9659J05510K4298p8008j04362j02366
10965A794013j75922k41001j68309o6657p211J02836K32526K79445K40865J50358
10955B140943P2573K8744O9990J57957K04585K13830K43324K77458K70784K69687
10945C949875L25661M01530M14872L74995K82825J77978J86923K67687L19825
10936F702171L14739K26561N6646j29421k55804k61805j31030K6992N7140k4473
10926F581716r4596j33412j95008k45853k12559j28728q6207j25960k50284m10907
10916D698202m71432l27977q5178K7937l1721j68664k48883j66901j0515M9835
10906C264703J5114p5358j57959j62099j09331o3157m3844j6823N00p0946j64089
$$ y = [1800541, 1798599, 1791124, 1816533, 1839169, 1869282, 1948941, 2054451, 2078749, 2000741, 1896379, 1794013, 1618091, 1377090, 1208781, 1142124, 1134913, 1237749, 1470275, 1749720, 1990585, 2140943, 2213516, 2242260, 2312250, 2470207, 2674792, 2888622, 3131946, 3409404, 3680188, 3949875, 4275536, 4677066, 5091938, 5466933, 5749758, 5927736, 6114659, 6382346, 6702171, 7016910, 7243471, 7300117, 7170696, 6914892, 6653087, 6522057, 6549049, 6606189, 6581716, 6487120, 6353708, 6158700, 5912847, 5700288, 5571560, 5485353, 5359393, 5109109, 4698202, 4226770, 3898793, 3813615, 3841552, 3809831, 3641167, 3392284, 3225383, 3214868, 3264703, 3279817, 3204459, 3046500, 2884401, 2775070, 2711913, 2668069, 2651246, 2651746, 2580800, 2416711]
10895B416711j38906K004J19937J47292J14633P8630N8286j5948o9655K3307K10673
10884B946964L47305L69815L21189K34039Q1416o8441r7302n1881k3279m5317
10874D014508j31900k17623k69952l05868k91602k20492r0411N1773Q2333o762
10864B614004j13951j66644j17317O785J3884j36172k41646k02927r1319m837
10854A559860J4092m151l930N1540J63458J99714J32187J09112J24185J38877
10844B484944K10644K62408K23704J44023J25763J66092J68159Q3623j8628n6287
10834C794445p4719j20641j58444j39603q6484r0819j54399j56566p7434j5561
10824B719775k2892K7832J65089K31960J67959R6031K3164o7951j15496j22120
$$ y = [2416711, 2277805, 2279809, 2399746, 2547038, 2661671, 2740301, 2798587, 2782639, 2712984, 2736291, 2946964, 3294269, 3664084, 3985273, 4219312, 4300728, 4232287, 4134985, 4083104, 4059825, 4014508, 3882608, 3664985, 3395033, 3089165, 2797563, 2577071, 2486660, 2538433, 2620766, 2614004, 2500053, 2333409, 2216092, 2222877, 2236761, 2100589, 1858943, 1656016, 1564697, 1559860, 1573952, 1569801, 1565871, 1617411, 1780869, 1980583, 2112770, 2221882, 2346067, 2484944, 2695588, 2957996, 3181700, 3325723, 3451486, 3617578, 3785737, 3869360, 3850732, 3794445, 3719726, 3599085, 3440641, 3301038, 3214554, 3123735, 2969336, 2812770, 2735336, 2719775, 2696883, 2724715, 2889804, 3121764, 3289723, 3385754, 3408918, 3340967, 3225471, 3103351]
10814C103351j02116q8112j42943k28113k36985j99973j46294m6705N6488J05587
10804B074185M7534l7140p4755m8847o785l7831j03316j23752j26927j74569k10476
10793A177321k29644k31279j35008J9863J30854J77125J73135J05749J4617n1380
10783A151353p7761n7734j4810K3507J3424p3335k14066k98703k73115j93507
10773a4747r7021j5495L6059P8284J14970J55359J57675R6030K5188l2914j07318
10762C96070j58299j27596m1126L2285L8260K2124K1301j5269o0739r8557j36550
10751a28096j96527k25023j63295q3509m4206n263N3351M9673M0599M2868m9341
10740g08769j57336j29632K4569J80781K74450K92907K15307J39975J16427J00754
$$ y = [3103351, 3001235, 2913123, 2770180, 2542067, 2305082, 2105109, 1958815, 1912110, 1968598, 2074185, 2121719, 2084579, 2009824, 1960977, 1954192, 1916361, 1813045, 1689293, 1562366, 1387797, 1177321, 947677, 716398, 581390, 601253, 732107, 909232, 1082367, 1188116, 1202733, 1151353, 1073592, 1015858, 1001048, 1024555, 1037979, 964644, 750578, 451875, 178760, -14747, -111768, -127263, -91204, -12920, 102050, 257409, 415084, 511114, 536302, 503388, 396070, 237771, 110175, 69049, 101334, 139594, 161718, 183019, 167750, 107011, 8454, -128096, -324623, -549646, -712941, -796450, -840656, -845919, -792568, -742895, -702296, -659428, -708769, -866105, -995737, -971168, -790387, -515937, -223030, -7723, 132252, 248679, 349433]
10730C49433O3795J7667j171N090K7876J02234J88393K12756J85916J39642J16720
10719A408351J46756J49668N2350l4520n0619k5056J8612r054r9628j33608j13578
10708A309674j03086j19608j38586j17609n4111j5982n8249q4558o0238m8568
10698E09079j10930j75624j64122j31818j08895j21114j52404j48413j10828j5570
10688g30639J07323J67645J77591J99435K50536K61286J82953J07727J04879N9700
10678H88436n4470j11690r2376j39333k54297k96059k27960j03454K2284J00460
10668b68459J06212K2801j41497k77827l09756k19358k7654J31494J60219J71553
10658f52272K14757J73372M6728m5671k8443J00976K20247J90076Q3306L3968
$$ y = [349433, 413228, 430895, 429724, 434814, 462690, 564924, 753317, 966073, 1151989, 1291631, 1408351, 1555107, 1704775, 1757125, 1722605, 1671986, 1646930, 1665542, 1656488, 1556860, 1423252, 1309674, 1206588, 1086980, 948394, 830785, 776674, 760692, 702443, 617885, 557647, 509079, 398149, 222525, 58403, -73415, -182310, -303424, -455828, -604241, -715069, -730639, -623316, -455671, -278080, -78645, 171891, 433177, 616130, 723857, 828736, 888436, 833966, 722276, 629900, 490567, 236270, -59789, -287749, -391203, -368919, -268459, -162247, -139446, -280943, -558770, -868526, -1087884, -1115538, -984044, -823825, -652272, -437515, -264143, -217415, -263086, -291529, -190553, 29694, 219770, 303076, 337044]
10648C37044K2607K0579L9021R732r8694j81163j53137p5768l3136J8028Q7803
10637g084Q5560K401r7976j60025j70756j72210j64163q0921L0098Q0752O1481
10626e92843l128o8007r0478l5286P7181J49316J62296J39119O5930p7000k00520
10615d73420k34924k33456k33350j73910r1628l5717J6889L6805M5896R1093J71773
10604a113949K15311J46877J8951n2569m7862L3293J03871O6753r612k3130m032
10593f66098L5916O5049J7461K2404R8460J27578J17944Q4414M1395L8216K5425
10582H164l0565q1840o0976P0193K30383K48876J26553M7923O5496L8060q2676
10571E79591k12995k82324l13785l13857k38390j43653l8566Q4307J42010J20139
$$ y = [337044, 359651, 380230, 419251, 428983, 330289, 149126, -4011, -79779, -112915, -94887, -7084, 78476, 80877, -17099, -177124, -347880, -520090, -684253, -765174, -735076, -654324, -592843, -595971, -663978, -754456, -789742, -712561, -563245, -400949, -261830, -195900, -272900, -473420, -708344, -941800, -1175150, -1349060, -1440688, -1476405, -1459516, -1422711, -1376815, -1285722, -1113949, -898638, -751761, -732810, -785379, -833241, -799948, -696077, -629324, -638936, -662066, -666098, -630182, -565133, -547672, -525268, -426808, -299230, -181286, -96872, -55477, -17261, 8164, -22401, -104241, -165217, -95024, 135359, 384235, 510788, 558711, 624207, 662267, 579591, 366596, 84272, -229513, -543370, -781760, -925413, -963979, -879672, -737662, -617523]
10561f17523O0467j1369p9961j39666j38099l6375N4821K4653k9452K9138Q6048
10550g97318J5294n9924k4519P9654J12368Q1181Q5046N0767j4677m7463j21505
10539f41096j72906j01164L0859J21801J30278R2115K9300m4471p1003j3114M4249
10528e95152j0034q1241o0974M8531J17618Q2564M4886N6262J12085J87689J61135
10517F3369L5393p3778r7240o5793m4460o7389r1212n4055J8772N4737Q870n9948
10505c72734q4279q7178j03886j24826j30161j07279m4000N4242J14615R6661
10495g88825M2026J4028n5688j91516k32584o5722J85904L42628L34200K17256
10485a98293R7404P02o8967q2556l6116K3488k011j19072k00837j80640r8904
$$ y = [-617523, -557056, -568425, -648386, -788052, -926151, -962526, -907705, -883052, -912504, -883366, -797318, -782024, -841948, -866467, -786813, -674445, -593264, -508218, -457451, -472128, -519591, -641096, -814002, -915166, -884307, -762506, -632228, -540113, -510813, -555284, -626287, -639401, -595152, -605186, -686427, -747401, -698870, -581252, -498688, -453802, -397540, -285455, -97766, 63369, 98762, 24984, -72256, -138049, -182509, -249898, -341110, -395165, -376393, -321656, -312786, -372734, -457013, -544191, -648077, -772903, -903064, -1010343, -1054343, -1000101, -885486, -788825, -746799, -732771, -788459, -979975, -1212559, -1278281, -1092377, -749749, -415549, -198293, -100889, -100187, -169154, -251710, -287826, -264338, -266349, -385421, -586258, -766898, -865802]
10474h65802q930P4243J21418J34414J57542J69183J31752P1547M6120N8565O3946
10463A53998K5811J0879J9842l5345q7468n2907M9548J09819R4683O4007N470
10452C58337j07294j97595j83258r4992J0099Q5122P1581P380m8965o6245l0924
10441a96754K1604P7299R1542j956j24545j61136j12742q4017p6769n3825m4270
10430f65569k8532J9700N0342K9223J7378N987n6994j34678j78686j81050j50623
10419a273502p5128R6389K86109L33121K04466L5465k0905l654l8j1352j4950
10408d43979k4688n6685p3840l4430K7080O1746Q5075J14297J23256O8154k306
10397a56320n4627j25130j72083j65104j21258o2889J9087P4072P9794R0131P1058
$$ y = [-865802, -874732, -800489, -679071, -544657, -387115, -217932, -86180, -14633, 31487, 90052, 153998, 179809, 190688, 210530, 175185, 87717, 34810, 84358, 194177, 288860, 352867, 358337, 251043, 53448, -129810, -224802, -214703, -129581, -58000, -50620, -99585, -165830, -196754, -175150, -97851, -6309, -8265, -132810, -293946, -406688, -490705, -567474, -621299, -665569, -694101, -674401, -624059, -594836, -577458, -571471, -628465, -763143, -941829, -1122879, -1273502, -1348630, -1252241, -966132, -633011, -428545, -393080, -413985, -417639, -417677, -429029, -443979, -468667, -525352, -599192, -633622, -606542, -544796, -459721, -345424, -222168, -154014, -156320, -210947, -336077, -508160, -673264, -794522, -857411, -838324, -764252, -684458, -594327, -523269]
10386e23269l229j30961k22191j84136m8902J11135K16852K37280K27006K20269
10376a00146J71470M6741o7127l4377Q4740J22607N4004k8875J7563Q1928J4991
10365C63519q7386j45398j75396j53183p6994k7037m8623p3066n0114m4967m3769
10354e62414j1048Q688j1247l2109k3997L3826J26446J92294J77405J20199J09505
10343A27548J26463Q5167l2653j60374k35866k20153j20986K8856J48564Q0330
10333a73104j53001l13551k63989j14682j5795L9051J02274J39917R5816M264
10323f52800l6423O1005J32038N6727n4581j03684p9608l3222j1016K8362P5356
10312f17846O9043M9414O1263J24271J64683Q8781r994k8385K0429Q7790J13159
$$ y = [-523269, -526498, -657459, -879650, -1063786, -1112688, -1001553, -784701, -547421, -320415, -100146, 71324, 118065, 50938, 16561, 101301, 223908, 277912, 249037, 266600, 348528, 363519, 276133, 130735, -44661, -197844, -274838, -301875, -350498, -423564, -473678, -518645, -562414, -573462, -564774, -576021, -608130, -632127, -598301, -471855, -279561, -102156, 18043, 127548, 254011, 339178, 306525, 146151, -89715, -309868, -430854, -401998, -253434, -173104, -326105, -639656, -903645, -1018327, -1034122, -995071, -892797, -752880, -657064, -652800, -689223, -628218, -496180, -439453, -494034, -597718, -677326, -710548, -721564, -693202, -617846, -548803, -499389, -438126, -313855, -149172, -60391, -70385, -98770, -78341, 9449, 122608]
10301A22608J04879R4592M9233l2068o8564o6744j52577k43602k43790j66266
10291f02299j9098J42679K15742J26688P16l0670k6205k4063j8176k1694k2828
10280b79208l7099o8097r8887r2960n1162m1706o9080o2178q336L0206K8623J6060
10268g33824O2941J24189J69748J78745R7989k4101q7338q3481k6589O2572J21368
10257a37781J47227J42939P2878l7877q9978r6219j05213r9931o6647R4P4110
10246a96398O8575m6290j78635k30323k07272j81734j09969q017K4629q606j1796
10235a085836O5253J42707J18902Q309p1710m6465P764J2810n2479q6940l5079
10224a022764Q856Q254L629K7784K6055k4435p4739j03355l0175J20335J87439
$$ y = [122608, 227487, 322079, 371312, 339244, 270680, 203936, 51359, -192243, -436033, -602299, -621397, -478718, -262976, -136288, -135572, -166242, -192447, -216510, -234686, -256380, -279208, -316307, -384404, -483291, -576251, -627413, -669119, -738199, -800377, -808713, -778507, -749884, -733824, -670883, -546694, -376946, -198201, -100212, -124313, -211651, -295132, -321721, -259149, -137781, 9446, 152385, 225263, 187386, 97408, 1189, -104024, -203955, -270602, -270508, -196398, -127823, -174113, -352748, -583071, -790343, -972077, -1082046, -1090063, -1065434, -1074040, -1085836, -1020583, -877876, -758974, -750665, -822375, -868840, -861076, -848266, -900745, -987685, -1022764, -1013908, -1005654, -1002025, -974241, -948186, -972621, -1047360, -1150715, -1180890, -1060555, -873116]
10213h73116J35022L6409q4750j92927j77019n1598P0504J09284J25277J41140
10203g61774J26593P9970p915j02845j12832o0467j5557L0412Q9326J00801O6240
10192e68048L1848l3344j04895j46914j56816j24668j13195p7167N1313J58512
10182a083374J55354J32255J26401P5322p689q3107r4250n7111p824Q9044J66763
10171e88216J56296J07947O7666L4236J7669j0305m8280j05763j04276j6344M6555
10160d42815M3210N8437J18013J19861P0932K6154j7055k4873j3182l6828n1482
10149a49628J3032R7576J14877Q8361J9761p1700j13704j03763o8157l8813p2076
10138b84234j42272j47904q4520k4228J2759Q2950J36458Q1526j1956q4427j61747
$$ y = [-873116, -738094, -701685, -786435, -979362, -1156381, -1207979, -1137475, -1028191, -902914, -761774, -635181, -555211, -563126, -665971, -778803, -839270, -854827, -824415, -735089, -634288, -568048, -536200, -569544, -674439, -821353, -978169, -1102837, -1216032, -1293199, -1241886, -1083374, -928020, -795765, -669364, -594042, -601731, -684838, -779088, -836199, -844023, -754979, -588216, -431920, -323973, -256307, -222071, -204402, -214707, -262987, -368750, -473026, -489370, -442815, -399605, -341168, -223155, -103294, -32362, -6208, -23263, -48136, -61318, -98146, -149628, -136596, -39020, 75857, 164218, 183979, 112279, -1425, -105188, -173345, -212158, -284234, -426506, -574410, -658930, -683158, -670399, -587449, -450991, -369465, -381421, -465848, -627595]
10127f27595j92907j02207N4813J69650K04897J81213R0257p1519j44526q208
10117d46132J59204J46598K0064j07724j35729p9702k7463J1798M2888O7987M8586
10106b99625J6757O7594J84965K31339J53763P8221Q3002Q6749K3596j07310k03016
10095C16035j97129j49340j06312o6952l4827L97P7790J39299J40968R8137L1755
10084B49821K5576M0367j898m5031n6355l2964l1055p0405o4218J1512L5910J90
10072F1450J8458R3470J46900J55926Q1505o5343j49386j75981j79366q8041M3256
10061e7152L9295m2323p7181p4136o7374r2210j45619j72206j18554r054N2834
10050g63680k6983j40006j50400j08253q4777m4397N1266J16684J41588J89223
$$ y = [-627595, -820502, -922709, -867896, -698246, -493349, -312136, -221879, -293398, -437924, -446132, -286928, -140330, -120266, -227990, -363719, -443421, -470884, -459086, -416198, -348211, -299625, -282868, -215274, -30309, 201030, 354793, 433014, 516016, 602765, 626361, 519051, 316035, 118906, -30434, -136746, -203698, -238525, -238128, -160338, -21039, 119929, 218066, 249821, 275397, 315764, 313866, 268835, 212480, 179516, 148461, 78056, 13838, 25350, 61260, 61450, 79908, 173378, 320278, 476204, 557709, 492366, 342980, 166999, -12367, -100408, -57152, -17857, -60180, -137361, -211497, -278871, -371081, -516700, -688906, -807460, -816514, -763680, -790663, -930669, -1081069, -1189322, -1274099, -1318496, -1267230, -1150546, -1008958, -819735]
10040h19735K38033K33216J76003J31335Q8425j4665j16978j31948j10832j23360
10030d50506j07166n5311j5058L9860N0291M7714J14211K12415K33387J40670
10020B10507K3804o9633j12543p7345l5234o6578j34380j64279j40270q7613J162
10009f52402P7753O8074L703o1451q3725o3016o033N4682L0584k8929l3153o335
9997g00248j5379o5909p7558n0488k0722L5755J21298J98996J92700J27485J02204
9986a51866J09981J14183J19099J05555M2889m9840r2154p1820j19445j62510
9976a55928r1029l0053n8735j36163j54144q2746j0864j9823p1441m7404M0386
9965h17944R6749J17334N5463o1518j52061j75472j17072j6328M4026M5688J8535
$$ y = [-819735, -581702, -348486, -172483, -41148, 47277, 32612, -84366, -216314, -327146, -450506, -557672, -612983, -628041, -588181, -537890, -490176, -375965, -163550, 69837, 210507, 234311, 164678, 52135, -25210, -60444, -127022, -261402, -425681, -565951, -653564, -652402, -574649, -506575, -502872, -564323, -648048, -711064, -717097, -662415, -631831, -660760, -693913, -700248, -715627, -781536, -859094, -909582, -930304, -894549, -773251, -574255, -381555, -254070, -151866, -41885, 72298, 191397, 296952, 339841, 290001, 197847, 126027, 6582, -155928, -246957, -277010, -335745, -471908, -626052, -708798, -719662, -739485, -810926, -858330, -817944, -721195, -603861, -548398, -609916, -761977, -937449, -1054521, -1070849, -1026823, -981135, -962600]
$$ [...]
##END NTUPLES=NMR SPECTRUM
##END=
