##TITLE=C13_DE-77W-b_TFA
 DMSO-d6, 22000sc

 26.11.2024
##JCAMPDX= 6.0         $$ Bruker NMR JCAMP-DX V2.0
##DATA TYPE= NMR SPECTRUM
##DATA CLASS= NTUPLES
##ORIGIN= UXNMR, Bruker Analytische Messtechnik GmbH
##OWNER= root
$$ XWIN-NMR		Version 3.5
$$ Wed Nov 27 13:42:04 2024 Russian Standard Time (UT+4h)  she@DPX200
##.OBSERVE FREQUENCY= 50.327896
##.OBSERVE NUCLEUS= ^13C
##.ACQUISITION MODE= SIMULTANEOUS
##.ACQUISITION SCHEME= undefined
##.AVERAGES= 18720
##.DIGITISER RES= 17
##SPECTROMETER/DATA SYSTEM= spect
##.PULSE SEQUENCE= zgpg30
##.SOLVENT NAME= CDCl3
##.SHIFT REFERENCE= (INTERNAL, CDCl3, 0, 222.565)
##AUDIT TRAIL= $$ (NUMBER, WHEN, WHO, WHERE, WHAT)
$$ ##TITLE= Audit trail, XWIN-NMR		Version 3.5
$$ ##JCAMPDX= 5.01
$$ ##ORIGIN= Bruker BioSpin GmbH
$$ ##OWNER= she
$$ F:/spectra/data/she/nmr/c13/1/pdata/1/auditp.txt
$$ ##AUDIT TRAIL=  $$ (NUMBER, WHEN, WHO, WHERE, WHAT)
(   1,<2024-11-27 10:17:03.51 +0400>,<she>,<DPX200>,
      <created by zg, POWCHK disabled, PULCHK disabled
       terminated by command 'halt'
       configuration hash MD5:
       00 E9 B6 7A A2 85 ED C7 34 08 36 98 17 FE 4E 26
       data hash MD5: 32K
       41 DB 62 B4 CF B7 9F D6 1E 92 E5 39 F2 8C 9B F9>)
(   2,<2024-11-27 13:40:28.43 +0400>,<she>,<DPX200>,
      <Start of raw data processing
       efp BC_mod = 2 LB = 2 FT_mod = 6 PKNL = 1 PHC0 = -552.9886 PHC1 = 28.57841 SI = 32K 
       data hash MD5: 32K
       78 F0 6F 6C AB 4F 5B 08 DA AD 06 19 3E 5E 29 95>)
(   3,<2024-11-27 13:40:31.28 +0400>,<she>,<DPX200>,
      <abs ABSG = 5 
       data hash MD5: 32K
       A8 BC A8 DF 3E 17 54 05 FB A7 26 BF BC FF 1F 10>)
(   4,<2024-11-27 13:41:04.21 +0400>,<she>,<DPX200>,
      <pk PHC0 = -1.705228 PHC1 = 2.8 
       data hash MD5: 32K
       EB 73 E8 95 1F 48 AC 8F E5 3B E1 2D B3 AA A9 03>)
(   5,<2024-11-27 13:41:07.73 +0400>,<she>,<DPX200>,
      <abs ABSG = 5 
       data hash MD5: 32K
       01 77 9C DC 38 29 CB 8E 6F 63 D8 40 49 3D BD F8>)
$$ ##END=
$$ 
$$ hash MD5
$$ 39 46 D4 AF 27 D4 E4 21 13 BC BE 6F 0F A0 5F B8
##$RELAX= 
##$RELAX= 
##$RELAX= 
##$RELAX= 
##$RELAX= 
##$RELAX= 
##$RELAX= 
##$RELAX= 
$$ Bruker specific parameters
$$ --------------------------
##$DU= <F:/spectra>
##$EXPNO= 1
##$NAME= <c13>
##$PROCNO= 1
##$TYPE= <nmr>
##$USER= <she>
##$AMP= (0..31)
100 100 100 100 100 100 100 100 100 100 100 100 100 100 100 100 100 100 
100 100 100 100 100 100 100 100 100 100 100 100 100 100 
##$AQSEQ= 0
##$AQ_mod= 1
##$AUNM= <au_zg>
##$AUTOPOS= <>
##$BF1= 50.322709
##$BF2= 200.13
##$BF3= 50.322709
##$BF4= 500.13
##$BF5= 500.13
##$BF6= 500.13
##$BF7= 500.13
##$BF8= 500.13
##$BYTORDA= 1
##$CFDGTYP= 0
##$CFRGTYP= 5
##$CHEMSTR= <none>
##$CNST= (0..31)
1 1 145 1 1 1 1 1 1 1 1 1 1 1 1 1 1 1 1 1 1 1 1 1 1 1 1 1 1 1 1 1 
##$CPDPRG= <waltz16>
##$CPDPRG1= <>
##$CPDPRG2= <waltz16>
##$CPDPRG3= <>
##$CPDPRG4= <mlev>
##$CPDPRG5= <mlev>
##$CPDPRG6= <mlev>
##$CPDPRG7= <mlev>
##$CPDPRG8= <mlev>
##$CPDPRGB= <>
##$CPDPRGT= <>
##$D= (0..31)
$$ [...]
##$SUBNAM4= <"">
##$SUBNAM5= <"">
##$SUBNAM6= <"">
##$SUBNAM7= <"">
##$SUBNAM8= <"">
##$SUBNAM9= <"">
##$SW= 239.972175391363
##$SWIBOX= (0..15)
0 1 3 0 0 0 0 0 0 0 0 0 0 0 0 0 
##$SW_h= 12077.2946859903
##$TD= 32768
##$TD0= 1
##$TE= 0
##$TE2= 300
##$TE3= 300
##$TEG= 300
##$TL= (0..7)
120 120 120 120 120 120 120 120 
##$TP= (0..7)
150 150 150 150 150 150 150 150 
##$TP07= 0
##$TPNAME0= <>
##$TPNAME1= <>
##$TPNAME2= <>
##$TPNAME3= <>
##$TPNAME4= <>
##$TPNAME5= <>
##$TPNAME6= <>
##$TPNAME7= <>
##$TPOAL= (0..7)
0.5 0.5 0.5 0.5 0.5 0.5 0.5 0.5 
##$TPOFFS= (0..7)
0 0 0 0 0 0 0 0 
##$TUNHIN= 0
##$TUNHOUT= 0
##$TUNXOUT= 0
##$USERA1= <user>
##$USERA2= <user>
##$USERA3= <user>
##$USERA4= <user>
##$USERA5= <user>
##$V9= 5
##$VALIST= <valist>
##$VCLIST= <CCCCCCCCCCCCCCC>
##$VD= 0
##$VDLIST= <DDDDDDDDDDDDDDD>
##$VPLIST= <PPPPPPPPPPPPPPP>
##$VTLIST= <TTTTTTTTTTTTTTT>
##$WBST= 1024
##$WBSW= 4
##$XGAIN= (0..3)
0 0 0 0 
##$XL= 0
##$YL= 0
##$YMAX_a= 80391465
##$YMIN_a= -140355293
##$ZGOPTNS= <>
##$ZL1= 120
##$ZL2= 120
##$ZL3= 120
##$ZL4= 120
##$ABSF1= 222.5654
##$ABSF2= -17.4314
##$ABSG= 5
##$ABSL= 3
##$ALPHA= 0
##$AQORDER= 0
##$ASSFAC= 0
##$ASSFACI= 0
##$ASSFACX= 0
##$ASSWID= 0
##$AUNMP= <proc_1d>
##$AZFE= 0.1
##$AZFW= 0.5
##$BCFW= 0
##$BC_mod= 2
##$BYTORDP= 0
##$COROFFS= 0
##$CY= -3
##$DATMOD= 1
##$DC= 0
##$DFILT= <>
##$DTYPP= 0
##$F1P= 0
##$F2P= 0
##$FCOR= 0.5
##$FTSIZE= 32768
##$FT_mod= 6
##$GAMMA= 0
##$GB= 0
##$INTBC= 1
##$INTSCL= 4.134877e-10
##$ISEN= 128
##$LB= 2
##$LEV0= 0
##$LPBIN= 0
##$MAXI= 10000
##$MC2= 0
##$MEAN= 0
##$ME_mod= 0
##$MI= 0.1934396
##$NCOEF= 0
##$NC_proc= 3
##$NLEV= 6
##$NOISF1= 120.0001
##$NOISF2= 80.00006
##$NSP= 0
##$NTH_PI= 0
##$NZP= 0
##$OFFSET= 222.5654
##$PC= 1.4
##$PHC0= -554.6938
##$PHC1= 31.37841
##$PH_mod= 1
##$PKNL= yes
##$PPARMOD= 0
##$PSCAL= 0
##$PSIGN= 0
##$REVERSE= no
##$SF= 50.3227345484362
##$SI= 32768
##$SIGF1= 140
##$SIGF2= 120
##$SINO= 11.81781
##$SIOLD= 32768
##$SREGLST= <13C.CDCl3>
##$SSB= 0
##$STSI= 32768
##$STSR= 0
##$SW_p= 12077.2946859903
##$SYMM= 0
##$S_DEV= 0
##$TDeff= 32768
##$TDoff= 0
##$TI= <>
##$TILT= no
##$TM1= 0
##$TM2= 0
##$TOPLEV= 0
##$USERP1= <user>
##$USERP2= <user>
##$USERP3= <user>
##$USERP4= <user>
##$USERP5= <user>
##$WDW= 1
##$XDIM= 32768
##$YMAX_p= 431032870
##$YMIN_p= -1040128
$$ End of Bruker specific parameters
$$ ---------------------------------
##NTUPLES= NMR SPECTRUM
##VAR_NAME=  FREQUENCY,     SPECTRUM/REAL,   SPECTRUM/IMAG
##SYMBOL=    X,             R,               I
##VAR_TYPE=  INDEPENDENT,   DEPENDENT,       DEPENDENT
##VAR_FORM=  AFFN,          ASDF,            ASDF
##VAR_DIM=   32768,         32768,           32768
##UNITS=     HZ,            ARBITRARY UNITS, ARBITRARY UNITS
##FACTOR=    0.368581032318806, 1,           1
##FIRST=     11200.0995020947, 0,            0
##LAST=      -877.195183895579, 0,           0
##MIN=       -877.195183895579, -1040128,    0
##MAX=       11200.0995020947, 431032870,    0
$$ Real data points
##PAGE= N=1
##DATA TABLE= (X++(R..R)), XYDATA
$$ [...]
13353 -271092 -224745 -209132 -188909 -107053 5136 82518 121053 154995 195583 242328 285259
13342 285259 322685 363457 405576 436833 447250 457588 501027 571671 615980 590315 491294
13331 491294 361845 240998 150195 87564 37811 6776 44045 158339 275712 338926 356909
13320 356909 370866 391535 398297 383160 376306 399297 437337 457534 446488 406832 338830 276722
13308 276722 267380 298378 301000 230666 106201 -22627 -107283 -125523 -100888 -79331 -83162 -99866
13296 -99866 -111526 -97021 -45207 13150 40225 35991 15191 -11683 -24763 -2932 51055 100942
13284 100942 96409 37473 -40626 -103733 -121075 -94014 -75289 -102887 -140757 -139129 -111438 -103748
13272 -103748 -120943 -125675 -87065 -13962 80027 172955 225442 230060 215033 220361 246920 276740
13260 276740 295224 261760 176961 92246 40207 20213 32616 65544 77417 38678 -32820
13249 -32820 -85195 -65286 23602 134431 230944 320650 401574 459742 502004 553286 649905
13238 649905 826159 1087196 1411385 1770574 2160532 2544860 2800407 2807353 2565437 2198237
13228 2198237 1819837 1507642 1308720 1200692 1099347 954944 800989 676504 590202 545982
13218 545982 526945 498291 447648 392907 361496 355528 353200 329409 277613 236913 221360 218121
13206 218121 232275 249695 248381 192153 82878 -16273 -82321 -164244 -275746 -386320 -475035
13195 -475035 -523354 -497534 -379495 -222230 -106774 -29266 47036 100151 117912 135800 159447
13184 159447 155349 126131 106454 98064 80341 48273 21111 15187 28833 63061 108783 142414
13172 142414 162894 176201 184345 209359 247074 255781 224238 201974 228411 281841 314640 296906
13160 296906 214282 81235 -52828 -126720 -116523 -68181 -38459 -45552 -60881 -57314 -50487 -50927
13148 -50927 -52060 -74031 -127687 -198585 -268131 -326236 -373573 -424181 -495018 -572616 -621990 -619175
13136 -619175 -573868 -517198 -493402 -512060 -562905 -628151 -663693 -645837 -564991 -432888 -316365
13125 -316365 -265660 -260664 -265040 -261784 -254912 -256320 -260975 -266304 -267845 -223503 -134491 -63824 -31809
13112 -31809 -22200 -26165 -50352 -76106 -64998 -4535 61147 94160 118930 155508 185289 206900
13100 206900 218621 221716 238398 280203 334934 375752 392855 388800 367577 326533 280142 252039
13088 252039 244124 227647 170344 91286 17316 -53501 -122603 -190105 -244501 -251052 -210952 -160818
13076 -160818 -123381 -100752 -69633 -24971 -8826 -32327 -63888 -82295 -104249 -150977 -213847
13065 -213847 -281233 -320729 -308783 -267947 -228326 -210244 -199019 -203665 -250624 -322580 -382126 -406494
13053 -406494 -401945 -398664 -400799 -382096 -321786 -213969 -85813 27361 125988 210730 244698
13042 244698 219177 168973 121990 93143 111756 161841 185287 164391 133001 117551 117369 116635
13030 116635 108620 113587 136746 149117 141986 147475 188535 225577 211408 176139 172511 200502
13018 200502 215478 198339 176618 185236 225902 256592 233349 162359 85060 28439 -15771 -81018
13006 -81018 -176998 -274835 -342964 -392469 -440419 -490135 -542581 -570941 -545483 -494055 -488763 -547734
12994 -547734 -616742 -663554 -686652 -683936 -679632 -681967 -653706 -585943 -509418 -437886 -349460 -240969
12982 -240969 -144687 -61402 27606 101075 113301 70194 9639 -43453 -81306 -103118 -140183
12971 -140183 -219926 -296736 -317003 -284633 -230905 -177419 -121140 -76197 -61842 -55406 -14045 80326
12959 80326 193140 259861 253478 187595 90672 -10858 -103135 -168327 -193646 -189720 -189674 -214053
12947 -214053 -246126 -244827 -199606 -136733 -99920 -92650 -88758 -91416 -103228 -108545 -120608 -142280
12935 -142280 -132039 -86491 -46338 -30459 -11601 27796 91278 179011 254423 272409 234086
12924 234086 175032 116127 71894 50599 30627 6339 14087 82002 178630 258608 303617 306847
12912 306847 290411 279803 265048 227564 174301 114734 39176 -53055 -149805 -232116 -293199
12901 -293199 -331253 -321673 -265454 -217653 -209416 -191386 -138465 -72512 -9316 22983 22577 25459
12889 25459 39472 46652 50028 41069 7076 -20577 -13230 3203 -16960 -90072 -163324 -187277
12877 -187277 -186953 -183304 -167002 -134503 -79041 -10798 27587 10566 -48255 -121335 -183025 -206597
12865 -206597 -184449 -135007 -79326 -39910 -37614 -69196 -109681 -141834 -154765 -158546 -170753 -170946
12853 -170946 -137785 -77433 -21700 -10803 -43617 -83926 -108742 -140057 -211368 -301490 -384881
12842 -384881 -460984 -508355 -527104 -528011 -489792 -429430 -382811 -336314 -276498 -231199 -222461 -229523
12830 -229523 -230095 -210030 -162042 -115994 -85854 -47186 -1221 14055 -10429 -48040 -80627 -129054
12818 -129054 -196130 -254560 -294089 -333251 -380154 -408323 -408986 -405333 -392892 -376637 -380695 -389658
12806 -389658 -389910 -380349 -339118 -282710 -241838 -210226 -186995 -197614 -255006 -322574 -373060 -387772
12794 -387772 -356380 -325974 -327462 -324250 -290526 -262203 -275201 -297530 -274851 -182312 -42528 73269
12782 73269 121251 83847 -41861 -214871 -376544 -480284 -512558 -490105 -438926 -370894 -273576
12771 -273576 -150699 -52735 -31423 -93249 -205869 -312742 -361038 -336555 -268470 -168069 -54634
12760 -54634 9581 20501 63435 178429 295847 340202 306219 254438 226880 210973 193023
12749 193023 197256 231639 251943 212919 131142 74017 78972 129187 198425 255642 257180 185602
12737 185602 62664 -73580 -176944 -225001 -214341 -167389 -87880 21178 105679 135539 104248
12726 104248 31097 -6634 25250 63190 64795 54877 38384 7184 -30833 -48815 -24275 13734
12714 13734 37826 54381 57902 29961 -28242 -83334 -111863 -120705 -119789 -128858 -158894 -180093 -163185
12701 -163185 -116232 -55769 -4511 22451 25743 3148 -52350 -125770 -154618 -108736 -39184 -25722
12689 -25722 -107817 -247979 -373946 -437739 -441074 -423973 -418201 -428057 -436375 -430330 -407705 -370392
12677 -370392 -336963 -315171 -283332 -219578 -126662 -41116 9295 15101 -33950 -115916 -177548 -186171
12665 -186171 -165688 -157556 -165727 -168972 -181976 -223371 -272157 -292214 -290168 -275768 -242156 -176568
12653 -176568 -78209 29126 118896 180548 206819 181971 93179 -30413 -135228 -205614 -224748
12642 -224748 -179989 -127789 -130518 -179324 -228800 -246438 -215323 -144482 -84704 -83856 -134432 -180701
12630 -180701 -188097 -150852 -78383 -17738 -13409 -43332 -62657 -78690 -116429 -166265 -197121 -201840
12618 -201840 -196512 -193892 -186215 -166962 -154701 -149755 -110718 -51680 -34435 -61629 -91146 -104528
12606 -104528 -137192 -196688 -231590 -241709 -260985 -279571 -271590 -225572 -168765 -129930 -98937 -45928
12594 -45928 26600 82444 107094 113608 100130 68307 37360 22739 14487 3143 -5952 -1883
12582 -1883 4533 -23221 -76303 -122861 -160201 -195967 -236320 -274224 -300276 -296562 -234794 -126256
12570 -126256 -17274 48950 58881 47044 46063 40421 15012 -10900 -39377 -75948 -111229 -147480
12558 -147480 -168165 -152718 -131345 -138323 -165847 -200304 -239111 -273800 -273552 -212822 -94485 41328
12546 41328 138456 172534 164198 151003 132488 95487 67428 60241 50644 31205 29464 56134
12534 56134 106710 189962 284378 336568 334375 299921 229818 142494 69830 15924 -30951 -76171
12522 -76171 -110413 -129861 -140547 -134387 -126072 -142260 -171009 -192772 -205935 -212461 -231577 -274977
12510 -274977 -327717 -365144 -366077 -318292 -231865 -146822 -90270 -39742 30270 99645 135196 126496
12498 126496 84806 33932 4399 9819 34430 53478 57254 42582 37757 77491 150181 234045
12486 234045 325608 404844 440199 430074 391578 338189 284027 236442 208446 201134 184034 149720
12474 149720 113049 82249 76460 111775 162085 184997 186273 197950 208726 207158 199973 192823
12462 192823 192729 187594 144965 52581 -54234 -107862 -74564 22501 127129 208804 266578 306128
12450 306128 336890 344618 334689 331283 309524 245377 174216 144688 163279 217318 297743 358439
12438 358439 351377 289653 222834 185525 175655 144026 78061 31923 39570 67717 79847 86800
12426 86800 101136 100109 96223 145155 241741 334534 389078 401574 390893 370789 363658 368462
12414 368462 350304 289448 203667 108000 21007 -20986 -18236 2370 35592 93023 164327 226999
12402 226999 275383 306819 302361 267521 236083 234706 272006 301495 282136 214780 121610 45342
12390 45342 4735 -799 36630 115705 187936 207721 189095 142119 63223 -4525 -5413 49493
12378 49493 129711 211632 261618 279990 283842 269168 222155 156069 112204 114514 128584 112134
12366 112134 74432 50502 56979 82408 89224 62751 26825 -17966 -70447 -85264 -38169 29624
12354 29624 80916 112507 124026 113100 114741 158787 228892 274607 253593 192295 131643 91151
12342 91151 77374 58200 -18110 -130776 -207690 -214989 -153877 -65120 11842 76949 124682 129333
12330 129333 90257 46094 16361 4235 5944 13042 -1745 -76217 -200473 -324186 -390786
12319 -390786 -391802 -353532 -283141 -203295 -150776 -131842 -129526 -143553 -184783 -226080 -248549 -262034
12307 -262034 -260286 -225914 -168750 -125684 -108928 -86330 -55979 -60126 -95140 -131594 -179903 -256005
12295 -256005 -321858 -323574 -270640 -218214 -188690 -161770 -106761 -25175 64040 130207 139591 104027
12283 104027 77136 83995 127771 205020 269818 310966 351736 370955 350193 290579 171871
12272 171871 17546 -116699 -212792 -283786 -361351 -441182 -483681 -472404 -420841 -350614 -306977
12261 -306977 -311654 -329877 -336911 -331625 -309278 -296634 -309845 -308224 -283233 -281962 -333996 -421000
12249 -421000 -480781 -494722 -469163 -397769 -323147 -290596 -312373 -360496 -375180 -341217 -278508
12238 -278508 -212459 -178120 -173502 -173328 -175655 -187239 -211146 -264109 -336036 -390471 -405719 -387710
12226 -387710 -336202 -236177 -106890 -2233 59825 96172 126109 121204 37410 -99203 -214614
12215 -214614 -276001 -310505 -325849 -317625 -330812 -370348 -373862 -310823 -210344 -122151 -73674 -58891
12203 -58891 -53328 -46269 -55894 -63491 -33873 22571 90324 156721 208868 236084 230207 186768 97809
12190 97809 -29600 -138870 -185458 -190331 -181797 -145441 -86186 -34516 24250 137573 307613
12179 307613 435086 458965 435102 428118 450412 479902 492166 474941 446670 444895 474837 515010
12167 515010 534052 501739 444576 410860 395294 381674 367956 355770 361217 385469 408865 422275
12155 422275 433928 441386 425352 399653 401117 418528 391770 292289 161455 54080 -8927
12144 -8927 -40028 -53735 -52892 -57275 -94397 -151234 -186904 -188010 -178580 -198122 -233189 -236740 -206779
12131 -206779 -171610 -147720 -156389 -217727 -275780 -284440 -267417 -235643 -205354 -197828 -200234 -171609
12119 -171609 -102999 -23364 45085 105110 161120 198266 228713 274367 300275 276221 218644
12108 218644 165108 138259 116708 57628 -51958 -160270 -226091 -249425 -236263 -200395 -162389
12097 -162389 -139239 -153400 -195807 -225933 -201176 -135613 -84183 -71374 -92388 -117190 -116248 -95860
12085 -95860 -75328 -71154 -99781 -146539 -184923 -197522 -173728 -149873 -177928 -201427 -142587 -37305
12073 -37305 36747 46340 -2549 -84912 -187866 -302044 -398511 -440973 -419198 -376702 -352003
12062 -352003 -335338 -339397 -367678 -387174 -369801 -331175 -298446 -266231 -230682 -182322 -115626 -58301
12050 -58301 -38105 -30718 -279 55867 119336 167066 180374 167897 147111 111264 64884 26682
12038 26682 13173 45814 118254 186021 194095 141158 89026 50224 -26838 -143662 -235266 -276580
12026 -276580 -284844 -291740 -321246 -342138 -304489 -198007 -71442 31210 101224 129736 115178
12015 115178 77082 23080 -29656 -65699 -93045 -120934 -150051 -166571 -150526 -112160 -70307
12004 -70307 -25919 24365 59975 47196 -4236 -31137 -25752 -30397 -36194 -26837 -13714 -12396 -31767
11991 -31767 -49165 -47559 -64940 -127075 -186567 -171979 -64976 53589 106924 103378 106201 139110
11979 139110 172649 182312 168055 161099 154425 104369 15829 -63768 -109799 -122931 -99399 -39350
11967 -39350 42357 95346 106308 130603 176190 215460 236283 217255 160688 95147 47889 33805
11955 33805 49562 89829 131414 122895 61243 7740 8023 44079 75078 76103 35078 -31139
11943 -31139 -85467 -83443 -24869 39700 56578 33149 21423 36836 47174 49303 51257 38015
11931 38015 12008 -12479 -25567 -31030 -23113 8065 59558 118533 160571 171131 164312 175338
11919 175338 190955 169706 125027 83196 37291 3557 14649 31966 14950 -31100 -84063
11908 -84063 -130839 -167775 -191416 -205762 -235088 -296236 -335322 -295787 -221161 -183243 -202544 -265228
11896 -265228 -342225 -392598 -420716 -453734 -472294 -449961 -382388 -270108 -128807 -3643 70972
11885 70972 85591 45334 -27826 -113150 -178052 -201266 -200446 -178854 -120593 -26565 78455 156945
11873 156945 183506 164112 130761 111109 100999 85914 64849 51191 51271 54279 60169 72071
11861 72071 73034 42720 1705 -8846 27362 67969 71018 26003 -51346 -130960 -212357 -286277
11849 -286277 -348975 -382089 -367491 -340556 -335470 -334373 -313650 -275234 -225671 -176235 -141654 -116957
11837 -116957 -95902 -89414 -84558 -67902 -59134 -54083 -21581 38684 98151 135420 150358 150351 133121
11824 133121 72158 -50958 -203321 -316532 -348204 -310644 -211041 -47604 141235 275019
11814 275019 316752 342764 394679 404997 313719 88690 -241486 -616138 -943204 -1040128 -860948
11803 -860948 -607512 -413388 -248821 -54694 134162 230291 214043 126245 3023 -113446
11793 -113446 -176668 -205126 -243960 -316561 -406710 -485578 -535491 -551094 -536788 -500368 -475270
11782 -475270 -501126 -550237 -559010 -507221 -422800 -336192 -260190 -200254 -138624 -68686 -27479 -41633
11770 -41633 -96149 -152514 -167779 -129711 -62003 -9407 -22104 -104026 -180908 -199442 -186135 -169158
11758 -169158 -148279 -150648 -173007 -184424 -180658 -186376 -206090 -197242 -146960 -94930 -68543 -61505
11746 -61505 -81594 -127353 -170966 -220075 -300681 -390764 -438535 -428297 -380089 -321291 -268777 -221476
11734 -221476 -170531 -128704 -132387 -191106 -266776 -304850 -287449 -233608 -162622 -100623 -82575 -98582
11722 -98582 -110894 -117065 -126184 -139687 -153695 -167025 -177747 -165580 -117840 -65933 -50429 -71866
11710 -71866 -105254 -98834 -28815 56050 95608 70212 18367 -30779 -95905 -178272 -259588 -335850
11698 -335850 -388052 -406243 -407320 -416791 -444777 -456708 -452294 -456254 -439082 -368891 -267694 -188541
11686 -188541 -166509 -201333 -268935 -330516 -364508 -360700 -299359 -169727 12930 223473 466768
11675 466768 771111 1039896 1050606 840832 647085 543037 494514 472407 427090 331434
11665 331434 227190 154553 97527 27849 -52350 -111398 -117060 -110082 -144024 -205682 -242857 -223137
11653 -223137 -161499 -91688 -26557 17588 33680 46942 50155 14097 -56310 -132733 -193226 -243337
11641 -243337 -275194 -285228 -306266 -323573 -304336 -250194 -176364 -105705 -41167 17481 53973
11630 53973 62829 72726 103148 161155 238289 294838 280352 199902 93108 -9513 -89341 -137356
11618 -137356 -139504 -100781 -36997 46578 107890 98570 40744 -12047 -44730 -81224 -140670 -194225
11606 -194225 -204656 -182285 -132301 -68383 -35507 -50164 -85803 -107725 -127137 -177491 -231585
11595 -231585 -263858 -277608 -260254 -228732 -207855 -198456 -216262 -282720 -344954 -355280 -345419 -332959
11583 -332959 -297705 -233974 -174793 -136039 -106568 -89872 -111518 -159671 -208623 -256835 -270459
11572 -270459 -217139 -95509 54393 142216 124592 40373 -68884 -189822 -288712 -323755 -309707
11561 -309707 -281393 -271143 -287732 -299300 -294873 -294926 -312336 -339578 -337209 -278186 -183686 -101165
11549 -101165 -50145 -17724 18673 61810 75154 37182 -39140 -135564 -229350 -303194 -349418
11538 -349418 -379090 -413000 -425737 -372384 -282290 -210775 -141630 -67993 -14150 18098 16262 -23241
11526 -23241 -74807 -104499 -108003 -111363 -151047 -240441 -336662 -373419 -349305 -294799 -215863 -119956
11514 -119956 -41264 -20052 -46652 -92543 -140174 -176843 -201779 -219312 -208525 -158806 -115997
11503 -115997 -115795 -152638 -208391 -275022 -332010 -319387 -203483 -31423 107018 163030 128011
11492 128011 34704 -61070 -113825 -131665 -164296 -217469 -229397 -207681 -228219 -283533 -313958
11481 -313958 -301156 -262990 -225966 -191797 -141216 -60532 42623 148344 233251 281846 291695
11470 291695 251232 149778 27267 -45741 -64111 -59536 -45363 -44504 -80365 -146523 -209673 -247450
11458 -247450 -240773 -181402 -94914 -27142 -345 9289 19418 27395 19000 -11058 -71582 -158226
11446 -158226 -241440 -303783 -334520 -318346 -257321 -182677 -126293 -77149 -25734 13653 34064
11435 34064 42553 59236 111457 173773 194274 185148 173317 150742 123816 118722 135278 148625
11423 148625 148784 148267 157606 168639 144554 79961 30387 32591 54775 73187 117944 196378 270347
11410 270347 321091 347397 319771 242680 193920 223093 288740 327724 341292 348129 332860 299692
11398 299692 293544 349148 436648 488079 471606 408069 339021 278090 222119 179254 139494 85861
11386 85861 36811 28339 67253 106778 83982 3132 -73193 -115633 -144997 -179132 -208104 -238807
11374 -238807 -277546 -279706 -237754 -182197 -111463 -27102 34481 51911 48046 54805 78762 110393
11362 110393 154199 198530 211305 195278 177680 181706 199719 182775 82568 -86932 -232201
11351 -232201 -270543 -244999 -239660 -245305 -220952 -192232 -202010 -233621 -266699 -299950 -325481 -347218
11339 -347218 -360158 -359575 -343208 -320322 -298273 -261209 -202343 -156249 -154548 -184939 -213388 -210319
11327 -210319 -173751 -154449 -189938 -246560 -295188 -333214 -359708 -366804 -347939 -320698 -313874 -315461
11315 -315461 -287143 -212794 -121152 -26483 73887 144683 142823 66403 -17942 -55487 -75925
11304 -75925 -98296 -107214 -97304 -73677 -54572 -30162 -1467 11884 12054 5088 -5202 -5364 13812
11291 13812 7242 -43096 -79606 -74246 -39901 303 14497 11616 19733 15097 -34480 -79264 -82529
11278 -82529 -70028 -64162 -82968 -132428 -180255 -215129 -256946 -306070 -356135 -402987 -441374 -490000
11266 -490000 -564484 -643962 -695705 -715963 -712119 -696451 -674490 -606959 -491786 -368007 -250937
11255 -250937 -159227 -106135 -97615 -127287 -162070 -181607 -188490 -188639 -186540 -182380 -160008 -128808 -109066
11242 -109066 -105428 -111321 -98700 -69522 -64227 -79152 -61716 6400 111928 212772 256715 249803
11230 249803 223952 175090 100397 28309 -21231 -43019 -55205 -73058 -83219 -49305 49259
11219 49259 179687 276193 307600 316715 329261 327738 328898 349034 371624 372282 319849 244968
11207 244968 204833 191318 174051 149534 125000 125715 149375 152474 107854 38393 -16421 -57929
11195 -57929 -110422 -155660 -159723 -126747 -75566 -15066 47449 98342 94567 17442 -74904 -126583
11183 -126583 -131865 -96935 -29848 50285 106913 131703 128683 107528 108968 160467 241808 310213
11171 310213 345521 349766 332159 313849 324723 347670 326031 262095 200227 149443 104994 77738
11159 77738 72824 70634 65944 68738 70695 61274 42614 15651 -41319 -122378 -186242 -220613 -259487
11146 -259487 -331816 -408757 -444310 -441447 -416203 -366867 -303679 -246894 -211320 -192899 -180702 -154228
11134 -154228 -87754 14606 95465 120333 113418 122437 163123 195781 182689 129155 71614 44740
11122 44740 45542 56215 67791 75430 76474 45727 -30842 -101114 -122838 -128523 -168259 -255208 -337027
11109 -337027 -352349 -313427 -265982 -235431 -233980 -253259 -265293 -259955 -257880 -261308 -255206 -254713 -279256
11096 -279256 -322599 -337658 -296810 -244863 -208780 -151616 -54462 55051 139566 184222 201158
11085 201158 191077 147282 99538 77643 82268 106686 147469 191687 215867 211108 190948 169163
11073 169163 164801 188774 219247 216252 185625 170735 183107 189197 180548 192300 229188 268631
11061 268631 299469 316997 331700 352011 360953 355506 339124 319581 322697 364898 448973 544859
11049 544859 605881 624369 630396 648981 684935 750505 877347 1085105 1382052 1749439 2133058
11038 2133058 2488065 2770061 2900819 2812103 2535780 2180633 1827393 1507652 1239185 1012649
11028 1012649 808470 631864 517874 468313 452712 462401 481782 475088 449654 433577 449136
11017 449136 500674 529929 506805 463884 431733 404589 372116 331556 282256 217917 130484
11006 130484 54519 24305 39441 83325 129143 172650 201838 198215 184751 203733 258547 329167
10994 329167 421476 517148 554232 515796 445126 377418 313052 243805 160674 62326 -39563
10983 -39563 -136671 -225609 -309490 -391380 -457401 -488457 -460336 -354206 -191782 -30370 118429
10972 118429 264481 378791 432485 418344 345527 252663 190908 175045 187921 210429 209057
10961 209057 181236 137628 86328 45837 19042 -25538 -119492 -232310 -314322 -348112 -340053
10950 -340053 -303930 -252466 -214249 -192252 -133937 -42452 18185 19233 -19031 -61188 -65899 -18281
10938 -18281 72602 179739 268222 316887 325934 318464 311983 296014 264333 233197 234550 253259
10926 253259 236511 177101 104142 26148 -66715 -166834 -265223 -345628 -368186 -330854 -296574
10915 -296574 -325162 -402925 -467722 -486387 -442326 -333022 -214484 -148425 -131980 -128714 -138010
10904 -138010 -170371 -205438 -233031 -271633 -313269 -329640 -331106 -324937 -273620 -162563 -26680
10893 -26680 98846 187452 219215 211845 204553 202304 217527 289738 396270 465247 499201 529193
10881 529193 541897 521014 464254 404649 374401 357002 349865 368864 421154 514961 626938
10870 626938 733279 843222 949079 1022923 1057927 1089672 1155364 1230737 1280867 1313734 1364271
10859 1364271 1465235 1605584 1733084 1833241 1917433 1984748 2037948 2055037 2002408 1912297
10849 1912297 1839391 1790298 1759436 1757796 1788339 1821954 1846493 1886052 1975116 2105897 2220018
10838 2220018 2286935 2343936 2418622 2492000 2561717 2629599 2677220 2706479 2727328 2715687 2652834
10827 2652834 2564513 2500074 2481125 2485283 2487384 2488676 2487438 2452308 2366074 2273315 2230272 2243501
10815 2243501 2261318 2246825 2213905 2186588 2174009 2159573 2107456 2025983 1979127 2005662 2056871
10804 2056871 2044660 1949799 1806898 1647511 1489163 1337150 1206002 1127553 1118505 1132084
10794 1132084 1093567 1010190 933467 860392 802562 783089 791922 804229 780113 698953 580176
10783 580176 465625 376162 306935 279427 310607 340034 323342 308739 347030 432856 562898
10772 562898 720813 856255 937941 960686 954375 955928 988143 1049024 1126242 1239592 1390249
10761 1390249 1503603 1525090 1484439 1432179 1364942 1252046 1104951 970097 873762 793154
10751 793154 716282 676502 677232 695818 714812 703722 668176 637681 600564 547630 513031 517506
10739 517506 533900 545516 549721 524077 487654 472650 475353 486685 485156 461662 428232 363342
10727 363342 246546 110341 10443 -17618 10448 50992 74290 84628 95583 107369 103925
10716 103925 95389 109702 179295 296137 390815 402790 329441 217452 122422 93545 137090
10705 137090 216769 299487 357027 375714 371972 370734 392378 451930 541417 622008 659892 650263
10693 650263 599898 523214 459122 447794 491719 575479 665170 714306 717880 716734 741822 788435
10681 788435 858693 963727 1079388 1158434 1186292 1178378 1147592 1099772 1037934 967334 926018
10670 926018 944628 1011326 1093764 1177084 1281526 1424686 1613429 1868141 2187609 2535506
10660 2535506 2872261 3204606 3566391 3966787 4396760 4868793 5408339 6032025 6732149
10651 6732149 7500885 8362287 9358099 10501183 11729417 12832227 13441237 13258964 12369360
10642 12369360 11151546 9935974 8864914 7952436 7170136 6518902 6034772 5709987 5475766
10633 5475766 5254809 5055332 4912922 4782403 4633623 4515823 4462657 4433804 4354224 4196784
10623 4196784 4003682 3807963 3597993 3374384 3159306 2970400 2814285 2670551 2527157
10614 2527157 2408323 2347993 2357512 2385377 2381436 2357075 2331321 2313877 2280636 2204500 2085931
10603 2085931 1951315 1823321 1715335 1635908 1586352 1548865 1514714 1477890 1418159 1348797 1299454
10592 1299454 1259068 1198260 1124943 1053159 1004410 1006321 1053471 1083040 1024262 884227 738244
10581 738244 627520 566113 560979 593224 633849 642901 589245 496652 426754 406732 415722 436698
10569 436698 450611 437946 402573 367423 342714 313178 295896 320501 367067 414276 472335
10558 472335 544167 606558 622686 561814 448391 337541 266755 226040 199074 187189 176355
10547 176355 176251 218838 308013 416714 496144 511397 475144 407309 335611 304060 344130 408233
10535 408233 413680 323015 153160 -23576 -138224 -187517 -203321 -198420 -168592 -116301 -47420
10524 -47420 13820 36532 25608 2174 -2252 25593 58859 73747 73283 44501 -14925 -63477
10512 -63477 -63889 -11695 66019 141911 209843 276847 354699 425805 466157 475721 462954 439450
10500 439450 398010 333058 288114 278272 279043 278906 274015 286652 329280 350400 309840 237137 151131
10487 151131 60673 -22557 -106549 -182805 -243921 -297387 -369543 -466492 -564609 -641934 -660233
10476 -660233 -607902 -516725 -413211 -305411 -208719 -147504 -111151 -67198 -13337 41004 77155
10465 77155 67824 25193 18126 80238 150323 191710 228218 248817 247877 228625 178476 71643
10453 71643 -97880 -257746 -332315 -327721 -291025 -263785 -258537 -267361 -288532 -297538 -249266 -151108
10441 -151108 -48736 22638 50880 53266 32367 -25944 -117360 -204143 -253466 -265115 -253527
10430 -253527 -227406 -181207 -109163 -51217 -40356 -33149 -3935 2169 -35532 -78612 -97522 -87887
10418 -87887 -77463 -71321 -52244 -28449 -27697 -64255 -120240 -170811 -204962 -209733 -183892 -150718
10406 -150718 -119261 -68095 14378 105292 179500 217284 194499 132936 69769 10466 -54576
10395 -54576 -121763 -181832 -219855 -219053 -205748 -197711 -174761 -121396 -40267 45743 108060 123003
10383 123003 80907 2294 -81822 -139338 -144860 -115293 -95003 -87114 -69028 -23606 61584 155449
10371 155449 192966 153828 62890 -35970 -96593 -102394 -71074 -46179 -58023 -100102 -126210 -110742
10359 -110742 -80064 -53009 -34086 -2998 68455 141557 158223 135941 93094 27516 -23065
10348 -23065 -46896 -72644 -93513 -110089 -135116 -154115 -170315 -202416 -246518 -276691 -291965 -300585
10336 -300585 -325633 -386457 -456057 -484417 -447663 -362853 -244026 -112546 -2857 75736 128065
10325 128065 162145 178312 180594 187912 199597 196167 169550 124067 76983 42937 18790 -7882
10313 -7882 -67300 -176154 -294552 -357415 -335413 -264570 -184173 -112606 -65475 -48865 -48315 -31464
10301 -31464 6626 44946 71792 77259 58692 26990 4940 23006 73685 137073 185398 194438
10289 194438 180733 171165 150544 99993 25112 -42526 -47255 44434 191372 290245 283031 208446
10277 208446 118654 33080 -34238 -70348 -85077 -99518 -102670 -78017 -36040 -9732 -21645 -69758
10265 -69758 -123552 -133079 -88069 -25577 -1980 -39499 -111778 -185301 -237160 -262647 -276597 -276016
10253 -276016 -255879 -222718 -196923 -185588 -157766 -71841 34988 89177 76293 19630 -57511
10242 -57511 -141864 -220796 -284277 -320332 -315233 -273831 -230059 -217280 -233707 -270810 -303098 -292518
10230 -292518 -232063 -153511 -85576 -35756 -4043 3296 -13608 -45010 -82675 -117304 -133157 -139016
10218 -139016 -193121 -303314 -374822 -333423 -231274 -161730 -145364 -139105 -115047 -95699 -113461
10207 -113461 -153923 -170359 -131811 -48674 27648 64310 47927 -5502 -60953 -102927 -132315
10196 -132315 -137283 -97856 -70028 -107491 -210038 -344688 -447706 -474574 -456003 -435061 -398136
10185 -398136 -325317 -233555 -154517 -93052 -31572 31723 89230 140193 177998 183408 147338 102131
10173 102131 80924 59444 27029 20702 37404 43286 18008 -26574 -64167 -76461 -62416 -48644
10161 -48644 -51767 -66402 -76387 -63732 -28631 31935 113786 188250 220153 187216 129563 112217
10149 112217 130850 147304 139411 85401 -28366 -196594 -369309 -478024 -509869 -488991 -441206
10138 -441206 -410309 -425584 -461137 -465331 -404012 -287785 -176590 -130805 -136224 -131851 -92039 -54422
10126 -54422 -56494 -92368 -149340 -199890 -237597 -268600 -298596 -311640 -290011 -241809 -187538 -171131
10114 -171131 -180755 -155916 -118447 -136880 -189109 -187189 -104957 -11455 23076 -9241 -72437 -114212
10102 -114212 -96549 -29077 60534 143594 183613 174264 147206 112821 79275 65169 75752 95582
10090 95582 100370 93536 83182 92816 135906 167700 162099 142735 140805 165628 183350 172168 135054
10077 135054 100814 110950 155496 196404 220618 239739 281262 354696 422627 464029 491994
10066 491994 508328 492687 423118 330650 259408 207534 143357 40525 -95772 -232698 -334789
10055 -334789 -377695 -357618 -294799 -216211 -125056 -27851 52227 116246 178060 208427 169827
10044 169827 83261 -24229 -137053 -227994 -282401 -298613 -268347 -197414 -125376 -92511 -95769
10033 -95769 -95897 -56454 24274 99106 94472 -3168 -120848 -208079 -251682 -237197 -184478 -127463
10021 -127463 -87506 -71833 -92450 -163854 -270518 -363929 -401439 -402870 -410793 -445494 -485955 -477837
10009 -477837 -410807 -341483 -306564 -293990 -293812 -302681 -309942 -297751 -257558 -191214 -107869 -39792
9997 -39792 -6934 439 6708 24142 61825 111572 158277 210579 249357 237687 158238 34922
9985 34922 -76791 -144025 -167610 -151597 -113175 -86876 -80983 -88526 -113946 -147941 -161714 -152731
9973 -152731 -147808 -162676 -169099 -148156 -106733 -57510 -7613 64726 161010 247565 315547 371681
9961 371681 404108 414088 421963 442610 467171 482123 477832 444559 400438 373505 351110 293142
9949 293142 212544 173992 198072 248378 269913 254140 215350 173535 153032 144018 115368 61150
9937 61150 13332 -11796 -37673 -82520 -135344 -189244 -233921 -259023 -267563 -264301 -255185 -240592
9925 -240592 -209300 -149917 -76734 -22566 10250 54276 121198 182307 224214 257317 273656 242544
9913 242544 156385 56109 -35939 -137162 -238720 -300236 -299090 -247582 -181701 -146870 -157567
9902 -157567 -190287 -204748 -191659 -160627 -91839 -2501 40128 6863 -56653 -80201 -43155 2725
9890 2725 22257 28550 52960 105375 149937 161434 129276 69039 -951 -86134 -176359 -240637
9878 -240637 -256484 -219577 -153631 -86820 -36569 10195 74671 162918 247595 266963 217820 176851
9866 176851 197536 258792 320881 344779 296301 196617 111821 86927 126974 199077 237034 215559
9854 215559 182782 179039 194513 207135 200798 178227 160209 161814 199202 253824 300109 350698
9842 350698 415912 458406 439954 388018 342623 311359 276117 236813 223170 248887 303048 363477
9830 363477 399442 377227 323807 277766 212650 127125 76691 87244 140947 198249 217781 201110
9818 201110 196148 233825 263185 237094 191674 154909 114775 87664 114924 198512 298022 382760
9806 382760 483103 639956 834041 992372 1080235 1114582 1114387 1113240 1143608 1201660 1257863
9795 1257863 1301157 1329762 1331425 1330158 1354612 1402135 1434924 1416070 1351977 1273714 1203323 1145179
9783 1145179 1089367 1027861 977414 938016 877066 790637 714898 688757 720167 779654 830341
9772 830341 840856 799731 736711 669061 604856 559108 507030 445001 396560 364866 334064 289103
9760 289103 239755 217410 242743 273251 254536 213487 187024 184191 228552 310252 381321 434696
9748 434696 488165 535634 585513 647948 692186 701685 687742 657467 628796 600439 516298 356633
9736 356633 187656 75579 25542 -891 -1081 68918 195485 303113 342905 323545 294183
9725 294183 291500 286583 238658 173539 128401 108284 105732 94688 55012 1941 -35273 -32251
9713 -32251 19951 108315 205554 270119 297746 309980 293470 233426 157368 120501 146310 184883
9701 184883 168696 99734 52233 66858 118080 157213 184463 238298 312626 355230 341911 297472
9689 297472 248086 206570 162536 103362 31747 -34138 -72820 -55016 25494 133707 229643
9678 229643 290521 308725 304702 321833 356816 351156 285333 208614 174987 205988 278834 341914
9666 341914 365474 341120 285768 235349 214574 199871 158846 105751 86549 123259 172068 178129
9654 178129 126969 37921 -40760 -68011 -34327 63064 187567 288097 361498 394369 367999
9643 367999 306618 265154 265064 286271 297201 275837 208601 108601 18461 -26782 -26284 -27655 -77674
9630 -77674 -191217 -350795 -504643 -591380 -579290 -489776 -386078 -319898 -296634 -289195 -288459 -301214
9618 -301214 -307755 -305900 -301638 -285325 -266223 -255070 -260696 -286966 -319886 -361528 -416396 -461078
9606 -461078 -478205 -465131 -415831 -329499 -216524 -96904 -3307 37558 14041 -27754 -28252 7170
9594 7170 46512 75686 82782 73001 65672 65268 70210 44938 -43411 -136164 -158254 -128300 -97183
9581 -97183 -61618 -18236 6660 10021 11556 10775 5319 19362 65181 95729 71957 21288 -16225
9568 -16225 -31472 -24555 -19148 -42954 -95242 -154009 -200467 -255824 -334253 -414804 -454182 -427676
9556 -427676 -351845 -252339 -166325 -127446 -135236 -139452 -119134 -95736 -106220 -168296 -255588 -301024
9544 -301024 -295155 -305760 -350719 -416491 -506158 -601342 -650049 -637349 -597868 -533178 -430942 -316956
9532 -316956 -205240 -105092 -30358 33167 84641 82717 -3211 -144574 -306432 -450048 -525033
9521 -525033 -541220 -536749 -520527 -501121 -509619 -528320 -511983 -461168 -404551 -368286 -354697 -350512
9509 -350512 -328972 -284612 -243730 -224912 -232041 -252652 -262895 -240842 -191960 -142631 -123052 -134361
9497 -134361 -166384 -198503 -200253 -180171 -174545 -182089 -164121 -115547 -78516 -53974 -27237 -4760
9485 -4760 18465 32833 41628 56633 56793 16033 -63802 -133090 -129486 -61445 36117 146811 251943
9472 251943 345818 419556 456180 455861 432676 384831 284857 146901 49487 47351 118890 205967
9460 205967 255683 254162 225203 199320 176490 123503 4509 -170819 -328781 -405259 -407498
9449 -407498 -362128 -291749 -240644 -243827 -288872 -342135 -380265 -399679 -400674 -388318 -367658 -338513
9437 -338513 -288160 -195483 -77887 7344 22517 -28044 -113509 -185886 -216050 -211881 -190083 -168778
9425 -168778 -163498 -150106 -106055 -31047 54241 88296 44104 -11785 -6454 45377 85689 87274
9413 87274 49766 7640 6928 31422 46766 49896 54720 87663 157053 216404 209817 149227 79354
9400 79354 23987 -18934 -48195 -74216 -120371 -166786 -173978 -130046 -48698 34612 106243 177960
9388 177960 240254 236700 116416 -61542 -210917 -318540 -415897 -502020 -528394 -481099 -399351
9377 -399351 -342234 -322100 -311182 -300794 -286980 -244121 -153293 -30141 86639 173317 235557
9366 235557 313056 419426 512657 551381 519661 433192 331684 234229 159088 118804 86826
9355 86826 49128 22704 -9506 -60764 -101562 -109996 -80540 -29453 14031 22189 -16229 -86571
9343 -86571 -137443 -119652 -47868 26876 69948 66668 47121 57888 94247 109552 66034 -38924
9331 -38924 -182515 -321512 -413461 -449560 -460738 -479680 -493490 -485455 -461465 -429144 -403701 -368568
9319 -368568 -305937 -259989 -252860 -260515 -257558 -212319 -129592 -47681 -3511 -19474 -80551 -133555
9307 -133555 -147270 -132294 -115791 -105304 -118813 -184593 -291074 -394358 -453535 -471457 -455904
9296 -455904 -386894 -268672 -152011 -70904 -33454 -25671 -31354 -40625 -54922 -88339 -130321 -157063
9284 -157063 -147343 -110559 -107270 -176291 -273747 -342311 -356781 -342982 -364141 -433101 -488864 -487108
9272 -487108 -452306 -421580 -399490 -373601 -338875 -320505 -371532 -487714 -594291 -643584 -648927
9261 -648927 -636659 -605494 -542371 -472920 -445446 -466984 -508835 -560503 -605053 -617084 -588170 -530530
9249 -530530 -454813 -355498 -280133 -270370 -292570 -282498 -214167 -125295 -47034 21994 73217 96853
9237 96853 107907 127293 142844 143817 133308 105386 61062 32784 36171 47199 59867 75096
9225 75096 81196 84237 66652 9748 -55142 -108538 -139120 -130121 -101750 -82609 -61540 -33102
9213 -33102 -17861 -41940 -98163 -127825 -106181 -75119 -71913 -110404 -186044 -258935 -295580 -319022
9201 -319022 -339978 -356291 -360791 -355052 -365291 -405547 -459654 -494325 -497319 -473127 -431638 -387691
9189 -387691 -331954 -270216 -214239 -154068 -111675 -109800 -128669 -139604 -132680 -117371 -111006 -130607
9177 -130607 -186457 -262558 -332737 -370689 -346232 -270789 -211005 -210906 -265262 -325336 -342066 -318121
9165 -318121 -276476 -220788 -160901 -108526 -66458 -63155 -120218 -207767 -278409 -304855 -281049 -240219
9153 -240219 -214620 -216827 -231585 -234156 -235310 -268834 -327780 -365143 -366795 -364188 -394400 -454645 -513608
9140 -513608 -548613 -549822 -525245 -487141 -418427 -307731 -188356 -118801 -122538 -176027 -242455 -277727
9128 -277727 -261108 -212048 -144224 -59422 18182 63105 76378 66814 55604 75597 141961 217855
9116 217855 243178 211619 163462 136885 134813 139525 161524 195853 190466 124886 63221 43626
9104 43626 12052 -77355 -173385 -205486 -186944 -158109 -142323 -144088 -139640 -133223 -149726 -165122
9092 -165122 -148827 -101149 -18577 83874 170215 214782 226772 216421 195440 204750 252548 310912
9080 310912 343815 330204 291787 269600 289943 361862 454616 529682 580563 603385 604907 619124
9068 619124 668030 741136 815823 888789 963424 1033493 1073032 1064198 1012747 930486 841712 761680
9056 761680 697502 673122 675389 663588 636504 619239 622004 621767 600763 547020 442177 321039
9044 321039 249285 236856 257249 283502 286135 254812 189723 114322 87115 115166 167938 201720
9032 201720 186994 153134 150093 189752 221500 203314 154729 116639 104661 108088 112136 112897 107585
9019 107585 108583 127363 146062 141547 89261 -2474 -88673 -126299 -91109 -1649 91595 162858
9007 162858 215686 256204 285007 308296 322118 302841 233131 139861 60426 13915 19248 96602
8995 96602 221859 318737 356097 346849 322502 321414 329935 309750 261582 218776 204342 195705
8983 195705 169707 158628 184375 220643 237288 234750 262911 344390 431660 487216 531019 590311
8971 590311 659026 712717 736558 740868 746552 754760 773419 814759 875181 957375 1066336 1183408
8959 1183408 1296215 1404610 1472068 1461610 1375631 1242778 1112862 1034266 1011574 1026036 1047697
8948 1047697 1056400 1035493 973029 887179 810041 778509 787043 787052 753665 690040 597165 491800
8936 491800 392238 308041 255616 240489 249448 261976 257866 242519 253426 302362 333348 299930
8924 299930 213953 131359 110422 126918 117065 74223 26361 30026 125827 271692 396566 476726
8912 476726 520601 551872 584880 619454 670145 740683 824862 909942 969670 984805 957764 913195
8900 913195 895350 935771 1001005 1046611 1079144 1116687 1150953 1152232 1125952 1115881 1151696 1205349
8888 1205349 1220361 1185969 1123333 1030002 906538 773012 650044 548593 492678 498486 531993
8877 531993 548802 541466 536072 542350 557398 601075 675651 737225 765695 786921 818685 873151
8865 873151 945902 1005706 1063833 1166921 1305786 1427578 1524160 1623013 1762465 1973694 2261130
8854 2261130 2582959 2879342 3153151 3469184 3832278 4215239 4641761 5132523 5667108 6201637
8844 6201637 6689781 7075506 7330766 7473184 7545463 7574833 7600790 7654431 7707852 7712052 7612908
8833 7612908 7402792 7097490 6730114 6355454 5997463 5639460 5285385 4986929 4768660 4598605
8823 4598605 4451713 4317233 4163493 3961853 3723827 3473619 3224251 2985497 2761660 2567436
8813 2567436 2435257 2362925 2297593 2188808 2043364 1915913 1813861 1722990 1639664 1529567
8803 1529567 1367190 1189950 1040053 927626 865953 850768 856169 887914 954969 1016768 1034276
8792 1034276 1029034 1038162 1051613 1031010 974715 923842 911598 920543 898842 817261 717755 662055
8780 662055 649902 649426 641399 618000 578049 535590 514557 511789 504812 485289 469937 463203 457053
8767 457053 458977 473863 488754 481649 449247 407793 363307 328178 319663 340841 378885 425944
8755 425944 486317 536734 550316 533966 517216 503753 482849 440011 361741 247156 130603
8744 130603 75015 82840 89430 85694 100173 145763 223988 295134 322916 310805 265010 158119
8732 158119 15358 -95370 -145798 -137860 -100412 -69114 -49818 -41197 -30548 13988 93176 189525
8720 189525 265736 295993 304552 315855 301732 259099 246696 278784 319868 366496 433699 478696
8708 478696 448518 339915 211215 118576 57311 -3299 -65764 -109759 -137657 -142326 -112445
8697 -112445 -67958 -26824 1323 10686 13688 30012 48533 47172 32925 -4245 -66682 -96004
8685 -96004 -66602 -24819 -20137 -49602 -92033 -122572 -119434 -111187 -139947 -176533 -174964 -133774 -64869
8672 -64869 -3938 -3267 -53882 -119230 -185331 -231817 -257104 -255362 -213027 -153725 -109454 -76385
8660 -76385 -43120 -25617 -27996 -32579 -8431 78338 189675 247636 234187 198933 198757 216187
8648 216187 188130 112466 29654 -53493 -122564 -142058 -90882 24686 157737 246942 269519
8637 269519 259743 253862 261906 279325 274141 232157 197043 219055 274914 307468 292470 239650
8625 239650 191337 193576 234842 265584 250045 186198 107215 31605 -25051 -36757 -16054 -3658
8613 -3658 -3012 6460 8771 237 5302 40650 100355 147990 167688 149269 96922 40605 -28210
8600 -28210 -142911 -270768 -352567 -369571 -315683 -210000 -115944 -82825 -88873 -95017 -91537 -74835
8588 -74835 -35502 14828 45155 64122 105519 157446 178091 176145 156085 74343 -62450 -187431
8576 -187431 -250350 -253799 -226643 -188086 -138951 -54385 62143 181451 280981 316204 263847
8565 263847 178041 131758 137513 173497 206582 227568 243129 265400 307212 343922 343778 323399
8553 323399 310616 315730 339623 374041 404901 414676 384606 342102 307369 255408 184334 114177
8541 114177 70264 60236 74879 108307 146389 162512 157211 152863 164753 180969 198696 245166
8529 245166 309778 376115 453953 533389 609620 681660 735033 749891 720055 663406 617409 603148
8517 603148 628850 661648 638714 566954 523909 562581 648678 717072 743247 754776 792967 840375
8505 840375 858634 847533 810692 745186 673367 602596 497067 350027 204584 110412 78386
8494 78386 75939 76408 67401 26734 -33376 -66166 -59599 -24609 22595 76124 124129 157760 186220
8481 186220 208426 224932 225640 182571 116150 80013 84804 115215 169948 226592 234535 184643
8469 184643 109895 30098 -28205 -34706 17371 117960 272533 451026 606076 743461 877042
8458 877042 997620 1083004 1085364 1005557 910488 840292 802376 793265 785248 759698 713919 636194
8446 636194 533483 422029 334831 287452 273830 291166 312626 295598 251337 226902 231081
8435 231081 236536 220901 171448 87621 -2834 -57072 -53362 -35155 -48358 -73874 -70315 -15838
8423 -15838 66107 116967 116129 90110 69939 59042 61763 89538 129827 160205 162956 125344 61658
8410 61658 -5059 -60500 -82799 -51371 3109 18321 -27594 -119661 -204059 -237454 -234715 -215238
8398 -215238 -170291 -102715 -49243 -14012 32399 76407 78404 37477 -31345 -105732 -156301 -166858
8386 -166858 -129447 -65137 -23842 -25029 -46675 -71264 -88769 -92620 -66783 -11089 45209 77550
8374 77550 78942 59499 29991 2286 1521 25410 42929 29502 -17802 -77204 -116037 -144149
8362 -144149 -178531 -191430 -171295 -138275 -108901 -90924 -62115 -9180 29816 32409 27590 27468
8350 27468 21271 16519 18283 22156 54082 122924 179648 193174 173856 130238 89918 93133 142162
8337 142162 198452 225703 215525 172393 98523 27669 -7118 -30516 -64464 -114075 -180042 -228829
8325 -228829 -244343 -216090 -112127 21951 122834 186958 209402 186275 135465 71431 11449
8314 11449 608 76826 236270 416768 525536 537258 491032 428256 379755 356873 361782
8303 361782 370158 352103 304700 240678 185702 155540 121992 83884 84295 130756 195744 259295
8291 259295 308136 332850 349651 389733 449915 472726 427948 351054 280340 220557 161437 93966
8279 93966 19344 -46459 -82635 -96380 -90912 -62332 -32085 4090 75709 173463 258773 294887
8267 294887 283402 284192 327157 384574 427268 440390 432212 430416 429135 402502 356468 326619 331640
8254 331640 351905 358217 349507 340753 353044 413911 512508 609256 682417 720414 724403 712089
8242 712089 682353 632334 592735 577850 573438 580967 616210 661031 690248 712783 736937 744875
8230 744875 723837 671625 597674 551112 555994 591056 612264 608407 595889 543717 440477 341990
8218 341990 294330 283061 280568 296509 337250 394967 449178 489899 512116 488706 418098 331884
8206 331884 276106 269530 293001 335376 398327 461489 490935 483480 463475 455842 472099 516503
8194 516503 573179 617855 655788 716630 828108 996289 1183546 1345577 1469027 1545381 1577613
8183 1577613 1580362 1542646 1462748 1368996 1278297 1199681 1142553 1106065 1077194 1035786 1000878 1006483
8171 1006483 1044523 1088652 1129899 1154240 1148347 1129892 1121669 1131507 1163430 1185941 1168464 1153544
8159 1153544 1182090 1217573 1210718 1162343 1110660 1065652 1009053 955768 928405 935599 981169 1056975
8147 1056975 1133395 1187629 1211456 1225882 1232419 1200074 1147144 1124773 1148014 1194810 1253895 1326502
8135 1326502 1416943 1522988 1619317 1675698 1669536 1626732 1594555 1559208 1493299 1409518 1323483
8124 1323483 1252516 1215344 1209913 1219209 1219741 1202367 1209896 1278193 1387813 1502729 1581836 1615763
8112 1615763 1626466 1634381 1650275 1670701 1681173 1653236 1595918 1553979 1532151 1504455 1453331 1392471
8100 1392471 1380717 1449075 1554358 1658408 1758874 1844937 1906454 1926471 1901260 1865560 1825402
8089 1825402 1760997 1697979 1675420 1701897 1758141 1810238 1849315 1911076 2025835 2187217 2372132
8078 2372132 2562701 2750494 2940230 3126681 3283728 3396672 3470332 3505835 3515626 3517719 3507328
8067 3507328 3506416 3539949 3588185 3612945 3589870 3523378 3445643 3390119 3378682 3405165 3428002 3394508
8055 3394508 3294902 3183199 3104404 3053033 3015988 3009921 3052405 3103718 3112010 3073788 3006063 2945046
8043 2945046 2946427 3033814 3172323 3292066 3356926 3379242 3351703 3273690 3201990 3188139 3229360
8032 3229360 3298623 3370091 3426072 3491352 3580136 3639286 3630435 3573241 3513200 3496452 3530706 3587080
8020 3587080 3628334 3635014 3617387 3594962 3563555 3519862 3477900 3441567 3402032 3376877 3409614 3527851
8008 3527851 3710322 3913029 4110826 4286377 4422171 4529034 4636958 4767994 4920738 5071783
7998 5071783 5210151 5362794 5543684 5742985 5965434 6223622 6510601 6816109 7179769 7645334
7988 7645334 8214576 8864732 9599899 10456868 11462557 12665521 14136637 15908972 17963134
7979 17963134 20306077 23017648 26203390 29945436 34263368 39088654 44266052 49524010
7971 49524010 54446664 58551593 61396520 62681513 62301901 60317880 56985854 52778549
7963 52778549 48198205 43646606 39389322 35570213 32230050 29356170 26938220 24918937
7955 24918937 23215848 21775102 20583059 19644615 18928985 18369505 17922673 17585730 17346755
7946 17346755 17171406 17032324 16907280 16767871 16621086 16523730 16538240 16696137 16981803 17377346
7936 17377346 17889825 18527861 19304846 20233199 21338028 22666009 24254953 26145419 28401522
7927 28401522 31111838 34387531 38356668 43172169 49028729 56106305 64542381 74469031
7919 74469031 86006104 99210969 113964299 129833739 145983566 161187449 173955369
7912 173955369 182815979 186652743 184975331 178122970 167190907 153631465 138925912 124349798
7904 124349798 110739182 98508454 87801606 78594819 70768554 64155485 58592852 53952079
7896 53952079 50115141 46949600 44359191 42265139 40577238 39200759 38012999 36915733
7888 36915733 35904850 35027340 34332592 33828016 33492801 33358935 33487334 33884881 34493284
7879 34493284 35274769 36277535 37603267 39327592 41472942 44049642 47125841 50835101
7871 50835101 55320139 60768701 67389555 75360180 84905186 96350365 110063580 126397401
7863 126397401 145731087 168371341 194389830 223499282 254841550 286788018 316886427
7856 316886427 342147347 359621904 367042720 363445767 349492479 327284165 299738051
7849 299738051 269854784 240167375 212407195 187491641 165735753 147072676 131226766
7842 131226766 117841823 106565373 97079819 89110624 82407686 76774521 72057725 68109597
7834 68109597 64766813 61878950 59341847 57058029 54944253 53021431 51358131 49990612
7826 49990612 48950829 48267437 47954008 48007035 48411835 49182877 50368290 52024381 54243548
7817 54243548 57114186 60657353 64886587 69918845 75982134 83351955 92314338 103146871
7809 103146871 116172389 131827568 150620462 173023608 199368867 229719471 263713990
7802 263713990 300326281 337636658 372800051 402302188 422605113 431032870 426467973
7795 426467973 409697613 383229017 350525273 315129446 279989817 247126449 217618701
7788 217618701 191808476 169595247 150651775 134561635 120907784 109311217 99457191
7781 99457191 91108643 84059521 78087725 72983413 68605369 64859975 61628408 58777659
7773 58777659 56220440 53950403 52011527 50424446 49179467 48243906 47605145 47305117 47383063
7764 47383063 47826794 48634149 49841313 51477919 53589046 56258685 59588246 63713549
7756 63713549 68804520 75035684 82608784 91801273 102941830 116345435 132340217 151271331
7748 151271331 173410222 198836102 227276608 257878057 289011810 318268708 342730719
7741 342730719 359460737 366184640 361933963 347362710 324542366 296390414 265920838
7734 265920838 235644476 207290583 181804525 159508134 140295625 123859378 109849127
7727 109849127 97964375 87924507 79415672 72135131 65867938 60498761 55922914 52020756
7719 52020756 48683277 45758083 43110627 40733228 38645824 36818977 35239967 33904270
7711 33904270 32779258 31857572 31166983 30737038 30592470 30723110 31078436 31637245 32422936
7702 32422936 33500393 34925411 36748665 39074754 41991538 45575857 49952883 55307283
7694 55307283 61860502 69773482 79132531 90023061 102501094 116475428 131542611 146898363
7686 146898363 161343979 173411365 181622723 184834608 182552230 175089883 163500406 149260222
7678 149260222 133893922 118667561 104415850 91564079 80252623 70444726 62001083
7671 62001083 54769285 48604003 43374373 38957537 35181607 31886434 29008675 26555365
7663 26555365 24496802 22755469 21237768 19875104 18647782 17559900 16626473 15842608
7655 15842608 15176962 14601093 14105339 13713212 13449690 13297801 13249032 13322486 13494415 13742447
7645 13742447 14076832 14475501 14945918 15575652 16428263 17523571 18900625 20608998 22685466
7636 22685466 25189501 28194206 31728942 35776756 40285002 45096326 49919105 54378346
7628 54378346 58061986 60547693 61477638 60691794 58290061 54573322 49968541 44952689
7620 44952689 39934501 35179728 30832146 26983380 23667126 20848876 18448083 16384244
7612 16384244 14618421 13120708 11850428 10771261 9844337 9055986 8380791 7738471 7092658
7603 7092658 6511931 6065822 5746394 5490892 5244470 5015143 4806719 4585241 4346738 4133468
7593 4133468 3977373 3850404 3720357 3574654 3408252 3229455 3040887 2856292 2705416 2596798
7583 2596798 2507277 2438955 2395149 2352417 2311697 2288314 2279470 2233263 2132591 2054625 2074300
7572 2074300 2168100 2226230 2190065 2089229 1950316 1807060 1695070 1611996 1547624 1506773 1474832
7561 1474832 1422233 1350502 1279001 1230217 1210358 1202809 1191440 1183154 1163390 1117690 1070996 1036494
7549 1036494 1022060 1039858 1076870 1093231 1055226 995621 972425 969032 943746 880602 790757 712171
7537 712171 691227 738272 804780 846314 865374 879854 888383 885636 878969 889751 904382 876537
7525 876537 787792 668273 578453 549007 554632 562035 565237 591688 640319 682262 729736 793527
7513 793527 843169 859946 866773 864427 835300 781475 734979 736722 763248 751575 700716 649259
7501 649259 600177 533637 462855 435389 477623 565630 647479 668545 608815 493344 391711
7490 391711 347835 338932 336910 327432 308386 277276 239223 212771 204382 214570 233498 240263 238323
7477 238323 240708 250070 271145 299434 337176 402393 495780 582950 610113 563073 486879 420041
7465 420041 396052 428385 494751 566269 619804 647871 630820 557990 456850 373112 328455
7454 328455 329575 378967 446771 495895 513640 496790 450307 396633 346254 297028 255114 230036
7442 230036 207875 158747 91914 46387 33972 37433 71726 164289 278796 361303 386602 364254
7430 364254 354632 391849 454045 507535 521372 508122 494720 474119 433666 387551 349399 313645
7418 313645 273027 235362 197706 153569 126674 144149 200434 260674 305130 348002 394353 443633
7406 443633 501659 550945 558906 521534 446147 345477 259466 212460 195573 191320 183701 148725
7394 148725 103973 89805 105818 142974 185518 229475 284148 317344 307783 292191 321096 377703
7382 377703 385193 310131 204401 144474 137588 114410 43294 -18440 -12924 51096 143490 240166
7370 240166 322908 376040 403035 422546 416654 369016 310050 275866 279042 293390 312162 357748
7358 357748 441619 553820 642312 657887 616144 553267 475424 383338 271713 156486 71636
7347 71636 8481 -58908 -118607 -142295 -108548 -9332 121599 219616 254887 254886 247850 224477 164974
7334 164974 63609 -47776 -116581 -124056 -103308 -77046 -39355 -2304 8132 -1647 -10899 -20768
7322 -20768 -35230 -38753 -22592 16011 70008 108842 129021 160918 215917 252807 239624 205781
7310 205781 183342 175057 166963 160152 173118 218730 283641 323647 313976 291860 296051 323868 361573
7297 361573 406577 460192 521617 583890 609626 573118 487068 390006 325039 270708 186440 79573
7285 79573 -25134 -108073 -168543 -222056 -277537 -292023 -253064 -211742 -200847 -210448 -203306 -161416
7273 -161416 -106162 -64776 -51847 -54745 -54831 -53365 -57551 -58453 -34950 41657 181737 341088 454170
7260 454170 484859 439623 344335 232150 146925 124255 151308 189110 233050 281710 328560
7249 328560 382257 431546 486327 538700 547686 500889 417437 330582 279603 260272 243854 227817
7237 227817 215495 212325 199484 150588 99122 110855 193034 306054 422453 531342 603422
7226 603422 611856 565378 479924 340609 164380 29911 -50724 -124148 -194147 -249166 -292100
7215 -292100 -334494 -375981 -395255 -370727 -309090 -223411 -129917 -58100 -5423 28396 39312 46770
7203 46770 48481 11381 -62399 -128918 -144459 -99595 -42987 9594 95940 196097 253447 285312
7191 285312 350891 436987 483982 480421 441022 382996 346230 352701 374210 372009 340798 314253
7179 314253 298278 270216 212346 140501 92984 79948 111510 170387 198191 172660 126871 101248
7167 101248 97168 111299 147149 200205 222451 177180 105406 74338 86746 80150 34449 -30727
7155 -30727 -111627 -161733 -129647 -37978 39923 47800 -2646 -76463 -136880 -144501 -124821 -99150
7143 -99150 -38774 63959 140148 125009 49583 -21617 -66192 -79046 -49273 -8435 5935 -7970
7131 -7970 -40088 -72984 -87735 -75070 -34037 5351 20684 -4435 -61503 -109947 -144455 -182551
7119 -182551 -221403 -238849 -233415 -236264 -241357 -216093 -183724 -164074 -133481 -85773 -20629 71147
7107 71147 160320 214567 242401 247569 240710 234849 227907 203241 176202 170745 197315 249125 312944
7094 312944 368937 415166 451904 470924 472872 453654 409661 366961 360899 394679 453524 509588
7082 509588 510188 420538 280503 152072 61434 18466 36353 86697 136252 175442 191288 175848
7070 175848 126780 57834 4533 -4792 38373 133641 255399 359470 419411 418773 362905 293893
7058 293893 253120 232864 187730 119925 61606 26584 7941 -9873 -41596 -82026 -107400 -121184
7046 -121184 -141891 -177350 -210106 -221535 -219472 -226031 -246521 -248638 -219182 -176288 -123672 -74298
7034 -74298 -53994 -66010 -87792 -92102 -57600 2315 44996 35573 -8448 -29762 -27212 -46876
7022 -46876 -95916 -158706 -224462 -286688 -371846 -478286 -545354 -531272 -453552 -322350 -167612
7011 -167612 -52524 6664 37067 67394 81162 40562 -40129 -95036 -102247 -80381 -38360 14331
6999 14331 48442 67553 103056 147536 153991 111213 43443 -40329 -117047 -184080 -258303 -325787
6987 -325787 -367343 -367990 -328389 -263290 -171665 -58962 30732 59950 33780 -2397 -21063 -51803
6975 -51803 -96122 -114764 -99423 -69070 -21389 52844 115251 117880 60986 -15300 -67363 -91516
6963 -91516 -123320 -178141 -214460 -197423 -151404 -117462 -98331 -71484 -58771 -91572 -122672 -105621
6951 -105621 -44676 53898 168300 271173 364903 430038 443791 428431 415920 404632 376018
6940 376018 344287 308588 250547 169037 91265 64051 80230 90182 54562 -27720 -125300 -189981
6928 -189981 -179832 -109973 -14381 93238 165720 142744 49825 -42961 -81943 -62263 -21478
6917 -21478 -2048 -19478 -32854 5254 84739 175965 267818 325582 332004 325869 348032 409875
6905 409875 499581 586670 638347 645672 599560 512400 426987 367999 344951 340269 320553 282230
6893 282230 252406 261696 313253 377191 424115 455592 471885 470357 439063 377116 319105 293989
6881 293989 263789 195227 141747 166046 258699 336218 365338 395978 460547 565476 682182
6870 682182 765994 816011 851043 855221 810408 739989 679880 648790 638120 602991 537244 482304
6858 482304 444376 404013 341302 259325 161430 79293 60497 95298 124937 123626 120199 128554
6846 128554 122920 87864 46135 25885 42496 73967 82671 80236 109905 176986 233197 258604
6834 258604 263938 240876 196252 162931 154899 151372 128044 82430 27807 -13109 -28236 -7289
6822 -7289 62608 150817 199746 207252 200277 219711 274650 319019 330132 326435 325241 329320 332800
6809 332800 331735 300726 232484 162781 106769 42960 -28683 -84123 -113256 -127314 -143662 -164413
6797 -164413 -165868 -136672 -88705 -45773 -33503 -49922 -82631 -113057 -113396 -84174 -50127 -11105
6785 -11105 51871 130369 177199 166626 136551 132006 151999 153235 93779 -20908 -134840 -213429
6773 -213429 -272547 -304836 -286074 -232548 -176112 -119563 -56650 -16231 -41016 -117316 -173422 -144363
6761 -144363 -24930 121965 237482 310433 372202 435381 479623 499904 515269 544272 578025
6750 578025 585891 554675 489413 385879 276588 208370 174789 118610 10494 -106684 -207120
6739 -207120 -295211 -347716 -334827 -272683 -212920 -170571 -159193 -183034 -192906 -162964 -137416 -132737
6727 -132737 -113888 -55133 51505 190844 318553 388958 397598 381825 365464 354404 363574
6716 363574 383905 374279 338384 327984 350820 370192 362462 351652 372520 423867 470467 483000
6704 483000 452609 386633 323286 278400 232636 183964 161095 175972 208527 240222 247200 215004
6692 215004 189156 205572 248675 300895 350101 396217 440058 468480 455414 390426 283981
6681 283981 171444 115398 126988 166017 210941 256074 288802 313565 374998 477391 572194
6670 572194 636507 693665 752950 794043 814267 822544 833917 863367 899636 918270 913339 882425
6658 882425 832839 771164 710226 677584 704320 757671 784382 784783 786754 791258 791528 746786 621540
6645 621540 474848 383220 344828 332215 340030 365369 394999 390872 347560 323412 347925 403497
6633 403497 485155 584853 670185 722791 747900 746302 729115 744199 807475 876862 931277 968373
6621 968373 971932 939098 873251 761289 631095 551098 530531 514011 469465 430735 412826
6610 412826 386477 361632 385221 456549 507692 491334 450159 435112 435176 425601 404723 366385
6598 366385 302276 240398 197875 143461 63060 -5773 -25528 -12222 -738 -14984 -45246 -52653
6586 -52653 -35904 -33675 -61055 -104369 -123542 -79133 12943 116696 196743 245121 273554 294636
6574 294636 330272 399443 488614 551512 559639 517361 459675 434918 450904 484493 507881 511190
6562 511190 508230 500640 469348 416938 354614 269084 179753 125637 114741 147818 224549 304262
6550 304262 340200 337527 325489 324871 358549 430608 492616 526388 553616 564407 560320 599703
6538 599703 711388 838949 911756 927114 917981 919621 965428 1062969 1218890 1420480 1626243
6527 1626243 1826020 2043222 2291236 2553965 2778980 2906744 2935144 2869592 2722706 2536832
6517 2536832 2342808 2136414 1919467 1723827 1567832 1454966 1393753 1352752 1275190 1151998
6507 1151998 1033650 959325 906649 852551 814240 793527 748738 672646 627341 639785 679242
6496 679242 732736 794757 842325 851314 822005 782784 763223 772866 794214 817538 869840 954371
6484 954371 1022492 1053794 1052055 1028870 984892 909373 825250 755692 705350 677724 665575 665052
6472 665052 685296 711621 729257 738946 734908 713845 672337 603867 504377 404325 330054 272085
6460 272085 221464 172835 139629 134410 135551 144231 190219 276531 376998 458506 507991 533092
6448 533092 563339 598381 622466 633362 625099 603316 560537 494482 457244 491959 592784 704597
6436 704597 773393 789261 727858 618718 538543 503277 480884 463937 466168 472325 468763 470071
6424 470071 472946 459256 430896 410398 406536 419926 459363 526146 607960 676337 719010 754378
6412 754378 772073 738193 652432 556861 483484 416208 341591 268892 215071 205730 227747 243658
6400 243658 228657 191169 144425 110714 99858 110937 154936 200649 195721 169920 190247 239271
6388 239271 257522 223014 177854 155094 148171 147116 147832 159560 179642 189359 184154 180101 184961
6375 184961 185543 177000 166668 158757 158930 166898 171685 138530 63782 22393 30553 36402 22987 -4485
6361 -4485 -39415 -55703 -31568 28822 103712 177663 259365 343157 382171 367552 332512 297232
6349 297232 278607 284325 316921 363068 396979 423068 458459 496986 525772 549628 564997 582479
6337 582479 606185 616052 589750 520799 446082 402816 393208 398014 393502 389648 415255 462493 500214
6324 500214 524178 535517 538121 521476 480550 440104 416427 413569 427032 425455 404313 380901
6312 380901 373880 400300 456306 523782 574305 589089 595127 618516 641377 653990 687679 765092
6300 765092 849862 928575 1018581 1103103 1138210 1115775 1066039 1038560 1107958 1286286 1507581
6289 1507581 1703838 1866382 2035029 2212723 2378946 2534134 2702978 2888111 3045682 3137549
6279 3137549 3174672 3172614 3111788 2996881 2831873 2620894 2384450 2151854 1946465 1748622
6269 1748622 1543592 1347892 1162974 991175 866562 814221 825726 856421 892414 945112
6259 945112 1005483 1052032 1093576 1149068 1202051 1227088 1230351 1218096 1185056 1161719 1169395 1180387
6247 1180387 1139544 1024850 866206 724327 651919 650915 681392 717844 742185 719774 656307
6236 656307 580119 493790 409325 327771 249218 186055 134432 93976 81423 98159 135370 185317
6224 185317 247348 322032 417368 572632 773857 923331 959027 914438 837678 751272 666736
6213 666736 587095 506111 415349 332341 283764 263640 249337 219520 184399 165342 164283 163675
6201 163675 159150 164875 163383 133679 86551 60067 61411 49829 28117 27004 37759 23008 -20936
6188 -20936 -65654 -97938 -115952 -112518 -105988 -130134 -207740 -306756 -349306 -309016 -232651 -174478
6176 -174478 -144237 -115019 -77806 -34472 8711 19820 -18979 -74043 -101136 -107060 -114062 -107347
6164 -107347 -71990 -45154 -61114 -116613 -167267 -175554 -154473 -133727 -125651 -111158 -77769 -57131
6152 -57131 -68588 -116930 -181135 -228330 -255901 -250974 -208241 -151388 -113479 -95103 -73226 -37338
6140 -37338 21343 107920 218613 319365 385844 423308 435660 431668 408043 385867 365487 315620
6128 315620 245187 169242 94456 33702 -612 -16807 -34958 -71970 -143783 -222788 -265107 -261361
6116 -261361 -229214 -186498 -152608 -137227 -115954 -68304 -17639 14200 52983 103494 126914 101611
6104 101611 65882 56622 67218 85499 100502 93724 69648 65445 108729 187359 271535 321176
6092 321176 323777 286690 221650 187025 223142 291475 341314 374962 392494 360100 278715 187817
6080 187817 109374 50124 -11707 -92532 -176636 -228402 -206091 -121304 -34792 24331 62064 84498
6068 84498 101617 124955 150700 167902 162103 146277 150355 160638 157139 156009 168172 173991 160250
6055 160250 132238 90773 64285 90099 160665 219069 200711 134741 87421 61649 43329 8318
6043 8318 -33616 -19038 48266 110049 132601 119840 97499 89226 97882 125276 169218 210400
6031 210400 217055 186218 148307 115158 88245 65353 40648 37957 87029 169142 230860 234757
6019 234757 204741 189188 188405 193433 209569 222785 237907 266868 293393 299099 277271 216895
6007 216895 118594 3640 -107267 -193854 -217518 -184048 -164321 -186039 -217949 -234731 -249213
5996 -249213 -291974 -340451 -357661 -338441 -294240 -241962 -191193 -136997 -68384 26348 156962
5985 156962 331253 528243 712221 887606 1094528 1369273 1708437 2085895 2461565 2759897
5975 2759897 2894671 2814545 2535813 2159320 1791678 1475302 1227365 1037234 895224 805627
5965 805627 752000 703690 632664 544718 481413 455752 420081 365565 321265 283455 234131 186666
5953 186666 156286 132649 103322 59935 8418 -34259 -57029 -63760 -56482 -50990 -64642 -87943
5941 -87943 -114374 -156832 -228861 -287886 -283681 -219443 -142978 -98430 -93133 -120670 -164785 -188944
5929 -188944 -182875 -181940 -204381 -233509 -252482 -241986 -201842 -136989 -62998 -24876 -37672 -66256
5917 -66256 -78089 -87967 -105311 -120742 -136987 -154328 -154525 -124374 -72974 -23943 12112 14907 -24837
5904 -24837 -86041 -150182 -183771 -168168 -123200 -91599 -92502 -120341 -154657 -159737 -124142 -65335
5892 -65335 -2904 71034 146363 186765 164584 94079 44734 40636 55501 72065 69117 27035
5880 27035 -27741 -62844 -103896 -184149 -271764 -305613 -286900 -242624 -189044 -136015 -107489 -113027
5868 -113027 -108689 -53672 35409 118839 172889 210535 243987 233772 162936 66746 -26799 -101882
5856 -101882 -137730 -128574 -99020 -74194 -23071 83663 208832 314702 377185 377312 336324 295395
5844 295395 262175 220204 167301 112570 69934 33410 -8757 -33579 -22708 4588 28644 34318
5832 34318 11613 -27080 -68973 -100250 -109450 -100838 -86726 -53247 3480 65480 125906 177397
5820 177397 205149 203129 175707 132638 98510 68387 30995 2708 -3177 -16492 -54522 -83877
5808 -83877 -87903 -96539 -128441 -133778 -69213 42908 145643 183322 169977 166323 159099 116440
5796 116440 82332 83571 94528 104708 120039 110789 46864 -36753 -82526 -97865 -126547 -171378
5784 -171378 -200634 -201176 -182329 -126374 -22147 56689 61028 24676 -6644 6343 54424 75334
5772 75334 56866 26809 -30807 -111451 -176895 -222072 -237658 -194819 -120105 -94710 -157020 -259344
5760 -259344 -332490 -346829 -323860 -286970 -234252 -177841 -151245 -150468 -138277 -107294 -48096 57415
5748 57415 190225 305218 373236 380563 332486 273018 243837 247914 267509 270197 231106 144452
5736 144452 37119 -38882 -88286 -142981 -193735 -229679 -280348 -340718 -369745 -381312 -404339
5725 -404339 -421639 -402921 -360954 -338019 -339370 -340561 -315798 -264168 -208301 -166153 -155611 -187185
5713 -187185 -244131 -302234 -346840 -346914 -263941 -138434 -64891 -70811 -114824 -145000 -144397 -130485 -139852
5700 -139852 -202280 -275601 -312463 -312143 -285634 -260025 -225961 -160842 -92894 -65490 -103907 -195985
5688 -195985 -283749 -315771 -308555 -289661 -254750 -199653 -124781 -22864 100728 204386 259931
5677 259931 297852 325357 299943 225286 135877 41046 -57326 -145851 -221889 -283189 -315938 -316412
5665 -316412 -282638 -194777 -78426 -10480 -23210 -76662 -100753 -52020 39485 117877 158030
5654 158030 164076 144249 115049 101409 118268 172058 251820 320724 341503 317131 282418 263355
5642 263355 256123 223553 138337 42684 4086 53309 164089 253389 263879 209268 122799 44844
5630 44844 12208 22145 56312 78571 49663 -10594 -52296 -48196 -21393 -6638 -5164 -13282 -41263
5617 -41263 -80264 -115996 -135156 -124738 -75056 -8654 38993 62613 80229 103569 141229 191297
5605 191297 216294 181964 109279 58001 58896 65830 19390 -80415 -174106 -206699 -197641 -165229
5593 -165229 -102045 -27351 26660 45306 58079 92694 120456 122894 104356 77361 78564 105690
5581 105690 113309 80833 36133 5758 -47821 -148288 -237835 -274924 -258404 -182445 -88582 -43408
5569 -43408 -54179 -105048 -169378 -223191 -282077 -337297 -363364 -365620 -330793 -221052 -46558 116817
5557 116817 205517 237061 253424 271511 301298 335449 363418 372610 327487 231899 143732 101308
5545 101308 109262 134938 126533 63914 -26057 -93091 -121978 -126088 -101620 -49450 11700 68586
5533 68586 124725 185622 241172 270768 277188 286827 310821 342826 367012 361378 329776 298952
5521 298952 283202 277569 275273 283526 307499 349232 415643 489275 552228 613417 689161 777119
5509 777119 847212 899386 980933 1114689 1281577 1463263 1639204 1800410 1968836 2182418
5499 2182418 2456419 2820891 3321482 3937813 4604760 5295042 6033052 6858361 7822173 9029351
5489 9029351 10553583 12350997 14215492 15683271 16204390 15608625 14256825 12683489 11253823
5480 11253823 10078784 9064723 8068194 7048216 6078743 5251118 4607122 4117703 3724502
5471 3724502 3388907 3092332 2809449 2518716 2220114 1936931 1693737 1490574 1335831 1235404
5461 1235404 1152942 1066474 990045 924495 838262 715377 592519 510331 500442 565207 652392
5450 652392 706802 720176 694467 615987 510036 420384 344999 268114 204980 188658 205956
5439 205956 229305 260056 266960 197968 91851 24803 -4106 -32516 -55306 -55413 -40184 -21244
5427 -21244 4644 37189 77084 136693 210414 281482 345710 402936 436501 425858 381505 310942
5415 310942 208465 84434 -40534 -150539 -241662 -296208 -285843 -235740 -210885 -231124 -270571
5404 -270571 -307691 -325725 -306150 -260664 -220842 -198662 -206887 -247252 -281516 -271692 -206047 -105837
5392 -105837 -8908 42923 43052 30971 53085 113539 203238 338149 467604 535360 566536 612386
5380 612386 693295 788515 863024 907061 922770 925765 966140 1050909 1120010 1146510 1159805 1156592
5368 1156592 1118288 1052269 978698 904356 832561 793716 779047 731799 659322 590748 529865
5357 529865 482133 429037 353904 280124 226522 178716 138502 133309 161542 154385 59964 -78612
5345 -78612 -185261 -252649 -314749 -363849 -365824 -312649 -226128 -129075 -40541 53533 163326 257818
5333 257818 302419 284511 225226 158306 123315 129977 129042 81521 7012 -50749 -80432 -81577
5321 -81577 -59690 -38766 -22309 -2246 11800 1968 -17028 -5284 53502 122032 165319 193556
5309 193556 234026 284974 323947 351955 379640 395700 363077 266492 142246 29939 -45376
5298 -45376 -81467 -96844 -123337 -183572 -255622 -305977 -327531 -328814 -310704 -288727 -268317 -219941
5286 -219941 -135145 -46621 9203 37450 67808 101282 119784 118959 90193 28043 -53960 -147582
5274 -147582 -226715 -274791 -285626 -257731 -202644 -140274 -102687 -108935 -142592 -166997 -171582 -190230
5262 -190230 -250856 -334745 -406453 -469117 -513855 -508262 -460467 -392968 -309347 -216455 -127601 -52646
5250 -52646 1521 19461 -23349 -120643 -228958 -328541 -422479 -516165 -607528 -661631 -662262 -609652
5238 -609652 -501242 -365778 -238879 -148310 -94346 -65642 -67064 -85754 -90518 -79561 -70719 -58201
5226 -58201 -24051 3021 -36521 -108919 -111334 -14768 130249 254240 330017 357530 326007 257922
5214 257922 186136 127022 94173 74847 47437 4514 -32095 -28214 17921 71468 92815 72086
5202 72086 21647 -46999 -118510 -146657 -126814 -112502 -140443 -186143 -182236 -121439 -58130 -31801
5190 -31801 -55139 -105005 -160600 -194714 -205011 -229044 -296090 -390076 -456739 -488943 -499404 -467370
5178 -467370 -385601 -263022 -121615 5939 93467 140578 151810 116942 37445 -58894 -146741
5167 -146741 -210409 -249873 -269319 -274775 -258325 -187809 -80449 1178 18328 -18113 -68834 -109297
5155 -109297 -148981 -177708 -175323 -157418 -139315 -126459 -149891 -234835 -350567 -461206 -565038
5144 -565038 -653333 -703043 -716200 -697793 -639620 -541379 -428371 -326310 -249418 -210839 -208509
5133 -208509 -234299 -287404 -347606 -372681 -348603 -290834 -222894 -177979 -171867 -176327 -143884 -89981
5121 -89981 -65870 -76697 -100083 -119830 -118279 -81887 -25695 16798 21241 -9372 -55654 -82589
5109 -82589 -87825 -93136 -99080 -103594 -111332 -108789 -101103 -110024 -129553 -140894 -97629 12101 127571
5096 127571 184877 162828 84486 -10845 -96873 -152416 -173156 -183443 -211686 -251543 -266703 -259274
5084 -259274 -273236 -307524 -306739 -256010 -210141 -205469 -219098 -245239 -278704 -299899 -312317 -330914
5072 -330914 -365984 -383981 -337755 -248999 -191711 -201483 -221932 -188471 -115843 -44909 1342 22150
5060 22150 44399 85282 115964 120234 93929 31007 -49030 -117779 -157127 -163753 -135020 -70526
5048 -70526 10809 68867 66005 -11116 -116668 -202612 -251238 -260294 -231378 -171991 -113794 -74431
5036 -74431 -48224 -49193 -84575 -153378 -250212 -326979 -355229 -349053 -329009 -317142 -302807 -254531
5024 -254531 -167617 -62991 12220 14861 -36503 -78747 -87613 -95768 -143703 -248166 -396515 -516740
5012 -516740 -531345 -447202 -334497 -267080 -284670 -373052 -467377 -523651 -531101 -492797 -456881 -453441
5000 -453441 -459317 -459981 -459448 -455903 -425777 -344666 -226429 -105850 -9832 48487 71984 87930
4988 87930 107340 112978 95605 67206 46237 28325 8677 6784 29326 59898 77903 78559 47828
4975 47828 -15747 -78858 -119541 -136429 -118639 -58501 19786 80085 112457 137721 169626 207239
4963 207239 248006 294549 321443 286279 175007 37820 -90698 -218325 -327839 -397928 -434359
4952 -434359 -436824 -399490 -321840 -243876 -196372 -156074 -106514 -51088 12395 85109 155725 197928
4940 197928 211996 219445 221027 221060 247783 303421 352092 359117 312249 238441 177710 138542 121590
4927 121590 130909 163653 193879 189458 168835 165844 176780 160939 89416 -1335 -67223 -113140
4915 -113140 -169922 -250081 -299671 -261859 -170151 -76321 -8930 11534 4999 12190 44646 79321
4903 79321 95163 93946 96389 126286 175544 207352 192515 146249 98673 34869 -46188 -107562
4891 -107562 -131070 -107952 -69212 -53362 -55687 -67167 -95151 -151804 -226423 -285267 -306713 -323494
4879 -323494 -336440 -303166 -238728 -184756 -127653 -47885 51203 154698 232524 247246 176623
4868 176623 59977 -34467 -79940 -98582 -117890 -140164 -155987 -170511 -189075 -202196 -185797
4857 -185797 -135671 -77342 -30319 -4569 -5167 -17755 -2747 44015 80273 88555 78896 66589
4845 66589 68272 70839 70467 83361 114936 161096 185932 156333 97155 47886 12287 -26097 -62806
4832 -62806 -115356 -184545 -203432 -147126 -72189 -15069 18873 20447 -12423 -61929 -106099 -131977
4820 -131977 -132759 -93386 -16487 69937 125247 104787 31476 -19964 -32067 -21072 -935 -14303
4808 -14303 -73866 -125081 -129158 -91371 -33750 20487 35171 -28767 -160019 -295396 -383521 -422324
4796 -422324 -430117 -416583 -371422 -291728 -176696 -42403 76214 156606 172364 125648 83443
4785 83443 110702 210289 331604 411136 423427 399213 373146 351352 324739 291878 259624 231596
4773 231596 201083 163957 126537 82186 33154 12539 29764 43596 40951 53727 80276 77096
4761 77096 26130 -44770 -116960 -191705 -242281 -230398 -164176 -101298 -94670 -153460 -245420 -349916
4749 -349916 -463958 -550915 -592669 -621354 -655387 -669659 -622228 -537337 -484578 -485240 -497490 -502377
4737 -502377 -528322 -573083 -618482 -657814 -669635 -658747 -645501 -621606 -595777 -544255 -450515 -369050
4725 -369050 -335303 -341505 -387396 -459399 -513751 -517463 -458841 -382904 -340363 -333486 -346525 -355092
4713 -355092 -339593 -301593 -253405 -197625 -133948 -74904 -42609 -52007 -56952 -6301 84284 161348
4701 161348 194854 211356 236084 271098 306591 331652 339671 316236 260194 191284 106554 17980
4689 17980 -32331 -29424 17758 72485 90620 74999 51379 38514 45991 52756 22123 -30228
4677 -30228 -57625 -50904 -35663 -15947 30325 111715 199413 260242 278775 256317 221080 181495
4665 181495 126269 51027 -57907 -186226 -279978 -320484 -314622 -271375 -211294 -171176 -172282 -199493
4653 -199493 -202793 -154489 -83080 -37108 -45537 -107296 -211164 -311115 -348226 -313944 -266017 -265919
4641 -265919 -306957 -339034 -365746 -409149 -453181 -456993 -406994 -348699 -306902 -272096 -236339 -189849
4629 -189849 -127577 -77880 -76593 -120040 -186159 -255702 -316544 -348368 -331985 -278841 -237712 -237446
4617 -237446 -271138 -309579 -329575 -329372 -319239 -297687 -256451 -216980 -206597 -239225 -268816 -249553
4605 -249553 -206374 -179638 -183968 -212421 -261928 -310413 -331980 -345533 -367835 -376819 -366115 -386743
4593 -386743 -453615 -510057 -511224 -486557 -492110 -510802 -510352 -519874 -547900 -557373 -523845 -456737 -381108
4580 -381108 -309288 -237620 -186788 -202471 -292407 -414021 -510951 -527538 -459735 -364906 -281715
4569 -281715 -232426 -209525 -187511 -170137 -151836 -126546 -119654 -149785 -197054 -219598 -221238 -236451
4557 -236451 -268405 -287951 -291379 -304630 -312470 -293166 -259052 -219840 -173099 -128519 -97176 -94849
4545 -94849 -156849 -280630 -401094 -490569 -565367 -614766 -620068 -598284 -546826 -438069 -303224
4534 -303224 -221657 -198967 -184836 -165912 -154093 -137392 -90021 -29263 6658 20777 30795 25414
4522 25414 1774 -6145 26155 80750 134473 174013 182897 163349 143308 151638 211277 298889
4510 298889 341942 316190 271885 233179 196254 188405 216805 250856 289333 332510 363951 382852
4498 382852 403157 400109 343061 239482 114601 -9787 -118762 -186366 -202483 -164660 -70005
4487 -70005 23656 53277 33702 9694 7654 30722 39746 31161 44322 66626 68578 56762 42224
4474 42224 44878 61520 52927 8999 -41898 -86935 -138420 -191730 -225605 -227825 -197559 -149211
4462 -149211 -85039 -12100 57863 133684 206434 242979 234615 216612 207516 189478 152539 103244
4450 103244 55718 24152 13555 20187 51027 121428 206780 276665 318139 342714 380075 429576
4438 429576 448534 398887 297159 227016 254138 348350 436908 487470 571872 758810 1012004
4427 1012004 1261936 1481046 1704678 1990727 2372341 2870079 3490305 4234796 5093973 6060411
4417 6060411 7138288 8360858 9795957 11445567 13214383 14911284 16217321 16834085
4409 16834085 16726234 16111610 15275102 14414417 13615951 12855732 12057865 11160292 10139187
4400 10139187 9043588 7949266 6945216 6088366 5363432 4748722 4258679 3908236 3660830
4391 3660830 3450613 3244409 3064818 2933644 2836527 2772624 2763354 2823393 2958564 3184420
4381 3184420 3504771 3921515 4421677 4966284 5510149 6031948 6527942 6954368 7230117 7347233
4371 7347233 7385710 7377903 7284440 7110336 6914544 6742735 6574931 6340763 5989644 5534605
4361 5534605 5052163 4611548 4233022 3889150 3556305 3255846 3039894 2921514 2870201 2861396
4351 2861396 2910341 3039876 3198145 3276527 3213201 2990893 2661308 2318245 2016466 1767198
4341 1767198 1541432 1306583 1067960 852742 728285 727201 790232 842249 846962 811516 764953
4330 764953 718051 682619 702326 794596 902081 970579 1002279 1007428 980968 950583 937065 931986
4318 931986 957137 1059234 1239595 1451342 1689031 2008635 2441798 2925682 3315829 3455769
4308 3455769 3290725 2926333 2484127 2012569 1539487 1103193 737745 450114 242578 112640
4298 112640 51121 63467 110122 133957 159329 223985 315218 396833 436212 427326 377229 291109
4286 291109 168866 38196 -56358 -106389 -119726 -90754 -39955 15264 81732 144303 176895
4275 176895 149733 60808 -45744 -116942 -131162 -99879 -41881 22915 79841 130157 174228
4264 174228 192054 169887 137495 120784 108248 76198 18077 -55581 -99725 -81467 -14201 62457
4252 62457 118351 141729 132767 102589 78729 81794 87636 70899 43148 -1547 -79470 -174909
4240 -174909 -243927 -271652 -282103 -280743 -273024 -276831 -273098 -206323 -107427 -80573 -131462 -187434
4228 -187434 -208722 -214139 -221543 -227294 -212008 -165634 -116962 -101800 -135671 -198194 -232068 -197415
4216 -197415 -136037 -128839 -169497 -209811 -263145 -328066 -346786 -314947 -273695 -243086 -220650 -190189
4204 -190189 -151770 -116184 -77303 -16727 56815 122799 178010 211416 222272 230197 231295 217431
4192 217431 206619 223116 274888 319233 306418 271681 276523 308020 316021 271670 177755 43086
4180 43086 -122763 -266390 -311780 -228705 -68366 97973 206685 220049 181916 152226 127679
4169 127679 83763 25775 -12086 -25768 -19826 15027 65450 111519 134300 107075 42237 -28514
4157 -28514 -75367 -66576 -12688 41760 67857 66472 30114 -40294 -137036 -249760 -329382 -339831
4145 -339831 -311074 -304490 -352882 -437735 -536289 -648251 -737072 -760052 -730384 -695871 -650627 -556570
4133 -556570 -393264 -195185 -42678 39896 74690 66403 21221 -32438 -62925 -74752 -99270
4122 -99270 -126978 -130224 -121492 -130240 -166697 -194544 -175607 -127470 -82398 -45618 -46751 -132217 -276336
4109 -276336 -387746 -396213 -314498 -203334 -106644 -25384 54599 129944 182068 193664 156309
4098 156309 101430 72755 73932 78987 92772 118892 123085 86358 37782 19284 8044 -44969
4086 -44969 -114147 -119756 -49381 24272 27205 -49893 -144992 -205876 -230694 -224068 -196039 -163768
4074 -163768 -129493 -107677 -104896 -123366 -146445 -153151 -165222 -192219 -204567 -192362 -181344 -207964
4062 -207964 -295523 -430630 -550366 -595793 -571549 -520812 -462022 -374551 -250480 -116667 -6286
4051 -6286 61270 90418 107954 136266 189368 243015 257131 207569 79814 -86858 -216014
4040 -216014 -271530 -277407 -259636 -220060 -173958 -154256 -194457 -290749 -386752 -435463 -433325 -404136
4028 -404136 -363368 -316740 -265031 -237031 -242265 -239942 -225267 -223131 -259275 -328995 -376497 -380276
4016 -380276 -375637 -362897 -317578 -248657 -201178 -191275 -174035 -122531 -54475 -2927 -5393 -81641
4004 -81641 -199897 -305280 -368026 -369704 -299387 -189661 -96510 -45069 -22505 -26198 -80298 -170581
3992 -170581 -227994 -228178 -218809 -237498 -286286 -353428 -401672 -392768 -325325 -268660 -259362 -260569 -246254
3979 -246254 -220159 -200588 -198332 -211005 -217723 -210095 -198219 -191060 -200090 -218569 -217048 -198396 -180353
3966 -180353 -169791 -169199 -167471 -146393 -95809 -29189 21214 33097 5489 -40852 -79632 -104237
3954 -104237 -103936 -81672 -70803 -92598 -127300 -154842 -192172 -249114 -296244 -320601 -308109 -252081
3942 -252081 -187025 -131302 -91989 -69644 -72880 -111342 -170745 -217407 -236279 -260637 -329164 -418876
3930 -418876 -464352 -431307 -339664 -237131 -160425 -115730 -97539 -74383 -16113 52951 96925
3919 96925 104404 90358 69206 18943 -55273 -109949 -151126 -200498 -272917 -366063 -414603 -366510
3907 -366510 -282025 -221471 -193126 -221300 -283356 -299047 -221316 -98172 -10053 26956 30928 1124
3895 1124 -65763 -157150 -224488 -240862 -212934 -168692 -167623 -234791 -305791 -301037 -234037 -166625
3883 -166625 -134809 -138297 -171454 -222384 -276300 -322722 -344522 -346699 -341525 -333715 -312831 -263335
3871 -263335 -183155 -99815 -39474 1675 12941 -25482 -84489 -99494 -54499 23115 104122 161796
3859 161796 181555 152350 96874 58675 38040 -5520 -77411 -138011 -173585 -213103 -255205 -277173
3847 -277173 -293087 -299418 -282466 -264150 -261874 -272615 -260421 -191394 -108347 -73693 -76146 -66445
3835 -66445 -49100 -48850 -66809 -111892 -172975 -191190 -138078 -64050 -16767 -24204 -96082 -187717
3823 -187717 -255000 -297515 -323724 -346892 -395241 -475638 -547846 -597300 -644240 -679379 -668817 -608884
3811 -608884 -552168 -546044 -554830 -518094 -436734 -336627 -240357 -175977 -154479 -151329 -118562 -49872
3799 -49872 9898 60827 124355 177501 183323 160873 148087 129905 72115 -10476 -57892 -57818 -50497
3786 -50497 -71981 -125147 -202867 -295659 -377984 -422039 -425830 -387775 -310235 -215927 -123185 -57666
3774 -57666 -40435 -65305 -108924 -147940 -193458 -259626 -323669 -348023 -326525 -273749 -187652 -101791
3762 -101791 -59648 -61307 -69429 -61307 -45264 -40160 -70739 -134090 -178003 -149860 -61950 55091
3750 55091 171175 236334 236754 204875 148051 48332 -66177 -150467 -215139 -294468 -392021 -495086
3738 -495086 -564436 -549122 -461451 -356793 -273404 -223461 -206256 -200241 -189159 -186979 -205572 -251002
3726 -251002 -312269 -361410 -371777 -344749 -312747 -298898 -292250 -271887 -231342 -191681 -181152 -207558
3714 -207558 -260284 -302731 -301940 -260079 -195315 -134921 -105303 -103707 -104885 -101700 -92805 -71718 -52087
3701 -52087 -53703 -58598 -30599 11577 26218 32238 58399 110055 183369 249534 256505 207337 144473
3688 144473 69934 -13316 -64766 -57820 9343 123398 253844 323643 280982 192209 131990
3677 131990 84957 53633 49637 42483 8708 -28259 -46152 -64157 -89784 -141237 -237736 -345077
3665 -345077 -415759 -441470 -432875 -409700 -389548 -392596 -402453 -369072 -286575 -215322 -213730 -249646
3653 -249646 -254989 -193639 -95934 -30204 -13472 -7731 41985 120909 162520 165177 147366 104472
3641 104472 56119 21402 3640 -3959 4347 24631 40515 67145 116446 174583 208953 188472
3629 188472 111782 16257 -64693 -117993 -124776 -90757 -39404 4700 37412 55767 64428 66168
3617 66168 51116 10758 -49102 -102494 -136154 -130807 -74164 -7048 30236 48853 68243 84019
3605 84019 94011 101330 96758 70218 52335 71590 112378 134410 140176 153704 175306 215717 263273
3592 263273 261178 174135 58320 -23142 -61258 -62769 -24491 41880 119471 178811 173737 85874
3580 85874 -32714 -140020 -259410 -383928 -464886 -480754 -451399 -396628 -321414 -247125 -186595
3569 -186595 -142173 -124607 -129737 -162806 -215580 -271967 -313903 -314471 -269979 -209057 -163098 -143584
3557 -143584 -146898 -151741 -151410 -159697 -141979 -62416 35623 96129 95389 30498 -61502 -121659 -126699
3544 -126699 -96323 -66805 -36293 -22020 -61933 -140999 -218311 -261121 -271820 -269692 -262452 -262593
3532 -262593 -279435 -298146 -299992 -294358 -281673 -240582 -178717 -130160 -127348 -185512 -293505 -395577
3520 -395577 -421659 -390280 -387338 -426210 -442043 -399581 -320861 -214672 -87494 23955 94885
3509 94885 122903 113812 78464 21697 -41550 -95203 -141565 -174383 -177298 -163763 -141097 -106297
3497 -106297 -51981 38239 157707 269790 330482 322420 254025 151672 42773 -64884 -145882
3486 -145882 -178581 -178736 -176878 -187469 -181801 -155234 -129062 -107950 -80686 -44564 -18901 -16008 -25799
3473 -25799 -29696 -21815 -11682 -21216 -68876 -142989 -227351 -285789 -295347 -279789 -254477 -250073 -298108
3460 -298108 -367265 -395988 -372192 -331270 -304603 -284030 -272832 -298553 -343341 -366667 -357113 -314425
3448 -314425 -237725 -161290 -128040 -129220 -141229 -166882 -208554 -244437 -253195 -242755 -245873 -257756
3436 -257756 -227315 -146878 -50782 31080 74908 68672 28143 -15009 -36772 -35012 -34185 -56614
3424 -56614 -88979 -108379 -102176 -66184 -11994 31102 59322 98830 150499 186146 206640 215200
3412 215200 188858 129275 59007 -14225 -79643 -115083 -108387 -55025 31058 104495 121376 85398
3400 85398 62529 76552 84828 44253 -29863 -90282 -108808 -88509 -59777 -60979 -105595 -161608
3388 -161608 -166101 -108070 -42143 2481 29715 34455 6706 -31792 -56862 -54258 -22836 21593
3376 21593 64184 92250 91048 69682 60508 61909 34641 -14397 -54539 -98121 -157301 -205578
3364 -205578 -221090 -216435 -219019 -230448 -233681 -203722 -132095 -25541 60407 43704 -56004 -155328
3352 -155328 -218100 -259082 -305219 -347044 -350450 -313387 -272496 -257947 -278910 -313272 -327107 -306736
3340 -306736 -268316 -220968 -146344 -36540 81005 171254 218994 228403 192839 118756 40346
3329 40346 -35397 -109347 -140322 -116043 -92234 -105743 -147676 -196626 -222374 -208241 -173773 -123791
3317 -123791 -65883 -32497 -18854 -2254 13032 -1666 -55811 -128803 -198766 -248821 -276113 -291442
3305 -291442 -295207 -307097 -341722 -380177 -408816 -429136 -446907 -432379 -348252 -225284 -142110 -144094
3293 -144094 -202321 -262454 -292763 -294247 -279991 -245730 -179760 -108279 -73074 -64836 -55795 -29171
3281 -29171 12046 45303 55269 64256 98779 137756 153352 144484 119280 89522 51579 -18796
3269 -18796 -117988 -209789 -273449 -306527 -284596 -186499 -69293 6464 48064 88360 128835 150763
3257 150763 175737 214638 228479 172948 54093 -68485 -143749 -146743 -80415 42699 181011
3246 181011 289153 342972 329368 275671 248067 278980 326325 337555 301426 242935 196316
3235 196316 148574 57506 -58341 -142862 -188642 -205790 -175163 -81636 7848 15631 -33611 -74693
3223 -74693 -67430 -336 96335 183205 236880 244839 209671 146439 61021 -18685 -52736 -50035
3211 -50035 -58712 -94098 -144547 -197097 -209242 -160820 -92682 -42267 2320 38868 50009 29612
3199 29612 -2669 -22473 -46052 -97052 -177386 -265245 -340952 -388441 -403277 -413641 -464208 -563613
3187 -563613 -645612 -644879 -568192 -465157 -374770 -307140 -257522 -210077 -150070 -92940 -55830 -33695
3175 -33695 -11655 23774 57883 51219 -11911 -102326 -170918 -179681 -152043 -146764 -169152 -181889
3163 -181889 -154780 -100582 -60005 -34785 -34278 -71515 -103502 -106248 -85335 -45180 -9648 5285
3151 5285 11378 20435 32185 46990 63796 52404 -5152 -70987 -108951 -119805 -98626 -40289
3139 -40289 16762 37722 19389 -39598 -122321 -190732 -230058 -216225 -140867 -58497 2339 60261
3127 60261 124501 160122 153811 142404 159170 176374 148225 92082 41308 12494 3254 -10029
3115 -10029 -50552 -125139 -215105 -284161 -325227 -347952 -348010 -322534 -281178 -252297 -251540 -290265 -362692
3102 -362692 -420603 -430645 -369871 -234919 -68449 94473 212428 212954 99604 -33122 -114331
3091 -114331 -130850 -101039 -67059 -77899 -131653 -189738 -217374 -212785 -175524 -92869 21285 127106
3079 127106 191385 208873 193587 142818 74764 28860 -10837 -67108 -114458 -112536 -40435 87479
3067 87479 222425 306612 325707 304417 254330 201061 172555 157998 142945 134877 130377 87959
3055 87959 15229 -35117 -60515 -88548 -110500 -98490 -53817 -12201 26302 76249 108544 120227
3043 120227 130380 136657 145504 178805 231792 274702 268704 208336 122205 55601 43497 82141
3031 82141 144845 187625 186415 163809 138694 98807 24241 -66679 -127453 -126558 -73922 -13917
3019 -13917 20886 25529 -1538 -32305 -25144 16226 64958 108939 142652 159017 163417 144312
3007 144312 94080 42336 1526 -33368 -31911 15295 46119 19218 -46817 -121979 -176112 -184256
2995 -184256 -138249 -67056 -2529 40696 65504 90012 123610 147104 133353 86600 39083 6183
2983 6183 -21606 -55257 -85317 -100894 -114098 -138161 -170401 -208984 -257460 -288309 -301209 -313428
2971 -313428 -313418 -304395 -283394 -234920 -155628 -46064 79044 181111 212526 152168 34848 -77612
2959 -77612 -147330 -181711 -184723 -147625 -89778 -54747 -64608 -86509 -79238 -52181 -39777 -60522
2947 -60522 -133042 -229195 -294991 -307575 -279328 -254758 -266335 -281715 -263551 -233116 -192974 -117754
2935 -117754 -40001 -14023 -36568 -44931 5226 82592 153701 226280 284667 283871 230279 185389
2923 185389 186944 235202 301940 327099 287597 217104 142773 76610 52527 76736 108563 100914
2911 100914 45959 -22762 -73301 -95011 -94115 -83895 -92190 -119803 -139075 -137624 -117915 -108882 -153994
2898 -153994 -265389 -400733 -507420 -573192 -620211 -654757 -668026 -662770 -646725 -627304 -605385
2887 -605385 -589483 -581319 -584299 -595594 -590738 -550434 -494668 -452316 -427109 -416629 -418186 -406928
2875 -406928 -372224 -333088 -301220 -283541 -290064 -288054 -231305 -134427 -36391 26251 16089 -62644
2863 -62644 -168689 -281354 -357758 -360488 -303823 -230065 -157871 -67531 33157 93489 99261 64896
2851 64896 -6755 -91417 -161172 -193107 -184639 -149945 -98094 -30792 45906 119550 162771 144754
2839 144754 71302 -20350 -90477 -106635 -67120 251 56263 86626 112584 150588 172469 141670
2827 141670 68205 -15920 -110383 -213257 -281563 -268369 -188637 -107635 -73749 -85418 -109188
2816 -109188 -114364 -81681 -30602 21211 52342 47081 24327 9285 11086 26303 70748 147688
2804 147688 229917 287129 310372 322093 323474 301491 288891 296805 296771 286706 289514 306212 317373
2791 317373 300270 242380 150119 48609 -17975 -22262 42262 150679 268198 362755 380266
2780 380266 298552 173195 79278 52250 78672 118600 130409 109508 73031 32925 4679
2769 4679 -7998 -33235 -88001 -145493 -169213 -155816 -144393 -136263 -99092 -37488 21420 40299
2757 40299 -4503 -83201 -148933 -184939 -216000 -261592 -289766 -268532 -214381 -149661 -76837 -10817
2745 -10817 8857 -21112 -71907 -129217 -178336 -189813 -144388 -68603 11242 81250 118666 94757
2733 94757 27590 -34287 -72579 -88492 -86287 -63984 -35008 -4595 35906 76782 112641 139306
2721 139306 145702 118551 46379 -46811 -105022 -112628 -100531 -84071 -77813 -91187 -98003 -90878 -93139
2708 -93139 -84716 -53053 -36425 -64751 -128383 -228069 -376871 -510920 -536207 -446485 -313474
2697 -313474 -221787 -188437 -145960 -81018 -39911 -27853 -17137 -3160 468 6855 33440 75187
2685 75187 113195 106148 34133 -79702 -197355 -256120 -221035 -147381 -108416 -96561 -71123 -35794
2673 -35794 -36772 -103334 -209866 -305604 -347484 -338274 -340154 -400986 -487987 -561060 -612448 -615558 -551950
2660 -551950 -470002 -418347 -394957 -394101 -400502 -388259 -355003 -317302 -282962 -255199 -224947 -187338
2648 -187338 -161251 -165679 -185737 -177973 -134905 -79824 -42948 -26323 -10255 4431 -13215 -90260
2636 -90260 -192009 -230327 -158963 -26599 83423 124047 120215 116761 119392 121992 119248 105438
2624 105438 76553 30940 -26694 -82309 -105159 -82340 -36350 12376 46324 36987 -371 -9610
2612 -9610 22731 58549 96509 154768 228993 287460 297493 292266 291118 263906 207335 126406
2600 126406 26990 -40635 -21490 67465 147845 180576 185739 172706 148850 160228 219485 267136
2588 267136 259826 219522 173788 128095 82347 18719 -64002 -122789 -134298 -111989 -68520 -4502
2576 -4502 72473 133876 163311 173707 153240 87620 -4548 -104464 -190971 -246835 -238397 -159678
2564 -159678 -65372 -1763 39019 84360 117130 94616 16722 -68333 -120668 -153160 -187587 -217356
2552 -217356 -262093 -320340 -329449 -257536 -142897 -28732 60519 114589 133795 108079 50691
2541 50691 -6147 -59428 -115162 -173592 -233309 -288518 -313574 -318113 -332057 -361248 -390934 -387810
2529 -387810 -349810 -305371 -278199 -286636 -309484 -307742 -279169 -240592 -205210 -163864 -119198 -103450
2517 -103450 -129854 -181756 -250191 -313615 -358043 -392074 -412309 -410474 -391297 -358116 -300786 -229683
2505 -229683 -194929 -221853 -289235 -346298 -358045 -353882 -334317 -276491 -213690 -168633 -121471 -76505
2493 -76505 -39571 3774 47103 60360 34307 -8467 -41855 -77428 -151046 -269035 -388186
2482 -388186 -461559 -470572 -432658 -374969 -321071 -288009 -241656 -165564 -107313 -99533 -122692 -144266
2470 -144266 -138624 -108388 -84574 -95975 -135508 -178848 -210950 -201435 -142287 -49162 55882 149572
2458 149572 218568 251977 272699 290378 269192 175516 45624 -66319 -145571 -190240 -193970
2447 -193970 -163677 -127357 -91602 -35421 19734 27831 -31211 -133293 -232354 -319020 -392902 -454484
2435 -454484 -504524 -532251 -521703 -476193 -411707 -334284 -265386 -206178 -114129 16141 120440
2424 120440 154059 128195 66303 -20014 -129652 -263464 -394027 -480858 -509207 -491426 -437092
2413 -437092 -359166 -276321 -190814 -96174 -1571 65031 81110 65938 51726 37701 27968 28751
2401 28751 19366 -2818 -27765 -67833 -140493 -228821 -309223 -370110 -402874 -391130 -327097 -242545
2389 -242545 -166266 -101259 -69423 -102191 -161359 -189773 -182177 -168481 -176539 -195056 -204285 -197836
2377 -197836 -187406 -173696 -133642 -83612 -53375 -38119 -40283 -74526 -134199 -185072 -194277 -163696
2365 -163696 -117398 -79451 -60908 -68738 -112090 -175305 -231311 -265600 -276162 -262303 -218668 -139807
2353 -139807 -36027 70197 149123 175056 157543 119407 70121 33571 13078 10417 42880
2342 42880 91480 116267 108519 77503 41097 22965 15724 9710 -1852 -19121 -24430 -27524 -28014
2329 -28014 -7071 14764 5203 -31457 -69083 -105816 -136996 -151238 -141967 -109945 -77768 -58669
2317 -58669 -48306 -59109 -88306 -115803 -133567 -127851 -101253 -70771 -37099 -4650 14240 -5798
2305 -5798 -64945 -133691 -186738 -195746 -148315 -67630 11668 54876 44903 4999 -32705 -65155
2293 -65155 -104955 -150516 -178360 -178496 -149729 -95585 -28325 43660 100163 97294 33968 -30998
2281 -30998 -38987 -7620 8735 -13071 -74879 -160178 -233669 -291953 -309626 -259129 -174679 -87691
2269 -87691 -31507 -25317 -54361 -92802 -117251 -114436 -96730 -109509 -176260 -258240 -316587 -353996
2257 -353996 -401159 -470432 -548212 -597028 -585905 -536161 -467512 -375471 -256685 -143360 -95927
2246 -95927 -114238 -144338 -156076 -171799 -209698 -254230 -278610 -276342 -278673 -307870 -365907 -400885
2234 -400885 -350661 -235506 -123191 -42604 14212 32537 -11400 -105734 -206443 -273956 -310811
2223 -310811 -323096 -317454 -328489 -373147 -412736 -405263 -365982 -330449 -315674 -319649 -350162 -395039
2211 -395039 -405503 -370953 -293585 -190481 -104514 -28715 71590 172295 228818 239511 235810
2200 235810 229402 211657 198269 198053 188499 140588 64448 -11370 -73751 -98664 -53857 48821
2188 48821 142261 187392 186848 148162 86035 17091 -26438 -9258 31512 36107 -9710 -68578
2176 -68578 -83050 -30891 66672 166831 246333 319687 375809 373196 312764 220350 101261 -26818
$$ [...]
##END NTUPLES=NMR SPECTRUM
##END=
