##TITLE=C13_DE-77Fk_TFA
 CDCl3, 22500sc

 28.11.2024
##JCAMPDX= 6.0         $$ Bruker NMR JCAMP-DX V2.0
##DATA TYPE= NMR SPECTRUM
##DATA CLASS= NTUPLES
##ORIGIN= UXNMR, Bruker Analytische Messtechnik GmbH
##OWNER= root
$$ XWIN-NMR		Version 3.5
$$ Fri Nov 29 13:40:35 2024 Russian Standard Time (UT+4h)  she@DPX200
##.OBSERVE FREQUENCY= 50.327896
##.OBSERVE NUCLEUS= ^13C
##.ACQUISITION MODE= SIMULTANEOUS
##.ACQUISITION SCHEME= undefined
##.AVERAGES= 22501
##.DIGITISER RES= 17
##SPECTROMETER/DATA SYSTEM= spect
##.PULSE SEQUENCE= zgpg30
##.SOLVENT NAME= CDCl3
##.SHIFT REFERENCE= (INTERNAL, CDCl3, 0, 222.565)
##AUDIT TRAIL= $$ (NUMBER, WHEN, WHO, WHERE, WHAT)
$$ ##TITLE= Audit trail, XWIN-NMR		Version 3.5
$$ ##JCAMPDX= 5.01
$$ ##ORIGIN= Bruker BioSpin GmbH
$$ ##OWNER= she
$$ F:/spectra/data/she/nmr/c13/1/pdata/1/auditp.txt
$$ ##AUDIT TRAIL=  $$ (NUMBER, WHEN, WHO, WHERE, WHAT)
(   1,<2024-11-29 13:38:55.43 +0400>,<she>,<DPX200>,
      <created by zg, POWCHK disabled, PULCHK disabled
       terminated by command 'halt'
       configuration hash MD5:
       00 E9 B6 7A A2 85 ED C7 34 08 36 98 17 FE 4E 26
       data hash MD5: 32K
       0F C1 34 8C 88 BD 96 C1 D4 EB 07 75 68 D8 E3 34>)
(   2,<2024-11-29 13:39:08.89 +0400>,<she>,<DPX200>,
      <Start of raw data processing
       efp BC_mod = 2 LB = 2 FT_mod = 6 PKNL = 1 PHC0 = -551.0544 PHC1 = 38.88833 SI = 32K 
       data hash MD5: 32K
       A6 54 19 57 18 C8 22 64 73 4E 22 40 06 86 67 70>)
(   3,<2024-11-29 13:39:11.70 +0400>,<she>,<DPX200>,
      <abs ABSG = 5 
       data hash MD5: 32K
       20 E3 10 F9 18 70 36 89 98 C9 79 B6 1F 91 C6 2A>)
(   4,<2024-11-29 13:39:40.07 +0400>,<she>,<DPX200>,
      <pk PHC0 = 1.295642 PHC1 = -1.799999 
       data hash MD5: 32K
       BF 71 E7 98 5D FE 54 B2 A2 38 F0 F2 96 EB CD D0>)
(   5,<2024-11-29 13:39:43.70 +0400>,<she>,<DPX200>,
      <abs ABSG = 5 
       data hash MD5: 32K
       6B 8D 52 8D 4F 23 43 F7 8C 31 2E BC 78 B7 30 4A>)
$$ ##END=
$$ 
$$ hash MD5
$$ 50 CE 99 06 93 84 E2 BD 00 8A AB C2 67 5F 1D 64
##$RELAX= 
##$RELAX= 
##$RELAX= 
##$RELAX= 
##$RELAX= 
##$RELAX= 
##$RELAX= 
##$RELAX= 
$$ Bruker specific parameters
$$ --------------------------
##$DU= <F:/spectra>
##$EXPNO= 1
##$NAME= <c13>
##$PROCNO= 1
##$TYPE= <nmr>
##$USER= <she>
##$AMP= (0..31)
100 100 100 100 100 100 100 100 100 100 100 100 100 100 100 100 100 100 
100 100 100 100 100 100 100 100 100 100 100 100 100 100 
##$AQSEQ= 0
##$AQ_mod= 1
##$AUNM= <au_zg>
##$AUTOPOS= <>
##$BF1= 50.322709
##$BF2= 200.13
##$BF3= 50.322709
##$BF4= 500.13
##$BF5= 500.13
##$BF6= 500.13
##$BF7= 500.13
##$BF8= 500.13
##$BYTORDA= 1
##$CFDGTYP= 0
##$CFRGTYP= 5
##$CHEMSTR= <none>
##$CNST= (0..31)
1 1 145 1 1 1 1 1 1 1 1 1 1 1 1 1 1 1 1 1 1 1 1 1 1 1 1 1 1 1 1 1 
##$CPDPRG= <waltz16>
##$CPDPRG1= <>
##$CPDPRG2= <waltz16>
##$CPDPRG3= <>
##$CPDPRG4= <mlev>
##$CPDPRG5= <mlev>
##$CPDPRG6= <mlev>
##$CPDPRG7= <mlev>
##$CPDPRG8= <mlev>
##$CPDPRGB= <>
##$CPDPRGT= <>
##$D= (0..31)
$$ [...]
##$SUBNAM4= <"">
##$SUBNAM5= <"">
##$SUBNAM6= <"">
##$SUBNAM7= <"">
##$SUBNAM8= <"">
##$SUBNAM9= <"">
##$SW= 239.972175391363
##$SWIBOX= (0..15)
0 1 3 0 0 0 0 0 0 0 0 0 0 0 0 0 
##$SW_h= 12077.2946859903
##$TD= 32768
##$TD0= 1
##$TE= 0
##$TE2= 300
##$TE3= 300
##$TEG= 300
##$TL= (0..7)
120 120 120 120 120 120 120 120 
##$TP= (0..7)
150 150 150 150 150 150 150 150 
##$TP07= 0
##$TPNAME0= <>
##$TPNAME1= <>
##$TPNAME2= <>
##$TPNAME3= <>
##$TPNAME4= <>
##$TPNAME5= <>
##$TPNAME6= <>
##$TPNAME7= <>
##$TPOAL= (0..7)
0.5 0.5 0.5 0.5 0.5 0.5 0.5 0.5 
##$TPOFFS= (0..7)
0 0 0 0 0 0 0 0 
##$TUNHIN= 0
##$TUNHOUT= 0
##$TUNXOUT= 0
##$USERA1= <user>
##$USERA2= <user>
##$USERA3= <user>
##$USERA4= <user>
##$USERA5= <user>
##$V9= 5
##$VALIST= <valist>
##$VCLIST= <CCCCCCCCCCCCCCC>
##$VD= 0
##$VDLIST= <DDDDDDDDDDDDDDD>
##$VPLIST= <PPPPPPPPPPPPPPP>
##$VTLIST= <TTTTTTTTTTTTTTT>
##$WBST= 1024
##$WBSW= 4
##$XGAIN= (0..3)
0 0 0 0 
##$XL= 0
##$YL= 0
##$YMAX_a= 35958026
##$YMIN_a= -136983466
##$ZGOPTNS= <>
##$ZL1= 120
##$ZL2= 120
##$ZL3= 120
##$ZL4= 120
##$ABSF1= 222.5654
##$ABSF2= -17.4314
##$ABSG= 5
##$ABSL= 3
##$ALPHA= 0
##$AQORDER= 0
##$ASSFAC= 0
##$ASSFACI= 0
##$ASSFACX= 0
##$ASSWID= 0
##$AUNMP= <proc_1d>
##$AZFE= 0.1
##$AZFW= 0.5
##$BCFW= 0
##$BC_mod= 2
##$BYTORDP= 0
##$COROFFS= 0
##$CY= -3
##$DATMOD= 1
##$DC= 0
##$DFILT= <>
##$DTYPP= 0
##$F1P= 0
##$F2P= 0
##$FCOR= 0.5
##$FTSIZE= 32768
##$FT_mod= 6
##$GAMMA= 0
##$GB= 0
##$INTBC= 1
##$INTSCL= 4.134877e-10
##$ISEN= 128
##$LB= 2
##$LEV0= 0
##$LPBIN= 0
##$MAXI= 10000
##$MC2= 0
##$MEAN= 0
##$ME_mod= 0
##$MI= 0.1934396
##$NCOEF= 0
##$NC_proc= 2
##$NLEV= 6
##$NOISF1= 120.0001
##$NOISF2= 80.00006
##$NSP= 0
##$NTH_PI= 0
##$NZP= 0
##$OFFSET= 222.5654
##$PC= 1.4
##$PHC0= -549.7587
##$PHC1= 37.08833
##$PH_mod= 1
##$PKNL= yes
##$PPARMOD= 0
##$PSCAL= 0
##$PSIGN= 0
##$REVERSE= no
##$SF= 50.3227345484362
##$SI= 32768
##$SIGF1= 140
##$SIGF2= 120
##$SINO= 11.81781
##$SIOLD= 32768
##$SREGLST= <13C.CDCl3>
##$SSB= 0
##$STSI= 32768
##$STSR= 0
##$SW_p= 12077.2946859903
##$SYMM= 0
##$S_DEV= 0
##$TDeff= 32768
##$TDoff= 0
##$TI= <>
##$TILT= no
##$TM1= 0
##$TM2= 0
##$TOPLEV= 0
##$USERP1= <user>
##$USERP2= <user>
##$USERP3= <user>
##$USERP4= <user>
##$USERP5= <user>
##$WDW= 1
##$XDIM= 32768
##$YMAX_p= 262298262
##$YMIN_p= -1774725
$$ End of Bruker specific parameters
$$ ---------------------------------
##NTUPLES= NMR SPECTRUM
##VAR_NAME=  FREQUENCY,     SPECTRUM/REAL,   SPECTRUM/IMAG
##SYMBOL=    X,             R,               I
##VAR_TYPE=  INDEPENDENT,   DEPENDENT,       DEPENDENT
##VAR_FORM=  AFFN,          ASDF,            ASDF
##VAR_DIM=   32768,         32768,           32768
##UNITS=     HZ,            ARBITRARY UNITS, ARBITRARY UNITS
##FACTOR=    0.368581032318806, 1,           1
##FIRST=     11200.0995020947, 0,            0
##LAST=      -877.195183895579, 0,           0
##MIN=       -877.195183895579, -1774725,    0
##MAX=       11200.0995020947, 262298262,    0
$$ Real data points
##PAGE= N=1
##DATA TABLE= (X++(R..R)), XYDATA
$$ [...]
15948A59193M37L356l8877n6086n4528j8614J9836J4375K5433R7785J23851L9001
15936C15162l0881m7328q9053j13549o5419j4377p262k8303q6805j25177j10595
15925d03587p3197K7658J30766J67469J46743R9441L4438n5842r5443n4470p14
15914g6738K3747N9065J28807K15282K53731J86686N1467l0179j6259J5063J4328
15903H25000j2551l4757k8059Q408k0012j44000k42216k27927j73539j94696k45805
15892d90154j78972J806J38455J36784O0293j6151j5074O0591J05453J04413J36888
15881D4332J75736J15223N466q589O3982O6266j8774p9639p1416k5034J5831k379
15869B81005q0565j63652j59747m1804Q5513R0025l468m3526o038K9144J4926
$$ plain form
15948 159193 159630 162986 124109 68023 13495 -5119 14717 29092 54525 152310 276161 315162
15936 315162 284281 236953 147900 34351 -31068 -45445 -52707 -81010 -167815 -292992 -403587
15925 -403587 -476784 -449126 -318360 -150891 -4148 95293 129731 73889 -21554 -76024 -76738
15914 -76738 -52991 6074 134881 350163 603894 790580 842047 811868 795609 810672 825000
15903 825000 812449 777692 749633 758041 738029 594029 351813 123886 -49653 -244349 -490154
15892 -490154 -669126 -667320 -528865 -392081 -331788 -347939 -363013 -302422 -196969 -92556 44332
15881 44332 220068 335291 340757 332168 396150 462416 443642 364003 292587 267553 283384 281005
15869 281005 200440 36788 -122959 -164763 -79250 10775 7307 -36219 -42257 -13113 1813
15858A813k3250O599R9281J93677K14550J38006R233q1463l2704Q4159J37528
15847G47429O4232j16006k31607k11839j39638n1101L6822Q9033Q9725K8119n1033
15836B54136j35059j97859j81644j37427o1254O6922J65266J69565J33966J23143
15826A99755J03135M5764K9609K92p7018j19802j04778j00766j78181k94952l75455
15815h72397l88567k88933j26471L4697K00155K96231K54851J29692o799n3881
15805h21422N847P7968J29356J22110J18815J64048J73861J26836J00525J21522
15795C19466R7790m6718k23179k96513k74381j87235q4142k3471k982J6338Q6678
15784f18349K09182K57820J67958L3690j9060M6884J51422K01356J65654R9569
$$ plain form
15858 1813 -21437 -14838 84443 278120 492670 630676 639909 558446 525742 609901 747429
15847 747429 811661 695655 464048 252209 112571 61470 98292 187325 277050 305169 254136
15836 254136 119077 -78782 -260426 -397853 -459107 -392185 -226919 -57354 76612 199755
15826 199755 302890 348654 378263 378555 301537 181735 76957 -23809 -201990 -496942 -872397
15815 -872397 -1260964 -1549897 -1676368 -1641671 -1441516 -1145285 -890434 -760742 -767541 -821422
15805 -821422 -815575 -737607 -608251 -486141 -367326 -203278 -29417 97419 197944 319466
15795 319466 417256 370538 147359 -149154 -423535 -610770 -694912 -718383 -721365 -705027 -618349
15784 -618349 -409167 -151347 16611 50301 31241 78125 229547 430903 596557 696126
15774F96126N7176k363r1046j93062k53973k09854r7484j123Q5760J61384J68356
15763C19897J19374N4453R016J9350P6033Q2931M5391k2923j19624j56496j20304
15752C07098l1478M7814J8114o1956n9538j1292k7154q0302q2376r9612j42200
15741b22882j09493q6729j28810j30654o8277J6361R0283J44505J92752K41667
15731f1277K62872K13648R6687n8376j85129k37354j73105q9461n6921j4612L2066
15720b70962M0796J5831J1452p232m6580n7556j2707M9245P6169O5315m453p3937
15708b14619m5594l592l6499j07026j21712q2060p2711o2388r891J08270K41007
15697d06815K54078J41609k2169j64938j38456L1946J49750K25397K68734K41114
$$ plain form
15774 696126 753302 750939 659893 466831 212858 3004 -94480 -95603 -9843 151541 319897
15763 319897 439271 493724 502740 522090 598123 681054 726445 703522 583898 427402 307098
15752 307098 275620 323434 341548 279592 220054 208762 181608 101306 18930 -80682 -222882
15741 -222882 -332375 -419104 -547914 -678568 -746845 -730484 -640201 -495696 -302944 -61277
15731 -61277 201595 415243 511930 453554 268425 31071 -142034 -231495 -288416 -303028 -270962
15720 -270962 -230166 -214335 -202883 -210115 -256695 -314251 -326958 -277713 -201544 -136229 -140682 -214619
15708 -214619 -260213 -263805 -300304 -407330 -529042 -611102 -683813 -746201 -756092 -647822 -406815
15697 -406815 -152737 -11128 -33297 -198235 -336691 -304745 -154995 70402 339136 580250
15687E80250J90201J39825P0066k6322j37424k07006j93933j37186r1379j03891
15677H3201j40216r5892k7344m5520m3920K5634P4016N1046j3622J202J01428
15666b9987J62708J33843J05026P3060j9313j22673j43831j28607j35012j30457
15656b35243j01783p6500p9247o2991j5923k5989j05576j71188r8560Q2562J87526
15645g02912J76625J55858J03944M0843P3273J15229L7593r7418j36598l6401
15635b69964R3456J14314L9277o195P498n03R599M9404Q5976J38270K14698K40055
15623G15885J76179N7601l3062r2262j48797j35860r1344r0794j01451r6015o8289
15612I1791J3320O7606j5111j22714j37833r1260j8025N1751N6530O499k4924
$$ plain form
15687 580250 770451 910276 980342 954020 816596 609590 415657 278471 187092 83201
15677 83201 -57015 -152907 -180251 -225771 -269691 -244057 -170041 -118995 -132617 -131415 -29987
15666 -29987 132721 266564 371590 444650 425337 302664 158833 30226 -104786 -235243
15656 -235243 -337026 -413526 -492773 -555764 -571687 -597676 -703252 -874440 -973000 -890438 -702912
15645 -702912 -526287 -370429 -266485 -225642 -152369 -37140 453 -96965 -233563 -269964
15635 -269964 -176508 -62194 -22917 -29112 -21614 -22117 -12518 36886 122862 261132 475830 715885
15623 715885 892064 949665 916603 824341 675544 539684 448340 357546 256095 160080 91791
15612 91791 105111 172717 157606 34892 -102941 -194201 -212226 -160475 -103945 -97446 -122370
15601a22370m7572p7318j02758j34785j76999j78315q0167L8223Q8902Q1547O9115
15590f42497N7299J7852l5317m836J38183K69793K13205L3722q3953j13437q7866
15579b37852r525J4690o3926j39649n1073J46397K70784K54635J43361L8207k5615
15568C40434m1352l1696j4051M929j3711n9658m8988N523O1369Q8529N6037l0427
15556C16938o1819L7641J27145L8362j72054k44024j63569r4489p0627p5315q1721
15545d43532p3096o2435m1322l279O1260J60810K42844K39105R7565r4195k11337
15534a27612k44880j79296n5461L9234M2547j4172M2833J65753J61379K6590j00862
15523b43947j19700r2682o5096j3364L9104P6024Q8593R2362Q4157L1169k1773
$$ plain form
15601 -122370 -169942 -247260 -350018 -484803 -661802 -840117 -920284 -882061 -793159 -711612 -642497
15590 -642497 -585198 -567346 -602663 -607499 -469316 -199523 13682 47404 -36549 -149986 -237852
15579 -237852 -247377 -232687 -296613 -436262 -487335 -340938 -70154 184481 327842 366049 340434
15568 340434 299082 267386 253335 258264 244553 184895 135907 141430 202799 291328 347365 316938
15556 316938 255119 292760 419905 458267 286213 42189 -121380 -215869 -286496 -361811 -443532
15545 -443532 -516628 -579063 -620385 -623664 -562404 -401594 -158750 80355 177920 83725 -127612
15534 -127612 -372492 -551788 -607249 -568015 -525468 -539640 -496807 -331054 -169675 -143085 -243947
15523 -243947 -363647 -456329 -521425 -534789 -495685 -419661 -331068 -238706 -154549 -123380 -145153
15512a45153j2770N0998Q8877J0605j16103j14708J4943J24520J29974N8783j7505
15501G2461j4339Q0087J14591P0233M4974K2458j0303l2805k7167K3809R5841
15490D39840J24789N5402q1535j53792r8533k3746m8529j07551j66020k44461
15480c04136l15574k64086o1409J26596J97423J95323J86010J85261J69259J20749
15470B35416N7230l2750q9043q3789k1064P1583J48857J85888J88050J31981J3626
15459H05985j05329j45391j15548q1920o0504l8514J3810J1608q9328j40085r6985
15448d2201n6068n7815p5884o1087P436P5576Q1764L0329Q004O0344O1572K3804
15436E5774L1065L3686M076o9814j49085j30585q841J07862J31204R6123N0944
$$ plain form
15512 -145153 -157923 -106925 -18048 -7443 -123546 -238254 -223311 -98791 31183 89966 72461
15501 72461 58122 138209 252800 323033 368007 390465 380162 347357 320190 343999 439840
15490 439840 564629 620031 538496 384704 286171 262425 213896 106345 -59675 -304136
15480 -304136 -619710 -883796 -945205 -818609 -621186 -425863 -239853 -54592 114667 235416
15470 235416 292646 259896 170853 87064 66000 137583 286440 472328 660378 792359 805985
15459 805985 700656 555265 439717 357797 297293 258779 272589 284197 194869 54784 -42201
15448 -42201 -98269 -156084 -231968 -293055 -285619 -210043 -128279 -97950 -89946 -29602 31970 55774
15436 55774 86839 120525 124601 54787 -94298 -224883 -233724 -125862 5342 101465 152409
15425A52409N184m2744l4493k9959o9818l0453M9696K6611n3453p7791n2453l5208
15413a92472l2227j9284l0358M03R4112J33008J01979J5583l6202J3816P5013
15402A23371N3632l426k456J4806K4331M4103J5867o0011o7826k9262m7910j51594
15390h6375k70348k69275j15716J00000K34031J95793N7100l8927l2249J1030
15380b14936N0820Q7083J01280O5582J4596k5774l4597L0110R4214N8751q137
15369B18992n1956m7662l0419r4325j56462j22352l0615L7730J5954j2124q723
15358b81962j4464j7300m108k0569m2561K5117J06002R6867Q047r6412j05102
15347c46445o5056p5917n4704j3419J523M3276J18061J69796J28241M7112Q923
$$ plain form
15425 152409 157593 114849 80356 50397 -19421 -49874 -178 26433 -27020 -104811 -157264 -192472
15413 -192472 -224699 -243983 -274341 -273938 -179826 -46818 55161 70744 34542 48358 123371
15402 123371 177003 173577 171121 185927 210258 254361 270228 210217 142391 113129 65219 -86375
15390 -86375 -356723 -625998 -741714 -641714 -407683 -211890 -154790 -193717 -225966 -214936
15380 -214936 -164116 -77033 24247 89829 104425 78651 44054 74164 168378 227129 218992
15369 218992 167036 119374 88955 -5370 -161832 -284184 -314799 -277069 -261115 -273239 -281962
15358 -281962 -296426 -313726 -317834 -338403 -380964 -355847 -249845 -152978 -144931 -241343 -346445
15347 -346445 -411501 -487418 -542122 -555541 -554018 -510742 -392681 -222885 -94644 -47532 -38609
15336c8609l9405j04278j48642j49761q6836O228N2348O1646Q3384P9369K0972
15325b63584M0960J28949J51558J25183O3792l5627j43532j92230j06627M7614
15315a83544J15365M3496k2670M161M1197M4162l0581j79602k40564j61342m954
15304e74876J24737J58761J52271J52819J46714R3313k4597j08532j13388o3161
15294e5939p160L8220P3948O6512N303n1012o0839j06673j94674j99498j19679
15283f11491o2840o6472r8270j30064j43764r8629m011O1902O9926M9592J1244
15272a022877M317L7748N1099L6437Q7767J63718J84160J33591M6371m5068j19400
15261d42137j14845N714J44185K35828K37991J35790K0906m2744l7950L938K3085
$$ plain form
15336 -38609 -78014 -182292 -330934 -480695 -567531 -561303 -508955 -447309 -363925 -284556 -263584
15325 -263584 -222624 -93675 57883 183066 246858 211231 67699 -124531 -231158 -183544
15315 -183544 -68179 -24683 -47353 -43192 -1995 42167 11586 -168016 -408580 -569922 -574876
15304 -574876 -450139 -291378 -139107 13712 160426 253739 229142 120610 7222 -55939
15294 -55939 -63099 -24879 49069 115581 120884 69872 9033 -97640 -292314 -491812 -611491
15283 -611491 -674331 -740803 -839073 -969137 -1112901 -1211530 -1215541 -1153639 -1083713 -1034121 -1022877
15272 -1022877 -1018560 -980812 -929713 -893276 -805509 -641791 -457631 -324040 -277669 -322737 -442137
15261 -442137 -556982 -551268 -407083 -171255 66736 202526 223432 180688 142738 146676 169761
15250A69761N2196Q0721O1217p755r2391j29379r6600m2217j5289j6353k3827
15239e9916l2304r657K9412J0590o7734p3078J1692J00401J66303J97531J16273
15228C89513n7858j64864j31908P986R9977R5138R5068P0945J5878j0575j4445
15217C94855l9793o1109p7960j13542j17882l8176K2463J9058K8202L0534q703
15206C7947q320K6631j3513j01562j48710j56789j64357j53048q8801N2558J70569
15195e47395J59497J24698J28470J40647J46546J14054P0348O0599Q6755J02702
15185E86921Q0110J9721j10274k65918l14970k63958j95005r2406J9840L8574
15175d97365j2712p0567j15117j58515j94528j81816j53534j13953n8437l4924
$$ plain form
15250 169761 221957 302678 363895 356140 263749 134370 37770 -4447 -19736 -36089 -59916
15239 -59916 -92220 -101877 -72465 -61875 -129609 -202687 -190995 -90594 75709 273240 389513
15228 389513 331655 166791 34883 42869 142846 237984 333052 403997 419875 409300 394855
15217 394855 355062 293953 215993 102451 -15431 -53607 -31144 -12086 16116 46650 37947
15206 37947 29627 56258 42745 -58817 -207527 -364316 -528673 -681721 -770522 -717964 -547395
15195 -547395 -387898 -263200 -134730 5917 152463 266517 336865 397464 484219 586921
15185 586921 667031 686752 576478 310560 -4410 -268368 -463373 -555779 -535939 -497365
15175 -497365 -510077 -580644 -695761 -854276 -1048804 -1230620 -1384154 -1498107 -1556544 -1591468
15165a591468j423P9087J49806J47234Q3658O4177J08941J72336J98234J68808
15155d20610J58583J35999O7785j2802p4044j27532j61261j36323o9611j3852
15145f53668n0915j32874j35228l9166O1165R5427J04321J28575J96656K76313
15135a49394K99066K51919J70334J1197j87235k94956k72509j60534m4945j4950
15125c92007q283N5672J47540K04856J84650J36433N4911r894O1666J56715J16403
15114G08662m4412k00011k38261j69917m5406N9147N1841k3310p9409j01050q8572
15103a70698j4724Q6529R2091L067r726L8504L0064M1092R3497R2603L6008j9000
15091B99307r6782j45614q8081m1038m3004l1012M184R433j9495k9338R274J19585
$$ plain form
15165 -1591468 -1592891 -1513804 -1363998 -1216764 -1133106 -1068929 -959988 -787652 -589418 -420610
15155 -420610 -262027 -126028 -58243 -71045 -145089 -272621 -433882 -570205 -639816 -653668
15145 -653668 -704583 -837457 -972685 -1011851 -950686 -855259 -750938 -622363 -425707 -149394
15135 -149394 149672 401591 571925 583122 395887 100931 -171578 -332112 -377057 -392007
15125 -392007 -400290 -344618 -197078 7778 192428 328861 383772 373878 435544 592259 708662
15114 708662 664250 464239 225978 56061 10655 69802 121643 98333 18924 -82126 -170698
15103 -170698 -185422 -98893 -6802 -3735 -13461 25043 55107 96199 189696 282299 318307 299307
15091 299307 202525 56911 -31170 -72208 -115212 -146224 -142040 -132607 -152102 -181440 -172166 -52581
15079e2581J99284J55520J23616P5197o2866j86151k11994j23919k4930l0693
15069a39517o2109m3900l3417n3051n3779l9826j158R390p77M3602J07384J05178
15057a61980J8873r1495j70753j77038j19544o1734j211Q1117J59947J55257J03000
15046b65561P1545N5261N9534Q1034P6177j7885j16904j18768r4079n7875M7124
15035b80397J53589J74119J11016J7872L6986J11632Q8004j312n8764K4843J40391
15024E17979R1933n5285j51801j44221q9724q1103j54663k67637k90341j76994
15014h01857k1658R6349J59883J57446R1259j1883p7040o3205k5289j6718k8655
15003e41368m4368k7850L7500Q9404P0017J7582j0987l1133m9907l9311p840O625
$$ plain form
15079 -52581 146703 302223 425839 501036 438170 252019 40025 -83894 -108824 -139517
15069 -139517 -201626 -245526 -278943 -331994 -385773 -425599 -426757 -417367 -418144 -374542 -267158 -161980
15057 -161980 -143107 -234602 -405355 -582393 -701937 -763671 -764882 -683765 -523818 -368561 -265561
15046 -265561 -194016 -138755 -79221 1813 77990 60105 -56799 -175567 -269646 -327521 -280397
15035 -280397 -126808 47311 158327 176199 213185 324817 412821 411509 352745 377588 517979
15024 517979 609912 554627 402826 258605 168881 87778 -66885 -334522 -624863 -801857
15014 -801857 -823515 -727166 -567283 -409837 -318578 -330461 -407501 -470706 -495995 -512713 -541368
15003 -541368 -585736 -613586 -576086 -486682 -416665 -399083 -410070 -441203 -491110 -530421 -538261 -531636
14991e31636o0202j39137j39520q8967m9432N239P6119J05534R8200N9540l00
14980f64562o787N9064J48777J98963J42607K9471J1068O9276Q7064j2848j76035
14969a13942k31055j64045o7170M6740J64547K06509J60964N6698p6989j66403
14959a84146j53877j44622j64629j41669p8924k9489J9521Q7546J15633Q8537
14949e86119O2390O8233P4118M9590l8373r5519m8466N7756J19289Q2951K7478
14938b26672L0412K3959J4385P9838J32894P8328l8911j09580n2275N3386L8123
14927B3887n9471p4322o0587r1052j40560j41590o2026J6206M7665K6814l3002
14916e48038r2628m6755Q7041J46715J13049Q7404N1204r3378k07230j35978l6710
$$ plain form
14991 -531636 -591838 -730975 -870495 -959462 -1008894 -1003655 -927536 -822002 -723802 -664262 -664562
14980 -664562 -671349 -612285 -463508 -264545 -121938 -92467 -81399 -12123 74941 62093 -113942
14969 -113942 -344997 -509042 -576212 -529472 -364925 -158416 2548 59246 -17743 -184146
14959 -184146 -338023 -482645 -647274 -788943 -867867 -897356 -877835 -790289 -674656 -586119
14949 -586119 -523729 -455496 -381378 -331788 -370161 -465680 -514146 -456390 -337101 -254150 -226672
14938 -226672 -196260 -172301 -157916 -78078 54816 133144 94233 -15347 -67622 -14236 23887
14927 23887 -35584 -109906 -170493 -261545 -402105 -543695 -605721 -589515 -541850 -515036 -548038
14916 -548038 -640666 -687421 -600380 -453665 -340616 -253212 -202008 -295386 -502616 -638594 -675304
14905f75304k1976j3527J7586K1848N579j951J5077M1518O6167Q2372O3294M9372
14893c49945M6787J2161l2975n6865o3019j8641R6523K28222K56305J62775L9599
14882C20927l2256j5071L2932L3715j0234p3768j32084j30631j16276j00621m6218
14871b69585j5613n8236j23604j54972j21653k234R3058L1774r6690j24607n3617
14860h95979M6927J38577J61280P8956o9584j82825j68450l1171J60544K80775
14850d80950L02123K62424J87634R3105L550k3333L142J9570l156n8218j11951
14839A93940j14756m1358L4570N6680P6108J24273J16232L0680n5373j20458j63822
14828A36716r8709Q1082J63090J07511M1875k1005q8522j31971r9842j21807k33642
$$ plain form
14905 -675304 -697280 -710807 -693221 -671373 -665794 -667745 -652668 -611150 -544983 -462611 -399317 -349945
14893 -349945 -303158 -290997 -323972 -380837 -443856 -462497 -365974 -137752 118553 281328 320927
14882 320927 288671 273600 306532 340247 330013 256245 124161 -6470 -122746 -223367 -269585
14871 -269585 -285198 -343434 -467038 -622010 -743663 -745897 -652839 -621065 -717755 -842362 -895979
14860 -895979 -849052 -710475 -549195 -470239 -539823 -722648 -891098 -922269 -761725 -480950
14850 -480950 -178827 83597 271231 364336 367886 344553 347695 367265 364109 305891 193940
14839 193940 79184 37826 72396 129076 205184 329457 445689 476369 420996 300538 136716
14828 136716 38007 119089 282179 389690 431565 410560 322038 190067 90225 -31582 -265224
14817b65224k92450k46994j65424p0654K440L3034L7290L4133N7736P6256O7440
14806g32417L5579L3903R6788K05703K75302K09571Q1438J3385l35j8171l7084
14795A63662n8033l9369J0685K0007k6560o1054m5570m1236j7846M5042L3142
14784a7130l6622m7220j0305J3873K4411N2007M2916j9967q1971r4550l6551N8728
14772a52381J36615J37972P8480L7917N0413N7449j3126j06369j40085j12884
14762b5999r6837r4608l7377N5953J29211J44126P2096n725K2173O4090o593p8461
14750A42049m3288k4793n4666m385J17902K04072J87736P2630l3639k3606J3907
14739E53919Q485p080L4031O0795j2325r8085j38437j28454q9815o5542l2174
$$ plain form
14817 -265224 -557674 -804668 -970092 -1040746 -1038306 -1005272 -967982 -933849 -876113 -799857 -732417
14806 -732417 -696838 -662935 -566147 -360444 -85142 124429 205867 219252 218917 200746 163662
14795 163662 105629 66260 76945 96952 70392 9338 -36232 -77468 -95314 -50272 -17130
14784 -17130 -53752 -100972 -111277 -97404 -72993 -20986 21930 1963 -80008 -174558 -211109 -152381
14772 -152381 -15766 122206 200686 238603 289016 346465 333339 226970 86885 -25999
14762 -25999 -122836 -217444 -254821 -198868 -69657 74469 146565 140840 163013 227103 220510 142049
14750 142049 98761 73968 19302 14917 132819 336891 524627 597257 563618 540012 553919
14739 553919 562404 555324 589355 650150 637825 539740 401303 272849 183034 117492 85318
14728H5318k8442p0557o9056K083O5161M4213j0474k4200k4534q2963j44537j03854
14716c61842m1238k3299K0588Q2452N7968l2337p6706p2189p1148l7860L5285
14705e20326O7621P5656Q6823Q2478Q1408J13509J88672K59513K47806J17627
14695H00787l8661j11036j30582r9641k5498L557Q592M0017N7030M5450N5906
14684F05921K6565m1163o4312k2721J9150L4049q004r5965j58920j65020j27525
14673B055j17383j39506j66567j77533j23518q848Q7421J01280O1094K4338m355
14662d61522R978O8793R7034O2167J3886l3906l1573J7564l4546j40304j23167
14651e55596o5762p2716l5563J1074j4251k4678J3328O0409J00539J14868J24264
$$ plain form
14728 85318 56876 -13681 -82737 -80654 -15493 28720 18246 -5954 -30488 -113451 -257988 -361842
14716 -361842 -403080 -426379 -405791 -323339 -265371 -297708 -374414 -446603 -517751 -555611 -520326
14705 -520326 -452705 -377049 -290226 -207748 -126340 -12831 175841 435354 683160 800787
14695 800787 762126 651090 520508 420867 395369 398926 407518 447535 504565 550015 605921
14684 605921 632486 591323 527011 504290 523440 557489 549485 453520 294600 129580 2055
14673 2055 -115328 -254834 -421401 -598934 -722452 -731300 -643879 -542599 -481505 -457167 -461522
14662 -461522 -451544 -382751 -285717 -223550 -209664 -243570 -275143 -257579 -292125 -432429 -555596
14651 -555596 -621358 -694074 -729637 -718563 -732814 -757492 -744164 -683755 -583216 -468348 -344084
14640c44084J48230J47176J60914J64318Q6641K990l1504L2801J55258J85145
14630G07885J26521N7801K724o4009j72205k74388k73055j46670m390M9885m069
14619F030j20281j27934J8216J24883R5534K0776k071J1091L3308O9903L8174
14608A67629k2121j9466L9854J30583J32857L2270p6066j25601o9127M8031P7083
14597C15926m2692j75954j52938l0839P5679J30892J80806K17140J63521O7516
14587G49057o46p0943j83614k27445j51854q9015j21783j41026p9177p2156q9659
14576d78261n5178P012R1904J37791P2150m4728r7701k3328R6431J05228J8603
14565a70077m8303p6285n8623j4053k3611q4499j23189j04494k1201O4957J8513
$$ plain form
14640 -344084 -195854 -48678 112236 276554 363195 366185 334681 367482 522740 707885
14630 707885 834406 892207 894931 830922 658717 384329 111274 -35396 -39786 10099 6030
14619 6030 -114251 -242185 -223969 -99086 -3552 17224 15153 26244 59552 129455 167629
14608 167629 145508 126042 165896 296479 429336 461606 385540 259939 190812 238843 315926
14597 315926 273234 97280 -55658 -86497 -10818 120074 300880 518020 681541 749057
14587 749057 748411 677468 493854 266409 114555 25540 -96243 -237269 -316446 -388602 -478261
14576 -478261 -533439 -526427 -434523 -296732 -224582 -269310 -367011 -390339 -293908 -188680 -170077
14565 -170077 -218380 -294665 -353288 -367341 -390952 -475451 -598640 -703134 -724335 -659378 -640865
14554f40865q5500p2159r333J5112P5855J88188K63906J89339K4816q1278r7271
14543b29190r7282q2667l7268l429K6357L6199J3796N883L6617J02324K05045
14532b3615K88494K58520J71615J12223L0273j14496j90652j60722j55548k19931
14522c839k45335j78564r0842m8481l6136N3069K01286K42815J94245J13296j9116
14511A82398r7416j09971p5077L9109J34580R4168m241k1839L359l0820q6427
14500B7823j08648j11632j19269r9485p765Q7245J17399N5864o0753j24192j07383
14489d50796k8606P3158J23626J56007J53629R0097J0357k2756k0428k6812K7888
14478H5364J13148J25104R7318O7271K9181j1138m0609n9735n5345n1359j01962
$$ plain form
14554 -640865 -726365 -798524 -807857 -792745 -716890 -528702 -264796 -75457 -50641 -131919 -229190
14543 -229190 -326472 -409139 -446407 -449836 -423479 -387280 -373484 -367601 -330984 -228660 -23615
14532 -23615 264879 523399 695014 807237 837510 723014 532362 371640 216092 -3839
14522 -3839 -249174 -427738 -518580 -567061 -603197 -550128 -348842 -106027 88218 201514 182398
14511 182398 84982 -24989 -100066 -60957 73623 167791 163550 141711 145070 114250 27823
14500 27823 -80825 -192457 -311726 -411211 -418976 -331731 -214332 -158468 -219221 -343413 -450796
14489 -450796 -479402 -406244 -282618 -126611 27018 117115 127472 104716 84288 57476 85364
14478 85364 198512 323616 420934 488205 517386 506248 465639 405904 350559 299200 197238
14467A97238j70196j53755l8067Q2826J03478K0443j5799N8927J42966J34484
14457C62545M6612n4978j66877k28220j44024j542L3295k7362m1699j993N2663
14446a71580J61293K48392K47813K11578J57174L8900j11064j83142j89434j57305
14436B52625o9082K910q410m0487m1319m2483j00755j79374j67238o9712M0628
14425d22697J25816J67339J58596J42856J64138J59780J08636L3247o4527j89343
14415C83841k82997k64166j65325o2637M5896J70352K60293K75438K24026J40065
14405G24786M0781n9435j38394j57117j16861m2105L7485O1387L2513l7995j15726
14394B29319j44079j13115q3457p6066m3953J1877O3265O9749L840p8099j05832
$$ plain form
14467 197238 27042 -126713 -164780 -81954 21524 41967 26168 85095 228061 362545
14457 362545 409157 354179 187302 -40918 -184942 -186484 -153189 -180551 -222250 -224243 -171580
14446 -171580 -10287 238105 485918 697496 854670 893570 782506 599364 409930 252625
14436 252625 183543 186453 178043 137556 96237 53754 -47001 -226375 -393613 -463325 -422697
14425 -422697 -296881 -129542 29054 171910 336048 495828 604464 637711 573184 383841
14415 383841 100844 -163322 -328647 -391284 -345388 -175036 85257 360695 584721 724786
14405 724786 765567 706132 567738 410621 293760 251655 289140 350527 383040 345045 229319
14394 229319 85240 -27875 -111332 -187398 -231351 -219474 -156209 -86460 -82620 -160719 -266551
14383b66551j13494j55349j93337j69936q5239K5331P0585J8656k3253k7933k5791
14372i46311K018R8537K25797K96488K53670J35920J4220k7419N6142J29985P6098
14361C15145m9703j67468k36180j83537n4679K0699J9400M6318J51060K33549
14351I4604K03529J32656O4456q335o9878p6999m0700p080J2633L1830P8074J26930
14339E41720J19469M5106J902L1349J8194l5138j3758O5390J03932R6171Q0973
14328A055310L6320o352k2391m8091j23538j70123r4155l547L3248L3117k8529
14317F61269j13800q3094L5773J08140P0900n4845j82511k94562l67852l54543
14307e75125k30904l5805J35963K07681K03145J81815J65139J43141P0992k6312
$$ plain form
14383 -266551 -380045 -535394 -728731 -898667 -983906 -958575 -887990 -869334 -892587 -920520 -946311
14372 -946311 -944293 -845756 -619959 -323471 -69801 66119 80339 52920 109062 239047 315145
14361 315145 265442 97974 -138206 -321743 -376422 -355723 -336323 -290005 -138945 94604
14351 94604 298133 430789 495245 486910 417032 340033 299333 292253 304886 336716 414790 541720
14339 541720 661189 706295 708197 739546 757740 722602 708844 774234 878166 974337 1055310
14328 1055310 1091630 1085278 1062887 1014796 891258 721135 626980 623433 656681 689798 661269
14317 661269 547469 464375 500148 608288 679188 624343 441832 147270 -220582 -575125
14307 -575125 -806029 -841834 -705871 -498190 -295045 -113230 51909 195050 266042 239730
14297B39730n0850k2398m7711j48862k37828k05188o1314P5751J30015J04110
14287b24545K2357n1078o7198o0499k7804L1332Q1871J38697J34906N4082n4096
14276b1975j16943n1926Q6862J63136K02541K34992J84325N7796k9754P19O0093
14265G69866K2176n1601p0262p7474o2542n0486j03357j63617j79593j53672r1480
14254b12042o4400k1540M8120M7331j9461j01443j36108j23152p4459m865L8199
14243f23820L1183J2725P8849K03347K05400R4349L0018q151k5534P621K7751
14232C3738L6034N9273J05157J34732J02887q700j66355k24621j42192l4524M021
14221a00550k8409j08631k24293k64792j29873Q7462K42506L34885K99982J42034
$$ plain form
14297 239730 188880 166482 118771 -30091 -267919 -473107 -534421 -458670 -328655 -224545
14287 -224545 -202188 -253266 -320464 -380963 -408767 -377435 -295564 -156867 -21961 32121 -21975
14276 -21975 -138918 -190844 -103982 59154 261695 496687 681012 738808 709054 709773 769866
14265 769866 792042 740441 670179 592705 530163 479677 376320 212703 33110 -120562 -212042
14254 -212042 -276442 -297982 -249862 -202531 -221992 -323435 -459543 -582695 -657154 -662019 -623820
14243 -623820 -592637 -579912 -501063 -297716 -92316 2033 32051 23900 -1634 5987 33738
14232 33738 69772 129045 234202 368934 471821 463121 296766 72145 -70047 -104571 -100550
14221 -100550 -128959 -237590 -461883 -726675 -856548 -769086 -526580 -191695 108287 250321
14211B50321O3559P8739M3486m8138j13006j50108j91526k26098k08879j41431
14201f43081n9714K7737P7798J28114J53007O8820m9968r8477p4401k4511M4885
14190d49791J16019J09408O1356N9834R0577J21947J24960M8573n0548j06882
14180A25453j41529j67284j46696m6661K7002N443k0916j7013J3142N7135M9333
14169b62591M1032J10361J66435J19844K4801l9663n5383o8596j26301j85929
14159b75990j41053n2239o2849j45822j49472j07018j3774J56046K42238J53573
14149c96360R753o2179n1914j7153j6206m357n301p7954j25694r0973K0273J45655
14137f72410J67654J24330J07386M9176m2803o7569r1328j15186n9989J9451N4400
$$ plain form
14211 250321 313880 392619 436105 387967 274961 124853 -66673 -292771 -501650 -643081
14201 -643081 -702795 -675058 -597260 -469146 -316139 -247319 -297287 -395764 -470165 -494676 -449791
14190 -449791 -333772 -224364 -163008 -103174 -12597 109350 234310 282883 232335 125453
14180 125453 -16076 -183360 -330056 -376717 -349715 -344272 -365188 -382201 -369059 -311924 -262591
14169 -262591 -221559 -111198 55237 175081 199882 160219 104836 36240 -90061 -275990
14159 -275990 -417043 -469282 -532131 -677953 -827425 -934443 -948217 -792171 -549933 -396360
14149 -396360 -386607 -448786 -500700 -517853 -534059 -538416 -543717 -621671 -747365 -838338 -818065 -672410
14137 -672410 -504756 -380426 -273040 -223864 -266667 -334236 -425564 -540750 -600739 -581288 -526888
14126e26888M8215J8184k8489n2917o5594j13917j77890j66863j5150J76647K35134
14115f69528J41535J0985o8020n3686N76Q515n0354j08025j24740p8133M4081
14104i46794J30605Q1419o1819r6102M3017K01579K64874K54141K34883K02830
14094C08633J20720K5233l3705m8745n3158p1710n9908Q655O3966M4058K3288
14083C27327L3921P121k9274l3952O867O1861J03832P8536n5897k00193k31993
14072F8156j74159j23599q4655k8154K1260M6410L9883P094n9284j11976j16270
14061e15294j04961K926J37809J37133P3622J4906m0767o8792m3349N2820J54523
14050a99424J95873J18611j2144m9534N257O7364R5172Q9560P0755O612j20071
$$ plain form
14126 -526888 -478673 -460489 -488978 -541895 -607489 -721406 -899296 -1066159 -1081309 -904662 -669528
14115 -669528 -527993 -517008 -585028 -638714 -638138 -629623 -679977 -788002 -912742 -990875 -946794
14104 -946794 -816189 -734770 -796589 -892691 -849674 -648095 -383221 -129080 105803 308633
14094 308633 429353 454586 420881 372136 318978 247268 187360 196015 259981 304039 327327
14083 327327 361248 368369 339095 305143 312010 373871 477703 556239 500342 300149 68156
14072 68156 -106003 -229602 -314257 -342411 -321151 -274741 -234858 -227764 -287048 -399024 -515294
14061 -515294 -620255 -617329 -479520 -342387 -268765 -253859 -294626 -363418 -406767 -353947 -199424
14050 -199424 -3551 115060 102916 53382 58639 126003 221175 310735 381490 388102 268031
14039B68031k14011j48864K8382J16084N9083l1093o0526m2197j1416K8067J05801
14028I7341J99178K20005J33883j1718j43230j91651j74779j51041j41906j36598
14018c00516q8488o595N8251R7879J00501K1178r7647j72277j13588J9946P8592
14007d02764M4975j7457n7791l4242R088J7092k2266m8661J9944J48806K46247
13996i7029J87149k3212k18796k78076j98498q0769p208R625J1863P1605J46330
13985d77016J40406P1611j4272n9571l1401L016P532J0106M932n762j6669o5782
13973d32870j15271j13346r6949j14313j06672n3534m722N4551J23026J73158
13963f86942J92572J66750N4293j5236M1430R3378O0930l8914j20725j57142j50033
$$ plain form
14039 268031 54020 -94844 -66462 49622 108705 77612 17086 -25111 -36527 -8460 97341
14028 97341 296519 516524 650407 638689 495459 303808 129029 -22012 -163918 -300516
14018 -300516 -389004 -395599 -337348 -239469 -138968 -117790 -215437 -387714 -501302 -481356 -402764
14007 -402764 -357789 -375246 -433037 -467279 -458191 -441099 -463365 -512026 -492082 -343276 -97029
13996 -97029 90120 66908 -151888 -429964 -628462 -709231 -716439 -706814 -694951 -623346 -477016
13985 -477016 -336610 -264999 -279271 -338842 -370243 -367227 -359695 -349589 -344657 -350419 -367088 -432870
13973 -432870 -548141 -661487 -758436 -872749 -979421 -1032955 -1037677 -983126 -860100 -686942
13963 -686942 -494370 -327620 -273327 -288563 -247133 -153755 -92825 -131739 -252464 -409606 -559639
13952e59639r6898n1808l6721J9530O9010N0055l0013j01957o7182N5256J26208
13941f24159J13062J20925J25452O9799J6650L2350R0038J25850R3817J7861p0979
13930A10666j06117m4270Q775J7462N1599J14921J36493P3695m3198j06923r6293
13919A16810p4447p3772n2939j0982l2224j10895j50421j11057m7530k5679j7858
13908e90994K2962Q4520J23076P6334L965o6309j11881p8470k1290M759J3424
13897e39904M8862J38789K02342J99638J77565J63240J33032N8596P693M1864
13887F31717N2975O973k8602n5930j16073j44500j20994j43919j57554r4216l2684
13876b02807j2544k1195J459j4814j01656j09020o6663o8041j02827r3329O886
$$ plain form
13952 -559639 -656537 -708345 -745066 -725536 -656526 -606471 -636484 -738441 -805623 -750367 -624159
13941 -624159 -511097 -390172 -264720 -194921 -178271 -145921 -55883 69967 163784 181645 110666
13930 110666 4549 -39721 -30946 -13484 38115 153036 289529 363224 320026 213103 116810
13919 116810 42363 -31409 -84348 -95330 -127554 -238449 -388870 -499927 -547457 -573136 -590994
13908 -590994 -568032 -483512 -360436 -284102 -280137 -346446 -458327 -536797 -558087 -553328 -539904
13897 -539904 -491042 -352253 -149911 49727 227292 390532 523564 582160 589853 631717
13887 631717 684692 691665 663063 607133 491060 346560 225566 81647 -75907 -170123 -202807
13876 -202807 -215351 -236546 -235087 -249901 -351557 -460577 -527240 -595281 -698108 -791437 -784551
13865g84551R3617O4244m262n5969j11499r8825l1509O594L0033P7991J37172
13854f76964J69295J80900J93950J38937N5659j5026q9486o5569J8603K9187l09
13843f0823Q060N4829J19869J33220M9273r1284j67259r6773N8180J88716K49919
13832D45927K02709O6118j05741k06376k00635j48360q5623n5066l1677l7564
13822a56288j11115j66529j21937l6359K4629N6756L2394J1637l02q2895j60679
13811g10688r5712O4771J97420K32697J24855l6122p8178l4521r574J9994N8288
13800b66770O1604j4986q6889q3189m6287N030P0505J32333J62062J18246P3219
13789A24878N4649l9933p5421O9685J93457J86349J05749r045r8105j02671n8523
$$ plain form
13865 -784551 -690934 -626690 -630952 -686921 -798420 -897245 -928754 -922160 -892127 -814136 -676964
13854 -676964 -507669 -326769 -132819 6118 61777 46751 -42735 -108304 -89701 -60514 -60823
13843 -60823 -52763 2066 121935 255155 304428 213144 45885 -50888 7292 196008 445927
13832 445927 648636 714754 609013 402637 202002 53642 -31981 -87047 -118724 -156288
13822 -156288 -267403 -433932 -555869 -592228 -567599 -510843 -478449 -466812 -467114 -550009 -710688
13811 -710688 -806400 -741629 -544209 -311512 -186657 -222779 -300957 -335478 -345052 -325058 -266770
13800 -266770 -205166 -220152 -307041 -390230 -436517 -431487 -360982 -228649 -66587 51659 124878
13789 124878 179527 139594 64173 133858 327315 513664 619413 610368 512263 409592 351069
13778C51069p0981j02139j05017r0518n9921j9230K8159M4472N4911J22892J76795
13767C30492J43492Q3277P1716J43075J97241J28997K6106n3250j31523k26364
13757G13259k79209k17992r5241l6352k9679p0996j32455j05580r3703j45099
13747d93047j35159q4609l1511L4255Q8050J11133J36378J51602Q6118k2757n7156
13736b16703J8979J20688J82061J38302o373j41055k20153k12660j53799j51904
13726f42617k08930k44882k13306j40270n4672J9115J08344J71421J27662M1971
13716a036164K1076N5711R6300J02704M2416l4185l4785J2003j069k7675Q089
13705g95579J03915K47328L21967K32246P8022K6929M9600M8906o499j05883j45472
$$ plain form
13778 351069 280088 177949 72932 -17586 -77507 -96737 -68578 -24106 30805 153697 330492
13767 330492 473984 557261 628977 772052 969293 1098290 1124396 1071146 939623 713259
13757 713259 434050 216058 120817 84465 54786 -16210 -148665 -254245 -347948 -493047
13747 -493047 -628206 -712815 -744326 -710071 -622021 -510888 -374510 -222908 -136790 -159547 -216703
13736 -216703 -197724 -77036 105025 243327 236954 95899 -124254 -336914 -490713 -642617
13726 -642617 -851547 -1096429 -1309735 -1450005 -1504677 -1485562 -1377218 -1205797 -1078135 -1036164
13716 -1036164 -1015088 -959377 -863077 -760373 -717957 -752142 -786927 -774924 -775993 -803668 -795579
13705 -795579 -691664 -444336 -122369 109877 187899 214828 264428 313334 306835 200952 55480
13694E5480j23977j04647q0158k6539L3714P4147P2309O1101L8112n834L4397
13683B8105J33097J84713J41805K9682m8537n5678q3520j03889n5956j7424l7211
13672A15187m8313j6463J6042M7692P2452L6621k5598m7229k8837K3659O9886
13661B15099M3736l0428r0572r5734o1009k9510L2394J13021J25782N5101k6871
13650B51009n8244o2699m1164J4422O0720P7191N1068l5416j40258j87842j92486
13639b63699j85707j39765m4879P4235J34045J49420J54748J05911N6131P3032
13629A13472Q3387L2170n470r9252k29954k52132j68240n2780M7521J15086J00615
13618c15577N8431J03228J24522M1695j7519o25o849p6425j05480n2043L6998
$$ plain form
13694 55480 -68497 -173144 -253302 -279841 -246127 -171980 -99671 -38570 -458 -6292 28105
13683 28105 161202 345915 487720 517402 468865 413187 329667 225778 169822 152398 115187
13672 115187 66874 50411 66453 114145 186597 223218 197620 150391 121554 145213 215099
13661 215099 258835 228407 137835 42101 -18908 -48418 -16024 96997 222779 277880 251009
13650 251009 192765 130066 88902 103324 164044 241235 292303 256887 116629 -71213 -263699
13639 -263699 -449406 -589171 -634050 -559815 -425770 -276350 -121602 -15691 40440 113472
13629 113472 196859 229029 223559 124307 -105647 -357779 -526019 -578799 -531278 -416192 -315577
13618 -315577 -257146 -153918 -29396 12299 -5220 -5845 -12694 -89119 -194599 -246642 -209644
13607b09644R6263M9660l1034l3314K9392L7361L3106O3636N9959K2281j7808
13596I9858j8407j7675o7023j52307k27274k17219q3983N5015J17337J02906N2569
13585c56203J7624j0778q2317k11157k95763k43585j07519J8717P5584R9153O3424
13574a032820J4018k8685p0117K777J65451K60393K14957J02345L8449O9091R6443
13563a67698L6450l6572p0676j04883j54510j66918p2731p8m4764o0664L6754
13552h06290J55694K29394K16170J07676N6480Q6155P0991N387m2644p3441r7894
13541i2322j29272j31633o3589Q930J6255k1106o2257k067J31878J98768J80820
13530C4405J21079R1581J26805J46649Q0504K0070K4128O4466Q2577J0066j61859
$$ plain form
13607 -209644 -113381 -63721 -94755 -128069 -98677 -61316 -28210 35426 95385 117666 99858
13596 99858 81451 63776 -3247 -155554 -382828 -600047 -684030 -629015 -511678 -408772 -356203
13585 -356203 -338579 -349357 -431674 -642831 -938594 -1182179 -1289698 -1270981 -1195397 -1096244 -1032820
13574 -1032820 -1018802 -1047487 -1117604 -1114827 -949376 -688983 -474026 -371681 -333232 -264141 -167698
13563 -167698 -131248 -167820 -238496 -343379 -497889 -664807 -737538 -737616 -782380 -843044 -806290
13552 -806290 -650596 -421202 -205032 -97356 -40876 45279 116270 121657 79013 5572 -92322
13541 -92322 -221594 -353227 -416816 -407886 -391631 -412737 -474994 -477061 -345183 -146415 34405
13530 34405 155484 247065 373870 520519 601023 621093 645221 709687 792264 802330 640471
13519F40471l26384l83315l22664k02076q8950L0884J61075J88651J57535J32411
13509a2362P2609k1069j17571j76200j34961n7110j6642M6155J47715J84083J34776
13498D9423J06793J01777P5941N6365L6820j8963j00157k29314l06593j94239
13488d22147q280Q0571Q1628J19405J70611J49874P3632K0825k1656q1813p1078
13477I1572l5803r8988j81397k11160k16495k13553j65580J2074K83681M55826
13467b79823M14786K33914Q1082q802n2519o5800j01495j43066j37968j24782
13457a84473j66107k26757k18209r8943N7958J51270J55454J27876J22381J47314
13447a32236J36156P1058K1502R845K2509M6529P9345J02078J10309J14906Q5912
$$ plain form
13519 640471 314087 -69228 -391892 -593968 -682918 -652034 -490959 -302308 -144773 -12362
13509 -12362 60247 39178 -78393 -254593 -389554 -446664 -463306 -417151 -269436 -85353 49423
13498 49423 156216 257993 333934 390299 427119 408156 307999 78685 -227908 -422147
13488 -422147 -430427 -349856 -268228 -148823 21788 171662 245294 266119 244463 162650 91572
13477 91572 55769 -43219 -224616 -435776 -652271 -865824 -1031404 -1019330 -735649 -279823
13467 -279823 134963 368877 449959 441157 388638 322838 221343 78277 -59691 -184473
13457 -184473 -350580 -577337 -795546 -894489 -836531 -685261 -529807 -401931 -279550 -132236
13447 -132236 3920 74978 96480 106325 128834 175363 254708 356786 467095 582001 667913
13436F67913N0314M5954O7723P8910l0552k03807k98410l05727k55324j49989
13426c32995m0588M6257Q0520L7878J6343N4102R5761J17971J03382P4828P074
13415B60533m6769k1325K6974M1266m729o3643p0128j3314M5543L8159K174Q560
13403B03301K2465J679n203K6409N6751K0240q5941r8695J9264J08885O5308q1883
13391B52580j70096p2386J9970N224k3335P068J03430J50236J32333J42720J32150
13380F79894N1302m3392o8236q0464j79288k69173j97900k7062J02920J37018
13370A05619P6933l5675j00915r3023m2154K0960M7193L5318K7541R1876J80410
13359C14083K09487J77826J36165R8093Q1927Q1683M8364j9032l4807l497j7953
$$ plain form
13436 667913 718227 764181 831904 910814 880262 676455 378045 72318 -183006 -332995
13426 -332995 -373583 -327326 -246806 -208928 -192585 -138483 -42722 75249 178631 253459 260533
13415 260533 213764 192439 219413 260679 255950 192307 122179 108865 154408 192567 194741 203301
13403 203301 225766 227445 222242 248651 305402 325642 239701 141006 160270 269155 334463 252580
13391 252580 82484 10098 30068 35292 11957 19025 122455 272691 405024 547744 679894
13380 679894 731196 687804 619568 539104 359816 90643 -107257 -134319 -31399 105619
13370 105619 182552 146877 45962 -47061 -89215 -68255 -21062 14256 41797 133673 314083
13359 314083 523570 701396 837561 935654 1017581 1099264 1147628 1128596 1093789 1090292 1072339
13348A072339n0933l3125n064j7008r091N9108J23166J47879J37746O8436l2820
13337A460633j28554j82316j57692q9667m3794j1606J9856j3468p1488p0077k1329
13326F90498L8605J05136J23457M5446l3540j6553K5960k4866j33103k09933j95246
13315D15861j04652j8289J8249O707p265M2767J34563K05379K22957J70011J15598
13304A201886O5613n4703j89088k44725k04807j54712q3112j400M6912J16658
13294D98522J90019K00845J55589J14080N2806n3960j50303j66363j06743n4385
13284F80107m242M9119P4813O1096J8927m1415o4135K2380J19077J39514J34767
13273A190008J31361P3805j9437l1467Q877j1541n9836n4645J360M5170j6417
$$ plain form
13348 1072339 1021406 988281 983217 966209 957118 1016226 1139392 1287271 1425017 1493453 1460633
13337 1460633 1332079 1149763 992071 902404 858610 847004 866860 853392 781904 711827 690498
13326 690498 729103 834239 957696 1003142 969602 953049 979009 954143 821040 611107 415861
13315 415861 311209 292920 311169 317876 310611 353378 487941 693320 916277 1086288 1201886
13304 1201886 1267499 1212796 1023708 778983 574176 419464 336352 334952 381864 498522
13294 498522 688541 889386 1044975 1159055 1211861 1157901 1007598 841235 734492 680107
13284 680107 675865 724984 799797 860893 879820 838405 774270 796650 915727 1055241 1190008
13273 1190008 1321369 1395174 1375737 1344270 1353147 1341606 1281770 1227125 1228485 1273655 1257238
13262A257238n6999L7318R4773J1836j18628j65532j04615m4621m0657l3978L546
13251H39681L1417j888k0321J3736O2155J34839J74803J50428J34062J29264R7669
13240A745845L5226r382m6000o3705m5099p8883k06938l06146k52558j03954j3398
13229F55008L676O7385J43496J05712M3953M3570N5464M0664J1933k3135J4593
13218A162319J21426J74452J83931J85393J70282J55034J27903M8963l5075r9427
13208B195201j47404j66875j31892p6399k5126L6645N9640M6230J5419l5715q2102
13197A687622r7490k3494J42841K54715J93270O7420K0086O3068Q3409J6751q3352
13186B324846j83484k34508k23945k01831j50975o5635m985j0763L2666J32185
$$ plain form
13262 1257238 1200239 1237557 1332330 1344166 1225538 1060006 955391 910770 870113 836135 839681
13251 839681 871098 869210 848889 862625 924780 1059619 1234422 1384850 1518912 1648176 1745845
13240 1745845 1781071 1771689 1725689 1661984 1616885 1538002 1331064 1024918 772360 668406 655008
13229 655008 658684 726069 869565 975277 1019230 1062800 1118264 1158928 1170861 1147726 1162319
13218 1162319 1283745 1458197 1642128 1827521 1997803 2152837 2280740 2329703 2294628 2195201
13208 2195201 2047797 1880922 1749030 1672631 1647505 1684150 1743790 1790020 1805439 1769724 1687622
13197 1687622 1590132 1566638 1709479 1964194 2157464 2224884 2244970 2308038 2391447 2408198 2324846
13186 2324846 2141362 1906854 1682909 1481078 1330103 1264468 1259483 1248720 1281386 1413571
13176A413571J77966J51802O7348R961J967j5912m6971p4610q1577n6048m7786
13165A499711m8206l2212m930M1574Q6680O6404j2423k0574R3519J68340J34206
13154A972089N3971J8112N5840Q2352M0350l7884o6854j8225R141k190k2047l2620
13142B052035L7883J26710J42411Q4368k4373j24927j70072j08214K1094J24910
13132B161825J93546K28487J63696l1631k02177k18744j92938j84054j05968m6338
13122A765704o7504o1552k7820k4073j1971L7858J16970K02639K73186L10055
13112B513492K14176P334j08954p7981K7848R3010L7979o0833j31844j63777j11684
13101B238766K58P1562L3907L721K9195N3514P2975Q1314J10368J88200K31807
$$ plain form
13176 1413571 1591537 1743339 1810687 1820648 1822615 1806703 1759732 1685122 1603545 1547497 1499711
13165 1499711 1451505 1419293 1414363 1455937 1542617 1609021 1596598 1576024 1669543 1837883 1972089
13154 1972089 2026060 2044172 2100012 2182364 2222714 2184830 2117976 2099751 2108892 2106702 2084655 2052035
13142 2052035 2089918 2216628 2359039 2443407 2419034 2294107 2124035 2015821 2036915 2161825
13132 2161825 2355371 2583858 2747554 2715923 2513746 2295002 2102064 1918010 1812042 1765704
13122 1765704 1698200 1636648 1608828 1584755 1572784 1610642 1727612 1930251 2203437 2513492
13112 2513492 2727668 2735002 2626048 2548067 2575915 2668925 2706904 2646071 2514227 2350450 2238766
13101 2238766 2239024 2310586 2344493 2348214 2377409 2430923 2503898 2585212 2695580 2883780 3115587
13090C115587K27416J64523n812j91530k59212j82262m4134O2464J12878J18525
13080C118443J15000R2162P2995J00563J17344J04809J13198J42599J34676J33823
13070D245612K15948K69798K11717J19654O3857L7693M7807O7970J6630m7092
13060E249594p9894j06658o6048N9688J31102P5713N0268J03698J50111J95261
13050E762835K43448K21164J16129N9980J03437Q4247k5632p4206k5511Q7443
13040F553334K13512K75268K31574J35104Q6085J25831K02069K67295K82013J65203
13030H537288j1922j09784j12967l8386M8913O0368M8254J02356J85871K32886
13020H942877J90432J48284K12224L27542L74732L51431L54309L79277L57769
$$ plain form
13090 3115587 3343003 3507526 3501714 3310184 3050972 2868710 2824576 2887040 2999918 3118443
13080 3118443 3233443 3325605 3398600 3499163 3616507 3721316 3834514 3977113 4111789 4245612
13070 4245612 4461560 4731358 4943075 5062729 5126586 5164279 5212086 5280056 5296686 5249594
13060 5249594 5169700 5063042 4996994 5056682 5187784 5263497 5313765 5417463 5567574 5762835
13050 5762835 6006283 6227447 6343576 6403556 6506993 6591240 6565608 6491402 6465891 6553334
13040 6553334 6766846 7042114 7273688 7408792 7494877 7620708 7822777 8090072 8372085 8537288
13030 8537288 8525366 8415582 8302615 8264229 8313142 8373510 8421764 8524120 8709991 8942877
13020 8942877 9133309 9281593 9493817 9821359 10196091 10547522 10901831 11281108 11638877
13011A1638877L24264L07966K82280K52588K52177L70738N90524P24178P01460
13002A5445052O32614O07379O45490P06214P68854Q96969J052348J127026J122701
12993B3004647J159439J282328J500804J789705K062271K233999K369470K618481
12985C8021144L006951L446642L917948M476777N167597N977682O877630P873474
12977G8765845Q904460R892800J0903715J2065168J3356871J4709799J6125172
12970A64723830J7563509J8740514J9065251J7685832J3680496O599358k673540
12963B55385250j1917973j8909127k2607544k3239610k1790900j9376638j6720138
12956A20823320j4185738j1979211j0195246q752518p525096o458814n546776
$$ plain form
13011 11638877 11963141 12271107 12553387 12805975 13058152 13428890 14019414 14743592 15445052
13002 15445052 16077666 16685045 17330535 18036749 18805603 19702572 20754920 21881946 23004647
12993 23004647 24164086 25446414 26947218 28736923 30799194 33033193 35402663 38021144
12985 38021144 41028095 44474737 48392685 52869462 58037059 64014741 70892371 78765845
12977 78765845 87670305 97563105 108466820 120531988 133888859 148598658 164723830
12970 164723830 182287339 201027853 220093104 237778936 251459432 258058790 255385250
12963 255385250 243467277 224558150 201950606 178710996 156920096 137543458 120823320
12956 120823320 106637582 94658371 84463125 75710607 68185511 61726697 56179921
12949E6179921m831879m260140l713666l152480k667927k297232j968688j681808
12941C1606101j486142j329891j164039j054849j000312q98706p25400n48435
12933B3398327m16426l26365k93526l38820l99306m06239l18022j81052j3211
12924B0705360J93535L34530L81722L58855L49908M48922O08830P84674Q82467
12915B5048803Q87391R15354J028509J167808J264971J364408J559091J754602
12907C4990937J735862J476966J112572P92672P28138R28872J214545J529487
12899D4510051J936552K480545L040604L588206M243799N022294N865457O725634
12891G7413142P644134Q721704R892380J1063093J2286152J3570690J5015410
$$ plain form
12949 56179921 51348042 47087902 43374236 40221756 37553829 35256597 33287909 31606101
12941 31606101 30119959 28790068 27626029 26571180 25570868 24672162 23946762 23398327
12933 23398327 22981901 22655536 22362010 22023190 21623884 21217645 20899623 20718571 20705360
12924 20705360 20898895 21233425 21615147 21974002 22323910 22772832 23381662 24166336 25048803
12915 25048803 25936194 26851548 27880057 29047865 30312836 31677244 33236335 34990937
12907 34990937 36726799 38203765 39316337 40109009 40837147 41766019 42980564 44510051
12899 44510051 46446603 48927148 51967752 55555958 59799757 64822051 70687508 77413142
12891 77413142 85057276 93778980 103671360 114734453 127020605 140591295 155606705
12884A55606705J6679471J8255124J9216609J9049206J7019476J2188849M282822
12877B62298262n502378j4676124k1005414k3685836k3385424k1432493j8911124
12870A33699469j6338339j3911857j1722948r836589q310475p046758n952813
12863F0579690n078753m468731m011584l536399l054551k656994k303043k015924
12855C3453711j851181j682562j439567j256957j176758j100456r90498q50821
12847B3104911o58273m47180l31638l31102l59717l92349m11290l68079k39262
12838A9566021q8104K0490P4213J26106K00882K31183K24834K43198K79681K97999
12828B1176503L36503M00240M14575L95185M25028N25044O72949Q42707R67450
$$ plain form
12884 155606705 172286176 190541300 209757909 228807115 245826591 258015440 262298262
12877 262298262 256795884 242119760 221114346 197428510 174043086 152610593 133699469
12870 133699469 117361130 103449273 91726325 81889736 73579261 66532503 60579690
12863 60579690 55500937 51032206 47020622 43484223 40429672 37772678 35469635 33453711
12855 33453711 31602530 29919968 28480401 27223444 26046686 24946230 23955732 23104911
12847 23104911 22446638 21999458 21667820 21336718 20977001 20584652 20173362 19805283 19566021
12838 19566021 19477917 19498407 19572620 19698726 19899608 20130791 20355625 20598823 20878504 21176503
12828 21176503 21513006 21913246 22327821 22723006 23148034 23673078 24346027 25188734 26156184
12819B6156184J031179J192038J464123J703724J897804K108586K371381K700346
12811D0625365L119663L586273M054887M613773N390948O364931P331911Q228614
12803H3316365R180304J0260325J1464572J2781587J4135590J5522733J6931110
12796A73592586J8165073J8849527J8346966J5694188R993776J448244q156795
12789B47933565j6361647k1508273k3405587k2819422k0734954j8125004j5589335
12782A09389343j3300671j1281396r578776q202214p075704o081547n177732m384818
12774D4306485l764272l356540l016697k652763k292950j995843j777179j574578
12766B3875663j357085j198706j163354j165811j067193r63341r95767j070771
$$ plain form
12819 26156184 27187363 28379401 29843524 31547248 33445052 35553638 37925019 40625365
12811 40625365 43745028 47331301 51386188 55999961 61390909 67755840 75087751 83316365
12803 83316365 92496669 102756994 114221566 127003153 141138743 156661476 173592586
12796 173592586 191757659 210607186 228954152 244648340 254642116 256090360 247933565
12789 247933565 231571918 210063645 186658058 163838636 143103682 124978678 109389343
12782 109389343 96088672 84807276 75228500 67026286 59950582 53869035 48691303 44306485
12774 44306485 40542213 37185673 34168976 31516213 29223263 27227420 25450241 23875663
12766 23875663 22518578 21319872 20156518 18990707 17923514 16960173 15964406 14893635
12758A4893635j040236r24248p80290o41770n56459n12282m66055m48098m60672
12749I063525m52315l86356l24489k93095k48025j34057l3636l6315r9202j39222
12739F916813j21493r2847j19570j72033k08815k07005j39627q2007j19122j91374
12729E462920j93595j63152j65374j31657q0863p7867o2775q911J9315j2080m4480
12718D541481p5322r4940j23623j52590j36386r3964j09113j80408k10626j03338
12708C261171N9575J06479l612j96632l32251l01780j49551m5069m9559j23366
12698B225405j27597K6558J41160J04313p280j25175j87320j74213j52129j75262
12688A548460j48455m2731K14l6144J9355J47567J74579O2937o2823p4837J6657
$$ plain form
12758 14893635 13853399 12929151 12148861 11507091 10950632 10438350 9972295 9524197 9063525
12749 9063525 8611210 8224854 7900365 7607270 7359245 7225188 7191552 7155237 7056035 6916813
12739 6916813 6795320 6702473 6582903 6410870 6202055 5995050 5855423 5773416 5654294 5462920
12729 5462920 5269325 5106173 4940799 4809142 4728279 4650412 4587637 4578726 4598041 4585961 4541481
12718 4541481 4466159 4371219 4247596 4095006 3958620 3864656 3755543 3575135 3364509 3261171
12708 3261171 3320746 3427225 3423613 3226981 2894730 2592950 2443399 2398330 2348771 2225405
12698 2225405 2097808 2124366 2265526 2369839 2362559 2237384 2050064 1875851 1723722 1548460
12688 1548460 1400005 1357274 1357488 1321344 1340699 1488266 1662845 1725782 1662959 1588122 1604779
12677A604779J12772J52922J16224j1580j32806j30977m8665K0855K1777m8612
12667A656689j35194j61960o7401L7932K2301k6636L911R1849J41090Q5034j0961
12656A636654o7954j01828r1694j3039Q5986J14444p421j43432j37487o1334J9025
12645A231920O6676O5308P2060J22746J69597J70950J56822J03518J7969p1567
12635B105999j62913k22527j93056m7554J23205J77977J32690P9780K035q4907
12625A910729j47663j31155J74J20590J49949J41705Q6535l5685j61553k41750
12615A691876k74744k14622j03989p5716j09776j21860r8364j9387J17282K35293
12605A025993K38305J04590q941p9957j59883j73061r9932j3731M5987N2447l0221
$$ plain form
12677 1604779 1717551 1870473 1986697 1975117 1842311 1711334 1662669 1683524 1705301 1656689
12667 1656689 1521495 1359535 1292134 1330066 1352367 1325731 1329642 1421491 1562581 1647615 1636654
12656 1636654 1568700 1466872 1375178 1362139 1448125 1562569 1555148 1411716 1274229 1212895 1231920
12645 1231920 1298596 1363904 1435964 1558710 1728307 1899257 2056079 2159597 2177566 2105999
12635 2105999 1943086 1720559 1527503 1479949 1603154 1781131 1913821 1993601 1995636 1910729
12625 1910729 1763066 1631911 1632085 1752675 1902624 2044329 2130864 2095179 1933626 1691876
12615 1691876 1417132 1202510 1098521 1022805 913029 791169 692805 673418 790700 1025993
12605 1025993 1264298 1368888 1359947 1279990 1120107 947046 847114 833383 879370 931817 901596
12594I01596p6635M016R6190J38588J48882J45269P1711p7118k11695k86698k48603
12583F05503j24771l0687M5711J13445O7279R489Q9159J63333J10344K055r0263
12572I60597j47755j36288k9794J03637J47013P2253K2682M0302L8242n271q7939
12561I77679j61084j74927j66063j67530j18869l5127K0732l804k2126L5581O7428
12550B51890k781q1238r3541j07378j64379j89727p3606J06715J57390P1094r088
12539a34649m4426l9219P602O1569Q4324O6416J6373K673O3874J11601R1340O5252
12527C52730Q3101J24130J18164K9125n3358q7187j03851r5786q9424p0130P069
12516B14583J04360J22721P0539Q5114J18939K4440j63189k66311j92679m3701
$$ plain form
12594 901596 824961 828977 925167 1063755 1212637 1357906 1429617 1352499 1140804 854106 605503
12583 605503 480732 450045 495756 609201 676480 685969 775128 938461 1048805 1050860 960597
12572 960597 812842 676554 646760 750397 897410 969663 992345 1032647 1070889 1065618 977679
12561 977679 816595 641668 475605 308075 189206 154079 174811 171007 148881 184462 251890
12550 251890 249109 167871 74330 -33048 -197427 -387154 -460760 -354045 -196655 -125561 -134649
12539 -134649 -179075 -218294 -210692 -149123 -64799 1617 17990 20663 84537 196138 287478 352730
12527 352730 435831 559961 678125 707250 653892 566705 462854 367068 277644 207514 214583
12516 214583 318943 441664 512203 597317 716256 740696 577507 311196 118517 74816
12506G4816L9008P5628J32446J16384J6758m4113k6468m1917j16089j59619j20198
12495e3364j6446P2193R6776K2940l9973n6922j24320k11238k47859j69672J7267
12484g10618J77070K22383J86501J13839P0686Q7202J00484O6610j5296n0720
12474B48141j4295k4224n2915K794J05611J49960J43273J27101P5809J448p1965
12463F90738j24580j18451r7703q7527q9644j18687j07908p8078q8632n6966j8533
12452b95971k5784l5847m8021l3560J1237N1417N7007Q253l1297K2344Q4652R8569
12440a37001R6760R0943Q4725O4150L1161o225J0784R3257J47052R9181J3651
12429E88438k4872n0915r0577j21016j57432j83355j88156j96367j74552p1576
$$ plain form
12506 74816 113824 189452 321898 438282 455040 410927 384459 342542 226453 66834 -53364
12495 -53364 -69810 2383 99159 122099 82126 25204 -99116 -310354 -558213 -727885 -710618
12484 -710618 -533548 -311165 -124664 -10825 59861 147063 247547 314157 298861 248141
12474 248141 233846 209622 156707 159501 265112 415072 558345 685446 761255 762703 690738
12463 690738 566158 447707 350004 262477 172833 54146 -53762 -131840 -220472 -277438 -295971
12452 -295971 -321755 -357602 -405623 -439183 -427946 -376529 -319522 -311269 -342566 -320222 -235570 -137001
12440 -137001 -40241 50702 135427 199577 230738 224513 235297 328554 475606 574787 588438
12429 588438 563566 512651 422074 301058 143626 -39729 -227885 -424252 -598804 -670380
12419f70380P2925J48094J45026R8688j6660j12080j16753q1685k544P7938P5051
12408c82380P5051J30995J40652O6608J3254r146k0694p0202j49647j66381r5176
12397d67066o672K0964P152j2484k2541k0968K9761J29863J96206J73892J16366
12386A44473J26619J72199J49667L3012n9378l9661j9718m7670q8261j22760j63987
12375H4535k53722k93072k01831o4407K3142K1903R390O5634J32607K01069K19139
12364e5613J02121o0557j64488j51054n8393N0123J39123J87230J94960J65683
12354C49135O7316n4036j37182j96228k02066j53980m8198J08763J88911J32973
12344E5408L0883l7250j3528O2924O8677J8496o0807r4783m596Q1760O1405L8198
$$ plain form
12419 -670380 -597455 -449361 -304335 -205647 -222307 -334387 -451140 -532825 -535369 -457431 -382380
12408 -382380 -307329 -176334 -35682 30926 44180 35034 14340 -55862 -205509 -371890 -467066
12397 -467066 -473738 -452774 -445622 -458106 -480647 -501615 -471854 -341991 -145785 28107 144473
12386 144473 271092 443291 592958 625970 566592 526931 507213 459543 371282 248522 84535
12375 84535 -169187 -462259 -664090 -728497 -705355 -683452 -674062 -608428 -475821 -274752 -55613
12364 -55613 46508 -14049 -178537 -329591 -387984 -337861 -198738 -11508 183452 349135
12354 349135 416451 362415 225233 29005 -173061 -327041 -375239 -266476 -77565 55408
12344 55408 86291 49041 35513 98437 167114 185610 124803 30020 25424 107184 168589 206787
12332B06787N7389O3954N4833M9011N8686J1092q7472j09780m7756J2171J6989
12321B85904J664J9595J7619p4262j90505k23703j70073r9458n2205J919L7023
12310d46482K7323N2383R9818Q4588L238r9822j83401k24061k32879j64385j4967
12299a098647R5760J02811J11262J29294J23480J02169N8086N1685J03503J33974
12289h6623P1621m02J7626P6602R1604P2735O3295M0067k9614k6427P2601J34192
12277D97277J05274j035p3461q3035q8628r8233n1109M0414R2235Q8684M7746
12266D76129k2803j17255k02222k42172k38831j53553j2765L3502J650J6720N8046
12255d03554M1534K0208L4195O0582R1376J04058R6349J27947J19485M786j13368
$$ plain form
12332 206787 264176 328130 382963 431974 490660 501752 414280 304500 256744 268915 285904
12321 285904 287568 307163 324782 250520 60015 -163688 -333761 -433219 -485424 -483505 -446482
12310 -446482 -419159 -366776 -266958 -182370 -179132 -278954 -462355 -686416 -919295 -1083680 -1098647
12299 -1098647 -1002887 -900076 -788814 -659520 -536040 -433871 -375785 -324100 -220597 -86623
12289 -86623 -15002 -15404 2222 78824 170428 243163 306458 346525 316911 290484 363085 497277
12277 497277 602551 601516 528055 445020 356392 258159 207050 247464 339699 428383 476129
12266 476129 453326 336071 133849 -108323 -347154 -500707 -513472 -479970 -478320 -461600 -403554
12255 -403554 -362020 -341812 -307617 -247035 -155659 -51601 44748 172695 292180 296966 183598
12244A83598j97866j83353o6725L6522K1154p4691j06047k359J54128J94481Q0483
12233C9325o7724j09188n3849k5042O4006K40940L09407K42271J00439j12321
12223F28264l14385m03960l01518o0615Q0751M5715m4790o9902P068P9514N7468
12212b96390j6835n7236o0191n5967n9695o2633l5227J6779P3825R6038R6431
12201c61101J22194J37937J61740K57372L11675J92658n10j22451j05419l285
12191E90810Q1015J32399J77570K36783K07781M8554j44406k46948k44830j92757
12181F45971j32707p0277k3410l0308p1819j03825j30093j01759j0008L2789J8157
12170B2711N4875R6223O4147K026j7540L9480J02184J48159J33772N5323j8560
$$ plain form
12244 183598 -14268 -197621 -264346 -227824 -206670 -281361 -387408 -389767 -235639 -41158 39325
12233 39325 -28399 -137587 -191436 -216478 -152472 88468 397875 640146 740585 628264
12223 628264 313879 -90081 -391599 -452214 -371463 -325748 -370538 -440440 -433372 -353858 -296390
12212 -296390 -313225 -370461 -430652 -486619 -546314 -608947 -644174 -627395 -553570 -457532 -361101
12201 -361101 -238907 -100970 60770 318142 629817 822475 821965 699514 594095 590810
12191 590810 671825 804224 981794 1218577 1426358 1474912 1330506 1083558 838728 645971
12181 645971 513264 442987 419577 389269 317450 213625 83532 -18227 -28235 4554 22711
12170 22711 77586 173809 237956 239982 222442 261922 364106 512265 646037 701360 682800
12159F82800q3126j25797j37133j42056j65088j29785L378R8516P5717J9572j3924
12148H3074l8248j9479P4758J67129J97713J26226j2684k1427R9869J73633J44050
12137I74614O5972m9161j66682j91920j54871j28371o4107L8529J00700P7829
12127E02532K7314K1625K9819r916o3171o3867k0834Q353k3320p9745q1018j4183
12115B33589R6640K11446K36158J37364n2255k15543k03075p0475K7451K9671
12105D30971k2592n3346j23845k06721j55873j290Q7993R7557O2773K6702M4371
12094A86700J01807J43136J17014l151q7423l1438L205m1817p9684j08952j27150
12083G2247j03168l9144K0398K3433J3383O1287J18489J49909J47363J27050J07123
$$ plain form
12159 682800 599674 473877 336744 194688 29600 -100185 -96807 1709 77426 96998 83074
12148 83074 44826 25347 100105 267234 464947 591173 578489 557062 656931 830564 974614
12137 974614 1040586 991425 824743 632823 477952 349581 285474 324003 424703 502532
12127 502532 529846 551471 581290 571374 508203 444336 423502 431855 408535 328790 247772 233589
12115 233589 330229 541675 777833 915197 862942 647399 444324 373849 401300 430971
12105 430971 408379 355033 231188 24467 -131406 -132696 -44703 52854 115627 142329 186700
12094 186700 288507 431643 548657 545506 458083 426645 429850 388033 308349 199397 72247
12083 72247 -30921 -70065 -49667 -26234 -12851 48436 166925 316834 464197 591247 698370
12072F98370O7238J8760K2377R5319J15056L7808m7622j11022j45101j45530j15601
12061D90052n7990N601J7572l3211n1497L469N8391Q8824Q7537O3310p761j14297
12049E50000j28915p5532m6871n6323m9830j3879k3031p4350r8598q7223l6673
12038a41225L5191L4920m2411p7846m2756O929N6577Q8553N7956l0512n4405K0793
12026h8236P2792P8225O7993N2388J1510m4974o2470l21P9511J35125J42623N9508
12014E03674k9570j09752j61905j24805n2832k0756n1106q8790q5369k2107M7513
12003a95805P3887M8664l5088j01107j18936r4585p4J05534J51681J65480J66054
11992A65705J42083J11668O4244k4018q8372r6643q2997o8511q5016j16932j02738
$$ plain form
12072 698370 765608 784368 806745 902064 1017120 1054928 1007306 896284 751183 605653 490052
12061 490052 432062 437663 455235 422024 370527 373996 432387 521211 608748 672058 664297 550000
12049 550000 421085 345553 298682 242359 192529 178650 155619 81269 -17329 -104552 -141225
12038 -141225 -106034 -71114 -113525 -191371 -234127 -227198 -170621 -82068 -24112 -54624 -109029 -88236
12026 -88236 -15444 62781 130774 183162 194672 149698 87228 86907 166418 301543 444166 503674
12014 503674 474104 364352 202447 77642 24810 4054 -47052 -135842 -221211 -243318 -195805
12003 -195805 -121918 -73254 -108342 -209449 -328385 -422970 -423044 -317510 -165829 -349 165705
11992 165705 307788 419456 483700 459682 371310 274667 191670 123159 38143 -78789 -181527
11981a81527m546R8956Q7330J5674L2196Q6803Q3702L4894O844J0411l600q146
11969B58991j1972n5035r4536j26164j48124r7485J4751P3748P0459O4851M7189
11958c327m5l8704m5063l4925O294K6877l4010o2102r821P131o4298j83376j70580
11945f05949N7663K74621K79780J23539J797k5170j5813m246L5698N3086K385
11934A77391l1204L0955J41691J55570P1436Q336J4879M7281K6820k9395m1387
11923E72373n3493j07637j41142j31870r5853m1500j253j2596j1655L1137O0608
11912F7119Q4572N2937m995J2427R9986J54204J18203K6258l8842j0873L4706
11901E95702N8666J25662J80475J01348o7729j93325k11006j77042j80469j47255
$$ plain form
11981 -181527 -186073 -87117 213 15887 48083 134886 218588 253482 260326 270737 267137 258991
11969 258991 247019 191984 97448 -28716 -176840 -274325 -259574 -185826 -115367 -50516 -3327
11958 -3327 -3372 -42076 -87139 -122064 -115770 -88893 -122903 -185005 -194826 -187695 -251993 -435369 -605949
11945 -605949 -548286 -273665 6115 129654 131451 106281 90468 86222 121920 175006 177391
11934 177391 146187 177142 318833 474403 545839 554175 569054 616335 643155 613760 572373
11923 572373 518880 411243 270101 138231 42378 878 -375 -12971 -24626 6511 67119
11912 67119 151691 204628 199633 212060 312046 466250 584453 610711 571869 560996 595702
11901 595702 654368 780030 960505 1061853 994124 800799 589793 412751 232282 85027
11891H5027m4625J5596N3175J32842J81209J31684M9327q423j5119q078m3514
11880E29101j12998j21776p2014m1512l0369Q842M8776L7565j5464o4159n4629
11869A11363L7553J38786J29240O8134K1047p7583j60531r7265Q27j92r3446j92623
11857a14690k01296o7744J25168K92816L31338K07278L7075n9532p3702n2972
11847D23739m960P5537Q9202l9266k10968k81263k18652q4517O7211J47144J11810
11836G5017P2167P9396Q3012M2717l4376n2823O2429J62197R6007j8162m6585
11825E20996J7983Q7482J6418j69242k62353k18429j86447j96765j56144r1367
11815f37868k1670O5929P7946l6326j40951p9410O3617J07265O912j37020j97957
$$ plain form
11891 85027 40402 55998 109173 242015 423224 554908 604235 595812 580693 572615 529101
11880 529101 416103 294327 222313 180801 150432 159274 208050 245615 230151 165992 111363
11869 111363 148916 287702 416942 485076 506123 428540 268009 170744 171571 171379 77933 -114690
11857 -114690 -315986 -383730 -258562 34254 365592 572870 609945 550413 476711 423739
11847 423739 418779 494316 583518 544252 333284 52021 -166631 -251148 -183937 -36793 75017
11836 75017 147184 226580 309592 352309 317933 265110 327539 489736 585743 567581 520996
11825 520996 538979 626461 642879 473637 211284 -7145 -193592 -390357 -546501 -637868
11815 -637868 -659538 -593609 -515663 -551989 -692940 -772350 -708733 -601468 -594556 -731576 -929533
11804i29533j29504N0279K33812L25402L03471J39219j24795k77802j94670n034
11794f09155J05480J10997M5252l6797m0567J396j8580j28257j81782q5292N4922
11783g82383J42024J77392K09617K20969K05066J76835J35203N8498j8576n3903
11773D70742p2161r8158j03872q1493o4121q6514j06429q5651o7238m9686j9784
11762c64365P708L611l803m7887j08334l5212J26340K16643K19926K11391K21356
11751D47374K06310J06037n1221j57651j58711p3682L337J7701J9890K5738k5771
11740C59351r8474j25953j09138o1611k4955n382K6988L8439k9154p8005l3702
11729a41596O9507J67763K11774J98111J24202L0191k6511m8803n3718o4840q5569
$$ plain form
11804 -929533 -1059037 -1008758 -774946 -449544 -146073 -6854 -131649 -409451 -604121 -609155
11794 -609155 -503675 -392678 -347426 -384223 -424790 -423394 -441974 -570231 -752013 -837305 -782383
11783 -782383 -640359 -462967 -253350 -32381 172685 349520 484723 543221 524645 470742
11773 470742 398581 300423 196551 115058 50937 -35577 -142006 -227657 -294895 -344581 -364365
11762 -364365 -356657 -353046 -356849 -404736 -513070 -548282 -421942 -205299 14627 226018 447374
11751 447374 653684 759721 708500 550849 392138 318456 321793 339494 359384 385122 359351
11740 359351 260877 134924 25786 -35825 -60780 -66162 -39174 -735 -29889 -107894 -141596
11729 -141596 -72089 95674 307448 505559 629761 659952 633441 584638 530920 466080 380511
11718C80511q7227k9690L054r115m3923m0911N114m953q3346j64164j77686j20698
11706c73034m5381J245N2095J12592J20483J01707J28012J42865R5150K5657m8641
11695C12750p8436l6184r702K0822O5716P2869K6873j6491K5704J19909J67319
11684F71149J33203J02571J08251N7213p3907j60562j48004j47428k10347l05062
11674B7077l73410m10683m24132k73666P1344L47888M24877L47745K10145O6884
11664A4069l6555k3530L1890K1127k159K6762N8792N4107O1989J08247J15632
11653D30371K8111j46201k37416j54357o1880o3713j15991j35246r0720m7539
11643e94581l3598k4986o3454j26049j07537M455Q9109P5955L4883L4487J3867
$$ plain form
11718 380511 293284 263594 266648 257533 213610 172699 177813 172860 89514 -74650 -252336 -373034
11706 -373034 -418415 -417170 -365075 -252483 -132000 -30293 97719 240584 335734 361391 312750
11695 312750 234314 198130 188428 209250 274966 347835 374708 358217 383921 503830 671149
11684 671149 804352 906923 1015174 1072387 998480 837918 689914 542486 332139 27077
11674 27077 -346333 -757016 -1181148 -1454814 -1383470 -1035582 -610705 -262960 -52815 14069
11664 14069 -22486 -46016 -14126 7001 4842 31604 90396 144503 206492 314739 430371
11653 430371 458482 312281 74865 -79492 -141372 -205085 -321076 -456322 -547042 -594581
11643 -594581 -628179 -653165 -716619 -842668 -950205 -945750 -856641 -780686 -745803 -711316 -697449
11632f97449o2301j10858r2039j9539J04891J86492J68286R0707M2743M6459O4234
11621b78374L3549l3704o2660r7697j57314j35932j1206J20973J56790J35112
11611c30463J29710J16257O2207J1423J071J2341J0452Q448N3099R3029L1936
11600A99510l3589m1617o3629q0409q6475p1266j4136M7366O1482j6229j21339
11589b20331j71306j98248k33731k45499k03253j54506j60572j48336l8943J24280
11579a650445K44353K51703J91104R9258j0662o3220l5261M3462O2071k8233q0332
11568i76202K022J19633J55480J36469J06063J09500J38324J05128L0442k9570
11558a02711p9722j03873q2335l6444k8766q5805j12963n7562K7681J10212R2473
$$ plain form
11632 -697449 -759750 -870608 -962647 -982186 -877295 -690803 -522517 -431810 -389067 -342608 -278374
11621 -278374 -244825 -278529 -341189 -438886 -596200 -732132 -743338 -622365 -465575 -330463
11611 -330463 -200753 -84496 -22289 -10866 -9795 2546 12998 21446 74545 167574 199510
11600 199510 165921 124304 60675 -19734 -106209 -177475 -191611 -144245 -82763 -98992 -220331
11589 -220331 -391637 -589885 -823616 -1069115 -1272368 -1426874 -1587446 -1735782 -1774725 -1650445
11579 -1650445 -1406092 -1154389 -963285 -864027 -874689 -937909 -973170 -929708 -867637 -895870 -976202
11568 -976202 -974180 -854547 -699067 -562598 -456535 -347035 -208711 -103583 -73141 -102711
11558 -102711 -182433 -286306 -368641 -405085 -433851 -519656 -632619 -690181 -662500 -552288 -459815
11547d59815k4026r5826r3917l5058P6654K20328K92553J87719L7805k1952k6686
11536E7779n2740m0654k3307p8968j15213q3095n7078j6974O0163R8609P7439
11525a74039Q9242J65142J74364K6852j31822j45457q6303n5905l0554k0100k3071
11514b11651m7449j14629j50173q9803j0932J22010L13178L74499K52877M3835
11504D81762j45306k91820l21750k02855m2395P1209J04117P4883L9785k5364
11494b57734r7234j20858j16671o0323L0948O2247O1761J05966J08924n748j78896
11483d67618k66453j78574R183J82566K82540K73681J57477P346n0259j3980k9932
11472i4023r4648j15736j27974j51909r8668O9890K68415L95438L88233K56464
$$ plain form
11547 -459815 -483841 -579667 -673584 -708642 -631988 -411660 -119107 68612 106417 84465 57779
11536 57779 5039 -35615 -58922 -137890 -253103 -336198 -393276 -410250 -350087 -251478 -174039
11525 -174039 -84797 80345 254709 281561 149739 4282 -82021 -137926 -168480 -188580 -211651
11514 -211651 -259100 -373729 -523902 -613705 -624637 -502627 -189449 185050 437927 481762
11504 481762 336456 44636 -277114 -479969 -522364 -451155 -347038 -272155 -232370 -257734
11494 -257734 -354968 -475826 -592497 -652820 -621872 -559625 -497864 -391898 -282974 -288722 -467618
11483 -467618 -734071 -912645 -903462 -720896 -438356 -164675 -7198 148 -50111 -64091 -94023
11472 -94023 -188671 -304407 -432381 -584290 -682958 -613068 -344653 50785 439018 695482
11462F95482Q7223j9263k1075Q085l8507j13026j21204j22126j43356q6872L7412
11451A62773J19958J25392R8723L9382o8992j57909k10041k15341j57670p1801
11441c35526m1862p7762j10759j22765j18738p8162r952N5562J25241K04187K11789
11430b98747J31959N7117M0972J00149J97082K17759R0874j09676k22627j74272
11420C0590n6654K6974L7329l272m1843m3610p881J9689k2500j01711r5206k8444
11408b86539K0639N3365L9801J7061J3580P506N1261J35723J72209J11657K9991
11397C66254m713O962N8126P7265M5573jn7235j39920j92495j80673j12372n4260
11385a87489m6002q5611j56986j91377j16494O6781J98625J78249M0739j16986
$$ plain form
11462 695482 782705 763442 742367 750452 711945 598919 477715 355589 212233 125361 162773
11451 162773 282731 408123 506846 546228 477236 319327 109286 -106055 -263725 -335526
11441 -335526 -377388 -455150 -565909 -688674 -807412 -885574 -895526 -839964 -714723 -510536 -298747
11430 -298747 -166788 -109671 -68699 31450 228532 446291 537165 427489 204862 30590
11420 30590 -26064 910 38239 34967 -6876 -50486 -58367 -38678 -61178 -162889 -258095 -286539
11408 -286539 -265900 -212535 -172734 -155673 -142093 -134587 -83326 52397 224606 336263 366254
11397 366254 361541 368503 426629 503894 549467 549466 492231 352311 159816 -20857 -133229 -187489
11385 -187489 -233491 -319102 -476088 -667465 -783959 -717178 -518553 -340304 -299565 -416551
11375d16551k10457k04853o4881Q0973Q5290M7415M5691J976n6738p3473l8698
11364h04306J2268L0727N2505J21032J97113K37184J95970J07753J9638k3248
11354A46636P932Q5795J18957P2022j778o1714j12511j19582m2977L1521O9907
11343A94208J16835J48296J46728J15609O8736N2026M0945j300n7967q3139l2371
11332G08606R1849K13632K55449K13555J20271J1508n0864k415M6001j3586j50913
11321A443093k48027k11629j28073o0576Q012P81p2864o8696j7034l6617j10547
11310D97823j57489j78126j84675j62397n2500O4476N3537n8351j69854j79751
11300e27307q7769m992J4169L3683Q7247J13469R7111O2803L8099o594o0090o6542
$$ plain form
11375 -416551 -627008 -831861 -896742 -815769 -730479 -683064 -637373 -635397 -692135 -765608 -804306
11364 -804306 -792038 -761311 -708806 -587774 -390661 -153477 42493 150246 169884 146636
11354 146636 154568 240363 359320 431342 429564 367850 255339 135757 92780 124301 194208
11343 194208 311043 459339 606067 721676 790412 842438 883383 882083 824116 740977 708606
11332 708606 800455 1014087 1269536 1483091 1603362 1614870 1564006 1561591 1607592 1594006 1443093
11321 1443093 1195066 983437 855364 794788 802800 803581 730717 662021 644987 608370 497823
11310 497823 340334 162208 -22467 -184864 -237364 -172888 -119351 -177702 -347556 -527307
11300 -527307 -615076 -620068 -605899 -572216 -484969 -371500 -274389 -211586 -173487 -180081 -240171 -306713
11288c06713j1207N493l7698k732J24487K08470K05579J69485J74213J92762J64121
11277H86260R8593L3573k5082p3401j13517j49221j39721j05698j01331r8477
11267B11978l2495N2217Q5065J04145J36199J00117k1640j32754j33134k9393
11257C40305O6705O1564k0221q9761j32106j29918p7352o30O6170Q2257J00130
11246B67143J07929M0772K3596J08982J81655K17100J80499R5330N7028N4749
11236A334783M6139R5082K08773K66063J87333L5713o5803o1853r375N0920J19666
11225B207441J58289J21201M0178K2791L7843O128J0575M6144n134j22225j68883
11214B354348j41483j30891j22847j05973p1612j8965L0363M3273N7379P6662
$$ plain form
11288 -306713 -317920 -312427 -350125 -352857 -228370 -19900 185679 355164 529377 722139 886260
11277 886260 984853 1018426 993344 919943 806426 657205 517484 411786 310455 211978
11267 211978 179483 231700 316765 420910 557109 657226 635586 502832 369698 340305
11257 340305 407010 468574 448353 358592 226486 96568 19216 18586 84756 167013 267143
11246 267143 375072 415844 439440 548422 730077 947177 1127676 1223006 1280034 1334783
11236 1334783 1380922 1476004 1684777 1950840 2138173 2173886 2108083 2046230 2036855 2087775 2207441
11225 2207441 2365730 2486931 2527109 2549900 2587743 2593871 2604446 2650590 2645456 2523231 2354348
11214 2354348 2212865 2081974 1959127 1853154 1781542 1762577 1792940 1836213 1893592 1970254
11204A970254M1570m6226j00384q0438q979N3309R0628N6940j7889m4470n6045
11193A858270r4528r4760M0285K25772K96816K54866J35636k4108j38028j90674
11183B269547j92114j59427j30079j29714r1182k500Q4057R6450K988r9401q9614
11172A559011j3205J2841L6973O1118L9859Q912m6455p3878j2179J13280K25426
11161A911703K27041J47138J09386R6564O0000k8158j50829k19415k52069k35901
11151A665460j28410j550P9176P1983J951q6447j42196j19382j9569J28923K11408
11140A661347J68056P3157j1278o4066q7795p9784k2178L9884Q3795J13874J05959
11129A980971L7346p3059j00088o56J64241L25657L48045K40902R4052k8923m1259
$$ plain form
11204 1970254 2011824 1965598 1865214 1784776 1775797 1829106 1919734 1976674 1958785 1914315 1858270
11193 1858270 1763742 1668982 1709267 1935039 2231855 2486721 2622357 2598249 2460221 2269547
11183 2269547 2077433 1918006 1787927 1658213 1567031 1564531 1648588 1745038 1748026 1648625 1559011
11172 1559011 1545806 1558647 1595620 1656738 1696597 1705509 1659054 1585176 1572997 1686277 1911703
11161 1911703 2138744 2285882 2395268 2491832 2551832 2523674 2372845 2153430 1901361 1665460
11151 1665460 1537050 1535500 1614676 1686659 1688610 1602163 1459967 1340585 1321016 1449939 1661347
11140 1661347 1829403 1902560 1891282 1827216 1739421 1659637 1637459 1677343 1761138 1875012 1980971
11129 1980971 2018317 1945258 1845170 1844514 2008755 2334412 2682457 2923359 3017411 2988488 2947229
11118B947229P5589K06454K28391J60983J02247Q4669J11048J44290J58058J64905
11108D383863J29657P6000N1247M8806M2284j7679j17038k11608k46553k09312
11098C929667j36916p5612r9482j81888k14638j65310j16273n4844O8089J88010
11088C140803K25072K50337K56695J24496m6228j24297j15257r0373q4297r8775
11078C438176r6039l5998L4573R9977J21849N9308j8562k9769L3185J18472J75116
11067C900288J62115O2407n3801j31881j95722k40232k38444j90512j08793k8230
11057B937195P5103K12630K86578K56296K33722K32570J55585J8751k4003Q95
11047D385322K3621Q0073R5412L6722l1847n3174l7788j2964J7185J9860k4050
$$ plain form
11118 2947229 3022818 3229272 3457663 3618646 3720893 3805562 3916610 4060900 4218958 4383863
11108 4383863 4513520 4589520 4640767 4689573 4731857 4714178 4597140 4385532 4138979 3929667
11098 3929667 3792751 3717139 3617657 3435769 3221131 3055821 2939548 2884704 2952793 3140803
11088 3140803 3365875 3616212 3872907 3997403 3951175 3826878 3711621 3621248 3536951 3438176
11078 3438176 3342137 3306139 3340712 3440689 3562538 3621846 3603284 3573515 3606700 3725172 3900288
11067 3900288 4062403 4124810 4071009 3939128 3743406 3503174 3264730 3074218 2965425 2937195
11057 2937195 3012298 3224928 3511506 3767802 4001524 4234094 4389679 4408430 4384427 4385322
11047 4385322 4408943 4489016 4584428 4621150 4589303 4536129 4498341 4485377 4502562 4522422 4498372
11036D498372r1313j77798k14881j74172j49218j41078j15288j21015j21624p0664
11026C121321q941K9019p215q5501j09505p2714n8102q6110r0449o6607n5978
11015B509218n7916m5523k5214j0399j1381j6373L4538J11647Q8564p0355j93825
11004B312981j27398k8876n3539o8956K3256J30268J52267J02016O2190L0911
10994B535120k5081p4612n0561J8183O0941J13050J86261J88040J07435O8839
10984C127615J00361J13200J07005J39780J66591J33102P4676O0447J50339K25924
10974D399040J99945J57887J18194O7438k1270j31908j79072j45511j11246j22005
10964D231492j29451j17428j02231j01197j04480r7920j18163j69756k19160j64733
$$ plain form
11036 4498372 4407059 4229261 4014380 3840208 3690990 3549912 3434624 3313609 3191985 3121321
11026 3121321 3112380 3141399 3134184 3048683 2939178 2866464 2808362 2722252 2631803 2565196 2509218
11015 2509218 2451302 2405779 2380565 2370166 2358785 2342412 2376950 2488597 2577161 2506806 2312981
11004 2312981 2185583 2156707 2103168 2034212 2057468 2187736 2340003 2442019 2504209 2535120
10994 2535120 2510039 2435427 2384866 2403049 2463990 2577040 2763301 2951341 3058776 3127615
10984 3127615 3227976 3341176 3448181 3587961 3754552 3887654 3962330 4022777 4173116 4399040
10974 4399040 4598985 4756872 4875066 4942504 4921234 4789326 4610254 4464743 4353497 4231492
10964 4231492 4102041 3984613 3882382 3781185 3676705 3578785 3460622 3290866 3071706 2906973
10954B906973j1461J45575K55263K30848J03612J9166j7111o4349n6626j8852
10944C493038n8076j73975k48742k48347k43699k59501k33379j51400j14764j08767
10934A652388m4178M1928P6172K7173o5699q3998L527P7570N2628n2292j29037
10923A556182j30211p8578k9809n0446j24031j35013j04300j15116j09825n1288
10913F27565L0544J17283K00605J68871O6982R381o1817j73343k49838k62785
10903D73448j92035l6410J14282K13163K33188J65149P6786K9117J1937L78j3124
10892A075879k3023l1448j6413J6874k1896m6481K1057L6266q2653k11014k26328
10881D90820j77563j54986j34919q0329k0342j5368j2014L8497R6173R6718K2166
$$ plain form
10954 2906973 2895512 3041087 3296350 3527198 3630810 3649976 3632865 3568516 3511890 3493038
10944 3493038 3434962 3260987 3012245 2763898 2520199 2260698 2027319 1875919 1761155 1652388
10934 1652388 1608210 1650138 1726310 1753483 1687784 1603786 1607313 1684883 1737511 1685219 1556182
10923 1556182 1425971 1347393 1317584 1267138 1143107 1008094 903794 788678 678853 627565
10913 627565 658109 775392 975997 1144868 1211850 1221231 1159414 986071 736233 473448
10903 473448 281413 245003 359285 572448 805636 970785 1047571 1076688 1088625 1089003 1075879
10892 1075879 1052856 1021408 1004995 1021869 999973 953492 974549 1010815 928162 717148 490820
10881 490820 313257 158271 23352 -56977 -77319 -92687 -104701 -66204 29969 126687 148853
10870A48853o6774q1122l4880M854l371p128M3982N1269k9538q6817p2000n2868
10858a85540J701J09325J67180P2807q7392j57183r7975J7477J07881J62899J55308
10847B66488Q9823m308j14767j66086j24726k4630P5710J10836N1478m8965j07239
10836C614j23964j69197k34120k16152j05420j816L9424J5131k2126K3187R6236
10825f95203P5693R455k4977k2432J977N0425Q8955O8928R051n6450o9572J147
10813e63003M7523R096j8078K460L1947M9555L7069L4901J06017J82401J79269
10802I9157Q8693l1038r2392j07735j47743j95486j82312n9967O6003O4188j2194
10791e10826n8140l9782J8001O1546L2476J4881Q2038J58993J85097J83252J15147
$$ plain form
10870 148853 82079 957 -33923 -29069 -32440 -39568 4414 55683 26145 -60672 -132672 -185540
10858 -185540 -183839 -74514 92666 165473 78081 -79102 -177077 -159600 -51719 111180 266488
10847 266488 356311 352003 237236 71150 -53576 -78206 -2496 108340 159818 110853 3614
10836 3614 -120350 -289547 -523667 -739819 -845239 -847055 -807631 -792500 -814626 -791439 -695203
10825 -695203 -619510 -610055 -635032 -657464 -655487 -605062 -516107 -447179 -438128 -494578 -564150 -563003
10813 -563003 -515480 -506384 -524462 -522002 -490055 -440500 -403431 -368530 -262513 -80112 99157
10802 99157 187850 156812 64420 -43315 -191058 -386544 -568856 -628823 -562820 -498632 -510826
10791 -510826 -568966 -608748 -590747 -529201 -496725 -481844 -399806 -240813 -55716 127536 242683
10780B42683k724m2445l0216p4312j25976j43715j33099q5804j5118K2294p846
10769c96278m3845m7143m1551l7617J20P8137J42977J44271J11085M7064j0876
10758e3656k3156k6459k390L6194M2397O1538R7580P6497J5996n1906j65774k49494
10746b42633k03230j19447j02524j38309j51695o9101M3563J08377J57467K16444
10736e01088K23551J72395J17016J16308J50969J67380J46766M1686q3119j09953
10726D41911m1259J0846o930l3511l9348k5219m958J0454j893j1511L6289J15539
10714D50410J35503P7873j1475o9407n5938K978L1222K4709P4725J79939K29171
10703A069710J53385k1582j96384k58469k30951k21964j64101k9244J5504p4223
$$ plain form
10780 242683 239959 197514 167298 92986 -32990 -176705 -309804 -395608 -410726 -388432 -396278
10769 -396278 -440123 -487266 -528817 -566434 -566314 -488177 -345200 -200929 -89844 -42780 -53656
10758 -53656 -76812 -103271 -105661 -69467 -27070 34468 132048 208545 224541 172635 6861 -242633
10746 -242633 -445863 -565310 -667834 -806143 -957838 -1026939 -983376 -874999 -717532 -501088
10736 -501088 -277537 -105142 11874 128182 279151 446531 593297 634983 551864 441911
10726 441911 400652 411498 404568 371057 331709 306490 301532 311986 310093 298582 334871 450410
10714 450410 585913 663786 652311 582904 526966 529944 561166 585875 660600 840539 1069710
10703 1069710 1223095 1201513 1005129 746660 515709 293745 129644 100400 115904 41681
10693D1681j84341k17255j90566j46106k8385J31511K23230K05838J22362O8837
10683B6806K2701l5539q6360j40388j72613j61449r7286j405O2243O1578P4252
10672d47460J23258J35890J20137Q5713O111p4579r2122o0529K9624J12767J09357
10661D8167N0303K3916L1459N1179R5200J36632J50332Q9223k2049q9275r2565
10650D72522r0054p9436m4373J8394P5616M3147m7939p0364q3292j71940k09221
10639a86940j47052o3926l0319j330J17578J95699R1830p3532j37432q5904J6635
10628c04693J19679J54300P3457l0176q0095l8170O3939J09968L6553j31340k32798
10617b59376j24109N6611J19478N0927p9063j54004j17187j921Q0039O8651J0177
$$ plain form
10693 41681 -142660 -359915 -550481 -696587 -724972 -593461 -370231 -164393 -42031 26806
10683 26806 49507 13968 -72392 -212780 -385393 -546842 -644128 -645533 -583290 -521712 -447460
10672 -447460 -324202 -188312 -68175 17538 23649 -50930 -143052 -203581 -173957 -61190 48167
10661 48167 98470 122386 153845 205024 300224 436856 587188 676411 654362 565087 472522
10650 472522 382468 303032 258659 277053 352669 395816 347877 277513 194221 22281 -186940
10639 -186940 -333992 -397918 -428237 -429567 -311989 -116290 -24460 -97992 -235424 -321328 -304693
10628 -304693 -185014 -30714 42743 12567 -67528 -105698 -41759 68209 104762 -26578 -259376
10617 -259376 -383485 -326874 -207396 -156469 -235532 -389536 -506723 -508644 -428605 -359954 -349777
10606c49777K8922N1262r107o9032p4269k4656L9056R1131J54494J67374P7732
10595H3130n0746j73660k63255k48107j72870o3502R4754J88570J80323J08157
10585c17206k164o8486n5355J2605R3527R5734O64m3592J4998J28334K17775J63580
10573B40414r583j89519k78869k22540q9323j9670J6152O6784J09949J78608K26654
10562B9057K10845J39520j4534j52961j69565j07361q4449r0834m2359M818M9725
10551b28098J16569J12487k0271j71481j80527j02861k5837O1915J32075R6782
10541b09247m6621j84144k19100j49858n4981P4888J87396J63609P4273Q290k7031
10530c82526j1111L901q419j67J9117N3820R6280J18405J22414P9800k439o8866
$$ plain form
10606 -349777 -320855 -269593 -278700 -347732 -422001 -446657 -407601 -316470 -161976 5398 83130
10595 83130 32384 -141276 -404531 -652638 -825508 -889010 -794256 -605686 -425363 -317206
10585 -317206 -319370 -387856 -443211 -430606 -337079 -241345 -240681 -284273 -269275 -140941 76834 240414
10573 240414 230831 41312 -237557 -460097 -549420 -569090 -552938 -486154 -376205 -197597 29057
10562 29057 239902 379422 364888 211927 42362 -64999 -149448 -240282 -282641 -277823 -228098
10551 -228098 -111529 958 -19313 -190794 -371321 -474182 -500019 -438104 -306029 -209247
10541 -209247 -255868 -440012 -659112 -808970 -863951 -789063 -601667 -438058 -363785 -355495 -382526
10530 -382526 -393637 -389736 -398155 -398322 -379205 -325385 -229105 -110700 11714 91514 89075 20209
10518B0209o8663k4847N8399J42094J48456Q9215M4340J5772k9938j04246j64481
10507A26310j48558j6232J29576J50719L3416j17799j83641j97395k16731j97310
10497f37645j14682k8045M4471R8193J21320J30950J23770R9556J16761J70939
10487A25588J99403J75311J60356J53943J14663O0524m692j29236k34608k02258
10477D18994q4968j9922l5847r8758j43529j14632m7062L5768R8708Q1733m2389
10466D8096j49668j20284j5213O6105J13991J05828O1943N0365N8111O7536M6908
10455C33718K9512K0195o1863j21655o5181K9960J22123J79093J61712R3560O5006
10444G86180R4116J15330P1557m5474j52406k17571k35821j78103r7459n9941
$$ plain form
10518 20209 -48454 -73301 -14902 127192 275648 364863 409203 424975 395037 290791 126310
10507 126310 -22248 -38480 91096 241815 275231 157432 -26209 -223604 -440335 -637645
10497 -637645 -752327 -780372 -735901 -637708 -516388 -385438 -261668 -162112 -45351 125588
10487 125588 324991 500302 660658 814601 929264 989788 985096 855860 621252 418994
10477 418994 334026 314104 278257 179499 35970 -78662 -125724 -89956 8752 90485 48096
10466 48096 -101572 -221856 -237069 -170964 -56973 48855 110798 161163 219274 286810 333718
10455 333718 363230 383425 321562 199907 134726 164686 286809 465902 627614 721174 786180
10444 786180 880296 995626 1067183 1021709 869303 651732 415911 237808 140349 80408
10434H0408o9766r5672j07880q1803k1218j627Q644O7043J39848J78331J27956
10423B24264N3027J0370N119j7010n8501o4377o2420j09043j76350k11480j98564
10412f04965j06647j267L2420J8893n447n0620o6010j9696J9655L2336N8141Q7630
10400f05577Q6109Q3979J49090K34122K41962J42482M486p4872r7431j02970p4105
10389a2725l5753l4159k4329J4635K6354J0919O0610J31315J11990N5641J1116
10378C15614l8719o5583r1682r0634o7126m4526k0544J5062N1373N7356M3238
10367F3829N960j8755j0481K619K9442J8094m6761j03043j16990r3104k2631R3484
10355a98337J14151m1907k12411k14297p4317J9871j1467q5136r3866K508J45924
$$ plain form
10434 80408 10642 -85030 -192910 -274713 -295931 -297558 -288914 -221871 -82023 96308 224264
10423 224264 277291 287661 292780 275770 217269 152892 90472 -18571 -194921 -406401 -604965
10412 -604965 -711612 -712879 -680459 -661566 -667013 -717633 -783643 -803339 -783684 -751348 -693207 -605577
10400 -605577 -519468 -435489 -286399 -52277 189685 332167 336653 261781 164350 61380 -12725
10389 -12725 -48478 -82637 -106966 -92331 -65977 -55058 5552 136867 248857 304498 315614
10378 315614 276895 211312 119630 28996 -38130 -82656 -103200 -88138 -36765 20591 63829
10367 63829 69789 51034 40553 43172 72614 90708 43947 -59096 -176086 -269190 -291821 -198337
10355 -198337 -84186 -126093 -338504 -552801 -627118 -607247 -618714 -703850 -797716 -795208 -649284
10344f49284K78918L13589K03441N8003o0395j41916j37488l5590J01745J98016
10334A29039J62257N3708p143k3524n2136q3455r8156j08037j00711n6946O2904
10323a22200J78552J87036J10986o509j17370j83091j77341j24241m0581O5711
10313b29048J24228J20954Q5760M8935j3128q1841p3142k0963j8897o5313p5713
10302a98168L544Q9553J40258J54276Q4856n9362j43190j08876p2028o0409j2176
10291a81722K1391K0902j197j2275k6717j01281j61269r8670M6680J02012J8446
10280c73700j00966j46802n3973J05232J95465J81049R7256L2393L6582N2461
10270B4997N5967L1294m483k272k2529m2615l5809k0123q523J4897P6100J13474
$$ plain form
10344 -649284 -370366 -56777 146664 204667 144272 2356 -135132 -170722 -68977 129039
10334 129039 291296 345004 337861 314337 262201 178746 80590 -27447 -128158 -185104 -122200
10323 -122200 56352 243388 354374 347865 230495 47404 -129937 -254178 -294759 -229048
10313 -229048 -104820 16134 101894 150829 137701 55860 -17282 -38245 -57142 -122455 -198168
10302 -198168 -194624 -105071 35187 189463 274319 214957 71767 -37109 -109137 -169546 -181722
10291 -181722 -160331 -139429 -140626 -152901 -179618 -280899 -442168 -540838 -494158 -392146 -373700
10280 -373700 -474666 -621468 -675441 -570209 -374744 -193695 -96439 -64046 -27464 24997
10270 24997 80964 112258 107775 105503 82974 40359 4550 -15573 -24096 -9199 66901 180375
10258A80375R1364L1101j1161L0790R8566R3462L1446L242j336m2520p2717r1789
10246C40823p6725N748Q1810J30873J48227Q3868k3112k5075N8164J11324R1622
10235I27547j6j01050j11864o2527n7324j17358j62578j13067q1956j30191j39371
10224a49755n0363N1974Q8890Q5388J11816J81310K39355K13368R6340p2875k45583
10213E49865l22720k15192R960J65099J76740Q1506n6782j34324j61218j78732
10203h5798j67451j41781j44570j86124k01026j08151N5434J34403J09055M5774
10193f90235l9167j09850j16199o920J20317J57635J93206K50251K68047K21001
10183B48086R7890m6810j33135j09322k0927O3282J34142J80000J72142J18182
$$ plain form
10258 180375 271739 302840 291679 322469 421035 514497 545943 549185 547849 505329 432612 340823
10246 340823 264098 269846 351656 482529 630756 714624 691512 666437 724601 835925 927547
10235 927547 927531 826481 714617 652090 594766 477408 314830 201763 119807 -10384 -149755
10224 -149755 -200118 -148144 -59254 26134 137950 319260 558615 771983 868323 795448 549865
10213 549865 227145 11953 21913 187012 363752 445258 388476 254152 92934 -85798
10203 -85798 -253249 -395030 -539600 -725724 -926750 -1034901 -979467 -845064 -736009 -690235
10193 -690235 -729402 -839252 -955451 -962371 -842054 -684419 -491213 -240962 27085 248086
10183 248086 345976 299166 166031 56709 35782 99064 233206 413206 585348 703530
10173G03530L5934q4518j92098k18808j96868j60812r3914P854J30104K05522
10163A35926K24780K20776J57488Q7046P0915O2673J4543q7129j69700j60980
10153E56338j04142l1766N3675Q2170L8959p01p8538j57891j38679p2111l6003
10142A11311j074L9302L9124P655l6770k4828O7395J58093K22391K43932J72078
10131I98609J6552j45042k11141j25144N9535J66582J52869J85814K82555L36720
10121A717909K90195K00080J31371N0905l9811m6317K5017L3154q2258j52909
10111B127336j05035o3108r6235j39089j04938l6634J1288K6385L0179O5635P0559
10100A786343n120q3357j13484j43722j93347k19379j70267r7508j20335j72297
$$ plain form
10173 703530 739464 654946 462848 244040 47172 -113640 -207554 -199700 -69596 135926
10163 135926 360706 581482 738970 826016 896931 959604 974147 887018 717318 556338
10153 556338 452196 420430 474105 556275 595234 594533 515995 358104 219425 147314 111311
10142 111311 110237 149539 188663 196318 159548 134720 202115 360208 582599 826531 998609
10131 998609 1015161 870119 658978 533834 593369 759951 912820 1098634 1381189 1717909
10121 1717909 2008104 2208184 2339555 2390460 2350649 2304332 2329349 2362503 2280245 2127336
10111 2127336 2022301 1959193 1862958 1723869 1618931 1582297 1593585 1619970 1650149 1715784 1786343
10100 1786343 1781223 1697866 1584382 1440660 1247313 1027934 857667 760159 639824 467527
10090D67527j26242k7393K9787J9303m5712j10549j44164j79549j62624m9852
10080c29468M6626J4722l1672r87M6574J11192J59878J48697P0308r3919k68267
10069a26316l34103k38285o9214R823N159J9571P7426J46025J46765M6642n5386
10058c71893l3877J01838J82506J19628r38q2498j20647j02692o90J75544K73813
10047A40094K50593J77592N4490j16249k46884k54977j97437j02478r614J049
10037c03821J4526J00938J64200J41595M0895j9330K9680R9862J28546R2788J0561
10026E00440r7360j96440k29754j84167p0444M2314N9231K7205J2633j6135j05014
10015b57491j88153j42590K0066J39481J48749J19117N2723J0273P7851J16024
$$ plain form
10090 467527 341285 313892 343679 362982 317270 206721 62557 -116992 -279616 -329468
10080 -329468 -282842 -268120 -299792 -300779 -254205 -143013 16865 165562 235870 141951 -126316
10069 -126316 -460419 -698704 -767918 -758095 -752936 -733365 -655939 -509914 -363149 -316507 -371893
10058 -371893 -405770 -303932 -121426 -1798 -2736 -85234 -205881 -308573 -309263 -133719 140094
10047 140094 390687 568279 622769 506520 259636 4659 -192778 -295256 -304870 -303821
10037 -303821 -289295 -188357 -24157 117438 158333 139003 168683 268545 397091 489879 500440
10026 500440 403080 206640 -23114 -207281 -277725 -235411 -176180 -148975 -136342 -152477 -257491
10015 -257491 -445644 -588234 -568168 -428687 -279938 -160821 -108098 -97825 -19974 96050
10005I6050O4013N2152R1028P9486j6807j14878j85103k24702j96994j16393n0525
9994e22673O893L4385k1601j27300k12282k06990j45023m8908M3274O8290M6266
9983a085669M5030Q5996Q9068M7873l296j2769O0334J55021J92808J36269N6702
9972b32633M3323O0976K8284n6119j30678j38455r1305k2617N8656J25264J74627
9961a80677J66125R5780L5127J4970L4143P7409Q7560l7053j90219j67625l6439
9950a00899O9950J74788K22934J03475n7319q4473n2476n9837p6084p6789m7224
9939A6046n699P311N4369J24473J52248J36529J26108J09868R9577J11519R4975
9928A027324M7195m027l1807k9408j3124M665L0498P3102N3957k1642o4489n5256
$$ plain form
10005 96050 160063 212215 303243 382729 365922 251044 65941 -158761 -355755 -472148 -522673
9994 -522673 -515780 -481395 -502996 -630296 -842578 -1049568 -1194591 -1243499 -1200225 -1131935 -1085669
9983 -1085669 -1040639 -954643 -865575 -817702 -820998 -833767 -773433 -618412 -425604 -289335 -232633
9972 -232633 -189310 -128334 -100050 -156169 -286847 -425302 -516607 -539224 -480568 -355304 -180677
9961 -180677 -14552 81228 116355 131325 165468 242877 330437 293384 103165 -64460 -100899
9950 -100899 -30949 143839 366773 470248 412929 328456 275980 216143 140059 63270 16046
9939 16046 10347 17658 72027 196500 348748 485277 611385 721253 820830 932349 1027324
9928 1027324 1074519 1070492 1038685 1009277 996153 1000818 1031316 1104418 1158375 1136733 1072244 1016988
9916A016988l6435n9214j41586j97027j73568j48718j59736j51167j20781j05886
9906b77130p4214L3094J73037J93170J19718O5387j303o8200o4402m0591o0106
9895a540q3481k0604R8310J64664J67353J66019J87841J70261Q9090M0020M8059
9884A025992K8901o0535j68719j75041o5517N1617P3279l1222j83833k46927j51279
9873I6716n2902m9848n5994K1503J49854J96267J52621O5283o6302j77276k33653
9862D6269k80222k72909j64240r127J11009J53631J72511J97903J80504J08548
9852B43877Q661m3806K6540J37408J14010j44n7722p7962j03583q1656J6507J42052
9840C24182J96774J57783Q1997L2858M7779J14685J60770J35691P0827R658l8114
$$ plain form
9916 1016988 980553 921339 779753 582726 409158 260440 100704 -50463 -171244 -277130
9906 -277130 -351344 -318250 -145213 47957 167675 233062 231759 163559 99157 58566 -1540
9895 -1540 -85021 -105625 -7315 157349 324702 490721 678562 848823 937913 977933 1025992
9884 1025992 1054893 994358 825639 650598 585081 636698 709977 678755 494922 247995 96716
9873 96716 43814 -6034 -62028 -40525 109329 305596 458217 523500 457198 279922 46269
9862 46269 -233953 -506862 -671102 -680229 -569220 -415589 -243078 -45175 135329 243877
9852 243877 252538 208732 235272 372680 486690 486546 428824 350862 247279 165623 182130 324182
9840 324182 520956 678739 760736 793594 841373 956058 1116828 1252519 1323346 1333004 1294890
9829A294890q2505j12751j37232j74250j69413n3369J15927K11284J88361R8937
9819A179879r370m7696n093K6819L0912j7196j01792j29132q9381n5026o4016
9808G18908m5633P549j7220q1983n7500N3045J34066Q9553L651k8026n07l110
$$ plain form
9829 1294890 1212385 1099634 962402 788152 618739 565370 681297 892581 1080942 1179879
9819 1179879 1170509 1122813 1117720 1144539 1175451 1158255 1056463 927331 837950 782924 718908
9808 718908 673275 680824 663604 581621 524121 577166 711232 800785 804436 776410 775903 772793
$$ [...]
##END NTUPLES=NMR SPECTRUM
##END=
