##TITLE=C13_DE-76K_NaOH
 D2O, 22000sc

 25.11.2024
##JCAMPDX= 6.0         $$ Bruker NMR JCAMP-DX V2.0
##DATA TYPE= NMR SPECTRUM
##DATA CLASS= NTUPLES
##ORIGIN= UXNMR, Bruker Analytische Messtechnik GmbH
##OWNER= root
$$ XWIN-NMR		Version 3.5
$$ Tue Nov 26 13:28:34 2024 Russian Standard Time (UT+4h)  she@DPX200
##.OBSERVE FREQUENCY= 50.327896
##.OBSERVE NUCLEUS= ^13C
##.ACQUISITION MODE= SIMULTANEOUS
##.ACQUISITION SCHEME= undefined
##.AVERAGES= 22004
##.DIGITISER RES= 17
##SPECTROMETER/DATA SYSTEM= spect
##.PULSE SEQUENCE= zgpg30
##.SOLVENT NAME= CDCl3
##.SHIFT REFERENCE= (INTERNAL, CDCl3, 0, 222.565)
##AUDIT TRAIL= $$ (NUMBER, WHEN, WHO, WHERE, WHAT)
$$ ##TITLE= Audit trail, XWIN-NMR		Version 3.5
$$ ##JCAMPDX= 5.01
$$ ##ORIGIN= Bruker BioSpin GmbH
$$ ##OWNER= she
$$ F:/spectra/data/she/nmr/c13/1/pdata/1/auditp.txt
$$ ##AUDIT TRAIL=  $$ (NUMBER, WHEN, WHO, WHERE, WHAT)
(   1,<2024-11-26 13:26:48.43 +0400>,<she>,<DPX200>,
      <created by zg, POWCHK disabled, PULCHK disabled
       terminated by command 'halt'
       configuration hash MD5:
       00 E9 B6 7A A2 85 ED C7 34 08 36 98 17 FE 4E 26
       data hash MD5: 32K
       DD FE 0C 3C 9B 77 1B CF 52 4A 4D 7F C4 A7 97 7B>)
(   2,<2024-11-26 13:26:56.89 +0400>,<she>,<DPX200>,
      <Start of raw data processing
       efp BC_mod = 2 LB = 2 FT_mod = 6 PKNL = 1 PHC0 = -556.3957 PHC1 = 36.50801 SI = 32K 
       data hash MD5: 32K
       CD 54 E5 DD 05 29 58 9D C9 5F 67 54 CF 79 48 41>)
(   3,<2024-11-26 13:27:06.46 +0400>,<she>,<DPX200>,
      <abs ABSG = 5 
       data hash MD5: 32K
       54 4C DC 9B C8 39 D0 DA 1E 43 0A 42 AD D2 78 B1>)
(   4,<2024-11-26 13:27:42.45 +0400>,<she>,<DPX200>,
      <pk PHC0 = 2.942876 PHC1 = -7.2 
       data hash MD5: 32K
       B0 B1 BC 5E 04 0D 6C EC DA 44 2E 3D 7F 06 11 ED>)
(   5,<2024-11-26 13:27:47.40 +0400>,<she>,<DPX200>,
      <abs ABSG = 5 
       data hash MD5: 32K
       8E 90 64 3E C6 97 62 F8 EE 4B 53 79 CA 37 88 5E>)
$$ ##END=
$$ 
$$ hash MD5
$$ B2 39 CB 49 C2 8B 87 32 F4 EC 51 C6 7D 94 D8 95
##$RELAX= 
##$RELAX= 
##$RELAX= 
##$RELAX= 
##$RELAX= 
##$RELAX= 
##$RELAX= 
##$RELAX= 
$$ Bruker specific parameters
$$ --------------------------
##$DU= <F:/spectra>
##$EXPNO= 1
##$NAME= <c13>
##$PROCNO= 1
##$TYPE= <nmr>
##$USER= <she>
##$AMP= (0..31)
100 100 100 100 100 100 100 100 100 100 100 100 100 100 100 100 100 100 
100 100 100 100 100 100 100 100 100 100 100 100 100 100 
##$AQSEQ= 0
##$AQ_mod= 1
##$AUNM= <au_zg>
##$AUTOPOS= <>
##$BF1= 50.322709
##$BF2= 200.13
##$BF3= 50.322709
##$BF4= 500.13
##$BF5= 500.13
##$BF6= 500.13
##$BF7= 500.13
##$BF8= 500.13
##$BYTORDA= 1
##$CFDGTYP= 0
##$CFRGTYP= 5
##$CHEMSTR= <none>
##$CNST= (0..31)
1 1 145 1 1 1 1 1 1 1 1 1 1 1 1 1 1 1 1 1 1 1 1 1 1 1 1 1 1 1 1 1 
##$CPDPRG= <waltz16>
##$CPDPRG1= <>
##$CPDPRG2= <waltz16>
##$CPDPRG3= <>
##$CPDPRG4= <mlev>
##$CPDPRG5= <mlev>
##$CPDPRG6= <mlev>
##$CPDPRG7= <mlev>
##$CPDPRG8= <mlev>
##$CPDPRGB= <>
##$CPDPRGT= <>
##$D= (0..31)
$$ [...]
##$SUBNAM4= <"">
##$SUBNAM5= <"">
##$SUBNAM6= <"">
##$SUBNAM7= <"">
##$SUBNAM8= <"">
##$SUBNAM9= <"">
##$SW= 239.972175391363
##$SWIBOX= (0..15)
0 1 3 0 0 0 0 0 0 0 0 0 0 0 0 0 
##$SW_h= 12077.2946859903
##$TD= 32768
##$TD0= 1
##$TE= 0
##$TE2= 300
##$TE3= 300
##$TEG= 300
##$TL= (0..7)
120 120 120 120 120 120 120 120 
##$TP= (0..7)
150 150 150 150 150 150 150 150 
##$TP07= 0
##$TPNAME0= <>
##$TPNAME1= <>
##$TPNAME2= <>
##$TPNAME3= <>
##$TPNAME4= <>
##$TPNAME5= <>
##$TPNAME6= <>
##$TPNAME7= <>
##$TPOAL= (0..7)
0.5 0.5 0.5 0.5 0.5 0.5 0.5 0.5 
##$TPOFFS= (0..7)
0 0 0 0 0 0 0 0 
##$TUNHIN= 0
##$TUNHOUT= 0
##$TUNXOUT= 0
##$USERA1= <user>
##$USERA2= <user>
##$USERA3= <user>
##$USERA4= <user>
##$USERA5= <user>
##$V9= 5
##$VALIST= <valist>
##$VCLIST= <CCCCCCCCCCCCCCC>
##$VD= 0
##$VDLIST= <DDDDDDDDDDDDDDD>
##$VPLIST= <PPPPPPPPPPPPPPP>
##$VTLIST= <TTTTTTTTTTTTTTT>
##$WBST= 1024
##$WBSW= 4
##$XGAIN= (0..3)
0 0 0 0 
##$XL= 0
##$YL= 0
##$YMAX_a= 126731587
##$YMIN_a= -81315583
##$ZGOPTNS= <>
##$ZL1= 120
##$ZL2= 120
##$ZL3= 120
##$ZL4= 120
##$ABSF1= 222.5654
##$ABSF2= -17.4314
##$ABSG= 5
##$ABSL= 3
##$ALPHA= 0
##$AQORDER= 0
##$ASSFAC= 0
##$ASSFACI= 0
##$ASSFACX= 0
##$ASSWID= 0
##$AUNMP= <proc_1d>
##$AZFE= 0.1
##$AZFW= 0.5
##$BCFW= 0
##$BC_mod= 2
##$BYTORDP= 0
##$COROFFS= 0
##$CY= -3
##$DATMOD= 1
##$DC= 0
##$DFILT= <>
##$DTYPP= 0
##$F1P= 0
##$F2P= 0
##$FCOR= 0.5
##$FTSIZE= 32768
##$FT_mod= 6
##$GAMMA= 0
##$GB= 0
##$INTBC= 1
##$INTSCL= 4.134877e-10
##$ISEN= 128
##$LB= 2
##$LEV0= 0
##$LPBIN= 0
##$MAXI= 10000
##$MC2= 0
##$MEAN= 0
##$ME_mod= 0
##$MI= 0.1934396
##$NCOEF= 0
##$NC_proc= 0
##$NLEV= 6
##$NOISF1= 120.0001
##$NOISF2= 80.00006
##$NSP= 0
##$NTH_PI= 0
##$NZP= 0
##$OFFSET= 222.5654
##$PC= 1.4
##$PHC0= -553.4528
##$PHC1= 29.30801
##$PH_mod= 1
##$PKNL= yes
##$PPARMOD= 0
##$PSCAL= 0
##$PSIGN= 0
##$REVERSE= no
##$SF= 50.3227345484362
##$SI= 32768
##$SIGF1= 140
##$SIGF2= 120
##$SINO= 11.81781
##$SIOLD= 32768
##$SREGLST= <13C.CDCl3>
##$SSB= 0
##$STSI= 32768
##$STSR= 0
##$SW_p= 12077.2946859903
##$SYMM= 0
##$S_DEV= 0
##$TDeff= 32768
##$TDoff= 0
##$TI= <>
##$TILT= no
##$TM1= 0
##$TM2= 0
##$TOPLEV= 0
##$USERP1= <user>
##$USERP2= <user>
##$USERP3= <user>
##$USERP4= <user>
##$USERP5= <user>
##$WDW= 1
##$XDIM= 32768
##$YMAX_p= 483426150
##$YMIN_p= -7971026
$$ End of Bruker specific parameters
$$ ---------------------------------
##NTUPLES= NMR SPECTRUM
##VAR_NAME=  FREQUENCY,     SPECTRUM/REAL,   SPECTRUM/IMAG
##SYMBOL=    X,             R,               I
##VAR_TYPE=  INDEPENDENT,   DEPENDENT,       DEPENDENT
##VAR_FORM=  AFFN,          ASDF,            ASDF
##VAR_DIM=   32768,         32768,           32768
##UNITS=     HZ,            ARBITRARY UNITS, ARBITRARY UNITS
##FACTOR=    0.368581032318806, 1,           1
##FIRST=     11200.0995020947, 0,            0
##LAST=      -877.195183895579, 0,           0
##MIN=       -877.195183895579, -7971026,    0
##MAX=       11200.0995020947, 483426150,    0
$$ Real data points
##PAGE= N=1
##DATA TABLE= (X++(R..R)), XYDATA
$$ [...]
24857 -1551816 -511332 179163 453848 314802 -1181 -175170 -142347 -91334 -136470 -243707
24847 -243707 -494015 -869864 -998666 -707041 -334328 -39393 246633 454703 649848 988471
24837 988471 1396885 1889556 2649435 3399571 3506716 2991094 2372714 1762161 1056088 525718
24827 525718 388268 404178 303061 105165 4416 57233 48097 -209716 -622737 -975385
24817 -975385 -1239993 -1533382 -1881545 -2124799 -2281051 -2335257 -2120675 -1762940 -1545760 -1556061
24807 -1556061 -1486213 -1188130 -1008699 -1006419 -919796 -630555 -358448 -299412 -249773 -90212
24797 -90212 -19873 -68428 -196567 -460528 -508330 -121832 272097 397372 332389 220769
24787 220769 146148 -54055 -481203 -1000263 -1396687 -1470947 -1272109 -910160 -273600 764811
24777 764811 1971187 2875451 3421347 3567532 3126683 2333680 1496616 697580 27521
24768 27521 -227756 12537 198387 6022 -341095 -665694 -948617 -1185341 -1294134 -1197605
24758 -1197605 -909363 -515913 -237641 -109415 69252 230226 -12640 -830228 -1732076
24749 -1732076 -1945431 -1253227 -211636 666431 1242295 1448588 1184219 700882 354301
24740 354301 91874 -178822 -371662 -445706 -408001 -398437 -612161 -974121 -1242234 -1400798
24730 -1400798 -1523219 -1709213 -2012532 -2340082 -2656895 -2849561 -2768585 -2383294 -1922796 -1571729
24720 -1571729 -1388597 -1560788 -2147403 -3043394 -4010823 -4655156 -4700499 -4082175 -3122685 -2163215
24710 -2163215 -1191648 -140740 726450 1240766 1476259 1586636 1770267 1962074 1918926
24701 1918926 1514089 744339 -246837 -1120399 -1666152 -2061513 -2554385 -3061973 -3225226
24692 -3225226 -3125459 -3112410 -3009069 -2631947 -2264341 -2212397 -2335911 -2441061 -2616049 -2761065
24682 -2761065 -2604896 -2190646 -1808239 -1522966 -1420482 -1586302 -1624019 -1337613 -1095701 -1157496
24672 -1157496 -1565040 -2064420 -2098963 -1544443 -734722 20971 512266 512311 -49438 -962747
24662 -962747 -1840438 -2487506 -2944414 -3350604 -3640784 -3566172 -3134923 -2534611 -1908064 -1330379
24652 -1330379 -893415 -613533 -539796 -772998 -1264073 -1662561 -1556643 -1159384 -967097 -868070
24642 -868070 -578296 -272802 -127371 -194973 -506949 -913599 -1210528 -1421844 -1794311 -2168241
24632 -2168241 -2178571 -2090990 -2187309 -2499356 -2926706 -3207421 -3258696 -3052881 -2542248 -2024401
24622 -2024401 -1652714 -1377930 -1051648 -439921 344144 948912 1071408 813440 670781
24613 670781 668378 392062 -93208 -351912 -48374 488513 733994 788280 1050093 1530599
24603 1530599 1944657 2069306 1939676 1613702 1332266 1197596 920263 407587 -11404
24594 -11404 -31293 174861 303975 309041 228467 -22065 -410751 -684116 -828236 -1022143
24584 -1022143 -1285976 -1469396 -1382092 -986279 -572570 -516052 -878326 -1340522 -1532225 -1405250
24574 -1405250 -1008857 -537019 -117249 406763 956966 1388417 1730615 1775458 1425301 895454
24564 895454 356979 1055 -66924 21266 110542 211566 273115 214616 147937 65954 -305119
24553 -305119 -929102 -1594819 -2291863 -2989126 -3584922 -4021247 -4130870 -3856092 -3630044 -3733681
24543 -3733681 -4071146 -4474070 -4765041 -4630038 -3700101 -2373817 -1493730 -1323703 -1724440
24534 -1724440 -2505138 -3430429 -4201396 -4586353 -4696502 -4739562 -4720030 -4322874 -3496846 -2638286
24524 -2638286 -2053311 -1937070 -2147800 -2359928 -2342698 -2132078 -2031851 -2183914 -2497868 -2759315
24514 -2759315 -2885805 -3128990 -3559346 -3897964 -3916975 -3691871 -3160831 -2218456 -1121530
24505 -1121530 -275258 143333 221288 223806 33285 -436171 -806084 -998223 -1133669 -1130715
24495 -1130715 -786387 -402438 -512977 -1005222 -1214967 -1038526 -959302 -836569 -388646 123911
24485 123911 389336 278043 -83869 -369086 -386620 -86062 441650 923967 1028936 931588
24475 931588 1045551 1358548 1605891 1674061 1732743 1881810 2097788 2252033 2132018 1755794
24465 1755794 1276296 840888 558397 275686 -108588 -690273 -1436645 -2133955 -2779579
24456 -2779579 -3344723 -3616831 -3458882 -2953862 -2362488 -1860888 -1328699 -574922 297328
24447 297328 893377 979616 807598 846406 1175240 1363996 1188091 855034 427690 -223314
24437 -223314 -1232059 -2477277 -3549524 -3895051 -3467262 -2657264 -1810615 -1232151 -935978
24428 -935978 -817393 -689297 -434169 -16060 459540 585821 140198 -447987 -656235 -490652
24418 -490652 -146494 223518 385223 344194 269158 228224 187423 -5600 -282976 -551172
24408 -551172 -1018110 -1576420 -1734034 -1481324 -1032522 -291320 699656 1546107 1760961 1368266
24398 1368266 858046 471837 161308 -119882 -295502 -192415 260258 966385 1700423
24389 1700423 2075457 1936046 1471922 870316 308706 -57259 -154461 -48566 65930 35331
24379 35331 -106774 -154042 -46466 -178171 -711945 -1311222 -1709256 -1941013 -2123952 -2302888
24369 -2302888 -2601889 -2957487 -3178626 -3120633 -2903775 -2849211 -2957600 -3128784 -3461586 -4011758
24359 -4011758 -4487921 -4425519 -3781271 -2856554 -1938303 -1101136 -187738 732150 1393274 1803823
24349 1803823 2056213 2072110 2003925 1908339 1765491 1762671 1927225 2080531 2009520 1627091
24339 1627091 804255 -415105 -1653307 -2540378 -3079752 -3482081 -3783486 -3830078 -3639291
24330 -3639291 -3342844 -3030209 -2826437 -2784068 -2808946 -2774529 -2681649 -2697956 -2893539 -3041897
24320 -3041897 -2952965 -2653235 -2238602 -1912549 -1703471 -1353414 -770537 -112979 570068 1225051
24310 1225051 1688173 1796908 1504244 1153583 1208186 1759394 2469035 2887920 2877398 2630359
24300 2630359 2511234 2634131 2653232 2389283 2114402 1880803 1488768 1200430 1221373 1543509
24290 1543509 2088259 2687596 3153266 3209233 2736409 1916566 1111206 637602 636755 902080
24280 902080 966780 864838 839552 895979 843403 683242 670146 786571 1010135 1368247
24270 1368247 1500240 1230532 805922 422892 249311 349661 416679 427448 765342 1294380
24260 1294380 1576221 1448722 1194482 1123005 1034610 770206 353817 -158833 -589990 -845358
24250 -845358 -785671 -471242 -287346 -343517 -573491 -934949 -1228881 -1463283 -1847226 -2221412
24240 -2221412 -2286105 -2068793 -1687445 -1400457 -1284674 -1141541 -952475 -886462 -1032570 -1317249
24230 -1317249 -1705677 -2158489 -2464323 -2406624 -1853542 -1107012 -821730 -1231629 -1882218 -2286128
24220 -2286128 -2326059 -2219018 -2031060 -1679124 -1361769 -1201203 -1136859 -1276190 -1704403 -2107759
24210 -2107759 -2216671 -2024767 -1775538 -1626532 -1533526 -1534319 -1699903 -2112231 -2669411 -3163096
24200 -3163096 -3325909 -3114046 -2570581 -1781776 -1045801 -470597 -55180 70561 -102798
24191 -102798 -246686 -163775 -17229 -73687 -409229 -992140 -1832920 -2670569 -3037386 -2810013
24181 -2810013 -2266164 -1765375 -1338509 -824834 -205164 554664 1501925 2573431 3551322
24172 3551322 4190441 4279909 3913720 3511680 3266443 3080559 2906238 2604322 1930661 1064150
24162 1064150 369612 44065 136659 269386 10520 -471139 -839453 -692089 50076 760141
24152 760141 884364 606326 486598 874723 1567849 2047912 2060484 1730684 1318529 839592
24142 839592 271187 -270621 -655121 -876221 -1022784 -974578 -725338 -645241 -934414 -1348741
24132 -1348741 -1618924 -1648010 -1439438 -1036670 -563632 -61911 557633 1332753 2065327 2601402
24122 2601402 3214097 3837522 4305263 4954868 5937729 7354021 9224079 11054002 12390685
24113 12390685 13294900 13931632 14278375 14135978 13311339 11937442 10338806 8734234 7300664
24104 7300664 6129933 5077873 4103638 3392821 3216697 3516102 4003202 4451529 4537101
24095 4537101 4005843 3107841 2436594 2353215 2724693 3103752 3110959 2602488 1754781 925488
24085 925488 441479 271499 58299 -361529 -850949 -1260945 -1343006 -824757 -8371 596759
24075 596759 967114 1143765 1129466 1113070 1264319 1505974 1776210 2059535 2254640 2161484
24065 2161484 1738823 1273096 986122 874340 696289 202683 -532742 -1251979 -1825734
24056 -1825734 -2172085 -2244457 -2109943 -1997199 -1959899 -2014799 -2310728 -2699782 -2757674 -2329810
24046 -2329810 -1765740 -1244601 -456085 343708 456933 66115 -197667 -247704 -228658 -193432
24036 -193432 -64004 2001 -273728 -865795 -1501710 -1809510 -1612682 -1270328 -1025726 -717726
24026 -717726 -353751 -131547 -38499 18228 -31165 -212268 -313491 -133365 257204 420727
24016 420727 165523 -101679 -219060 -525433 -1036696 -1515997 -2035339 -2732183 -3338416 -3633802
24006 -3633802 -3743193 -3616991 -3179395 -2641698 -2295840 -2190786 -2102478 -1937071 -1658698 -1467397
23996 -1467397 -1645751 -1927097 -2014341 -1959491 -1756585 -1225619 -379369 679343 1868721
23987 1868721 3014015 3771992 3878876 3577186 3172308 2699960 2276044 1984352 1672560
23978 1672560 1293768 1369868 2216266 3260825 3835618 3950538 3834371 3569372 3148031
23969 3148031 2672116 2357805 2137549 1604608 830872 124548 -387912 -481001 -134576 357642
23959 357642 708678 791545 749896 846183 1056215 1155955 1125353 1078329 1103572 1350475 1788226
23948 1788226 2207446 2511414 2652051 2734010 3019741 3495061 3832008 4016136 4369695 4963926
23938 4963926 5522378 5782785 5938338 6237521 6620259 7187135 8272480 9779460 11398723
23929 11398723 13110483 15050682 17146412 19164610 21041347 22608568 23569276 23841810
23921 23841810 23469691 22701516 22054834 21918125 22421829 23375938 24560391 26032530 28045283
23912 28045283 30625531 33569546 36836000 40480578 44148293 46996427 48333704 47941003
23904 47941003 45887243 42577086 38694873 35059189 32144927 29780663 27861184 26583889
23896 26583889 25931751 25802289 26385688 27688717 29415626 31475339 33718154 35735253
23888 35735253 37475983 39116788 40098797 39389993 36875096 33479044 30023742 26684055
23880 26684055 23425461 20446851 18127671 16480027 15030671 13637471 12516155 11527763
23872 11527763 10394898 9230836 8412306 7993542 7586927 6989722 6185286 5226566 4438042
23863 4438042 4067930 3899049 3511500 2927827 2358325 1912429 1883332 2419005 3304827 4202138
23853 4202138 4786996 4971363 4848775 4606009 4539415 4577346 4577825 4706626 5152216 5738187
23843 5738187 6096882 6156923 5817871 5120422 4442083 3877221 3429227 3175653 3063299 3148472
23833 3148472 3477454 3908673 4340541 4792248 5110889 5060962 4654015 4073687 3494020 2887503
23823 2887503 2206659 1479020 832688 382075 24022 -406517 -788239 -1034237 -1289248
23814 -1289248 -1607555 -2020305 -2377009 -2330426 -1745350 -963675 -398957 -284859 -571981 -733819
23804 -733819 -669855 -878931 -1373693 -1816842 -2129144 -2392844 -2605518 -2591221 -2321390 -2031284
23794 -2031284 -1802725 -1398518 -790560 -321009 -77621 68089 205002 468161 780285
23785 780285 961157 970267 820500 624567 557552 510304 492834 719483 1007289 916948 488226
23774 488226 136010 -91932 -311279 -646953 -1221414 -1984930 -2628322 -2821147 -2374608 -1552330
23764 -1552330 -1055087 -1022333 -1147000 -1463664 -1930460 -2253710 -2427589 -2806684 -3415694 -3785381
23754 -3785381 -3458808 -2653392 -1929851 -1450563 -927010 -92099 828595 1338716 1234143
23745 1234143 612115 -351294 -1199544 -1415118 -1229494 -1132519 -980284 -558132 -84132 442276
23735 442276 1292528 2310201 3018119 3292213 3202636 2759693 2278158 2115871 2023293 1581409
23725 1581409 973171 596679 496185 434540 405626 462924 305780 26344 131356 513329
23715 513329 635095 465324 369211 289006 102748 75896 374505 824609 1102843 874410
23705 874410 253276 -258782 -335681 -138584 87049 471563 1030257 1475032 1762283 2070947
23695 2070947 2215609 2014884 1625998 1316467 1014357 385480 -442262 -885589 -613692
23686 -613692 177095 1159203 2028331 2571028 2786385 2697306 2247076 1471310 632700 13853
23676 13853 -406331 -784727 -1071584 -1089504 -980810 -976984 -1022053 -1024815 -1183596 -1346473 -1151010
23665 -1151010 -599655 135725 550220 258865 -296251 -475534 -227657 279057 920389
23656 920389 1538349 1924598 2130676 2264443 2121048 1683676 1216932 841779 569083 298914
23646 298914 -82100 -295931 20967 623085 787460 305620 -254675 -709695 -1138788 -1294376
23636 -1294376 -1106064 -794274 -388553 317935 1205224 1660445 1577784 1453713 1424068 1219748
23626 1219748 872107 726959 868900 1086687 1240617 1302941 1263016 967581 394506 -16288
23616 -16288 20396 227284 161133 -246413 -646824 -739353 -586832 -312981 163585 800928
23606 800928 1306233 1616628 1786750 1745993 1616758 1655134 1825569 1871317 1480714 635642
23596 635642 -354278 -1135944 -1613751 -1670881 -1344741 -1011978 -772135 -463288 -166445 -179877
23586 -179877 -752401 -1706432 -2481991 -2716919 -2488571 -2026420 -1532695 -1257830 -1274012 -1363614
23576 -1363614 -1400120 -1410882 -1277400 -708953 307234 1232503 1591694 1496059 1322131 1307570
23566 1307570 1385840 1412354 1384873 1278554 1099911 704472 -126825 -1084976 -1589366 -1624801
23556 -1624801 -1471935 -1210503 -874910 -428332 137773 417473 -61656 -1114551 -1795864
23547 -1795864 -1620908 -979169 -339209 83005 140568 -52256 -75241 112122 241586 140467
23537 140467 -75537 -224591 -254977 -251236 -301422 -380307 -608157 -1013862 -1349662 -1286957 -936206
23526 -936206 -854583 -1081956 -1321163 -1707419 -2465139 -3218293 -3444017 -3110207 -2515020 -1867298
23516 -1867298 -1358022 -1273593 -1561162 -1891977 -2225879 -2672077 -3127517 -3311181 -3003674 -2253974
23506 -2253974 -1268988 -140775 1014126 1934993 2517481 2715268 2441467 1966555 1730816
23497 1730816 1668782 1267795 509653 -159479 -596395 -917431 -1324293 -1763804 -1811528 -1390640
23487 -1390640 -787868 -128992 586353 1388846 1982071 2114533 1915186 1486249 860329
23478 860329 261546 73323 288782 722490 1231604 1497977 1297560 776837 288912 47179
23468 47179 -27468 -75233 -154865 -315781 -340700 -17632 540972 1128558 1583680 1588771 1019830
23457 1019830 112771 -721278 -1226141 -1347471 -1333592 -1424751 -1389832 -1225486 -1264231 -1521778
23447 -1521778 -1750985 -2020902 -2699696 -3733263 -4565904 -4767828 -4213905 -2942405 -1328963
23438 -1328963 -72181 356428 -178317 -1385054 -2329708 -2568133 -2483899 -2368549 -2251255
23429 -2251255 -2040972 -1740608 -1518800 -1535993 -1799413 -2170178 -2291878 -1963777 -1348780 -782995
23419 -782995 -648105 -932876 -1075588 -729038 -177039 116983 71233 -222794 -756315 -1302990
23409 -1302990 -1560238 -1330506 -700137 114205 924676 1541957 1903036 2034839 1813037
23400 1813037 1192301 518240 344123 940313 1958352 2861580 3210829 2696503 1560488
23391 1560488 459533 -13247 216096 519036 258884 -408615 -992534 -1487439 -1927110
23382 -1927110 -2002816 -1507104 -597820 315408 644329 236206 -570517 -1179619 -1150541 -648269
23372 -648269 -154074 13697 -227464 -611794 -630179 -276755 -70356 57784 370633 578904
23362 578904 424532 -60486 -684469 -1034971 -875010 -537336 -381663 -314851 -126146 154022
23352 154022 330416 320378 202237 63521 -117139 -295514 -416102 -457349 -351655 -200529
23342 -200529 -64360 37476 144585 425574 803789 874330 384881 -343578 -705906 -653669
23332 -653669 -550421 -520874 -401964 104781 1092846 2003566 2390229 2427516 2242123 1801003
23322 1801003 1070885 202597 -400269 -540890 -402122 -248428 -229270 -325745 -381607 -264861
23312 -264861 -27566 34574 -251418 -831507 -1384172 -1318283 -429961 989621 2425730 3491561
23302 3491561 4126899 4469739 4628387 4467915 4055237 3698803 3531567 3317905 2684268
23293 2684268 1592769 390046 -563565 -1081512 -1239881 -1247591 -1078375 -711308 -307749
23284 -307749 -42606 -40443 -149834 69417 664199 1145970 1283927 1191012 1075482 1031007
23274 1031007 1014190 1009169 1054431 1157254 1164633 1009707 710610 367406 -2126 -523437
23264 -523437 -1020780 -1262989 -1405281 -1803118 -2266643 -2427418 -2494722 -2887400 -3607774 -4074567
23254 -4074567 -3894581 -3367887 -3053501 -3132471 -3330112 -3372912 -3175097 -2551668 -1404428 75555
23244 75555 1436216 2296372 2553887 2295473 1861928 1497042 1075584 506789 -100959 -473463
23234 -473463 -470202 -270996 -141443 -306711 -960909 -1913851 -2508983 -2372040 -1800903 -1221395
23224 -1221395 -901901 -920886 -1363056 -2069014 -2434426 -2305877 -2140391 -2341078 -2838364 -3325710
23214 -3325710 -3666972 -3779032 -3482244 -2902589 -2377018 -1946136 -1482613 -967704 -650228
23205 -650228 -693706 -826928 -890131 -969706 -1161248 -1401782 -1496423 -1175887 -484849 88295
23195 88295 140922 -295262 -774344 -1030418 -1044525 -740582 -202513 392615 646550 342782
23185 342782 -84169 -234062 -299720 -305479 -58053 357952 783189 1223574 1648718 2018746
23175 2018746 2214717 2029450 1573863 1101371 620730 180737 -23646 46049 196741 139260
23165 139260 -135840 -608127 -1313924 -1994009 -2226917 -1914506 -1293174 -699353 -391545 -410199
23155 -410199 -587527 -911360 -1295509 -1450383 -1382677 -1171430 -728688 -128533 308656 377115
23145 377115 -98983 -1091988 -2027736 -2250559 -1686516 -869775 -217310 210133 580324 922897
23135 922897 1057792 1036517 809793 274121 -355538 -901511 -1319609 -1637291 -1862527 -1886989
23125 -1886989 -1699964 -1574391 -1779991 -2240742 -2476556 -2091253 -1406319 -994074 -916429 -1040072
23115 -1040072 -1189480 -1200034 -1392086 -1887623 -2301433 -2432180 -2460452 -2621012 -2755775 -2693245
23105 -2693245 -2522091 -2376557 -2266499 -2113891 -1917875 -1864118 -2137099 -2470526 -2499734 -2347625
23095 -2347625 -2211845 -2088654 -1949780 -1938044 -2090646 -2069897 -1702877 -1187698 -731436 -315614
23085 -315614 196762 700717 1064449 1480308 2088465 2850148 3572401 3894090 3750424 3271621
23075 3271621 2505768 1627210 747250 -121603 -799260 -1242906 -1625945 -1973928 -2223192
23066 -2223192 -2386708 -2480120 -2369424 -1955109 -1416354 -1147640 -1246100 -1289102 -839615 44977
23056 44977 922015 1561990 1885762 1656565 872005 106717 -136526 108239 487172 804299
23046 804299 915303 762719 512835 253743 186781 478720 867635 1077476 980764 702042
23036 702042 393513 -86588 -774940 -1431637 -1900051 -2110143 -1967343 -1570974 -1007201 -354611
23026 -354611 101825 144436 86700 177809 240417 256868 251667 254665 387461 649553 744173
23015 744173 319569 -348063 -666039 -530930 -258802 -64104 -162205 -779157 -1518923 -1608530
23005 -1608530 -1107264 -663744 -587372 -729455 -667140 -181142 407225 666329 618526 767363
22995 767363 1355556 2008877 2427672 2541964 2439829 2374487 2362003 2278056 2060952 1763545
22985 1763545 1377416 856595 405380 269287 334494 331291 77627 -349353 -562762 -333250
22975 -333250 187189 675755 964594 1035452 870114 518789 48798 -406457 -844333 -1169889
22965 -1169889 -1136312 -801169 -333843 70999 174122 -30950 -588716 -1393994 -2025088 -2166548
22955 -2166548 -1819512 -1329885 -990175 -747576 -306142 404785 1104783 1488452 1644306
22946 1644306 1776188 1754879 1362595 671998 -29768 -580386 -970726 -1180047 -1110130 -719024
22936 -719024 -210681 234784 455950 312308 -268727 -982383 -1421779 -1618986 -1773228 -1789478
22926 -1789478 -1454424 -1019072 -830080 -733653 -380243 205729 854850 1324436 1279263 646287
22916 646287 -277527 -1110607 -1767202 -2331089 -2742864 -3065026 -3357624 -3517915 -3427433 -2876614
22906 -2876614 -1798401 -799818 -505854 -721557 -1112470 -1526649 -1821506 -2088288 -2455575
22897 -2455575 -2915745 -3267277 -3421074 -3444656 -3266361 -2976011 -2640868 -2135292 -1405620 -473896
22887 -473896 423896 926417 790062 317405 193195 623097 1128725 1263045 1278464 1467317
22877 1467317 1669919 1718241 1770169 1916802 2101203 2255782 2149052 1762973 1362627 1051464
22867 1051464 680079 72683 -655623 -1133886 -1271229 -1097639 -629174 -122423 -28470 -460094
22857 -460094 -907622 -969775 -796946 -568000 -364985 -325975 -431146 -624713 -731882 -509232
22847 -509232 32042 722149 1337971 1716859 1860198 1771563 1277998 431241 -430082 -967626
22837 -967626 -982130 -698575 -447161 -171444 46813 -16625 -528173 -1452031 -2282498 -2687926
22827 -2687926 -2798355 -2877131 -3001022 -3218009 -3674143 -4148448 -4212349 -3771049 -2969021 -1994331
22817 -1994331 -909067 119434 771778 859554 421219 -347960 -1127427 -1583435 -1632207
22808 -1632207 -1516089 -1476492 -1499442 -1464296 -1401603 -1502596 -1658517 -1393925 -784247 -488713
22798 -488713 -787514 -1297073 -1444451 -1265978 -1308568 -1629766 -1761043 -1530086 -1306520 -1557498
22788 -1557498 -2115102 -2535768 -2611012 -2297382 -1721583 -1042130 -454539 -150149 -240528 -625065
22778 -625065 -1183388 -1804484 -2133604 -1944906 -1513756 -1111397 -999773 -1178255 -1427501 -1656581
22768 -1656581 -1896013 -2331590 -2939194 -3509451 -3826563 -3802624 -3635049 -3482467 -3355890 -3199338
22758 -3199338 -3149439 -3215861 -3166953 -2924439 -2364192 -1590122 -858931 -198534 286606 588396
22748 588396 704047 574615 397910 232392 35615 -117298 -89281 83876 33529 -417837
22738 -417837 -994887 -1309350 -1100362 -641857 -403363 -378434 -222969 26635 -51274 -747550
22728 -747550 -1905034 -2939255 -3311328 -3118937 -2823638 -2749735 -2952767 -3210887 -3378283
22719 -3378283 -3435298 -3349747 -3195944 -3150932 -3194941 -3200781 -3050136 -2568274 -1780263 -1051921
22709 -1051921 -620723 -350674 -213110 -406120 -1032962 -1843373 -2331171 -2312704 -1981504 -1518669
22699 -1518669 -1051957 -797221 -904236 -1373931 -1974194 -2322049 -2264707 -1858205 -1262641 -633357
22689 -633357 -281703 -445366 -834995 -980138 -915346 -916127 -794436 -385742 131488 610762
22679 610762 1079963 1476724 1746880 1772133 1524857 1105011 576739 44956 -335913 -370547
22669 -370547 -226488 -114746 46667 300238 519463 788375 1228560 1679944 1898379 1932416
22659 1932416 2018720 2186398 2195348 1948333 1539713 895295 -70711 -1312205 -2413604 -2934378
22649 -2934378 -2941357 -2760333 -2323816 -1574569 -937568 -679977 -428775 167027 853946 1181855
22639 1181855 1104970 841421 498495 181468 22213 52986 136484 328057 754298 1094971
22629 1094971 821733 118065 -241298 54855 599421 757562 426235 169572 341671
22620 341671 684905 1019066 1432609 1784809 1732304 1302932 906992 642783 328201 -127910
22610 -127910 -746659 -1448157 -1995744 -2315117 -2350203 -1958586 -1308217 -785261 -507777 -349978
22600 -349978 -266424 -286109 -523940 -739025 -629645 -343080 52665 797830 1818318 2579516
22590 2579516 2765889 2503119 2226231 2051892 1747577 1434816 1508851 1975460 2408068 2433920
22580 2433920 2138696 1858887 1583943 1074486 586489 688626 1505417 2568524 3354666
22571 3354666 3571240 3338042 3002600 2586193 2066870 1716422 1663424 1635679 1383103 868214
22561 868214 198260 -415060 -681384 -465293 -223649 -401599 -772252 -1061139 -1303013 -1252635
22551 -1252635 -552749 351748 757573 574435 123593 -303432 -655627 -1021674 -1358988
22542 -1358988 -1390593 -1005176 -429592 89334 546174 1124687 1827981 2411264 2836494 3151615
22532 3151615 3028899 2156865 889680 -26709 -400188 -468364 -302204 99877 651087
22523 651087 1233487 1536154 1285716 844056 675349 687771 548363 377160 664163 1311812
22513 1311812 1862127 2035496 1906760 1734056 1539682 1301369 1001811 554676 168683
22504 168683 162733 583041 1192232 1688561 1922579 2012607 2138399 2201990 2024548 1764266
22494 1764266 1588533 1346343 1087540 1202829 1875475 2700127 3237565 3583981 3875559
22485 3875559 4028944 3904675 3488988 3131747 3095964 3261488 3372742 3425868 3468487 3214240
22475 3214240 2501612 1499182 496014 -204875 -559569 -861901 -1138361 -1344335 -1442418
22466 -1442418 -1288280 -1091731 -1026457 -917695 -728093 -411328 48763 564444 1001176 1184811
22456 1184811 1309238 1771640 2463120 2956083 3237812 3571317 3927294 3807119 3035088
22447 3035088 1961876 1125239 688199 530774 637597 880957 939210 737272 512082
22438 512082 267996 -74528 -489160 -962519 -1343064 -1398745 -1326646 -1449575 -1661705 -1810814
22428 -1810814 -1745420 -1369194 -826630 -165131 664515 1472960 1988409 2115523 1754058 952861
22418 952861 270716 147599 603681 1316174 1722380 1732023 1689091 1794864 2004427 2148532
22408 2148532 2141121 1965421 1558084 868841 75851 -568112 -1053967 -1413235 -1556397 -1343364
22398 -1343364 -774397 -156564 243029 515706 745894 852811 850215 876456 1061124 1492864
22388 1492864 2227337 2958332 3269244 3014546 2195247 1123905 216967 -397201 -656149
22379 -656149 -424274 62736 332764 331055 185111 31103 146095 561113 919115 922454
22369 922454 677070 259024 -217127 -548059 -616256 -390520 38517 443304 545546 324163
22359 324163 26449 2202 319917 718740 791814 632126 681596 983059 1082969 814488
22349 814488 493820 113976 -613086 -1606476 -2385440 -2368661 -1393757 -189862 390387 385253
22339 385253 347714 567293 1070746 1670273 2271367 2868950 3218808 3051840 2319408 1402950
22329 1402950 827991 792158 1091116 1389447 1389753 900882 118571 -654422 -1357810 -1981073
22319 -1981073 -2290894 -2075655 -1396452 -602541 -295316 -719697 -1401135 -2047108 -2573959
22310 -2573959 -2695987 -2595149 -2543667 -2520722 -2547778 -2589478 -2386661 -1829384 -964360 65598
22300 65598 988062 1552127 1649639 1667864 2033277 2488157 2714419 2863914 2901026 2636969
22290 2636969 2049808 1280783 386441 -500739 -1063782 -1311776 -1480625 -1624019 -1846387
22281 -1846387 -2085880 -2068452 -1737326 -1183586 -678649 -482880 -460613 -417300 -493938 -660521
22271 -660521 -561724 -133298 279857 600919 893125 959438 736121 202817 -636582 -1531987
22261 -1531987 -2180848 -2571945 -3017030 -3436845 -3526547 -3275099 -2693109 -1948277 -1427893 -1309041
22251 -1309041 -1272517 -819408 128522 1006918 1461609 1741162 2020810 2337029 2811380 3419209
22241 3419209 3719451 3205312 2086040 891849 -258243 -1453004 -2530808 -3094137 -2945021
22232 -2945021 -2198933 -1206301 -551135 -288539 -67829 129544 294166 414576 218494
22223 218494 -347937 -775332 -734166 -454618 -240233 -256657 -419141 -504679 -405953 -212699
22213 -212699 25790 402308 931337 1615308 2374225 3053533 3592814 3755671 3267388 2297920
22203 2297920 1299315 660818 463698 543424 645818 525103 110646 -397656 -623168 -422711
22193 -422711 -38921 127699 -176963 -805932 -1310585 -1485291 -1478329 -1372019 -1152954 -973786
22183 -973786 -996607 -1117313 -1203076 -1222244 -1178357 -1233340 -1571464 -2069111 -2528889 -2935244
22173 -2935244 -3023267 -2461991 -1447194 -432204 161556 104865 -370139 -809048 -1048225
22164 -1048225 -1003068 -612402 -29520 545283 996213 1420079 1876961 2108614 1887845 1222462
22154 1222462 254428 -574056 -860279 -652272 -342813 -220736 -385868 -824272 -1238473
22145 -1238473 -1525045 -1737977 -1770538 -1588052 -1202593 -835367 -802684 -995998 -1197696 -1380694
22135 -1380694 -1446224 -1284348 -1046729 -938251 -1004685 -1299964 -1699010 -1910927 -1728931 -1178391
22125 -1178391 -591762 -409005 -602143 -838693 -984141 -963284 -745808 -548476 -536162 -788263
22115 -788263 -1371379 -2117102 -2758343 -2947288 -2324652 -1145749 -116942 369232 479180
22106 479180 473437 359456 124698 -108490 -265473 -253578 257536 1122553 1658912 1610940
22096 1610940 1330478 1045758 741601 347195 -45601 -318123 -539194 -816784 -1184176
22087 -1184176 -1513790 -1574534 -1397005 -1163290 -992624 -623708 306760 1425894 2029083
22078 2029083 2013313 1818781 1941942 2564278 3025788 2714926 1948935 1166696 741399 821810
22068 821810 980927 1024142 1333215 2074771 2875836 3164736 2846145 2181494 1600982 1401395
22058 1401395 1444847 1581952 1729425 1786879 1913360 2243145 2565522 2574397 2148719 1652967
22048 1652967 1332678 888030 79768 -950515 -1804359 -2319481 -2605840 -2732299 -2774135
22039 -2774135 -2898087 -3169109 -3363917 -3370082 -3195501 -2697354 -1969256 -1213901 -449415 272313
22029 272313 746434 872203 738150 581285 858793 1561443 2055347 2008456 1699253 1315075
22019 1315075 1074758 1132322 1176969 1010003 760202 643835 584153 319923 -179312 -837568
22009 -837568 -1539305 -2266972 -3073215 -3845846 -4319229 -4216327 -3665435 -3191664 -2998036 -3059819
21999 -3059819 -3259408 -3514031 -3931028 -4483109 -4913623 -4941253 -4751330 -4697539 -4715860 -4675831
21989 -4675831 -4598278 -4358189 -3792307 -2988251 -2242114 -1848434 -1545477 -850306 -90919 34240
21979 34240 -510189 -1201786 -1720185 -1942917 -1704968 -1099506 -208372 791652 1483582 1576710
21969 1576710 1107729 536262 197668 65832 -101163 -323950 -262696 175017 664831 668715
21959 668715 259804 -16859 -46575 174592 671068 1229659 1569887 1781122 1892753 1614047
21949 1614047 929240 245602 -314179 -967705 -1698985 -2343071 -2741844 -2688739 -2069596 -986411
21939 -986411 291554 1291613 1651866 1460588 905111 261044 -250014 -828328 -1543646
21930 -1543646 -1986024 -1793750 -1094093 -279794 525254 1322286 1917297 2187821 2194365 2017067
21920 2017067 1824470 1817886 2035283 2351705 2610551 2718534 2464893 1813280 1269120 1185217
21910 1185217 1179316 887154 344397 -186342 -512868 -575846 -284286 229544 697891 1071304
21900 1071304 1455477 1806794 1970221 1825403 1535485 1371238 1421986 1464984 1090515 260147
21890 260147 -482195 -593147 -209149 163260 349575 543914 609952 344578 -212241 -880449
21880 -880449 -1330193 -1366467 -1124530 -738832 -276473 125815 306161 340012 402392 566765
21870 566765 854597 1029002 886549 471148 33721 -227061 -214582 206989 1103324 2031084
21860 2031084 2549187 2702193 2619920 2393863 2203356 2252719 2232665 1626864 629263 -131333
21850 -131333 -507058 -597988 -466263 -323366 -225645 7481 217957 165499 15876 69705
21840 69705 344503 630087 865465 1028519 944765 467251 -142767 -578245 -726582 -702465
21830 -702465 -806105 -1039670 -1325412 -1714199 -2085360 -2125976 -1663892 -895403 -239102 60211
21820 60211 131151 43561 -249417 -585201 -888554 -1397618 -2105200 -2539731 -2621999 -2684833
21810 -2684833 -2915779 -3244240 -3490895 -3598259 -3617799 -3461822 -3039764 -2433722 -1787419 -1220294
21800 -1220294 -740770 -254463 290635 794163 1079512 1126770 1036409 911105 791564 705997
21790 705997 635508 687250 1006233 1623552 2373124 2926305 3039747 2649652 1999300 1377832
21780 1377832 946491 710850 699297 962489 1412814 1804890 1868501 1482814 806102 55856
21770 55856 -752611 -1429757 -1616334 -1460696 -1269064 -1207091 -1433063 -1868801 -2182342 -2256127
21760 -2256127 -2196426 -2206905 -2369422 -2623140 -2996532 -3361815 -3585725 -3800310 -4094695 -4296332
21750 -4296332 -4442520 -4684863 -4894580 -4967917 -4870021 -4499736 -3960064 -3657932 -3781724 -3898919
21740 -3898919 -3640774 -3068479 -2449625 -1902622 -1380173 -893265 -550302 -452724 -610007 -946308
21730 -946308 -1270833 -1465262 -1426516 -945649 -76952 738072 1218523 1480189 1700357 1995223
21720 1995223 2355874 2577955 2405887 1772492 951403 455384 466794 659592 655340 333421
21710 333421 14238 -21249 81835 94822 111156 356880 754092 962144 852472 458014
21700 458014 -294243 -1324728 -2067011 -2199365 -2055664 -1729167 -1251838 -813466 -404051
21691 -404051 46545 327774 60125 -746186 -1597688 -2106149 -2418332 -2719856 -2917375 -2995025
21681 -2995025 -3091393 -3212393 -3317272 -3150387 -2526954 -1740002 -1200703 -1144470 -1461532 -1696973
21671 -1696973 -1657813 -1602383 -1653116 -1554598 -1207156 -868423 -659137 -472980 -294122 -266849
21661 -266849 -499339 -725346 -702850 -657011 -751084 -947244 -1062267 -882772 -298774 635381
21651 635381 1526559 1993973 2156563 2353167 2533270 2492126 2214172 1790574 1172158 310194
21641 310194 -588298 -1409377 -2269372 -2995000 -3359692 -3474762 -3518428 -3630750 -3712550 -3515313
21631 -3515313 -3162434 -2888486 -2856305 -3010557 -3104973 -3273691 -3680832 -4263496 -4934083 -5493966
21621 -5493966 -5656047 -5288653 -4546670 -3667466 -2813620 -2078423 -1685620 -1665176 -1816016 -1963767
21611 -1963767 -1898918 -1668208 -1415903 -1108627 -680658 -164550 284163 447465 462694 725210
21601 725210 1208715 1640634 1931648 2017176 1984828 2047144 2252735 2451669 2521075 2488144
21591 2488144 2294057 1931813 1645227 1682602 1962055 2157355 2055742 1458774 442712
21582 442712 -492657 -1130950 -1441234 -1298229 -782803 -3810 730034 1036566 903143 605143
21572 605143 318227 -17401 -514285 -1233793 -1960772 -2459039 -2853450 -3302796 -3685975 -3867870
21562 -3867870 -3901124 -3944705 -4276506 -4999869 -5746067 -6001102 -5727595 -5098994 -4423533 -3999479
21552 -3999479 -3719304 -3292021 -2516783 -1301565 -101793 591429 735625 386679 -155567
21543 -155567 -368514 -279645 -217155 -140834 14399 -43234 -540880 -1111649 -1255710 -924469
21533 -924469 -528181 -309294 -173207 4865 415640 964405 1473453 1960581 2419174 2721037
21523 2721037 2961308 3215240 3287258 3007254 2326716 1329811 173626 -916251 -1669821
21514 -1669821 -1919826 -1714069 -1267207 -828213 -637499 -744512 -1104212 -1589658 -1795881
21505 -1795881 -1301497 -228681 754139 1286865 1651980 1917804 1740797 1199501 876188
21496 876188 1327190 2680350 4741366 7017806 8773373 9369815 8711042 7224586 5523351
21487 5523351 4130621 3315525 2988226 2833597 2605198 2320128 2118823 2118482 2191596 2350415
21477 2350415 2616940 2775723 2647729 2441587 2459221 2622926 2816105 2974170 2920771 2578611
21467 2578611 2202510 2137059 2497404 3029608 3307112 3121553 2491975 1680182 935216 264248
21457 264248 -174864 -279180 -229119 -169299 -193403 -337334 -399863 -59859 543262 921119
21447 921119 906762 644264 450639 450925 420371 297112 72780 -149095 -277398 -498025
21437 -498025 -935535 -1298668 -1241020 -934733 -825038 -972170 -1181636 -1160653 -1037901 -1192055
21427 -1192055 -1452576 -1559987 -1570917 -1476628 -1279059 -946086 -185225 902042 1624833 1458499
21417 1458499 612326 -280223 -821063 -1009456 -981175 -950749 -1035341 -1160074 -1362416 -1710218
21407 -1710218 -2099719 -2371705 -2375279 -2087697 -1775222 -1684059 -1792381 -1888305 -1753590 -1278211
21397 -1278211 -457964 486816 1367765 2009562 2232999 2160611 2008027 1772157 1486371 1305039
21387 1305039 1281271 1289726 1283151 1426119 1604450 1581644 1429007 1259594 961695 484134
21377 484134 -25803 -205618 -50991 -68051 -449739 -829339 -800171 -561546 -566317 -842643
21367 -842643 -1038650 -938509 -752924 -655468 -476772 -194513 -36441 -37586 107457 665171
21357 665171 1556967 2489277 3168180 3533092 3603171 3329977 2655298 1653107 536918
21348 536918 -429246 -1034403 -1426367 -1786296 -2047311 -2035310 -1606230 -1044972 -735815 -528037
21338 -528037 -104054 363935 467187 92538 -390991 -716909 -955180 -1119178 -1188969 -1300300
21328 -1300300 -1415074 -1451768 -1457595 -1294410 -748560 230986 1277603 1979626 2231306 2140720
21318 2140720 1957620 1765710 1437229 1062885 724361 340038 24691 -173205 -431696
21309 -431696 -527860 -213443 339344 753747 871097 928867 1310359 1942257 2459879 2297450
21299 2297450 1188613 -199634 -1122097 -1531129 -1722748 -1813429 -1995079 -2429158 -2876606
21290 -2876606 -3051739 -3074141 -3137087 -3038599 -2639731 -2073547 -1679112 -1659360 -1777745 -1767190
21280 -1767190 -1516545 -1111476 -863092 -758064 -569779 -390553 -356101 -395345 -435433 -493764
21270 -493764 -475344 -207192 174834 450002 738341 1129984 1475556 1647920 1497112 1084801
21260 1084801 666771 349895 117259 -26301 -92736 -8938 186795 217294 99980 -25762
21250 -25762 -285190 -662910 -810095 -596633 -174056 302650 672441 728262 305724 -350822
21240 -350822 -762491 -689989 -418831 -188345 117898 388854 308558 -115597 -551156 -997212
21230 -997212 -1582235 -2232580 -2755414 -2897384 -2659413 -2212613 -1675100 -1357280 -1293146 -1078913
21220 -1078913 -645572 -214127 86193 121080 -76921 -181218 -32721 285497 622763 746507
21210 746507 549018 217374 -21183 -154971 -216646 -257861 -190384 80046 383564 482982
21200 482982 467299 641848 1178402 1859204 2287908 2252171 1774627 1104278 506853 148736
21190 148736 -40712 -164836 -48663 347372 734378 1051350 1495439 2012169 2432169 2639143
21180 2639143 2589077 2237832 1588019 901453 653511 1029376 1526402 1749730 1836060 1826476
21170 1826476 1613408 1188749 453566 -676627 -1824677 -2530024 -2459370 -1581711 -409545
21161 -409545 391000 583310 544919 420858 -67334 -921944 -1776718 -2298236 -2352400 -2008387
21151 -2008387 -1492841 -984898 -648473 -503455 -441259 -252510 314634 1319701 2736912
21142 2736912 4066622 4649845 4529595 4068825 3456359 2639512 1536952 218444 -1105427
21133 -1105427 -2088124 -2532884 -2532243 -2373454 -2301169 -2318963 -2400895 -2473460 -2558185 -2584040 -2289097
21122 -2289097 -1787416 -1363524 -1084634 -880455 -667568 -281565 114349 265907 108519
21113 108519 -149784 -229456 -172992 -18812 572791 1600840 2593275 3278026 3615973 3583749
21103 3583749 3018129 1934292 626945 -452095 -1190612 -1706300 -2018114 -2138529 -2060490
21094 -2060490 -1913181 -1770109 -1652014 -1667714 -1874374 -2154553 -2428258 -2555804 -2379934 -1920577
21084 -1920577 -1060558 46914 989610 1571710 1716736 1568727 1394525 1282363 1392440
21075 1392440 1762462 2025359 2022831 1991180 2113647 2372219 2616735 2646728 2486522 2164839
21065 2164839 1780085 1457580 1092196 767559 673221 872293 1214300 1443255 1409647 1181113
21055 1181113 804667 404584 135934 15699 84820 438266 984256 1767686 2725958 3390511
21045 3390511 3591097 3726328 4304694 5359366 6387265 6860392 6716709 6246657 5835065
21036 5835065 5585829 5527411 5689014 5886279 5874797 5466011 4733298 3621051 2037604
21027 2037604 350766 -1007083 -1687007 -1443840 -549523 435497 1162765 1553037 1707370
21018 1707370 1672092 1563602 1588535 1850677 2296739 2722413 2957738 3164619 3597830 4258018
21008 4258018 5042280 6078289 7436795 8609982 9111373 9178012 9415310 10071146 11033282
20999 11033282 12048269 13069309 14176220 15228950 16268192 17662800 19741529 22444451
20991 22444451 25430745 28324637 30820975 33059585 35721238 39287881 43687891 48633215
20983 48633215 53991565 59838030 66102952 72055903 76723455 79617896 80583270 79559983
20975 79559983 76673904 72315960 67372936 62751759 58776392 55373869 52555112 50386996
20967 50386996 48887564 47991319 47062107 45024642 41779467 38171362 34761746 31863952
20959 31863952 29587681 27906284 26684028 25568652 24177455 22465392 20567424 18745157
20951 18745157 17248747 16017497 14736534 13344231 12236087 11695164 11416082 10969892
20943 10969892 10411549 9944974 9666149 9769972 10046121 10203504 10317611 10431840 10563344
20934 10563344 10643673 10424604 9671229 8715585 8006512 7712788 7782314 8132716 8814015 9784236
20924 9784236 10581477 10435558 9428588 8363544 7664661 7267851 6944964 6417322 5756500
20915 5756500 5270608 4957496 4573828 3948864 3033403 2035388 1563202 2003197 2920897
20906 2920897 3660232 4097572 4388288 4752829 5179990 5488146 5395092 4608402 3363206
20897 3363206 2173732 1297580 723372 351233 103576 189543 641886 1000598 1201113
20888 1201113 1509275 1906936 2246380 2548414 2850129 3007999 2892193 2489857 1903674
20879 1903674 1265319 854227 1040750 1810841 2796982 3496768 3724478 3736897 3678262 3572324
20869 3572324 3412644 3152422 2981181 3122365 3513147 3776595 3566195 3072420 2584409
20860 2584409 2160252 2005868 2143473 2082442 1462242 426745 -335776 -334235 16021 182129
20850 182129 59746 -2015 413366 1286854 2248952 3063054 3823452 4553978 5040751 5274953
20840 5274953 5418790 5375131 4993299 4516169 4051706 3251347 2124330 1138882 472097
20831 472097 138962 196644 476799 781374 1083094 1497663 1937954 2195998 2236226 2218547
20821 2218547 2304098 2454430 2398476 2036401 1659748 1429756 1292227 1342526 1553765 1619041
20811 1619041 1342083 824999 467388 444434 458052 303738 -17283 -294712 -457218 -622317
20801 -622317 -782955 -1011940 -1270995 -1230997 -802529 -299585 -11531 24503 76726 452360
20791 452360 1161746 1827870 2132936 2203291 2322912 2534443 2808748 3157541 3482075 3575648
20781 3575648 3293165 2695073 2068594 1813022 2176296 2889675 3507661 3783236 3529456
20772 3529456 2723250 1645773 728159 231540 165790 205850 158007 268326 620550 797205
20762 797205 579556 391864 585149 1095622 1784391 2459761 2938052 3113768 2892913 2309884
20752 2309884 1645700 1161023 932428 726324 194773 -641346 -1444344 -2003365 -2134046
20743 -2134046 -1804063 -1434990 -1297349 -1369389 -1680535 -2168040 -2615974 -2800111 -2622389 -2190885
20733 -2190885 -1766528 -1542410 -1495444 -1644587 -1855160 -1824497 -1663218 -1621098 -1516382 -1188937
20723 -1188937 -730618 -154860 340237 532978 549630 532818 395683 -73265 -891639 -1439296
20713 -1439296 -1190460 -374605 415969 786689 835277 716274 475793 80428 -387228 -712316
20703 -712316 -753527 -602434 -429912 -259820 13130 444332 772075 711718 601155 819568
20693 819568 1128029 1116059 596429 -4665 -32104 282581 206730 -414964 -1101341 -1447123
20683 -1447123 -1580450 -1768125 -2001059 -1952692 -1506108 -1007095 -750558 -644466 -589461 -725204
20673 -725204 -1049740 -1261333 -1153841 -883627 -773074 -894656 -1210354 -1800952 -2439467 -2857834
20663 -2857834 -3144960 -3382243 -3480626 -3390568 -3072605 -2570456 -2154891 -2042717 -2259663 -2822354
20653 -2822354 -3341336 -3269030 -2703038 -2051411 -1531877 -1247396 -1392682 -1693801 -1780656 -1780551
20643 -1780551 -1706802 -1577658 -1493188 -1426417 -1145629 -585223 -163000 -95741 4163 357031
20633 357031 745690 1011340 1221924 1337784 1427940 1747533 2295477 2601994 2308862 1681603
20623 1681603 1107402 790038 860228 1325170 1809500 1997667 1931927 1741053 1734083 1929185
20613 1929185 2125877 2377322 2747330 3001998 2838555 2328983 1731569 1289532 1094162
20604 1094162 1156338 1426141 1625514 1641709 1573548 1494777 1426529 1293009 886976 144830
20594 144830 -712350 -1439483 -1979304 -2355097 -2500165 -2285968 -1717863 -1048125 -557631 -395335
20584 -395335 -488617 -636569 -398645 231061 779802 1058690 1243180 1597825 2089528 2391569
20574 2391569 2292864 1857115 1314984 915835 665840 526063 591225 746915 714405 422926
20564 422926 106539 28326 223892 579565 783498 739332 754143 1039775 1389085 1443741
20554 1443741 1243488 857882 196406 -658717 -1478299 -2043020 -2136203 -1605023 -681133 32868
20544 32868 382787 559822 396991 -248530 -758539 -673580 -331388 -249051 -480507 -781649
20534 -781649 -1104531 -1453743 -1951585 -2573754 -2754879 -2204034 -1108451 173163 1126416
20525 1126416 1504527 1328975 813516 352693 87589 -94720 -275336 -440944 -528506 -550007
20515 -550007 -439685 -34517 899513 2249369 3329749 3588903 3120723 2442982 1902421
20506 1902421 1445491 772731 -290327 -1401391 -2045572 -1861475 -1127670 -623336 -581080
20497 -581080 -635795 -622943 -568586 -593915 -895687 -1237324 -1222603 -921339 -573132 -372512
20487 -372512 -383649 -541582 -742669 -879193 -887439 -910936 -1132890 -1475984 -1601969 -1226152
20477 -1226152 -549598 191465 948916 1413096 1351831 730390 -333019 -1448311 -2213931
20468 -2213931 -2535686 -2569234 -2383456 -2088645 -1874241 -1789302 -1834320 -1961506 -2030323 -2077697
20458 -2077697 -2224242 -2184914 -1567018 -679665 -33640 281002 274410 -2472 -193288 -74990
20448 -74990 331831 831518 1183510 1397212 1527935 1628861 1668676 1698553 1839091 2055893
20438 2055893 2273338 2578166 2938364 2880197 2080643 665844 -789733 -1535763 -1413549
20429 -1413549 -873352 -296487 275480 795470 1090390 1259418 1470497 1592683 1277686
20420 1277686 548078 -300003 -1184219 -2057125 -2711633 -2965391 -2840981 -2521656 -2163905
20411 -2163905 -1891725 -1759740 -1683154 -1715909 -1891201 -2124764 -2288576 -2245905 -2005554 -1792907
20401 -1792907 -1697077 -1548997 -1165674 -386423 931419 2529648 3866304 4558945 4650983
20392 4650983 4452985 4119959 3707050 3318455 2767082 1854839 819054 -1907 -499038
20383 -499038 -669036 -612873 -750590 -1143871 -1239879 -858369 -580155 -924158 -1578251 -2109593
20373 -2109593 -2384918 -2265064 -1887636 -1741112 -1995578 -2274647 -2277016 -2083483 -1904651 -1989973
20363 -1989973 -2349645 -2697306 -2882462 -2822342 -2451584 -1904072 -1316626 -762736 -590388 -971284
20353 -971284 -1673613 -2419835 -2974693 -3136372 -3077154 -3092769 -3299396 -3481845 -3287242 -2670306
20343 -2670306 -1876050 -1222631 -838035 -666941 -626095 -402269 68858 553705 798199 767714
20333 767714 698823 860589 1438028 2158682 2565035 2374071 1542612 366892 -585317 -900339
20323 -900339 -602719 -35177 427385 664842 869315 1077915 1131036 1056957 1028789 1087888
20313 1087888 1239559 1552338 1953028 2222556 2147896 1854124 1493071 815528 -173335 -1136725
20303 -1136725 -1942168 -2430586 -2395666 -1899063 -1075751 -166968 353242 462639 583329 899967
20293 899967 1048151 618861 -137439 -617397 -606286 -264306 137553 428919 502550 312227
20283 312227 144267 259122 681341 1257983 1810221 2293968 2696883 2785793 2387484 1749692
20273 1749692 1171598 809829 722761 728005 600343 180184 -492490 -1253012 -1862217 -2184487
20263 -2184487 -2286433 -2254059 -2154146 -1784010 -957237 15188 591235 821281 1240917 2180359
20253 2180359 3392436 4331249 4751891 4603303 4043637 3328460 2791269 2705109 2959950
20244 2959950 3227594 3363337 3435466 3486423 3491385 3382815 3056146 2440176 1723964 1209765
20234 1209765 1027870 1166760 1562167 1992236 2171442 2021432 1744315 1566724 1535106 1603946
20224 1603946 1577658 1316129 1049372 1006439 1174296 1390366 1370712 1042667 463575 -332449
20214 -332449 -1193000 -1936487 -2340763 -2321824 -1923008 -1091549 -50265 820426 1531107 2181570
20204 2181570 2726349 3091413 3169151 3024896 2884924 2865696 2836198 2770728 2893314 3283826
20194 3283826 3647716 3680965 3582603 3580612 3648581 3908919 4348276 4906954 5539380 6066197
20184 6066197 6196405 5651106 4571339 3396217 2513507 1907557 1248038 565264 298152
20175 298152 560264 1052338 1534369 1986607 2312170 2530575 2767245 3108650 3445622 3481688
20165 3481688 3253163 3012918 2819626 2542555 2128118 1561834 880590 282991 25043
20156 25043 97702 247651 290010 117168 -288636 -844956 -1477061 -1817302 -1485935 -735122
20146 -735122 -73650 356921 811786 1366529 1814984 1941798 2008351 2411884 2865301 3064638
20136 3064638 3089306 2880069 2468741 2005967 1450399 823301 328982 5574 -87689 59860
20126 59860 42798 -183575 -463358 -786070 -846353 -533836 -63109 456408 891316 1198461
20116 1198461 1428520 1492727 1296800 890784 345581 -175721 -562530 -897916 -1094916 -777670
20106 -777670 153682 1257015 2208573 2985972 3475943 3434844 2804189 1974196 1416702 1272403
20096 1272403 1248681 1075385 714066 296171 -113672 -320752 -171760 184970 591324 991284
20086 991284 1378477 1756168 2289784 2809453 3104227 3305614 3338494 3176784 2775127 2015453
20076 2015453 996359 -53832 -973281 -1550408 -1459813 -764757 223249 1471923 2859554
20067 2859554 4035747 4735481 5020718 5070948 4891044 4362264 3508758 2631510 1970503
20058 1970503 1563450 1535480 1978571 2659980 3224136 3582265 3799778 3854677 3818980 3945983
20048 3945983 4251462 4500085 4556970 4411330 4184163 4026008 4137771 4527445 4847242 4792191
20038 4792191 4404721 3917332 3543800 3268267 3007862 2881119 3017944 3302847 3628543
20029 3628543 3836606 3729317 3522722 3503671 3658535 3858926 4034873 4105480 3893595 3363114
20019 3363114 2738856 2249142 2108953 2430956 2922098 3166500 3202673 3314467 3539375 3804562
20009 3804562 4094956 4455740 4986329 5532800 5673629 5677622 6085879 6652378 6928397 7040107
19999 7040107 7240627 7547553 8001349 8474217 8881330 9334460 9564284 9189487 8403902
19990 8403902 7705593 7164964 6880888 7075480 7594026 8320491 9368064 10627971 11761165
19981 11761165 12484799 12805118 13015164 13442101 14103079 14673132 14878719 14772413 14410451
19972 14410451 13996091 14126380 15281697 17447391 20179555 22810740 25009011 27060602
19964 27060602 29373295 32254254 35850486 39977669 44621857 50036570 56538405 64303052
19956 64303052 73435912 84385991 97749777 113970621 133890181 158992284 190732272
19949 190732272 229990069 276809205 328777416 380048344 424016825 457309826 478022464
19942 478022464 483426150 472868814 449230932 418269498 385599061 353599764 321600393
19935 321600393 288823525 256478204 226175498 198707081 174522979 153961586 136890855
19928 136890855 122765618 110890704 100529752 91340715 83359224 76454783 70242855
19921 70242855 64563591 59736936 56114983 53497411 51245625 49072430 47281513 46016900
19913 46016900 45179734 44736491 44528417 44522450 44992466 45911367 46889317 47708927 48479729 49406977
19903 49406977 50668899 52429714 55043371 58971205 64175907 70433273 77831609 86557573
19895 86557573 96868347 108952648 122820937 137839681 152479090 165336787 175949164
19888 175949164 184231014 189356231 190006264 185846120 177969501 168015055 157414208 147278604
19880 147278604 138082495 129531486 121058126 112547976 104174555 95955737 87793663 79706853
19872 79706853 71969924 64965488 58760695 53281143 48683525 45050119 42154554 39832593
19864 39832593 38010426 36385859 34715705 33051304 31560079 30284085 29055372 28078811
19856 28078811 27694484 27765668 28319946 29476845 31085204 33090247 35434352 37645576 39032984
19847 39032984 39277595 38370758 36725946 34780572 32734971 30831947 29347434 28704684
19839 28704684 28757397 28771320 28402424 27934355 27796289 28160584 28951921 29935958 30843071 31627049
19829 31627049 32600064 33997499 35727281 37631615 39699437 42147263 45122522 48425024
19821 48425024 51837075 55273577 59100695 64183734 70773111 78004733 84623457 89645988
19813 89645988 92909750 95222715 97688657 101033254 105746818 112139588 120048974 129234933
19805 129234933 139889529 152204494 166532060 183574470 203833649 227081568 252085844
19798 252085844 276863095 298778238 314964196 323813380 325519564 320124101 306599723
19791 306599723 285633303 261179010 237340113 215950933 196978559 179775953 163891347
19784 163891347 149396661 136490033 125259741 115539799 106831521 98765835 91197662
19777 91197662 84070438 77620574 72244529 68185001 65473976 64067304 64116764 65759637
19769 65759637 68805783 72845218 76990926 79128059 77060361 71056018 63340189 55738791
19761 55738791 48862093 42754112 37740690 33952389 30937769 28209134 25638581 23346210
19753 23346210 21336906 19504717 17855093 16459913 15450522 14933470 14742802 14521702
19745 14521702 14091249 13574755 13101169 12477308 11587776 10725841 10045629 9512049 9154393
19736 9154393 8939368 8749474 8598376 8485732 8292159 8085141 8076570 8206936 8157972 7791231
19726 7791231 7311513 7225257 7646227 8164634 8576884 9117169 9723332 10015138 10013408 9951582
19716 9951582 9820390 9622074 9458739 9557024 10020186 10613798 11079245 11154780 10632142 9578069
19706 9578069 8372677 7451882 6938751 6628382 6464100 6435609 6457221 6576520 6785728 6967071
19696 6967071 6939263 6632180 6202882 5733604 5429869 5468483 5681544 5829956 5879606 5819896
19686 5819896 5656158 5469711 5399143 5527112 5652855 5564719 5118617 4324856 3457881 2689962
19676 2689962 2071696 1626163 1238661 878938 732576 695230 573569 494866 633664 815763
19666 815763 555942 -277137 -1260334 -1828260 -1800907 -1485371 -1239103 -933832 -263183 544702
19656 544702 1022629 887229 266154 -343790 -704633 -811410 -857498 -1202452 -1890361 -2489774
19646 -2489774 -2530671 -2060689 -1464754 -778197 -77615 403883 601472 494043 183955 -147128
19636 -147128 -396888 -507250 -430221 -345867 -373398 -284429 46248 429988 613806 447729
19626 447729 100200 -29273 154573 494574 888774 1241838 1453325 1449787 1327387 1334623
19616 1334623 1514164 1897097 2378844 2543923 2181378 1705021 1603989 1715644 1629477 1332420
19606 1332420 1042876 897244 1000457 1282085 1621076 1953513 2089527 2119741 2351060 2623860
19596 2623860 2589785 2170762 1590368 1188759 902551 659499 540709 475441 271801 -104245
19586 -104245 -633433 -1197392 -1347010 -816835 120693 1059778 1932506 2582085 2747973 2414718
19576 2414718 1902527 1642796 1829270 2350874 2863038 3202669 3499379 3943976 4443137
19567 4443137 4753165 4941649 4999782 4767583 4321715 3790122 3126344 2196121 1058895
19558 1058895 -11803 -767761 -1106350 -1230760 -1355676 -1306047 -673482 390167 1521012
19549 1521012 2561877 3073073 2801423 2180205 1753856 1723384 1664159 1282523 1040978 1189445
19539 1189445 1610256 2275436 2991594 3301978 3118973 2794804 2579414 2713748 3234589
19530 3234589 3735758 3935736 3857713 3569732 3043997 2301739 1786211 2094004 3058713 3883766
19520 3883766 4095357 3561925 2376406 961073 -122737 -746984 -1287015 -1894133 -2464703
19511 -2464703 -2917742 -3113962 -2856930 -2219235 -1462763 -705827 -56843 576624 1267298
19502 1267298 1922976 2414750 2569911 2201802 1377129 555997 98432 249 155133 414956
19492 414956 515132 211762 -342221 -895903 -1340218 -1598189 -1614924 -1371019 -1037012 -868094
19482 -868094 -901713 -1045939 -1187106 -1260744 -1200912 -923599 -382125 269671 639077 639691 556984
19471 556984 550406 359259 73267 34157 250150 421980 186406 -392500 -927954 -1106031
19461 -1106031 -858956 -248188 604858 1447302 2088042 2483489 2530126 2252188 1792092 1225813
19451 1225813 631687 139584 -197707 -553270 -1089705 -1653705 -1887950 -1731370 -1340016
19442 -1340016 -804133 -379695 -265822 -239020 -153487 -147237 -214109 -124072 91555 -3745 -614461
19431 -614461 -1444869 -2038668 -2060753 -1722416 -1510972 -1376288 -1022790 -368626 586180 1479655
19421 1479655 1819521 1505621 848808 427670 519473 828277 846911 491401 93106 -270873
19411 -270873 -842090 -1575490 -2095411 -2233278 -2205962 -2140943 -1878706 -1289990 -318836 815950
19401 815950 1704734 1994173 1641166 966591 303626 -179437 -209943 438828 1238391 1457974
19391 1457974 1035313 341153 -355303 -843644 -983379 -778131 -382517 -152319 -289878
19382 -289878 -691966 -978640 -842169 -394002 43030 330737 592574 1007874 1536502 2022449
19372 2022449 2391271 2753582 3069180 3007673 2543936 1772841 732532 -489340 -1569976
19363 -1569976 -2167024 -2418294 -2548249 -2545549 -2281623 -1704535 -935888 -206107 491575 1150082
19353 1150082 1586822 1740209 1648355 1135807 419573 138099 548132 1268108 1831669 2227688
19343 2227688 2556712 2707824 2386720 1706761 1197695 1136807 1290799 1345999 1137272 721548
19333 721548 256886 -62291 -134277 -33009 263958 746327 1297883 1866283 2199470 2004882
19323 2004882 1348748 574178 119711 189145 709284 1333583 1949745 2735626 3657355 4244019
19313 4244019 4241623 3821623 3180659 2337697 1378373 677146 424334 417559 341175 -55795
19303 -55795 -750012 -1335012 -1533472 -1484613 -1399066 -1424176 -1631747 -1935356 -2271546 -2454848
19293 -2454848 -2419739 -2423174 -2503979 -2531460 -2525127 -2552466 -2591766 -2381428 -1695524 -659453 348444
19282 348444 714453 147363 -962143 -2088929 -3022985 -3720273 -3924572 -3583174 -2825524
19273 -2825524 -1739412 -604267 176725 440606 276167 -162713 -633262 -920424 -802070
19264 -802070 -56152 1030549 1750786 1776418 1427196 1264806 1433771 1648492 1707691 1446432
19254 1446432 832768 174547 -327084 -806760 -1233841 -1474299 -1510065 -1400301 -1354107 -1541589
19244 -1541589 -1779382 -1721156 -1368773 -1033605 -885894 -1043189 -1535897 -2143795 -2775559 -3416631
19234 -3416631 -3899287 -3971737 -3756523 -3473726 -2786719 -1813153 -1367442 -1757667 -2420197 -2540138
19224 -2540138 -1923317 -1029897 -174861 551134 1100507 1402419 1435610 1250835 995325 848845
19214 848845 741096 389966 -234828 -885570 -1200500 -1002685 -562969 -225257 -133653 -108888
19204 -108888 -118881 -301184 -581639 -662716 -226381 633552 1763576 2944834 3613955 3396421
19194 3396421 2630950 1865539 1292103 832962 363055 28912 126501 680251 1267809 1281872
19184 1281872 613115 -202133 -783897 -1029123 -899289 -543250 -194821 43561 32892 -401151
19174 -401151 -1125828 -1811013 -2099696 -1867239 -1310821 -647661 -27373 529302 1062920 1485644
19164 1485644 1721912 1759163 1626773 1490756 1512990 1524552 1268709 844740 658230 872369
19154 872369 1427197 2285976 3353112 4434905 5067127 4935907 4274753 3409630 2623568
19145 2623568 2261010 2291534 2236826 1833125 1364513 1132331 1210844 1469916 1835863 2274179
19135 2274179 2612405 2774033 2895644 2936484 2529095 1843672 1455928 1391429 1176486 579102
19125 579102 -86132 -467560 -453587 -127718 295210 673213 944275 987273 808267 442549
19115 442549 -56392 -310430 -218145 -243424 -561911 -1006917 -1441338 -1581776 -1328470 -1114060
19105 -1114060 -1317122 -1838054 -2378696 -2708344 -2695992 -2222000 -1310001 -235656 703145
19096 703145 1470413 2002605 2112456 1707832 948977 338202 95930 -26553 -301819 -731188
19086 -731188 -1016655 -843025 -228948 443473 1081617 1785166 2286925 2303605 1927689 1441740
19076 1441740 1069081 921909 1193503 1882166 2533292 2946119 3221761 3491254 3824624
19067 3824624 4053969 4085233 3908639 3530798 2925069 2187548 1591270 1158964 843883 671184
19057 671184 561284 482874 519985 500057 293396 -12999 -389054 -819831 -1071936 -1026555
19047 -1026555 -843766 -564871 -387008 -553296 -816547 -843272 -575418 -191140 138988 407457
19037 407457 472285 253292 107820 144229 153017 -51277 -530211 -1189286 -2027867 -2942740
19027 -2942740 -3648470 -4074719 -4222636 -4074068 -3538038 -2632035 -1728930 -992743 -273083
19018 -273083 252884 309769 279840 726653 1489679 2268165 2780436 2831982 2557285 2190306
19008 2190306 1868116 1517447 1322678 1378723 1386837 1097222 534273 -42138 -555194 -1159667
18998 -1159667 -1724222 -1980887 -1962516 -1748825 -1503069 -1575197 -2079833 -2601812 -2626254 -2126255
18988 -2126255 -1497674 -1109353 -980046 -908238 -659183 -366724 -294367 -315963 -66050 396439
18978 396439 784795 1325400 1984647 2254345 1957864 1469475 1125536 834958 518799 249116
18968 249116 166556 432956 717437 600356 162157 -422775 -1033211 -1527295 -1837987 -2100698
18958 -2100698 -2162608 -1879469 -1538843 -1378467 -1338235 -1203259 -970053 -855740 -920064 -1041203
18948 -1041203 -978993 -640643 -343073 -379157 -704625 -1196671 -1609685 -1666109 -1341023 -863612
18938 -863612 -526518 -242312 2133 -81016 -312855 -404474 -267953 28648 373823 776132
18928 776132 1348637 1892926 2193158 2240157 2093241 2198925 2669800 2811528 2185688 1216905
18918 1216905 475702 310586 871894 1743900 2188884 1876671 1075978 205528 -542629
18909 -542629 -1241269 -2030921 -2634079 -2709620 -2612448 -2828018 -3159687 -3323393 -3488521 -3885467
18899 -3885467 -4351229 -4583409 -4653376 -4493278 -4064068 -3649435 -3140241 -2170432 -868995
18890 -868995 331352 1194917 1904440 2554753 2970693 3175095 3227343 3085301 2698907 2102111
18880 2102111 1399684 691873 92699 -215455 -210371 -377 208959 361878 645467 947725
18870 947725 1044712 815635 405536 173870 147789 144517 71136 -333663 -1076378 -1697225
18860 -1697225 -1921914 -1900705 -1808820 -1716378 -1727644 -1693109 -1633168 -1729270 -1976968 -2316449 -2732233
18849 -2732233 -3234041 -3788536 -4253938 -4615277 -4938852 -5137510 -4914836 -4199250 -3417841
18840 -3417841 -2808879 -2209767 -1728389 -1574396 -1523715 -1361424 -1152422 -925625 -644503 -499790
18830 -499790 -611581 -785617 -807554 -710678 -688134 -616759 -341170 -142773 -345651 -792291
18820 -792291 -1053637 -1069388 -1096901 -1155634 -1077919 -901587 -913612 -1408640 -2359087 -3289911
18810 -3289911 -3582303 -3195969 -2515992 -1811581 -1270817 -1070418 -1092651 -1158321 -1442461 -1897366
18800 -1897366 -2309242 -2389217 -1849872 -1048279 -574282 -641044 -1085739 -1516721 -1804712 -2018747
18790 -2018747 -2014001 -1687135 -1355311 -1453528 -1893838 -2403456 -3044349 -3713000 -4039654 -3893886
18780 -3893886 -3441584 -2894662 -2423447 -2086316 -1891367 -1785948 -1594830 -1383575 -1478004 -2008164
18770 -2008164 -2739577 -3305137 -3604474 -3788067 -4072835 -4508422 -4656748 -4229341 -3476576
18761 -3476576 -2689976 -1950856 -1409350 -1078986 -907005 -863978 -935681 -1157093 -1345532 -1176315
18751 -1176315 -666165 -114457 290124 371579 115450 -349815 -747272 -805240 -768276 -867025
18741 -867025 -1111139 -1399244 -1353416 -832186 -185590 183516 38904 -652123 -1503998 -2024177
18731 -2024177 -1946409 -1431887 -877744 -488245 -340249 -463631 -628654 -429132 25584 345069
18721 345069 447202 314153 -56818 -418670 -643867 -776384 -1000540 -1537718 -2166332 -2468570
18711 -2468570 -2380577 -2000570 -1418461 -865802 -506997 -216940 190958 841887 1755727 2775410
18701 2775410 3548421 3832805 3603857 3000295 2093689 1067990 320078 53212 206599
18692 206599 518987 637257 322599 -229997 -810967 -1292185 -1595036 -1672994 -1205492 -171248
18682 -171248 894135 1624699 1944433 1969215 2025214 2150490 2030775 1563974 963112 253877
18672 253877 -668160 -1370844 -1574204 -1622325 -1805930 -1883874 -1640182 -1312608 -1063940 -909518
18662 -909518 -1026437 -1464456 -2032224 -2570595 -2985445 -3061152 -2695991 -2190229 -2001688 -2243246
18652 -2243246 -2604327 -2816205 -2848126 -2680734 -2388583 -2133177 -1867516 -1485239 -1098934 -767125
18642 -767125 -386112 -51884 230491 599954 1029800 1298869 1103695 551121 2882 -482836
18632 -482836 -1072633 -1996773 -3073245 -3629794 -3358602 -2539748 -1850130 -1691068 -1941914
18623 -1941914 -2121735 -1986437 -1652527 -1165321 -674413 -275196 -100983 -333714 -814018
18614 -814018 -1132775 -1176104 -1252631 -1440007 -1445372 -1173957 -911748 -761715 -661665 -619761
18604 -619761 -691299 -803407 -793293 -518827 37867 858970 1863425 2783043 3303298 3371225
18594 3371225 3268798 3195883 3077340 2728769 2126135 1354204 565507 -11463 -471079 -1165363
18584 -1165363 -1942385 -2239455 -1821016 -1080128 -418505 9870 -7650 -344359 -473768 -294888
18574 -294888 -92857 59002 306019 764211 1329279 1826530 2096137 2040244 1904072 1950133
18564 1950133 2032327 1842945 1365674 803975 413175 257225 129112 -96983 -253156 -188780
18554 -188780 -74948 -188789 -669046 -1446814 -2084486 -2118578 -1940489 -2141545 -2571282 -2774909
18544 -2774909 -2613534 -2274054 -1985524 -1848221 -1666717 -1188057 -332544 552690 829333
18535 829333 423056 -156239 -529968 -732071 -877945 -1022860 -1118671 -778246 -103717 271474
18525 271474 290635 477311 1125898 1995719 2819715 3705740 4820881 5884511 6247560
18516 6247560 5800155 5117830 4732678 4638737 4622714 4452772 3974515 3311578 2711243 2127250
18506 2127250 1446391 973052 781658 623402 500487 542932 808210 1354230 2004943 2440341
18496 2440341 2509420 2451387 2547290 2721064 2882980 3037068 3125045 3052896 2885886 2832519
18486 2832519 3019968 3257343 3388035 3531081 3867773 4226221 4188600 3806818 3358833 2785247
18476 2785247 2060777 1295742 650747 405260 454183 497645 521416 640294 825203 1013428
18466 1013428 1185290 1259540 1187373 980779 389670 -544151 -1249337 -1419756 -1112686 -587072
18456 -587072 -108992 269596 620997 1029323 1453907 1719826 1822505 1717815 1426605 1286370
18446 1286370 1324948 1281015 1103194 832958 533466 345973 271028 263442 418274 898565
18436 898565 1655773 2325567 2524719 2245568 1663414 996500 537010 463668 727279 1282720
18426 1282720 2083778 2831929 3216953 3170063 2626718 1557400 264885 -568893 -500014
18417 -500014 237555 1109909 1803790 2148324 1969207 1460215 1107262 1122283 1225023 1208204
18407 1208204 1140412 1139882 1230539 1366299 1523446 1628650 1490386 1124116 812821 579848
18397 579848 442778 449919 533642 755732 1268605 1904872 2209252 1938634 1274320 745248
18387 745248 485797 244260 -157953 -704751 -925817 -515284 53805 301123 74548 -646397
18377 -646397 -1525802 -1984958 -1832706 -1305996 -563238 329327 1385744 2427567 3018216
18368 3018216 3118419 3003770 2786788 2437486 2030950 1692425 1484834 1359074 1469865
18359 1469865 1862234 2184640 2236580 2011881 1625881 1291191 1145938 1120678 852593 274292
18349 274292 -258829 -705380 -1277555 -1940856 -2196728 -1689731 -933681 -481726 -329581 -222197
18339 -222197 -87168 -84915 -331498 -726854 -1279621 -2090419 -3044886 -3980109 -4461436 -4218769
18329 -4218769 -3493969 -2611152 -2062063 -2078791 -2592647 -3307060 -3595890 -3169027 -2572480 -2456698
18319 -2456698 -2763123 -3040418 -2983050 -2472044 -1724526 -1029461 -616259 -708473 -1192827 -1571513
18309 -1571513 -1624158 -1418493 -912552 -212133 389027 715083 668225 323170 -38573 -409053
18299 -409053 -768724 -960117 -998387 -966281 -796266 -340238 472273 1403241 2146853 2561477
18289 2561477 2569328 2279089 1934707 1638929 1536451 1553952 1412424 1136886 889466 761760
18279 761760 692483 589963 593824 842970 1306055 1858731 2318363 2503554 2321276 1896299
18269 1896299 1332338 495360 -684412 -1856418 -2672789 -2957472 -2779715 -2356791 -2056969
18260 -2056969 -2128381 -2311111 -2563844 -3053710 -3747668 -4337274 -4476326 -4228872 -3901977 -3485856
18250 -3485856 -2910757 -2492909 -2414290 -2509729 -2590345 -2495407 -2098745 -1431786 -717659 -47407
18240 -47407 560572 910906 765538 -41812 -1328133 -2608791 -3513181 -3808169 -3458363
18231 -3458363 -2684051 -1765898 -876750 -95803 346458 359036 223783 10331 -286191 -584407
18221 -584407 -692528 -486559 61477 912800 1854690 2549232 2833501 2773016 2384387 1834367
18211 1834367 1372857 834719 313540 188404 478461 941359 1241324 1223239 1078019 1023946
18201 1023946 1074276 1238183 1531886 1748682 1623718 1127922 596775 289695 111728 -92808
18191 -92808 -527742 -1200526 -1646778 -1459685 -578218 793744 2254687 3401070 4145442
18182 4145442 4497874 4443620 4151280 3641661 2869001 1988471 1117355 279748 -397929 -802760
18172 -802760 -997054 -1130871 -1378724 -1768129 -2168724 -2373560 -2196858 -1743085 -1164504 -552453
18162 -552453 -7244 386174 629804 860777 1270196 1854553 2137616 1681805 706164 13428
18152 13428 -115038 -336144 -866556 -1147265 -945096 -482486 230137 1191756 1879977 1726374
18142 1726374 828862 -383086 -1497026 -2105730 -2091090 -1654495 -1065024 -357676 413485
18133 413485 1072469 1506278 1554559 1203675 618453 -41533 -617267 -1005815 -1175063 -1084177
18123 -1084177 -922846 -923167 -871516 -692851 -609976 -542954 -304728 94586 578215 1024618
18113 1024618 1415004 1813760 2010905 1922310 1778030 1665611 1374491 785095 133151 -284306
18103 -284306 -295080 66933 581184 1136433 1828301 2557058 2875455 2675809 2312737 1864170
18093 1864170 1170376 401822 -35989 -67626 124169 316916 226506 -130187 -407616 -432189
18083 -432189 -298060 21642 394211 254219 -529494 -1438049 -2062904 -2197874 -1938792 -1486664
18073 -1486664 -1012186 -644682 -388126 -78142 336674 601789 634939 656469 895919 1381179
18063 1381179 1914494 2306830 2423814 2088364 1546795 1269155 1081054 593104 -90013
18054 -90013 -456922 -324564 12824 406696 828293 1077064 1003493 758722 286263 -407594
18044 -407594 -837004 -715847 -165347 556886 1170386 1627366 1960789 2193998 2407995 2390962
18034 2390962 2128829 1964392 2098181 2382693 2656593 2870848 2900762 2631511 2226046 2065958
18024 2065958 2303012 2704752 3040003 3152261 2865047 2091242 1093063 361350 139889
18015 139889 257010 222917 -151589 -711825 -1313471 -1921412 -2568753 -3239147 -3760075 -3972733
18005 -3972733 -3895006 -3600967 -3262082 -3057785 -2950619 -2863231 -2795327 -2530282 -1888742 -1175776
17995 -1175776 -806725 -845615 -1093263 -1365179 -1417170 -1023068 -375421 35975 42217 30874
17985 30874 208588 331255 122855 -284356 -717813 -1288693 -1984443 -2511509 -2772545 -3077698
17975 -3077698 -3406747 -3602194 -3711168 -3555719 -2976369 -2237952 -1699263 -1492299 -1537195 -1634604
17965 -1634604 -1586935 -1371119 -1266109 -1398431 -1441350 -954786 186582 1658836 2931803
17956 2931803 3536395 3264042 2570088 2071265 1701846 1231146 701553 116113 -658262
17947 -658262 -1584150 -2490974 -3197425 -3423551 -3253513 -2831229 -1983555 -951012 -271762
17938 -271762 -178638 -413989 -487240 -184634 219174 148795 -492756 -1289416 -1953812 -2374756
17928 -2374756 -2306132 -1593839 -480075 510354 894450 776485 648768 830091 1161582
17919 1161582 1323149 1135832 759816 638905 1093025 1845349 2338395 2228039 1634809
17910 1634809 1119551 1023845 1213559 1548933 2069830 2670289 3153117 3536070 3872167 4063821
17900 4063821 3817746 3130629 2439076 2138706 2341248 2848836 3244155 3566828 4014664
17891 4014664 4354355 4299779 3940517 3538657 3196898 2894736 2526231 2164749 1858144 1638646
17881 1638646 1611208 1599905 1378308 1140231 971978 617777 123792 -138152 147691 916817
17871 916817 1578976 1592197 874330 -226273 -1162216 -1642198 -1680364 -1298765 -657197 -64197
17861 -64197 398746 749944 874014 842940 779262 647842 632925 889413 1354711 2123793
17851 2123793 3044945 3854161 4393329 4421300 4042931 3600850 3114217 2634417 2297903 1922393
17841 1922393 1252592 379589 -249371 -396160 -399461 -561065 -602610 -222743 460649 1081251
17831 1081251 1306070 1213174 1194338 1366020 1392701 1091496 626648 259746 255919 602412
17821 602412 803043 687117 647556 822448 932506 784526 494060 182515 -195956 -566531
17811 -566531 -755946 -814508 -867171 -907232 -868874 -734087 -506507 -248741 -165958 -414957
17801 -414957 -879288 -1350346 -1800880 -2177892 -2326276 -2197474 -1921387 -1629484 -1245573 -733164
17791 -733164 -207301 124666 94790 -125295 -137837 153557 489157 724982 695758 199280
17781 199280 -390128 -541824 -211293 393493 1069847 1554597 1447087 680055 -216042 -833949
17771 -833949 -1122666 -1252092 -1410812 -1758095 -2242033 -2343784 -1971682 -1667419 -1514096 -1232118
17761 -1232118 -821259 -295178 412424 1175588 1655959 1710831 1502882 1271320 1389491 1724000
17751 1724000 1765671 1585918 1539501 1701305 1946583 2171063 2396330 2618704 2941674 3397369
17741 3397369 3848332 4063331 3883764 3326830 2481036 1612720 1015623 745763 515465
17732 515465 213788 159144 607631 1422327 2095708 2401702 2332977 1837128 1233527 895541
17722 895541 917546 1275486 1899639 2397484 2378974 1939642 1402584 912403 474101 -676
17712 -676 -270394 -10264 561551 1045771 1190897 986048 667977 554068 828492 1465983
17702 1465983 2130102 2477713 2612392 2667270 2610519 2606075 2681085 2510572 2057620 1768181
17692 1768181 1676025 1378626 771147 209144 -168938 -564913 -854995 -751260 -224353 424914
17682 424914 772930 620263 38124 -654437 -1121641 -1347273 -1328131 -993216 -409235 249339
17672 249339 884800 1424966 1772523 1940641 1991803 2032773 2377035 3093918 3593912 3392854
17662 3392854 2549881 1431838 279669 -708897 -1279108 -1367538 -1169846 -972153 -975663 -1288144
17652 -1288144 -1800705 -2154711 -2147152 -1914187 -1659848 -1574335 -1593362 -1546198 -1390876 -1169853
17642 -1169853 -797298 -337973 -80220 39114 318352 709454 895816 786982 572122
17633 572122 521669 852049 1367645 1691166 1662656 1366931 986764 735798 825582 1282775
17623 1282775 1715535 1661903 1149927 649851 579075 735073 709409 401131 -237123 -1097459
17613 -1097459 -1686304 -1566285 -966231 -318038 198830 517388 653502 868415 1408617
17604 1408617 2097607 2366799 1834514 726881 -554053 -1592491 -2177043 -2330887 -1957187
17595 -1957187 -1111417 -193556 495258 822899 820087 550347 270930 283165 381339 274152
17585 274152 99992 -28856 -274564 -875746 -1878767 -2770535 -3206792 -3301920 -3155391 -2762214
17575 -2762214 -2137990 -1386392 -760831 -563727 -734194 -783964 -448758 28782 488009 881562
17565 881562 1057209 743010 -94441 -1032353 -1666794 -1909830 -1806261 -1289140 -574884 -182446
17555 -182446 -499225 -1209483 -1544637 -1275867 -701198 -22732 528438 803662 937152 848393
17545 848393 371947 -415978 -1263219 -2035066 -2640345 -2794825 -2323471 -1325881 -360554 240462
17535 240462 814667 1538425 2133407 2106355 1571415 1127612 975255 854726 626729 563173
17525 563173 1022808 1937625 2923580 3536745 3580303 3319550 2924648 2383435 1832787 1614623
17515 1614623 1685571 1704876 1645741 1578033 1497499 1486816 1669655 1950536 2089593 1769486
17505 1769486 1242344 1091454 1117472 862933 264061 -476068 -960592 -936554 -521858 -131669
17495 -131669 2281 -5881 -24578 58478 427932 1191912 2082328 2493172 2094848 1169920
17485 1169920 113219 -924358 -1568523 -1557181 -1105374 -700190 -550147 -565619 -648957 -669654
17475 -669654 -551416 -473532 -404097 -1627 703244 1355284 1771717 1918849 1669658 965478
17465 965478 -37364 -915417 -1321624 -1356296 -1322788 -1478805 -1806323 -2015452 -2050119 -2146180
17455 -2146180 -2390531 -2545860 -2567796 -2632887 -2730803 -2719229 -2550030 -2156619 -1464950 -694076
17445 -694076 -171062 19772 -47650 -237243 -279830 -158021 -79970 -57001 45071 167175
17435 167175 73471 -300766 -752414 -986385 -995601 -1007790 -1205303 -1525940 -1729938 -1544780
17425 -1544780 -915207 -66823 754408 1234763 1419690 1560982 1630831 1676473 1931409 2488581
17415 2488581 3111704 3519158 3770020 3867058 3653393 2923660 1732992 505589 -346828
17406 -346828 -699739 -876050 -1223870 -1667293 -1932583 -1916054 -1626554 -1291466 -1275901 -1777194
17396 -1777194 -2527937 -2906373 -2549950 -1572587 -393557 427239 885795 1317064 1808836
17387 1808836 2189689 2431702 2558372 2457533 2066114 1471832 858823 404073 39495
17378 39495 -460389 -1062500 -1417670 -1435227 -1404543 -1676937 -2244459 -2597432 -2532437 -2402284
17368 -2402284 -2354374 -2164100 -1885319 -1894918 -2159835 -2370494 -2362225 -2161954 -2005151 -1994865
17358 -1994865 -1971633 -1723192 -1301262 -1152724 -1439475 -1833870 -2022878 -1723176 -1044816 -447290
17348 -447290 -175842 -195626 -293315 -259750 -6133 412661 914782 1389328 1530987 1254345
17338 1254345 765453 158219 -384110 -561575 -443554 -376259 -566965 -984149 -1469904 -2080323
17328 -2080323 -2671049 -2946105 -2940526 -2719975 -2294259 -1946656 -2011826 -2318486 -2351951 -1906606
17318 -1906606 -1170111 -626828 -499123 -508076 -390519 -89215 239228 311338 22565 -471899
17308 -471899 -805175 -691460 -267331 371701 1154903 1905977 2464054 2711101 2829306 2980837
17298 2980837 3195685 3416932 3247964 2496327 1490407 539857 -293608 -1000335 -1531063
17289 -1531063 -1858831 -1869495 -1660268 -1428903 -1135577 -981538 -1134049 -1457999 -1767315 -1975389
17279 -1975389 -2023518 -2139032 -2527606 -3031560 -3451012 -3491679 -2855046 -1656885 -428685
17270 -428685 313261 343104 -174944 -741126 -939857 -648875 -72925 412035 874059 1385608
17260 1385608 1507067 1092092 549667 198224 -116067 -731934 -1603593 -2304994 -2646036
17251 -2646036 -2668839 -2348121 -1693436 -924775 -379736 -84447 218504 449740 426817 187324
17241 187324 -233533 -669767 -947543 -1093942 -1171365 -1162407 -1059960 -777624 -221731 534471
17231 534471 1187123 1370813 1131807 810009 671253 738115 838002 882489 891740 931476 1004546
17220 1004546 1030036 1017927 1127863 1472586 1942872 2291576 2193809 1723499 1326677 1335316
17210 1335316 1892810 2668097 3185489 3418974 3484117 3221962 2434915 1428010 813849
17201 813849 710698 731954 522524 -184830 -1179856 -1701084 -1434289 -857036 -390165 -197000
17191 -197000 -329308 -499970 -370797 91554 645644 1129718 1580941 1806786 1380727 256850
17181 256850 -1195750 -2607362 -3655200 -4174665 -4206827 -3792504 -3103650 -2357797 -1783216
17172 -1783216 -1615153 -1778967 -2042811 -2279598 -2542660 -2889316 -3146666 -3053513 -2470216 -1591874
17162 -1591874 -978722 -892379 -998255 -1197194 -1533379 -1805012 -1801097 -1693904 -1670225 -1720595
17152 -1720595 -1647353 -1149543 -269187 468892 675252 602622 437004 230534 255634 709749
17142 709749 1408065 1972550 2219747 2398742 2673151 2787413 2514141 1979293 1333486 625435
17132 625435 -33579 -393964 -353200 -336058 -673860 -1198730 -1490573 -1360241 -1065236 -922266
17122 -922266 -963320 -971665 -937109 -1062881 -1408351 -1748869 -1819285 -1601393 -1376118 -1288637 -1442286
17111 -1442286 -1646468 -1423169 -877034 -373236 -34409 100221 147446 285691 362214 157978
17101 157978 -261374 -833195 -1639070 -2429108 -2696922 -2437263 -1993931 -1507625 -1110094 -763884
17091 -763884 -383930 -197228 -360944 -882556 -1506822 -1856907 -1646715 -861072 82580 539494
17081 539494 193068 -498360 -952878 -1074542 -1218862 -1742475 -2422957 -2943222 -3274155 -3556600
17071 -3556600 -3910966 -4005899 -3406678 -2090852 -367027 1302038 2619271 3540292 4141072
17062 4141072 4406034 4284753 3826390 3254518 2941412 2728898 2147449 1293238 518049
17053 518049 -45685 -252946 -151354 130743 506203 913773 1396857 1689755 1594440 1217762
17043 1217762 615104 -211112 -1143604 -1773646 -1734136 -1243504 -721901 -395904 -255452 -102539
17033 -102539 226558 597698 707932 477482 111541 -201518 -293131 -244547 -361968 -731480
17023 -731480 -1195293 -1498846 -1555260 -1396401 -1142557 -919979 -673086 -438613 -342616 -392564
17013 -392564 -483583 -425641 -173219 113433 209723 -118341 -777002 -1442856 -2001444 -2460197
17003 -2460197 -2617340 -2437067 -2303983 -2406971 -2630935 -2835486 -2982222 -3126458 -3224837 -3221231
16993 -3221231 -3235667 -3291823 -3150372 -2816399 -2570413 -2487546 -2422756 -2142652 -1600533 -924413
16983 -924413 -367279 27483 559805 1296353 1897671 2066284 1750408 1083632 496598 568685
16973 568685 1235747 1804251 1742750 1101870 303526 -173983 -175333 123720 502444 798668
16963 798668 776715 412276 141677 376026 1031627 1636399 2106271 2615062 2961752 2972075
16953 2972075 2802854 2579956 2255230 1922032 1645936 1418003 1401697 1698933 2177477 2716383
16943 2716383 3097223 3091640 2756475 2357139 2091244 1981133 1714387 1102597 477058 200057
16933 200057 442827 1131789 1753796 1982034 2065072 2303950 2693846 2979949 3011654 2894246
16923 2894246 2942850 3108303 2944423 2306131 1484246 930458 683816 414077 -53595 -634543
16913 -634543 -1096162 -1317120 -1314525 -1042571 -610959 -334494 -326340 -315140 -191695 -97741 -255593
16902 -255593 -591461 -558977 -38853 507622 644818 379007 176565 364995 702224 746241
16892 746241 401790 -228574 -953823 -1519499 -1649686 -1145417 -235792 489596 776467 785908
16882 785908 651240 427177 218426 198920 360336 632753 973531 1331969 1794652 2303108
16872 2303108 2621863 2602588 2106808 1290193 448613 -323832 -855278 -1025866 -1205916 -1622818
16862 -1622818 -1803453 -1520628 -1143470 -936120 -828703 -847960 -1000967 -906487 -372782 163988
16852 163988 256317 163247 271122 406853 145918 -222934 -296966 -311786 -612686 -918903
16842 -918903 -741316 -312263 -249081 -781256 -1597627 -2340630 -2952623 -3297933 -3148872 -2791033
16832 -2791033 -2686396 -2783016 -2782672 -2553384 -2382043 -2549787 -2972211 -3453682 -3756216 -3817783
16822 -3817783 -3689431 -3182210 -2196845 -1185105 -759871 -823827 -910094 -779819 -369103 120050
16812 120050 599312 1065066 1298224 1154378 753853 206675 -517604 -1241819 -1543029 -1542986
16802 -1542986 -1839175 -2673026 -3575157 -3817589 -3162070 -2072984 -1368321 -1426747 -2136021
16793 -2136021 -3104590 -3918732 -4316270 -4196461 -3736902 -3238386 -2826840 -2400922 -1716895
16784 -1716895 -819154 -29301 370218 383491 253500 236288 573105 1158987 1677963 1930652
16774 1930652 1875464 1565096 1000341 130459 -924593 -1797441 -2042477 -1498693 -421693
16765 -421693 772919 1628894 1893378 1676610 1315098 1033526 807944 533180 166914
16756 166914 -209470 -513643 -891494 -1255088 -1190172 -774429 -342941 134880 630787 988818
16746 988818 1259586 1387230 1090059 415163 -288945 -878221 -1344981 -1517895 -1351807 -1109337
16736 -1109337 -1080549 -1308546 -1624615 -1779592 -1598664 -1249354 -963643 -709066 -520516 -461673
16726 -461673 -394026 -387443 -527586 -529760 -222384 111916 46897 -539952 -1254374 -1814294 -2149650
16715 -2149650 -2106536 -1775432 -1308633 -787875 -386653 -38502 360919 637841 556834 376424
16705 376424 555701 1025720 1247568 778027 -229987 -1304188 -2199619 -2851086 -3187930
16696 -3187930 -3288087 -3219772 -2998359 -2606946 -2003913 -1464683 -1275118 -1463205 -1766070 -1884761
16686 -1884761 -1819988 -1614749 -1197883 -636318 -254363 -211542 -368435 -657995 -1134538 -1675015
16676 -1675015 -1853568 -1548615 -990835 -425527 -59772 20058 -105909 -211919 116385 1114304
16666 1114304 2338324 3079194 3172695 2838143 2374951 2168532 2232000 2221184 1936411 1513047
16656 1513047 1122135 682324 136548 -377158 -1147170 -2381204 -3551607 -4217978 -4568754
16647 -4568754 -4692271 -4324474 -3340559 -2145176 -1405856 -1108422 -1033441 -987572 -616230 52478
16637 52478 541548 564939 292363 36989 -1407 186878 372847 347083 175797 -44083
16627 -44083 -396633 -943424 -1476587 -1675186 -1421376 -801339 -49608 531087 707771 445827
16617 445827 86172 134122 579382 824690 477865 -160469 -544529 -602319 -687428 -1089465
16607 -1089465 -1540031 -1669457 -1653298 -1748909 -1622299 -976479 -138744 491682 663690 324395
16597 324395 -332062 -1018420 -1540607 -1934002 -2185251 -2071554 -1592095 -937785 -326992 -89023
16587 -89023 -325453 -675328 -951028 -1259320 -1539229 -1630509 -1558717 -1614101 -1803471 -1959280
16577 -1959280 -1905424 -1448587 -661474 198840 899395 1402281 1565422 1144484 197896 -919190
16567 -919190 -1766616 -2122862 -2141563 -2020383 -1794370 -1409846 -965405 -701691 -697748 -792902
16557 -792902 -736630 -363789 425723 1356907 2138769 2902970 3662338 4257637 4560071 4489483
16547 4489483 4160028 3794472 3565520 3462731 3387283 3248913 3098587 2825908 2191607 1431480
16537 1431480 913505 698991 605633 426528 98098 -368960 -945021 -1364183 -1632418 -1933659
16527 -1933659 -2103602 -2092855 -2019106 -2037877 -2075246 -1845804 -1384043 -887839 -239715 710499
16517 710499 1696355 2247632 2126784 1552312 1054908 696627 86768 -671630 -1263673 -1891626
16507 -1891626 -2614408 -3153753 -3500638 -3802429 -3997173 -4014163 -3797545 -3567812 -3625541 -3830676
16497 -3830676 -3975000 -3946943 -3631480 -3212620 -3073577 -3098986 -2900197 -2509148 -2249475 -2154696
16487 -2154696 -1979521 -1567016 -1148642 -1301153 -2061186 -2951944 -3863619 -4806149 -5338826
16478 -5338826 -5050219 -4173179 -3133839 -2288120 -1915943 -1863997 -1854891 -1959443 -2279336 -2543717
16468 -2543717 -2453526 -2280698 -2187213 -1918863 -1492783 -1152041 -1091884 -1308012 -1606173 -1638628
16458 -1638628 -1384544 -958116 -276523 267038 252542 -54771 -340831 -559431 -728097 -870119
16448 -870119 -882303 -746083 -734755 -1082271 -1712263 -2387883 -2768992 -2610343 -2151147 -1735837
16438 -1735837 -1567680 -1736085 -1932100 -1774570 -1095405 -103225 606375 728403 442942
16429 442942 -7776 -327396 -458563 -628299 -755031 -737807 -698161 -867058 -1388176 -2070509
16419 -2070509 -2585668 -2821845 -2924074 -2916167 -2660261 -2154689 -1757398 -1749181 -1956484 -1932751
16409 -1932751 -1655254 -1403124 -1285238 -1067974 -618755 -134480 334182 966765 1817466
16400 1817466 2567450 2896791 2881342 2888225 2870787 2662749 2560865 2795010 3355032 4006503
16390 4006503 4367393 4441194 4544847 4629857 4406097 3913928 3240753 2604220 2388817 2586004
16380 2586004 2898544 3155457 3294315 3461275 3729103 3755393 3441599 2979236 2560580 2227824
16370 2227824 1897166 1619087 1098403 217410 -605996 -1213605 -1674039 -2157699 -2692046
16361 -2692046 -2855529 -2445153 -1714130 -930297 -393239 -138189 69761 265222 263967 -149939
16351 -149939 -890673 -1550804 -1853217 -1950248 -1876753 -1562755 -1121716 -673432 -298248 -160596
16341 -160596 -521434 -1280348 -1956692 -2254795 -2246944 -1966852 -1462159 -940076 -503637 -283724
16331 -283724 -455574 -837710 -1049211 -899550 -617288 -698931 -1273809 -1887962 -2124776 -2042056
16321 -2042056 -1841268 -1546501 -1176802 -917097 -789897 -575999 -215086 103629 442407
16312 442407 956781 1627934 2319412 2781990 2766277 2258260 1630750 1166132 730956 191358
16302 191358 -369041 -918473 -1414468 -1853292 -2134039 -2134751 -2028141 -1919308 -1691487 -1178144
16292 -1178144 -392737 544388 1426227 1797177 1368376 502235 -207977 -431614 -307321
16283 -307321 -18226 397705 666985 529017 78726 -299554 -331311 -13211 460481 874597
16273 874597 1204383 1449966 1639381 1631840 1353867 1165406 1267650 1253539 923526 675222
16263 675222 638684 553458 153692 -351073 -604995 -482816 -91434 253556 277322 176804
16253 176804 251473 551748 834523 855111 581491 -140585 -1277361 -2240634 -2643074 -2637200
16243 -2637200 -2466620 -2314962 -2229729 -2080138 -1813416 -1538449 -1168397 -769161 -575147 -559072
16233 -559072 -466758 -119520 398051 842066 1157637 1563598 2075859 2411551 2478013 2417942
16223 2417942 2349626 2263936 2269122 2685623 3565265 4256035 4125743 3489869 2901354 2433612
16213 2433612 2179559 2167666 2273497 2474528 2456582 2146560 1865218 1589750 1365825 1512612
16203 1512612 1883342 2096486 1920021 1439958 996392 652667 366308 22640 -483598
16194 -483598 -847764 -791314 -359082 184647 491117 693394 968612 1271056 1474301 1429620
16184 1429620 1303099 1286622 1204414 800679 -55640 -1181407 -2125721 -2421741 -2012051 -1416473
16174 -1416473 -865829 -573051 -860830 -1443890 -1953231 -2414276 -2671135 -2357019 -1535348
16165 -1535348 -871590 -640226 -623612 -678701 -816817 -941820 -915404 -892664 -1058297 -1181027
16155 -1181027 -956275 -522462 -207545 -233024 -632180 -1184251 -1524544 -1444659 -1053744 -669818
16145 -669818 -483142 -347414 -224583 -421351 -1001054 -1506554 -1548904 -1542290 -1976459 -2473432
16135 -2473432 -2507909 -2134504 -1659438 -1147414 -599108 -245399 -273647 -562334 -847715 -884180
16125 -884180 -661037 -330422 30485 430324 708676 558422 -51317 -916180 -1604854 -1635293
16115 -1635293 -924455 114274 1110371 1839301 2179236 2308672 2399755 2419240 2108810 1487410
16105 1487410 785079 -270257 -1876246 -3510697 -4512180 -4713274 -4398555 -3891677 -3499947
16096 -3499947 -3447383 -3852862 -4553948 -5000389 -4792445 -3933852 -2577647 -1119186 58148
16087 58148 912955 1395801 1540425 1373933 823164 86889 -537119 -843465 -661497 -321582
16077 -321582 -445419 -1016989 -1492948 -1624480 -1519127 -1384365 -1529285 -1971987 -2408990 -2752362
16067 -2752362 -2975128 -2952908 -2654477 -2318198 -2192131 -2209354 -2047195 -1424051 -392258 781673
16057 781673 1987440 3061325 3669967 3717873 3409270 2809471 2036322 1355313 785805
16048 785805 168507 -311944 -412257 -313523 -340384 -578367 -873172 -918339 -618460 -176554
16038 -176554 378870 1238405 2298154 3066006 3213811 2876377 2325604 1577474 774950
16029 774950 169307 -314876 -725737 -954056 -1188814 -1592061 -1984885 -2221873 -2198768 -2145570
16019 -2145570 -2372001 -2723556 -2987715 -3248332 -3348587 -3090814 -2682755 -2184979 -1428825
16010 -1428825 -625496 -302107 -620220 -1065431 -1119329 -803128 -543209 -495947 -378583 -230210
16000 -230210 -570396 -1373854 -1991042 -2006845 -1361467 -569937 -91614 161414 379061 528421
15990 528421 501220 340814 236249 278265 393512 411126 386078 418202 257959 -165167
15980 -165167 -551221 -667533 -572453 -362796 33978 535220 822026 741523 276462 -556439
15970 -556439 -1448824 -1957931 -2131764 -2194879 -2078119 -1745448 -1336867 -1067679 -1179919 -1542524
15960 -1542524 -1893143 -2322994 -2708195 -2746815 -2557503 -2332928 -2088676 -1981239 -2172982 -2436237
15950 -2436237 -2475329 -2258376 -1870593 -1488753 -1236034 -1198899 -1314835 -1247493 -977485 -870498
15940 -870498 -1132729 -1665100 -2063072 -2112066 -1921531 -1641029 -1280381 -849898 -630680 -865990
15930 -865990 -1303056 -1552426 -1539513 -1371360 -1266705 -1222432 -1149349 -1070424 -1156186 -1419737
15920 -1419737 -1734130 -1839694 -1623380 -1440752 -1496316 -1558561 -1447766 -1407624 -1377651 -930804
15910 -930804 -71900 709515 986639 657373 106557 -238308 -462899 -742142 -874356 -671515
15900 -671515 -380790 -322309 -504655 -762485 -1105182 -1644827 -2259280 -3006452 -3923450 -4786271
15890 -4786271 -5253253 -5131492 -4617191 -4153209 -3984759 -3956071 -3865145 -3720633 -3574183 -3301981
15880 -3301981 -2770671 -2029911 -1199058 -505541 -32036 398957 1000139 1732822 2294616
15871 2294616 2303109 1838481 1209500 625099 272268 243678 352691 320673 213478 61259
15861 61259 -233654 -519691 -837340 -1132236 -872680 -85860 502077 445910 -30415 -442455
15851 -442455 -563071 -484156 -229426 150637 284671 50841 -90820 -37894 -56567 -226894
15841 -226894 -444494 -275150 361395 971571 1310990 1424162 1422880 1460611 1419827 1144359
15831 1144359 610724 -48968 -444472 -481031 -561177 -846061 -992247 -872414 -686808 -617004
15821 -617004 -561490 -484931 -489062 -477375 -367432 -398460 -763009 -1096669 -996162 -662939 -452057
15810 -452057 -253660 181785 504507 453958 360316 548146 967330 1313236 1431428 1606303
15800 1606303 2195716 2979058 3244863 2761379 1972236 1227486 626753 257068 -3936
15791 -3936 -458943 -1266978 -2122538 -2599154 -2659584 -2608845 -2756249 -3106331 -3445007 -3580812
15781 -3580812 -3519696 -3257374 -2846733 -2592931 -2500758 -2321810 -2081517 -1956888 -2021658 -2180773
15771 -2180773 -2225409 -2024086 -1619875 -1064566 -362594 470298 1173823 1496205 1571509 1595068
15761 1595068 1677921 1719214 1593044 1550199 1795825 1974786 1857251 1887789 2451087 3198099
15751 3198099 3465109 3106597 2319642 1329493 392096 -190657 -391985 -407678 -259240 1603
15741 1603 316265 577500 622979 372255 -105330 -666397 -1138778 -1362270 -1437571 -1530370
15731 -1530370 -1500193 -1238629 -932788 -826742 -903379 -782235 -353107 4381 158627 271936
15721 271936 272116 222790 372098 706419 919216 882010 764138 679331 646283 748168 1084703
15710 1084703 1459989 1581539 1666925 2199841 3274401 4431891 4999547 4582970 3504204
15701 3504204 2364610 1412141 679603 38815 -618933 -992660 -918110 -559595 -4950
15692 -4950 624996 1130017 1362778 1309580 1200644 1361284 1848236 2406476 2768053 2876135
15682 2876135 2903180 2875195 2686188 2346187 1968579 1861419 2128084 2385597 2383574 2196445
15672 2196445 1968731 1727154 1301560 839008 711429 1035979 1566949 1828572 1628357
15663 1628357 1239311 1067174 1197526 1334485 1351649 1375626 1510322 1702877 1869716 1974235
15653 1974235 2128634 2436125 2679644 2756896 2752225 2501893 1915554 1314525 960759 653307
15643 653307 144027 -479001 -1114121 -1721180 -2075197 -2144159 -2020755 -1598218 -900537 -273035
15633 -273035 -50264 -240648 -583918 -830448 -953554 -1029650 -1212698 -1514954 -1665666 -1360858
15623 -1360858 -569042 330465 1000034 1455635 1769892 1834294 1404253 502527 -373418 -833302
15613 -833302 -1024685 -1264224 -1588596 -1757224 -1519314 -896568 -69813 614451 725072 294476
15603 294476 -363568 -921115 -1386463 -2050030 -2777077 -3215091 -3171365 -2783500 -2341771 -2006985
15593 -2006985 -1814473 -1670747 -1468878 -1109064 -506562 152932 575809 666987 462835 -58344
15583 -58344 -585386 -688571 -239677 432357 1064796 1723349 2352293 2928390 3386439 3550230
15573 3550230 3242696 2520738 1632312 780484 250735 124816 150000 180318 188164 163658
15563 163658 122996 245432 731578 1546713 2189681 2149609 1702769 1432783 1423001 1400602
15553 1400602 1270407 1260155 1499317 1860397 2274521 2845148 3574070 4039968 3683537 2646639
15543 2646639 1634802 1054804 820948 605702 250844 6910 -22476 -97778 -281821 -433457
15533 -433457 -523941 -650796 -709379 -713002 -782223 -675549 -321479 -126327 -350706 -668635
15523 -668635 -678001 -300163 297768 811373 989968 884388 868280 1241159 1686995 1730306
15513 1730306 1328669 629118 -22312 -136575 288022 890499 1495802 1957240 1793214
15504 1793214 753915 -571015 -1375407 -1378317 -831467 -184752 147175 41859 -422566
15495 -422566 -1090811 -1560141 -1548304 -1198755 -689168 -299100 -165607 -73502 176362 739807
15485 739807 1510267 2114639 2270082 2068351 1992222 2323945 2987327 3664247 4015987 4027027
15475 4027027 3891185 3739156 3545115 3294997 3078706 2994411 2963339 2656240 1940011 1053724
15465 1053724 401545 226359 334226 378807 159755 -254967 -555838 -704786 -1098069 -1891301
15455 -1891301 -2685423 -3148939 -3342357 -3162755 -2525501 -1739391 -1047353 -466612 -43286
15446 -43286 -11770 -361370 -691118 -676653 -317149 89949 339640 595309 890511 1062657
15436 1062657 1148167 1324605 1601841 1770108 1841521 1955259 2025397 1910160 1647234 1448873
15426 1448873 1486898 1725182 1986350 2225425 2670677 3464441 4246404 4673066 4637003 4221649
15416 4221649 3835581 3597605 3332984 3202051 3386894 3791226 4193447 4572702 5034194
15407 5034194 5436000 5653751 5540573 4957600 4150068 3104660 1667960 433943 60230
15398 60230 473649 1347072 2305450 2900156 2983672 2664365 2293831 2194226 2264187 2336257
15388 2336257 2376382 2225337 1907181 1606083 1528127 1717344 2126768 2546415 2577635 2225857
15378 2225857 1734104 1246669 932364 870139 1004973 1106723 1016174 837708 642585 379454
15368 379454 68216 -188195 -321757 -369980 -308902 -113110 156614 327798 212715 -28576
15358 -28576 -59196 139043 161890 -63848 -149297 -21566 152409 289044 188105 -396552
15348 -396552 -1303048 -2090795 -2327849 -1961874 -1487732 -1359387 -1607205 -1828733 -1754069 -1543390
15338 -1543390 -1365618 -1270233 -1245416 -1092123 -670212 -13865 902861 1843091 2354034 2311185
15328 2311185 2065633 2102931 2495806 2856591 2828546 2642556 2716686 2916599 2933993 2599053
15318 2599053 2042370 1577807 1296206 1082911 879714 762569 708416 631853 572397 706984
15308 706984 968823 1166344 1281613 1219526 746336 65120 -330196 -230062 353769 1218127
15298 1218127 2158496 3044428 3467414 3256905 2654745 1822405 819799 48228 -202388
15289 -202388 -136400 -119473 -448944 -1131439 -1871538 -2414686 -2664930 -2662550 -2465398 -2065759
15279 -2065759 -1483382 -715699 110953 864833 1441944 1753017 1794053 1798175 1892686 1841712
15269 1841712 1499036 930831 346943 -130415 -490205 -628343 -537412 -264607 272307 1049792
15259 1049792 1806713 2560577 3427095 4102652 4031915 3210910 2218146 1321081 536360 -89378
15249 -89378 -529069 -813900 -1242420 -1873342 -2321705 -2335188 -2075782 -1646805 -1145157 -882648
15239 -882648 -1010414 -1388920 -1617450 -1623933 -1500259 -1077459 -408257 299739 966811 1605134
15229 1605134 2068858 2299273 2517666 2804999 2983191 2820923 2280198 1586739 1011002
15220 1011002 821300 925245 849270 390842 -309019 -938257 -1420281 -1801969 -1907410 -1849029
15210 -1849029 -1776247 -1630099 -1493426 -1476793 -1603579 -1739335 -1788438 -1742035 -1690261 -1677560
15200 -1677560 -1624694 -1580619 -1551558 -1381667 -1065625 -625241 -92017 644880 1580259 2289855
15190 2289855 2717758 3033203 3185821 3259643 3254028 3086608 2838105 2417782 1889840 1455001
15180 1455001 1078900 775171 605385 504149 321991 -74499 -631013 -1132463 -1331455
15171 -1331455 -1156118 -983950 -1107096 -1261566 -1048674 -585356 -277887 -149561 -151673 -376847
15161 -376847 -649762 -810993 -1030886 -1425709 -1835239 -1888590 -1453630 -858178 -419317 -206154
15151 -206154 -102704 -82227 -58777 162913 483486 762340 842442 771669 758262 823210 719634
15140 719634 259789 -179938 -238457 -96325 -183907 -558012 -797023 -715399 -650443 -644460 -498124
15129 -498124 -266416 -20720 373480 870207 1157432 1095827 844189 554242 335409 323691
15119 323691 500188 763005 1212549 1943580 2820293 3596911 4082742 4240411 4190496 4159072
15109 4159072 4096590 3791884 3330328 2990191 2812112 2594041 2138771 1513550 838165 170135
15099 170135 -166265 64823 507588 831363 828083 529618 287692 407751 967925 1842847
15089 1842847 2633037 3005390 2862186 2389160 1881231 1351527 790562 337717 150131
15080 150131 309809 525449 459338 193909 69084 575243 1621241 2489996 2732259 2381673
15070 2381673 1745297 1306120 1364177 1883442 2757151 3593577 3990141 3820703 3121775 2172003
15060 2172003 1287194 656704 390054 453721 710133 879916 784906 711431 1067320 1779682
15050 1779682 2167833 1813059 979910 59813 -783840 -1412600 -1756964 -2025953 -2244825
15041 -2244825 -2130025 -1810455 -1636073 -1633093 -1681478 -1539912 -1201372 -978882 -983953 -1061761
15031 -1061761 -1078292 -975384 -655712 -156850 291912 401560 46195 -679229 -1598522 -2531626
15021 -2531626 -3281660 -3639453 -3661679 -3674630 -3706699 -3541707 -3032254 -2429472 -2258852 -2366770
15011 -2366770 -2212433 -1735827 -1182717 -733449 -433045 -222588 -60533 16338 195997 559129
$$ [...]
##END NTUPLES=NMR SPECTRUM
##END=
