##TITLE=C13_DE-76H_2_pH10
 D2O, 22300sc

 14.1.2025
##JCAMPDX= 6.0         $$ Bruker NMR JCAMP-DX V2.0
##DATA TYPE= NMR SPECTRUM
##DATA CLASS= NTUPLES
##ORIGIN= UXNMR, Bruker Analytische Messtechnik GmbH
##OWNER= root
$$ XWIN-NMR		Version 3.5
$$ Wed Jan 15 13:42:58 2025 Russian Standard Time (UT+4h)  she@DPX200
##.OBSERVE FREQUENCY= 50.327896
##.OBSERVE NUCLEUS= ^13C
##.ACQUISITION MODE= SIMULTANEOUS
##.ACQUISITION SCHEME= undefined
##.AVERAGES= 22301
##.DIGITISER RES= 17
##SPECTROMETER/DATA SYSTEM= spect
##.PULSE SEQUENCE= zgpg30
##.SOLVENT NAME= CDCl3
##.SHIFT REFERENCE= (INTERNAL, CDCl3, 0, 222.565)
##AUDIT TRAIL= $$ (NUMBER, WHEN, WHO, WHERE, WHAT)
$$ ##TITLE= Audit trail, XWIN-NMR		Version 3.5
$$ ##JCAMPDX= 5.01
$$ ##ORIGIN= Bruker BioSpin GmbH
$$ ##OWNER= she
$$ F:/spectra/data/she/nmr/c13/1/pdata/1/auditp.txt
$$ ##AUDIT TRAIL=  $$ (NUMBER, WHEN, WHO, WHERE, WHAT)
(   1,<2025-01-15 13:40:55.92 +0400>,<she>,<DPX200>,
      <created by zg, POWCHK disabled, PULCHK disabled
       terminated by command 'halt'
       configuration hash MD5:
       00 E9 B6 7A A2 85 ED C7 34 08 36 98 17 FE 4E 26
       data hash MD5: 32K
       C5 0B C5 B9 F5 7A 97 23 B2 7B 7C 14 8C 1A CA 04>)
(   2,<2025-01-15 13:41:10.32 +0400>,<she>,<DPX200>,
      <Start of raw data processing
       efp BC_mod = 2 LB = 2 FT_mod = 6 PKNL = 1 PHC0 = -409.3641 PHC1 = 23.28833 SI = 32K 
       data hash MD5: 32K
       B5 D8 D9 FE 7F 9E 07 17 9A 08 91 99 23 2F D3 BD>)
(   3,<2025-01-15 13:41:20.82 +0400>,<she>,<DPX200>,
      <abs ABSG = 5 
       data hash MD5: 32K
       57 B8 51 57 2B 6A EE B3 23 4E 64 F9 06 A5 D4 55>)
(   4,<2025-01-15 13:42:22.93 +0400>,<she>,<DPX200>,
      <pk PHC0 = 4.778825 PHC1 = -0.1999971 
       data hash MD5: 32K
       67 E4 3B C0 1D 77 AB 11 EB E9 87 5B D4 51 A8 69>)
(   5,<2025-01-15 13:42:26.10 +0400>,<she>,<DPX200>,
      <abs ABSG = 5 
       data hash MD5: 32K
       58 18 8D 62 41 88 35 FA C5 E7 49 03 B2 CA E1 F5>)
$$ ##END=
$$ 
$$ hash MD5
$$ 02 0D F4 3F 71 AA 72 C5 B6 FB 94 ED FF 7E B3 B1
##$RELAX= 
##$RELAX= 
##$RELAX= 
##$RELAX= 
##$RELAX= 
##$RELAX= 
##$RELAX= 
##$RELAX= 
$$ Bruker specific parameters
$$ --------------------------
##$DU= <F:/spectra>
##$EXPNO= 1
##$NAME= <c13>
##$PROCNO= 1
##$TYPE= <nmr>
##$USER= <she>
##$AMP= (0..31)
100 100 100 100 100 100 100 100 100 100 100 100 100 100 100 100 100 100 
100 100 100 100 100 100 100 100 100 100 100 100 100 100 
##$AQSEQ= 0
##$AQ_mod= 1
##$AUNM= <au_zg>
##$AUTOPOS= <>
##$BF1= 50.322709
##$BF2= 200.13
##$BF3= 50.322709
##$BF4= 500.13
##$BF5= 500.13
##$BF6= 500.13
##$BF7= 500.13
##$BF8= 500.13
##$BYTORDA= 1
##$CFDGTYP= 0
##$CFRGTYP= 5
##$CHEMSTR= <none>
##$CNST= (0..31)
1 1 145 1 1 1 1 1 1 1 1 1 1 1 1 1 1 1 1 1 1 1 1 1 1 1 1 1 1 1 1 1 
##$CPDPRG= <waltz16>
##$CPDPRG1= <>
##$CPDPRG2= <waltz16>
##$CPDPRG3= <>
##$CPDPRG4= <mlev>
##$CPDPRG5= <mlev>
##$CPDPRG6= <mlev>
##$CPDPRG7= <mlev>
##$CPDPRG8= <mlev>
##$CPDPRGB= <>
##$CPDPRGT= <>
##$D= (0..31)
$$ [...]
##$SUBNAM4= <"">
##$SUBNAM5= <"">
##$SUBNAM6= <"">
##$SUBNAM7= <"">
##$SUBNAM8= <"">
##$SUBNAM9= <"">
##$SW= 239.972175391363
##$SWIBOX= (0..15)
0 1 3 0 0 0 0 0 0 0 0 0 0 0 0 0 
##$SW_h= 12077.2946859903
##$TD= 32768
##$TD0= 1
##$TE= 0
##$TE2= 300
##$TE3= 300
##$TEG= 300
##$TL= (0..7)
120 120 120 120 120 120 120 120 
##$TP= (0..7)
150 150 150 150 150 150 150 150 
##$TP07= 0
##$TPNAME0= <>
##$TPNAME1= <>
##$TPNAME2= <>
##$TPNAME3= <>
##$TPNAME4= <>
##$TPNAME5= <>
##$TPNAME6= <>
##$TPNAME7= <>
##$TPOAL= (0..7)
0.5 0.5 0.5 0.5 0.5 0.5 0.5 0.5 
##$TPOFFS= (0..7)
0 0 0 0 0 0 0 0 
##$TUNHIN= 0
##$TUNHOUT= 0
##$TUNXOUT= 0
##$USERA1= <user>
##$USERA2= <user>
##$USERA3= <user>
##$USERA4= <user>
##$USERA5= <user>
##$V9= 5
##$VALIST= <valist>
##$VCLIST= <CCCCCCCCCCCCCCC>
##$VD= 0
##$VDLIST= <DDDDDDDDDDDDDDD>
##$VPLIST= <PPPPPPPPPPPPPPP>
##$VTLIST= <TTTTTTTTTTTTTTT>
##$WBST= 1024
##$WBSW= 4
##$XGAIN= (0..3)
0 0 0 0 
##$XL= 0
##$YL= 0
##$YMAX_a= 105751574
##$YMIN_a= -34035465
##$ZGOPTNS= <>
##$ZL1= 120
##$ZL2= 120
##$ZL3= 120
##$ZL4= 120
##$ABSF1= 222.5654
##$ABSF2= -17.4314
##$ABSG= 5
##$ABSL= 3
##$ALPHA= 0
##$AQORDER= 0
##$ASSFAC= 0
##$ASSFACI= 0
##$ASSFACX= 0
##$ASSWID= 0
##$AUNMP= <proc_1d>
##$AZFE= 0.1
##$AZFW= 0.5
##$BCFW= 0
##$BC_mod= 2
##$BYTORDP= 0
##$COROFFS= 0
##$CY= -3
##$DATMOD= 1
##$DC= 0
##$DFILT= <>
##$DTYPP= 0
##$F1P= 0
##$F2P= 0
##$FCOR= 0.5
##$FTSIZE= 32768
##$FT_mod= 6
##$GAMMA= 0
##$GB= 0
##$INTBC= 1
##$INTSCL= 4.134877e-10
##$ISEN= 128
##$LB= 2
##$LEV0= 0
##$LPBIN= 0
##$MAXI= 10000
##$MC2= 0
##$MEAN= 0
##$ME_mod= 0
##$MI= 0.1934396
##$NCOEF= 0
##$NC_proc= -1
##$NLEV= 6
##$NOISF1= 120.0001
##$NOISF2= 80.00006
##$NSP= 0
##$NTH_PI= 0
##$NZP= 0
##$OFFSET= 222.5654
##$PC= 1.4
##$PHC0= -404.5853
##$PHC1= 23.08833
##$PH_mod= 1
##$PKNL= yes
##$PPARMOD= 0
##$PSCAL= 0
##$PSIGN= 0
##$REVERSE= no
##$SF= 50.3227345484362
##$SI= 32768
##$SIGF1= 140
##$SIGF2= 120
##$SINO= 11.81781
##$SIOLD= 32768
##$SREGLST= <13C.CDCl3>
##$SSB= 0
##$STSI= 32768
##$STSR= 0
##$SW_p= 12077.2946859903
##$SYMM= 0
##$S_DEV= 0
##$TDeff= 32768
##$TDoff= 0
##$TI= <>
##$TILT= no
##$TM1= 0
##$TM2= 0
##$TOPLEV= 0
##$USERP1= <user>
##$USERP2= <user>
##$USERP3= <user>
##$USERP4= <user>
##$USERP5= <user>
##$WDW= 1
##$XDIM= 32768
##$YMAX_p= 268540902
##$YMIN_p= -160368877
$$ End of Bruker specific parameters
$$ ---------------------------------
##NTUPLES= NMR SPECTRUM
##VAR_NAME=  FREQUENCY,     SPECTRUM/REAL,   SPECTRUM/IMAG
##SYMBOL=    X,             R,               I
##VAR_TYPE=  INDEPENDENT,   DEPENDENT,       DEPENDENT
##VAR_FORM=  AFFN,          ASDF,            ASDF
##VAR_DIM=   32768,         32768,           32768
##UNITS=     HZ,            ARBITRARY UNITS, ARBITRARY UNITS
##FACTOR=    0.368581032318806, 1,           1
##FIRST=     11200.0995020947, 0,            0
##LAST=      -877.195183895579, 0,           0
##MIN=       -877.195183895579, -160368877,  0
##MAX=       11200.0995020947, 268540902,    0
$$ Real data points
##PAGE= N=1
##DATA TABLE= (X++(R..R)), XYDATA
$$ [...]
##PAGE= N=2
##DATA TABLE= (X++(I..I)), XYDATA
$$ plain form
6736 -99956022 -99404075 -98697568 -98442248 -98886494 -99177700 -98303640 -96558365 -94570315 -92533791
6727 -92533791 -90855415 -90060551 -90050061 -90211532 -90162382 -89868165 -89349434 -88900885 -88607676 -88443822
6717 -88443822 -88482517 -88763322 -89426255 -90466649 -91831570 -92947609 -92741897 -90916819 -88292489
6708 -88292489 -85992495 -84358859 -82898497 -81434175 -80487760 -80045888 -79212773 -77375522 -74840280
6699 -74840280 -72226725 -69786826 -67788756 -66482414 -65512689 -64650716 -64011257 -63434473 -62465915
6690 -62465915 -60764344 -58135765 -54825262 -51492743 -48346586 -45042892 -41295176 -37431209
6682 -37431209 -33836762 -30511059 -27535336 -24715828 -21786139 -18915200 -16680197 -16195865
6674 -16195865 -18800798 -25386350 -36190086 -51450714 -70936688 -93086593 -115879443
$$ packed form
6736i9956022N51947P06507K55320m44246k91206Q74060J745275J988050K036524
6727i2533791J678376P94864J0490j61471M9150K94217N18731M48549K93209J63854
6717h8443822l8695k80805o62933j040394j364921j116039K05712J825078K624330
6708h8292489K299994J633636J460362J464322R46415M41872Q33115J837251K535242
6699g4840280K613555K439899J998070J306342R69725Q61973O39459N76784R68558
6690f2465915J701571K628579L310503L332519L146157L303694L747716L863967
6682c7431209L594447L325703K975723K819508K929689K870939K235003M84332
6674a6195865k604933o585552j0803736j5260628j9485974k2149905k2792850
$$ plain form
6667 -115879443 -137917451 -158094701 -175898598 -191415733 -204426126 -214224838 -219995062
6660 -219995062 -221785252 -220525544 -217811303 -215000797 -212099458 -208669353 -204604522 -200033269
6652 -200033269 -195305682 -191121384 -187969130 -185944807 -184626817 -183006175 -180771863 -178579984
6644 -178579984 -176933201 -175823933 -174756846 -173407740 -172016116 -170590066 -168911268 -166984412
6636 -166984412 -165025781 -163222700 -161471821 -159882400 -159009667 -158992526 -159728754 -160938821 -161645748
6627 -161645748 -161075462 -159085492 -156122910 -153198101 -150830219 -148879298 -147521875 -146861219
6619 -146861219 -146386294 -145808030 -145191335 -144312839 -143046901 -141762474 -140572797 -139444392 -138346405
6610 -138346405 -137646290 -137597436 -137732857 -137396223 -136712451 -136184678 -135884107 -135664052 -135144139
$$ packed form
6667a15879443k2038008k0177250j7803897j5517135j3010393r798712n770224
6660b19995062j790190J259708K714241K810506K901339L430105M064831M571253
6652b00033269M727587M184298L152254K024323J317990J620642K234312K191879
6644a78579984J646783J109268J067087J349106J391624J426050J678798J926856
6636a66984412J958631J803081J750879J589421Q72733J7141p36228j210067p06927
6627a61645748N70286J989970K962582K924809K367882J950921J357423O60656
6619a46861219M74925N78264O16695Q78496J265938J284427J189677J128405J097987
6610a38346405P00115M8854j35421L36634O83772N27773L00571K20055N19913
$$ plain form
6601 -135144139 -134007076 -132769084 -132364521 -132990770 -134134717 -134821678 -134495718 -133661996 -132667880
6592 -132667880 -131629557 -130920233 -130527354 -130025691 -129395231 -129351705 -130202796 -131268168 -132047423
6583 -132047423 -132684215 -133271773 -133820502 -134338722 -134754168 -135163776 -135793731 -136898577 -137915097
6574 -137915097 -137948261 -137332206 -136690507 -136008387 -134957076 -133443567 -132140750 -131341024 -130347466
6565 -130347466 -128958573 -127649504 -126589681 -125528820 -124268200 -122705849 -121169664 -120386942
6557 -120386942 -120627361 -121714262 -123094859 -124029416 -124465575 -124866175 -125575616 -126341957 -127494909
6548 -127494909 -129313198 -131024444 -132247374 -133250996 -134191080 -135230818 -136543517 -137601781
6540 -137601781 -137578022 -136534196 -135028154 -133625590 -132628195 -131980145 -131636421 -131587187 -131599278
$$ packed form
6601a35144139J137063J237992M04563o26249j143947o86961L25960Q33722R94116
6592a32667880J038323P09324L92879N01663O30460M3526q51091j065372p79255
6583a32047423o36792n87558n48729n18220m15446m09608o29955j104846j016520
6574a37915097l3164O16055O41699O82120J051311J513509J302817P99726R93558
6565a30347466J388893J309069J059823J060861J260620J562351J536185P82722
6557a20386942k40419j086901j380597r34557m36159m00600p09441p66341j152952
6548a27494909j818289j711246j222930j003622r40084j039738j312699j058264
6540a37601781K3759J043826J506042J402564R97395O48050L43724M9234j2091
$$ plain form
6531 -131599278 -131251316 -130531422 -129683626 -128758864 -128251633 -128237312 -128085472 -127782431 -127814223 -128123713
6521 -128123713 -128485243 -128977958 -129274127 -129125136 -128873947 -128859507 -128588390 -127411558 -125327890
6512 -125327890 -123116592 -121684369 -121199551 -121547840 -122264157 -123067576 -124216633 -125460603 -126192431
6503 -126192431 -126349161 -125997728 -124937051 -123575529 -122550441 -121747641 -121126969 -120538543 -119963620
6494 -119963620 -119975207 -120861550 -122467422 -124634052 -126965231 -128925626 -130126922 -130277461 -129665469
6485 -129665469 -128737320 -127705557 -126725551 -125871796 -125013080 -123868989 -122672696 -121889897 -121359410
6476 -121359410 -121154472 -121680432 -122348362 -122807401 -123772636 -125618316 -127819749 -129539480 -130221282
6467 -130221282 -129525251 -127657639 -125486361 -123885088 -122899122 -122174524 -122299936 -123582678 -125267497
$$ packed form
6531a31599278L47962P19894Q47796R24762N07231J4321J51840L03041l1792l09490
6521a28123713l61530m92715k96169J48991K51189J4440K71117J176832K083668
6512a25327890K211298J432223M84818l48289p16317q03419j149057j243970p31828
6503a26192431j56730L51433J060677J361522J025088Q02800O20672N88426N74923
6494a19963620j1587q86343j605872k166630k331179j960395j201296j50539O11992
6485a29665469R28149J031763R80006Q53755Q58716J144091J196293P82799N30487
6476a21359410K04938n25960o67930m59039r65235j845680k201433j719731o81802
6467a30221282O96031J867612K171278J601273R85966P24598j25412j282742j684819
$$ plain form
6458 -125267497 -126526507 -127037002 -127421425 -127876899 -127826158 -127419493 -127123037 -126836823 -126771787
6449 -126771787 -127033721 -127034642 -126824478 -126815677 -126949174 -127443327 -128650823 -129950597 -130930555 -131352482
6439 -131352482 -130620673 -128671790 -126200369 -124215003 -123077893 -122434696 -122108487 -122213141 -122466302
6430 -122466302 -122352202 -121783254 -121115242 -120572669 -120323195 -120356525 -120084180 -119229976 -117981131
6421 -117981131 -116406973 -114582580 -112829816 -111367774 -110908850 -112190874 -114769472 -117396792
6413 -117396792 -119381791 -120381627 -120287609 -119664912 -119158285 -119046991 -119179444 -119573557 -120550539
6404 -120550539 -121972787 -123145534 -123449470 -122863386 -122254062 -122224210 -121993588 -121007630 -119885333
6395 -119885333 -119156053 -118549117 -118169470 -119025774 -121175065 -123252295 -123991294 -123432825 -122844699
$$ packed form
6458a25267497j259010n10495l84423m55474N0741M06665K96456K86214O5036
6449a26771787k61934r21K10164Q801j33497m94153j207496j299774r79958m21927
6439a31352482P31809J948883K471421J985366J137110O43197L26209j04654k53161
6430a22466302J14100N68948O68012N42573K49474l3330K72345Q54204J248845
6421a17981131J574158J824393J752764J462042M58924j282024k578598k627320
6413a17396792j984999r99836R4018O22697N06627J11294j32453l94113r76982
6404a20550539j422248j172747l03936N86084O09324K9852K30622R85958J122297
6395a19885333P29280O06936L79647q56304k149291k077230p38999N58469N88126
$$ plain form
6386 -122844699 -123046076 -123494875 -123598581 -123778614 -124103664 -124180341 -124474379 -125140866 -125802555
6377 -125802555 -125854606 -124880835 -123228754 -121525165 -120207136 -119918510 -120940894 -122602465 -123755867
6368 -123755867 -123812829 -123038583 -121723901 -120456180 -119941026 -120144136 -120787833 -121578576 -122257600
6359 -122257600 -122733927 -123260853 -123441142 -122653677 -121366229 -120475444 -120349545 -121043695 -122393357
6350 -122393357 -124090657 -125566557 -126099597 -125387957 -123920158 -122435597 -121830666 -121901680 -121661971
6341 -121661971 -121354568 -121563751 -122004328 -121711506 -120547012 -119376395 -119060949 -119470460 -120275515
6332 -120275515 -121160292 -121660447 -121930899 -122103405 -122029318 -122056544 -122589945 -123385451 -124337441 -125552186
6322 -125552186 -126996274 -128387111 -129451404 -130260708 -131365637 -132975884 -134268046 -134708254
$$ packed form
6386a22844699k01377m48799j03706j80033l25050p6677k94038o66487o61689
6377a25802555n2051R73771J652081J703589J318029K88626j022384j661571j153402
6368a23755867n6962P74246J314682J267721N15154k03110o43697p90743o79024
6359a22257600m76327n26926j80289P87465J287448Q90785J25899o94150j349662
6350a22393357j697300j475900n33040P11640J467799J484561O04931p1014K39709
6341a21661971L07403k09183m40577K92822J164494J170617L15446m09511q05055
6332a20275515q84777n00155k70452j72506P4087k7226n33401p95506r51990j214745
6322a25552186j444088j390837j064293q09304j104929j610247j292162m40208
$$ plain form
6314 -134708254 -134495589 -133817774 -132611661 -130981745 -129209732 -127421899 -125687675 -124128206
6306 -124128206 -122806718 -121599634 -120556607 -120128495 -120708586 -121607668 -122135659 -122553729 -123112500
6297 -123112500 -123714080 -124217857 -124450251 -124496563 -124786627 -125418015 -125754186 -125467918 -124964689
6288 -124964689 -124568980 -124258798 -123585211 -122613985 -121915338 -121371993 -120816694 -120563531 -120152565
6279 -120152565 -119178590 -118318254 -117925153 -118087774 -119093524 -120690828 -122311257 -124052444 -125828973
6270 -125828973 -127058996 -127094980 -125859421 -124452021 -123609740 -123190083 -122989843 -122767864 -122541003
6261 -122541003 -122208802 -121247120 -119474800 -117276757 -115570570 -115114743 -115643757 -116087376 -116341455
6252 -116341455 -116716998 -116971902 -117058541 -117520661 -118476995 -118921929 -118520640 -118191721 -118406559
$$ packed form
6314a34708254K12665O77815J206113J629916J772013J787833J734224J559469
6306a24128206J321488J207084J043027M28112n80091q99082n27991m18070n58771
6297a23112500o01580n03777k32394m6312k90064o31388l36171K86268N03229
6288a24964689L95709L10182O73587R71226O98647N43345N55299K53163M10966
6279a20152565R73975Q60336L93101j62621j005750j597304j620429j741187j776529
6270a25828973j230023l5984J235559J407400Q42281M19657K00240K21979K26861
6261a22541003L32201R61682J772320K198043J706187M55827n29014m43619k54079
6252a16341455l75543k54904q6639m62120r56334m44934M01289L28919k14838
$$ plain form
6243 -118406559 -118900662 -119240549 -119170845 -118803872 -118414438 -118461925 -118930893 -119619285 -120306395 -120835780
6233 -120835780 -121111072 -121558904 -122635844 -123790124 -124091629 -123216173 -121984709 -121069434 -120532816
6224 -120532816 -120423568 -120490283 -120396394 -120304223 -120741420 -121496560 -121513831 -120661011 -119400640 -118068624
6214 -118068624 -117356908 -117498223 -118338666 -119616365 -120741117 -121202527 -121460236 -122215957 -123229800
6205 -123229800 -124217902 -125598120 -127044923 -127190920 -125655475 -123320284 -121117124 -119646427
6197 -119646427 -119147910 -119024311 -118400945 -117402017 -116672313 -116212956 -115775250 -115696192 -116518529
6188 -116518529 -118283951 -120243873 -121444261 -121971114 -122036427 -121353727 -120060271 -118703035 -117909071
6179 -117909071 -117750453 -117991909 -118479352 -118715791 -118431479 -117545903 -116195044 -114855291 -114189989
$$ packed form
6243a18406559m94103l39887O9704L66973L89434m7487m68968o88392o87110n29385
6233a20835780k75292m47832j076940j154280l01505Q75456J231464R15275N36618
6224a20532816J09248o6715R3889R2171m37197p55140j7271Q52820J260371J332016
6214a18068624P11716j41315q40443j277699j124752m61410k57709p55721j013843
6205a23229800r88102j380218j446803j45997J535445K335191K203160J470697
6197a19646427M98517J23599O23366R98928P29704M59357M37706P9058q22337
6188a16518529j765422j959922j200388n26853o5313O82700J293456J357236P93964
6179a17909071J58618k41456m87443k36439K84312Q85576J350859J339753O65302
$$ plain form
6170 -114189989 -114853539 -116519390 -117825109 -118082941 -117750715 -117659451 -118127128 -118685966 -118973226
6161 -118973226 -119304892 -119701486 -119617182 -118758059 -117694320 -116941227 -116381133 -115775132 -115310031
6152 -115310031 -115002165 -114812345 -115462579 -116896545 -118029464 -118323354 -118079576 -117797249 -117476962
6143 -117476962 -116889445 -116034313 -114953111 -113955448 -113550595 -113910835 -114453199 -114378480 -113664603
6134 -113664603 -112815814 -111944358 -111452437 -111636506 -111665470 -111143176 -110584500 -110296225 -110045881
6125 -110045881 -109933558 -110449047 -111653951 -113109525 -114186284 -114809383 -115358657 -115793069 -115659571
6116 -115659571 -114909684 -114064560 -113737392 -113975877 -114174255 -113835069 -113337514 -113197852 -113393392
6107 -113393392 -113718729 -113802620 -113752247 -114180526 -115148950 -116077227 -116412416 -116135267 -115729313 -115326882
$$ packed form
6170a14189989o63550j665851j305719k57832L32226R1264m67677n58838k87260
6161a18973226l31666l96594Q4304Q59123J063739P53093N60094O06001M65101
6152a15310031L07866J89820o50234j433966j132919k93890K43778K82327L20287
6143a17476962N87517Q55132J081202R97663M04853l60240n42364P4719P13877
6134a13664603Q48789Q71456M91921j84069k8964N22294N58676K88275K50344
6125a10045881J12323n15489j204904j455574j076759o23099n49274m34412J33498
6116a15659571P49887Q45124L27168k38485j98378L39186M97555J39662j95540
6107a13393392l25337q3891N0373m28279r68424r28277l35189K77149M05954M02431
$$ plain form
6097 -115326882 -114576926 -113491472 -112553363 -112593204 -113955893 -115435569 -116018047 -116203712 -116434748
6088 -116434748 -116523326 -116362149 -116324123 -117007283 -117996267 -118441111 -118324011 -117920506 -116905755
6079 -116905755 -115298684 -113937411 -113456110 -113689860 -114488040 -116004760 -117939968 -119294817
6071 -119294817 -119326016 -118330192 -117266391 -116462852 -115473780 -114289409 -113365824 -112894629 -112756025
6062 -112756025 -112900589 -113441645 -114393946 -115207518 -115637904 -115732006 -115695885 -115959586 -116582963 -117389960
6052 -117389960 -118346945 -118962909 -118675244 -117874228 -117497460 -117687116 -118166644 -119041339 -119864741
6043 -119864741 -119989546 -119371528 -118397933 -117730079 -117747031 -118192869 -118437311 -117905628 -116639347
6034 -116639347 -115230333 -114244932 -114206779 -115303466 -116717637 -117219893 -116383118 -114634488 -112596842
$$ packed form
6097a15326882P49956J085454R38109l9841j362689j479676n82478j85665k31036
6088a16434748q8578J61177L8026o83160r88984m44844J17100M03505J014751
6079a16905755J607071J361273M81301k33750p98180j516720j935208j354849
6071a19294817l1199R95824J063801Q03539R89072J184371R23585M71195J38604
6062a12756025j44564n41056r52301q13572m30386r4102L6121k63701o23377q06997
6052a17389960r56985o15964K87665Q01016L76768j89656m79528q74695q23402
6043a19864741j24805O18018R73595O67854j6952m45838k44442N31683J266281
6034a16639347J409014R85401L8153j096687j414171n02256Q36775J748630K037646
$$ plain form
6025 -112596842 -110876349 -109699228 -109104842 -109146734 -109589921 -109868261 -109867157 -110274041 -111492660
6016 -111492660 -112650000 -112637681 -111506890 -109810637 -108266302 -107809168 -108560143 -110086038 -111790388
6007 -111790388 -113199349 -114503764 -115811149 -116683273 -116986101 -117182296 -117441094 -117774547 -118135325
5998 -118135325 -118266763 -118141319 -117651497 -116685956 -115265136 -113340750 -111419055 -110344239 -110424243
5989 -110424243 -111228178 -112258539 -113621262 -115105858 -115769440 -115081029 -113412534 -111552320
5981 -111552320 -109677113 -108088566 -107340965 -107310321 -107667194 -108271958 -108669422 -108860305 -109309693
5972 -109309693 -110147771 -111072874 -112092564 -113474132 -115173910 -116802169 -117509846 -116960486 -115587734
5963 -115587734 -114151830 -113124438 -112689189 -112943932 -113774976 -114925726 -116266513 -117585893
$$ packed form
6025a12596842J720493J177121N94386m1892m43187k78340J104m06884j218619
6016a11492660j157340J2319J130791J696253J544335M57134p50975j525895j704350
6007a11790388j408961j304415j307385q72124l02828j96195k58798l33453l60778
5998a18135325j31438J25444M89822R65541J420820J924386J921695J074816q0004
5989a10424243q03935j030361j362723j484596o63582O88411J668495J860214
5981a11552320J875207J588547P47601L0644l56873o04764l97464j90883m49388
5972a09309693q38078r25103j019690j381568j699778j628259p07677N49360J372752
5963a15587734J435904J027392M35249k54743q31044j150750j340787j319380
$$ plain form
5955 -117585893 -118579844 -119152257 -119408682 -119405010 -119097986 -118478895 -117752436 -117633383 -118611260 -119643699
5945 -119643699 -119408290 -118055907 -116542221 -115642258 -115861305 -117220028 -118937991 -119903898 -119836182
5936 -119836182 -119181386 -118169370 -117002400 -116009566 -115299211 -114739421 -114095812 -113220601 -112398195
5927 -112398195 -112300595 -113227799 -114311674 -114611471 -114490843 -114300341 -113678447 -112718606 -111438428
5918 -111438428 -109960962 -108765982 -107814283 -106944378 -106414981 -106935821 -109119545 -112585793 -115880058
5909 -115880058 -117528053 -117578515 -117234811 -117391907 -117701361 -117475180 -116756295 -115714682 -114816134
5900 -114816134 -114714968 -115529315 -116989402 -118392009 -118877240 -118726075 -118952919 -119685370 -120300918
5891 -120300918 -120582140 -120666006 -120331791 -119511570 -118571106 -117868302 -117374850 -116773581 -116217544
$$ packed form
5955a17585893r93951n72413k56425L672L07024O19091P26459J19053r77877j032439
5945a19643699K35409J352383J513686Q99963k19047j358723j717963r65907O7716
5936a19836182O54796J012016J166970R92834P10355N59790O43609Q75211Q22406
5927a12398195R7600r27204j083875k99797J20628J90502O21894R59841J280178
5918a11438428J477466J194980R51699Q69905N29397n20840k183724l466248l294265
5909a15880058j647995n0462L43704j57096l09454K26181P18885J041613Q98548
5900a14816134J01166q14347j460087j402607m85231J51165k26844p32451o15548
5891a20300918k81222q3866L34215Q20221R40464P02804M93452O01269N56037
$$ plain form
5882 -116217544 -116323092 -117602913 -119497578 -121122859 -122112878 -122028308 -120857121 -119642687 -118995571
5873 -118995571 -118491336 -117566446 -116724824 -117019405 -118677708 -120836821 -122478653 -123561825 -124101181
5864 -124101181 -124003819 -123659218 -123410319 -123325649 -122893573 -121604114 -119441905 -116585018 -113349995
5855 -113349995 -110310122 -107908365 -106287398 -105729065 -106651657 -108899599 -111195719 -112680596
5847 -112680596 -113477762 -113980501 -114402384 -114754747 -114932623 -114833038 -114558552 -114383100 -114041312
5838 -114041312 -113046212 -111693678 -110366758 -109411061 -109384100 -110288756 -111642952 -112686032 -112823854
5829 -112823854 -112118188 -110827198 -109019263 -107219351 -106470482 -107223834 -108883578 -110917738
5821 -110917738 -112483227 -112761488 -112274944 -112147726 -112676205 -113420187 -113770270 -113103538 -111200842
$$ packed form
5882a16217544j05548j279821j894665j625281r90019Q4570J171187J214434O47116
5873a18995571N04235R24890Q41622k94581j658303k159113j641832j083172n39356
5864a24101181R7362L44601K48899Q4670M32076J289459K162209K856887L235023
5855a13349995L039873K401757J620967N58333r22592k247942k296120j484877
5847a12680596p97166n02739m21883l52363j77876R9585K74486J75452L41788
5838a14041312R95100J352534J326920R55697K6961r04656j354196j043080j37822
5829a12823854P05666J290990J807935J799912P48869p53352j659744k034160
5821a10917738j565489k78261M86544J27218n28479p43982l50083O66732J902696
$$ plain form
5812 -111200842 -108349168 -105491442 -103538625 -102703112 -102779714 -103354047 -104301634 -105723295 -107157828
5803 -107157828 -108053283 -108481618 -108930351 -110118582 -112225821 -114382450 -115423816 -115130238 -114452476
5794 -114452476 -114106016 -113926245 -113564086 -113398991 -113753071 -114193772 -114361627 -114428235 -114602223
5785 -114602223 -114584957 -113978557 -113052902 -112575112 -112436162 -112198818 -111750373 -110834294 -109724322
5776 -109724322 -108957021 -108613882 -108556032 -108637988 -109103696 -110092700 -111476472 -113193554 -114774818
5767 -114774818 -115642603 -115787980 -115570366 -115360195 -115751311 -116942692 -117958347 -117878067 -116964891
5758 -116964891 -115914537 -115367541 -115824463 -117285076 -118648279 -118807421 -117798244 -116201646
5750 -116201646 -114399170 -112399742 -110480205 -109321289 -109247110 -110020262 -111101143 -112192310
$$ packed form
5812a11200842K851674K857726J952817Q35513p6602n74333r47587j421661j434533
5803a07157828q95455m28335m48733j188231k107239k156629j041366K93578O77762
5794a14452476L46460J79771L62159J65095l54080m40701j67855o6608j73988
5785a14602223J7266O06400R25655M77790J38950K37344M48445R16079J109972
5776a09724322P67301L43139N7850q1956m65708r89004j383772j717082j581264
5767a14774818q67785j45377K17614K10171l91116j191381j015655Q0280R13176
5758a16964891J050354N46996m56922j460613j363203j59142J009177J596598
5750a16201646J802476J999428J919537J158916P4179p73152j080881j091167
$$ plain form
5742 -112192310 -113341637 -114570090 -115447411 -115446289 -114839260 -114225077 -113841643 -113585664 -113186867
5733 -113186867 -112758169 -112253432 -111494778 -111072561 -111115429 -110963106 -110414753 -109846399 -109468598
5724 -109468598 -109336975 -109585553 -109867183 -109874505 -109869552 -110213843 -110846286 -111369420 -111674561 -111622328
5714 -111622328 -111256418 -110769312 -109807520 -108349026 -106920777 -105734025 -104890884 -104635607 -104775836
5705 -104775836 -105204679 -105955159 -106819739 -107918804 -109784868 -112190315 -113837450 -114756015 -115862016
5696 -115862016 -116543668 -116208921 -115540816 -115035019 -114692657 -114569279 -114467578 -114127674 -114153627
5687 -114153627 -115008712 -115774563 -115703217 -115208792 -115073022 -115888294 -117175992 -117844761 -117426381
5678 -117426381 -115987613 -114259923 -113222283 -113022042 -113082405 -112996567 -112922420 -113275247 -113849039
$$ packed form
5742a12192310j149327j228453q77321J122O07029O14183L83434K55979L98797
5733a13186867M28698N04737P58654M22217m2868J52323N48353N68354L77801
5724a09468598J31623k48578k81630p322M953l44291o32443n23134l05141N2233
5714a11622328L65910M87106R61792J458494J428249J186752Q43141K55277j40229
5705a04775836m28843p50480q64580j099065j866064k405447j647135r18565j106001
5696a15862016o81652L34747O68105N05797L42362J23378J01701L39904k5953
5687a14153627q55085p65851P1346M94425J35770q15272j287698o68769M18380
5678a17426381J438768J727690J037640K00241o0363Q5838P4147l52827n73792
$$ plain form
5669 -113849039 -114437467 -115218123 -116118661 -116850401 -117036681 -116719954 -116214687 -115802444 -115610532
5660 -115610532 -115735522 -116212859 -116895850 -117270183 -116956405 -116102134 -115067462 -113945663 -112593964
5651 -112593964 -110832330 -109049821 -108312830 -109061835 -110433601 -111428836 -111915029 -112505934 -113177414
5642 -113177414 -113784300 -114547745 -115498234 -116605138 -117731347 -118806025 -119294736 -118736534 -117629061
5633 -117629061 -116962287 -117345532 -118512426 -119628281 -120286098 -120746945 -120900118 -120441050 -119922568
5624 -119922568 -119746830 -119662941 -119534761 -119271868 -118586716 -117785546 -117780020 -118484724 -119045044 -119281554
5614 -119281554 -119281897 -119456681 -120415988 -121582086 -121484591 -120053076 -118178729 -116570471 -115535660
5605 -115535660 -114760861 -114461584 -115151198 -116732174 -118590282 -119769093 -119713803 -118413748 -116106387
$$ packed form
5669a13849039n88428p80656r00538p31740j86280L16727N05267M12243J91912
5660a15610532j24990m77337o82991l74333L13778Q54271J034672J121799J351699
5651a12593964J761634J782509P36991p49005j371766r95235m86193n90905o71480
5642a13177414o06886p63445r50489j106904j126209j074678m88711N58202J107473
5633a17629061O66774l83245j166894j115855o57817m60847j53173M59068N18482
5624a19922568J75738Q3889J28180K62893O85152Q01170N526p04704n60320k36510
5614a19281554l43j74784r59307j166098R7495J431515J874347J608258J034811
5605a15535660P74799K99277o89614j580976j858108j178811N5290J300055K307361
$$ plain form
5596 -116106387 -113502381 -111224783 -109478679 -108505807 -108492047 -109068492 -110027915 -111330229 -112777511
5587 -112777511 -114096591 -114788442 -115031548 -115018148 -114442193 -113449459 -112560581 -112214129 -112364279
5578 -112364279 -112764558 -113382696 -114420988 -115293272 -114866928 -113600078 -112591588 -111871729 -111214415
5569 -111214415 -110811246 -110615383 -110457897 -110396109 -110730435 -111889110 -113367365 -114193176 -114086928
5560 -114086928 -113337059 -112463585 -112064239 -112578956 -113543129 -114374602 -115079431 -115710380 -115892278
5551 -115892278 -115593914 -115106627 -114337161 -113319633 -112410288 -111855908 -111730709 -111592205 -110914379
5542 -110914379 -109808527 -108826167 -108518059 -108894632 -109691672 -111184617 -113058483 -114402997 -114923551
5533 -114923551 -114831122 -114323015 -113649915 -113344685 -113320824 -113331938 -113798627 -114889694 -116247928
$$ packed form
5596a16106387K604006K277598J746104R72872J3760n76445r59423j302314j447282
5587a12777511j319080o91851k43106J3400N75955R92734Q88878L46452j50150
5578a12364279m00279o18138j038292q72284M26344J266850J008490P19859O57314
5569a11214415M03169J95863J57486O1788l34326j158675j478255q25811J06248
5560a14086928P49869Q73474L99346n14717r64173q31473p04829o30949j81898
5551a15892278K98364M87287P69466J017528R09345N54380J25199J38504O77826
5542a10914379J105852R82360L08108l76573p97040j492945j873866j344514n20554
5533a14923551R2429N08107O73100L05230K3861j1114m66689j091067j358234
$$ plain form
5524 -116247928 -117405218 -118146028 -118288699 -117491309 -116009758 -114972526 -114721894 -114469925 -113656392
5515 -113656392 -112487765 -111607090 -111388996 -111983524 -113141983 -114349849 -115307684 -116082711 -116493501
5506 -116493501 -116096443 -114986592 -113786872 -112916269 -112106400 -111511048 -111745324 -112470839 -112707371
5497 -112707371 -112019064 -110839974 -109720637 -108720387 -107853498 -107498080 -107594821 -107760007 -108270049
5488 -108270049 -109644036 -111907583 -114368523 -115987490 -115994325 -114502944 -112507506 -110926725
5480 -110926725 -110221352 -110348619 -110630386 -110100084 -108527672 -106687704 -105593218 -105267939 -105473023
5471 -105473023 -106026886 -106531912 -107137598 -108024347 -108881749 -109343532 -109331835 -109322545 -109835474 -111158732
5461 -111158732 -113024094 -114548933 -115469460 -115864701 -115918722 -115837623 -115970282 -116500946 -116714059
$$ packed form
5524a16247928j157290p40810j42671P97390J481551J037232K50632K51969Q13533
5515a13656392J168627Q80675K18094n94528j158459j207866r57835p75027m10790
5506a16493501L97058J109851J199720Q70603Q09869N95352k34276p25515k36532
5497a12707371O88307J179090J119337J000250Q66889L55418r6741j65186n10042
5488a08270049j373987k263547k460940j618967o835J491381J995438J580781
5480a10926725P05373j27267k81767N30302J572412J839968J094486L25279k05084
5471a05473023n53863n05026o05686q86749q57402m61783J1697R290n12929j323258
5461a11158732j865362j524839r20527l95241n4021Q1099j32659n30664k13113
$$ plain form
5452 -116714059 -115892706 -114248387 -112582943 -111338951 -110473851 -109702047 -109135705 -108922926 -108549889
5443 -108549889 -108008608 -107804630 -108102490 -108485193 -109003563 -110021582 -111369402 -113242668 -115814724
5434 -115814724 -117908442 -117963485 -116018162 -113777131 -112586547 -112218143 -112366264 -113440799 -115467436
5425 -115467436 -117754322 -119666797 -120807670 -120685331 -119185689 -117276199 -115808161 -115165729
5417 -115165729 -115519477 -116598171 -117984759 -119298016 -120496390 -121558804 -121849133 -121131367
5409 -121131367 -119975062 -118736711 -117150118 -115010078 -113228463 -112849968 -113620592 -114590580
5401 -114590580 -114876206 -114598158 -114293515 -113786357 -112892105 -112257859 -112321236 -112638332 -112904222
5392 -112904222 -113088900 -113251039 -113833446 -114734984 -115061613 -114221257 -112533597 -110834903 -109689352
$$ packed form
5452a16714059Q21353J644319J665444J243992Q65100P71804N66342K12779L73037
5443a08549889N41281K03978k97860l82703n18370j018019j347820j873266k572056
5434a15814724k093718n5043J945323K241031J190584L68404j48121j074535k026637
5425a15467436k286886j912475j140873J22339J499642J909490J468038O42432
5417a15165729l53748j078694j386588j313257j198374j062414k90329P17766
5409a21131367J156305J238351J586593K140040J781615L78495p70624r69988
5401a14590580k85626K78048L04643N07158Q94252O34246o3377l17096k65890
5392a12904222j84678j62139n82407r01538l26629Q40356J687660J698694J145551
$$ plain form
5383 -109689352 -109522689 -110151161 -110990004 -111808144 -112305723 -112376540 -112041342 -111789054 -111985852
5374 -111985852 -112389030 -112800347 -112906284 -112103673 -110523619 -109258076 -108761623 -108711522 -108884062
5365 -108884062 -108841365 -108178544 -107490039 -107404867 -107814008 -108756598 -110146788 -111098620 -111232186
5356 -111232186 -111032500 -110672493 -110322074 -110650984 -111759707 -113062943 -113988832 -114422103 -114474325
5347 -114474325 -114480474 -114560377 -114398216 -114003210 -113682852 -113697816 -114435804 -115822786 -117133901 -117906863
5337 -117906863 -118381060 -119120368 -120169472 -120613515 -120051455 -119357437 -118563793 -117173956 -115815359
5328 -115815359 -115532063 -116553388 -117970018 -118643504 -118253077 -117239592 -116356768 -115856952 -115223300
5319 -115223300 -113821152 -111802550 -110140522 -109520542 -109820839 -110610474 -111435202 -111862189 -112150455
$$ packed form
5383a09689352J66663o28472q38843q18140m97579p0817L35198K52288j96798
5374a11985852m03178m11317j05937Q02611J580054J265543M96453N0101j72540
5365a08884062M2697O62821O88505Q5172m09141r42590j390190r51832j33566
5356a11232186J99686L60007L50419l28910j108723j303236r25889m33271n2222
5347a14474325o149p9903J62161L95006L20358j4964p37988j386982j311115p72962
5337a17906863m74197p39308j049104m44043N62060O94018P93644J389837J358597
5328a15815359K83296j021325j416630o73486L90427J013485Q82824M99816O33652
5319a15223300J402148K018602J662028O19980l00297p89635q24728m26987k88266
$$ plain form
5310 -112150455 -112977165 -114237501 -115055583 -115102821 -114785386 -114523745 -114624951 -115061897 -115234422
5301 -115234422 -114850237 -114420715 -114275465 -113961696 -113236221 -112511933 -112284753 -112443722 -112074165
5292 -112074165 -110877736 -109739870 -109424753 -109646470 -109994965 -110572453 -111340427 -112055093 -112666472
5283 -112666472 -113112270 -113304616 -113061204 -112398176 -111979681 -111920055 -111707120 -111406936 -111520274
5274 -111520274 -112154662 -113052615 -113998103 -115113322 -116070148 -116230648 -115694403 -114813473 -113685676
5265 -113685676 -112558949 -111778728 -111336136 -110930874 -110579934 -111077450 -112760798 -114683889 -115632246
5256 -115632246 -115274498 -113983575 -112315395 -110874023 -110107202 -110205774 -110875286 -111325841 -110992343
5247 -110992343 -110208023 -109745858 -109924187 -110656918 -111428953 -111631352 -111232171 -110519164 -109695969
$$ packed form
5310a12150455q26710j260336q18082m7238L17435K61641j01206m36946j72525
5301a15234422L84185M29522J45250L13769P25475P24288K27180j58969L69557
5292a12074165J196429J137866L15117k21717l48495n77488p67974p14666o11379
5283a12666472m45798j92346K43412O63028M18495N9626K12935L00184j13338
5274a11520274o34388q97953r45488j115219r56826j60500N36245Q80930J127797
5265a13685676J126727P80221M42592M05262L50940m97516j683348j923091r48357
5256a15632246L57748J290923J668180J441372P66821r8572o69512m50555L33498
5247a10992343P84320M62165j78329p32731p72035k02399L99181P13007Q23195
$$ plain form
5238 -109695969 -109246081 -109227012 -108857724 -107455510 -105590102 -104394460 -104036192 -104147735 -104375810
5229 -104375810 -104601215 -104636839 -104526715 -104918828 -105981652 -106804373 -106727735 -106196828 -105821102
5220 -105821102 -105969432 -106813903 -108108558 -109348737 -110085734 -110288935 -110454315 -110793645 -110827745
5211 -110827745 -110354514 -110021645 -110761262 -112435075 -113795385 -114349918 -114765184 -115478186 -116339289
5202 -116339289 -116951354 -117105551 -116923078 -116635679 -116192358 -115449845 -114233574 -112533261 -110809356
5193 -110809356 -109331044 -108312666 -108344988 -109349758 -110402366 -111220166 -112299118 -113641224
5185 -113641224 -114577514 -114584907 -113695060 -112449822 -111552841 -110969869 -110360895 -109686602 -109293061
5176 -109293061 -109549553 -110213126 -110359316 -109330962 -107919459 -107525921 -108281221 -109109428 -109881043
$$ packed form
5238a09695969M49888J9069L69288J402214J865408J195642L58268j11543k28075
5229a04375810k25405l5624J10124l92113j062824q22721P6638N30907L75726
5220a05821102j48330q44471j294655j240179p36997k03201j65380l39330l4100
5211a10827745M73231L32869p39617j673813j360310n54533m15266p13002q61103
5202a16339289o12065j54197J82473K87399M43321P42513J216271J700313J723905
5193a10809356J478312J018378l2322j004770j052608q17800j078952j342106
5185a13641224r36290p393Q89847J245238Q96981N82972O08974O74293L93541
5176a09293061k56492o63573j46190J028354J411503L93538p55300q28207p71615
$$ plain form
5167 -109881043 -110920317 -111456213 -110668689 -109116367 -108044277 -108229138 -110000417 -112639316
5159 -112639316 -114777520 -115667676 -115390916 -114246182 -112883649 -112092302 -111977169 -112245506 -112674465
5150 -112674465 -113081222 -113524544 -114345670 -115220623 -115583272 -115454159 -114981238 -114186109 -113079502
5141 -113079502 -112037833 -111184845 -110215849 -109384683 -109225887 -109910354 -111193915 -112387606 -112891763
5132 -112891763 -113049415 -113248627 -113509611 -113845230 -114018647 -113755603 -113033037 -112358758 -112472448
5123 -112472448 -112950314 -113090758 -113259636 -113852941 -114961845 -116491154 -117869060 -118581564 -118713382
5114 -118713382 -118643725 -118384755 -117997094 -117680666 -117232731 -116347164 -115466318 -114912675 -114112223
5105 -114112223 -112670490 -111099821 -110189924 -109798425 -108770575 -106582799 -104275719 -102972954
$$ packed form
5167a09881043j039274n35896P87524J552322J072090j84861j771279k638899
5159a12639316k138204q90156K76760J144734J362533P91347J15133k68337m28959
5150a12674465m06757m43322q21126q74953l62649J29113M72921P95129J106607
5141a13079502J041669Q52988R68996Q31166J58796o84467j283561j193691n04157
5132a12891763j57652j99212k60984l35619j73417K63044P22566O74279j13690
5123a12472448m77866j40444j68878n93305j108904j529309j377906p12504j31818
5114a18713382O9657K58970L87661L16428M47935Q85567Q80846N53643Q00452
5105a14112223J441733J570669R09897L91499J027850K187776K307080J302765
$$ plain form
5097 -102972954 -102673722 -102595000 -102071327 -101317138 -101140449 -101981022 -103254149 -104093522 -104456102
5088 -104456102 -104830754 -105582299 -106228258 -106489557 -106735403 -106802694 -106161096 -104888852 -104365686
5079 -104365686 -105200864 -106287210 -106898436 -107195348 -107399467 -107439311 -107406281 -107791535 -108945780
5070 -108945780 -110431905 -111377743 -111715005 -111909112 -111978850 -111946313 -111873924 -111260382 -109836107
5061 -109836107 -108276291 -107188938 -107038469 -108246908 -110264563 -111641142 -111755399 -111204001
5053 -111204001 -110629959 -110160256 -109567684 -108675604 -107596040 -106868235 -106580640 -106478490 -107197588
5044 -107197588 -108908269 -110461444 -111229498 -111087537 -110387744 -110280326 -111415024 -112891447 -113334500
5035 -113334500 -112204690 -110457419 -109745091 -110419887 -111790792 -113404434 -115008842 -116123278
$$ packed form
5097a02972954K99232P8722N23673P54189J76689q40573j273127q39373l62580
5088a04456102l74652p51545o45959k61299k45846o7291O41598J272244N23166
5079a04365686q35178j086346o11226k96912k04119l9844L3030l85254j154245
5070a08945780j486125r45838l37262j94107o9738L2537P2389O13542J424275
5061a09836107J559816J087353J50469j208439k017655j376579j14257N51398
5053a11204001N74042M69703N92572Q92080J079564P27805K87595J02150p19098
5044a07197588j710681j553175p68054J41961O99793J07418j134698j476423m43053
5035a13334500J129810J747271P12328o74796j370905j613642j604408j114436
$$ plain form
5027 -116123278 -116564077 -116753588 -116746838 -116562180 -116324629 -116093169 -115836374 -115502412 -115093100 -114251982
5017 -114251982 -112652870 -111082709 -110631041 -111076914 -111497728 -111573508 -111575806 -111583414 -111494143 -111698634
5007 -111698634 -112732560 -113957924 -114239256 -113519133 -112133784 -110807612 -110772316 -111497572 -111817981
4998 -111817981 -112000671 -112287451 -112038614 -111118517 -110307826 -110079422 -109943587 -109652896 -109669621
4989 -109669621 -110150320 -110783295 -111350751 -111815059 -112372402 -113141887 -113844011 -114437725 -114952015
4980 -114952015 -114954213 -114582467 -114296268 -113835643 -113019256 -112108279 -111584336 -111425540 -111066448 -110556962
4970 -110556962 -110013265 -109677195 -109925784 -110399173 -110460560 -110107510 -109749307 -109690926 -109900878 -110029573
4960 -110029573 -109665809 -108897307 -107983239 -107182399 -106639306 -106385117 -106732019 -107685644 -108864320
$$ packed form
5027a16123278m40799j89511O750J84658K37551K31460K56795L33962M09312Q41118
5017a14251982J599112J570161M51668m45873m20814p5780k298p608Q9271k04491
5007a11698634j033926j225364k81332P20123J385349J326172L5296p25256l20409
4998a11817981j82690k86780K48837R20097Q10691K28404J35835K90691j6725
4989a09669621m80699o32975n67456m64308n57343p69485p02124n93714n14290
4980a14952015k198L71746K86199M60625Q16387R10977N23943J58796L59092N09486
4970a10556962N43697L36070k48589m73389o1387L53050L58203N8381k09952j28695
4960a10029573L63764P68502R14068Q00840N43093K54189l46902r53625j178676
$$ plain form
4951 -108864320 -109953512 -110769425 -111398291 -112142327 -113195439 -114478988 -115841762 -116649809 -115908444
4942 -115908444 -113573633 -110502210 -108072163 -106911101 -106211151 -105310373 -104541233 -104623005 -105584112
4933 -105584112 -106978592 -108381371 -109846221 -111671611 -113351017 -114260349 -114482760 -114619238
4925 -114619238 -114595520 -114007890 -113513455 -113821190 -114752226 -115944871 -116779950 -116622064 -115598734
4916 -115598734 -114064168 -112125418 -110060469 -108398601 -107439651 -107235070 -107509917 -107764489 -107805755
4907 -107805755 -108268432 -109593268 -111534574 -113528643 -115072388 -115486247 -114163758 -111701404
4899 -111701404 -109267382 -107624943 -107251632 -108116261 -109823246 -111855293 -113448924 -114229938
4891 -114229938 -114188797 -113319648 -111946317 -110677181 -109741020 -109150451 -108794970 -108556929 -108439657
$$ packed form
4951a08864320j089192q15913o28866p44036j053112j283549j362774q08047P41365
4942a15908444K334811L071423K430047J161062O99950R00778P69140q1772r61107
4933a05584112j394480j402779j464850j825390j679406r09332k22411j36478
4925a14619238K3718N87630M94435l07735r31036j192645q35079J57886J023330
4916a15598734J534566J938750K064949J661868R58950K04581k74847k54572m1266
4907a07805755m62677j324836j941306j994069j543745m13859J322489K462354
4899a11701404K434022J642439L73311q64629j706985k032047j593631p81014
4891a14229938M1141Q69149J373331J269136R36161N90569L55481K38041J17272
$$ plain form
4882 -108439657 -108578302 -108921689 -109276155 -109576651 -109807623 -109468510 -108453691 -107961668 -108543934
4873 -108543934 -109680647 -110972784 -112127810 -112777526 -112701389 -112106567 -111341987 -110592930 -109934040
4864 -109934040 -109445421 -109585881 -110360969 -111126913 -111335727 -110848110 -110057132 -109435399 -109063689
4855 -109063689 -108849133 -108811071 -109024697 -109285077 -109205482 -108650022 -107666935 -106373499 -105186001
4846 -105186001 -104327923 -103364479 -102045380 -100786243 -100205332 -100565525 -101177030 -100962933 -99808024
4837 -99808024 -98643772 -97902065 -97307952 -96977691 -96883409 -96839359 -97123002 -98012920 -99175655
4828 -99175655 -100260744 -100853787 -100959011 -101236964 -101949367 -102583499 -102850204 -102838142 -102410099
4819 -102410099 -101532698 -100806633 -100600722 -100475060 -100156737 -99920119 -99765088 -99624339 -99283719
$$ packed form
4882a08439657j38645l43387l54466l00496k30972L39113J014819M92023n82266
4873a08543934j136713j292137j155026o49716P6137N94822P64580P49057O58890
4864a09934040M88619j40460p75088p65944k08814M87617P90978O21733L71710
4855a09063689K14556L8062k13626k60380P9595N55460R83087J293436J187498
4846a05186001Q58078R63444J319099J259137N80911l60193o11505K14097J154909
4837i9808024J164252P41707N94113L30261R4282M4050k83643q89918j162735
4828i9175655j085089n93043j05224k77953p12403o34132k66705J2062M28043
4819a02410099Q77401P26065K05911J25662L18323K36618J55031J40749L40620
$$ plain form
4810 -99283719 -98615017 -98182982 -98582186 -99484281 -100189303 -100081182 -98901685 -97372970 -96377263
4801 -96377263 -95714525 -95184005 -95315569 -96107441 -96603453 -96289936 -95879641 -96042638 -96665676
4792 -96665676 -97259904 -97546335 -97819592 -98288438 -98676887 -98993073 -99727273 -100889104 -102041483
4783 -102041483 -102770614 -102801233 -102394928 -101914445 -101485800 -101271117 -101360769 -101636374 -102213310 -102490099
4773 -102490099 -101858272 -100864785 -100362572 -100712022 -101304359 -101400566 -101210772 -100953831 -100517768
4764 -100517768 -100088468 -99787568 -99204808 -98084159 -96848879 -96087733 -96058142 -96565627 -97194091
4755 -97194091 -97656436 -97806350 -97423524 -96499206 -95296594 -93933090 -92451143 -91340394 -90848023
4746 -90848023 -90977838 -91999154 -93023158 -92572749 -90525303 -88268544 -86821694 -86231780 -86592477
$$ packed form
4810i9283719O68702M32035l99204r02095p05022J08121J179497J528715R95707
4801i6377263O62738N30520j31564p91872m96012L13517M10295j62997o23038
4792i6665676n94228k86431k73257m68846l88449l16186p34200j161831j152379
4783a02041483p29131l0619M06305M80483M28645K14683q9652k75605n76936k76789
4773a02490099O31827R93487N02213l49450n92337r6207J89794K56941M36063
4764a00517768M29300L00900N82760J120649J235280P61146K9591n07485o28464
4755i7194091m62345j49914L82826R24318J202612J363504J481947J110749M92371
4746i0848023j29815j021316j024004M50409K047446K256759J446850N89914l60697
$$ plain form
4737 -86592477 -87816388 -89160445 -90212673 -90680457 -90045186 -88520723 -87301105 -87023046 -86861826
4728 -86861826 -86743191 -87359693 -88408141 -89215980 -89457595 -89210894 -88718184 -87623106 -85923243
4719 -85923243 -84394312 -83424846 -82804282 -82340609 -81845108 -81285755 -80848644 -80121589 -78483236
4710 -78483236 -76164445 -73447684 -70033648 -66601484 -64214931 -62787369 -61713957 -60535193
4702 -60535193 -59051237 -57180142 -55239244 -54108314 -54375167 -56474289 -61192966 -68811604
4694 -68811604 -79200122 -92217784 -106733200 -120864846 -132940999 -141704463 -146453253
4687 -146453253 -147517423 -146124305 -143360419 -140007485 -136878018 -134567914 -133405434 -133358120
4679 -133358120 -133676228 -133489857 -132594015 -131636077 -131096691 -130640295 -129585606 -127904722 -126066831
$$ packed form
4737h6592477j223911j344057j052228m67784O35271J524463J219618K78059J61220
4728h6861826J18635o16502j048448q07839k41615K46701M92710J095078J699863
4719h5923243J528931R69466O20564M63673M95501N59353M37111P27055J638353
4710g8483236K318791K716761L414036L432164K386553J427562J073412J178764
4702f0535193J483956J871095J940898J130930k66853k099122m718677p618638
4694f8811604j0388518j3017662j4515416j4131646j2076153q763464m748790
4687a46453253j064170J393118K763886L352934L129467K310104J162480M7314
4679a33358120l18108J86371Q95842R57938N39386M56396J054689J680884J837891
$$ plain form
4670 -126066831 -124369676 -122906778 -121262271 -119118627 -117207281 -116399650 -116677497 -117046906
4662 -117046906 -116715448 -115800163 -114136322 -112564253 -112148672 -112273213 -112175081 -112153596 -112250855
4653 -112250855 -111581684 -109394668 -106167778 -103558207 -102630769 -103189222 -104637280 -106360714
4645 -106360714 -108010631 -109385755 -110000572 -109711679 -109000936 -108151167 -107331972 -106871390 -106769938
4636 -106769938 -106734142 -106374902 -105653084 -105091298 -105263523 -105930432 -106562784 -107408145 -108370349
4627 -108370349 -109024368 -109201466 -108887943 -108088655 -106773797 -105115964 -103332910 -101816214 -100696416
4618 -100696416 -99533053 -98107536 -96931132 -96599566 -96861825 -96858484 -96317470 -95362995 -94377975
4609 -94377975 -94284139 -95685819 -97854547 -99609065 -100220653 -99781838 -98972231 -98246398 -97691648
$$ packed form
4670a26066831J697155J462898J644507K143644J911346Q07631k77847l69409
4662a17046906L31458R15285J663841J572069M15581j24541R8132K1485r7259
4653a12250855O69171K187016L226890K609571R27438n58453j448058j723434
4645a06360714j649917j375124o14817K88893P10743Q49769Q19195M60582J01452
4636a06769938L5796L59240P21818N61786j72225o66909o32352q45361r62204
4627a08370349o54019j77098L13523P99288J314858J657833J783054J516696J119798
4618a00696416J163363J425517J176404L31566k62259L341N41014R54475R85020
4609i4377975R3836j401680k168728j754518o11588M38815Q09607P25833N54750
$$ plain form
4600 -97691648 -96999058 -95725004 -93615071 -91237046 -89399821 -87830848 -86347375 -85221565
4592 -85221565 -84588474 -84668490 -85258266 -85620255 -85072163 -83670567 -82320507 -81494875 -80402224
4583 -80402224 -78781001 -77193979 -75881091 -74865527 -74114137 -73374208 -72149529 -70357913
4575 -70357913 -68387459 -66761111 -66019876 -66470666 -67632128 -68374016 -68103575 -67071282 -65832989
4566 -65832989 -64869604 -64246528 -64037678 -64389795 -65401750 -66908925 -68246864 -69319351 -69995788
4557 -69995788 -69957955 -69417347 -68626484 -67739910 -66859286 -65983097 -65129292 -63876796 -61705575
4548 -61705575 -59762709 -59347232 -59962157 -60802004 -61626694 -62119066 -62145831 -61852804 -61058894
4539 -61058894 -60011191 -59288733 -58998588 -58769139 -58115875 -56977591 -55514295 -53695873 -51755071
$$ packed form
4600i7691648O92590J274054K109933K378025J837225J568973J483473J125810
4592h5221565O33091q0016n89776l61989N48092J401596J350060Q25632J092651
4583h0402224J621223J587022J312888J015564P51390P39929J224679J791616
4575g0357913J970454J626348P41235m50790j161462p41888K70441J032293J238293
4566f5832989R63385O23076K08850l52117j011955j507175j337939j072487o76437
4557f9995788L7833N40608P90863Q86574Q80624Q76189Q53805J252496K171221
4548f1705575J942866M15477o14925q39847q24690m92372k6765K93027P93910
4539f1058894J047703P22458K90145K29449O53264J138284J463296J818422J940802
$$ plain form
4530 -51755071 -49930272 -47973720 -45315655 -41902493 -38170925 -34589560 -31400631 -28299852
4522 -28299852 -24708044 -21137656 -18355526 -16190870 -13727011 -10287320 -6280199 -2804171
4514 -2804171 -483967 961886 1706144 958098 -2922203 -11761889 -27300648 -51091351
4506 -51091351 -83013000 -119261660 -153859854 -181964699 -201444388 -212785772 -217802905
4499 -217802905 -218124428 -214606639 -208110007 -199972045 -191597642 -183805610 -176533556 -169463070
4491 -169463070 -162549712 -155812491 -148953965 -142100513 -135757019 -129975351 -124423346 -118719882
4483 -118719882 -112575510 -106211588 -100110324 -94272502 -88020039 -80690204 -72887246 -66209868
4475 -66209868 -61073357 -56726086 -52728736 -49119340 -46296036 -46104520 -51393224 -65301709
$$ packed form
4530e1755071J824799J956552K658065L413162L731568L581365L188929L100779
4522b8299852L591808L570388K782130K164656K463859L439691M007121L476028
4514b804171K320204J445853P44258p48046l880301q839686j5538759k3790703
4506e1091351l1921649l6248660l4598194k8104845j9479689j1341384n017133
4499b17802905l21523L517789O496632Q137962Q374403P792032P272054P070486
4491a69463070O913358O737221O858526O853452O343494N781668N552005N703464
4483a18719882O144372O363922O101264N837822O252463P329835P802958O677378
4475f6209868N136511M347271L997350L609396K823304J91516n288704j3908485
$$ plain form
4467 -65301709 -89460905 -122742904 -161852503 -201630418 -236283349 -261626304 -276693927
4460 -276693927 -283261001 -283805981 -280612542 -275439574 -269249708 -262788893 -257088020 -252679970
4452 -252679970 -248935949 -245109934 -240810537 -235964505 -231129138 -226804531 -223290118 -220708265
4444 -220708265 -218555490 -216124617 -213293848 -210422772 -207601636 -204800218 -201958703 -199496340
4436 -199496340 -197868992 -196855655 -196106393 -195202222 -194095928 -193109410 -191983965 -190148764
4428 -190148764 -188018632 -186615489 -186116895 -186040771 -185605847 -184552720 -183292894 -182322659 -181757220
4419 -181757220 -181320366 -180963288 -180827410 -180728324 -180256995 -179034625 -177125415 -175491972 -175147592
4410 -175147592 -175610907 -175769256 -175279830 -174184200 -172757849 -171328940 -170066014 -169167948 -168770830
$$ packed form
4467f5301709k4159196l3281999l9109599l9777915l4652931k5342955j5067623
4460b76693927o567074n44980L193439N172968O189866O460815N700873M408050
4452b52679970L744021L826015M299397M846032M835367M324607L514413K581853
4444b20708265K152775K430873K830769K871076K821136K801418K841515K462363
4436a99496340J627348J013337P49262R04171J106294R86518J125445J835201
4428a90148764K130132J403143M98594P6124M34924J053127J259826R70235N65439
4419a81757220M36854L57078J35878R9086M71329J222370J909210J633443L44380
4410a75147592m63315j58349M89426J095630J426351J428909J262926Q98066L97118
$$ plain form
4401 -168770830 -168683834 -168602341 -168407159 -168279722 -168464517 -168609533 -168000117 -166510710 -164623550
4392 -164623550 -162922179 -161776043 -160735171 -159135139 -157575722 -156825046 -156640565 -156623032 -157034629
4383 -157034629 -157547431 -157370342 -156859141 -156778217 -156808860 -156510005 -155842664 -154818434 -153686997
4374 -153686997 -152850942 -152343039 -151959176 -151657861 -151424198 -151209578 -150605420 -149841392 -149969698
4365 -149969698 -150860784 -151360392 -150915387 -150071464 -149611572 -149768095 -149900446 -149298000 -148192919
4356 -148192919 -146924882 -146053920 -145952030 -146352538 -146804401 -147153776 -147328507 -147003664 -146443515
4347 -146443515 -146246537 -146732355 -147557046 -148247706 -148911489 -149801634 -150664137 -151045954 -150679419
4338 -150679419 -149832975 -149440447 -149711672 -150113581 -150487116 -150554320 -150132066 -149290243 -148013778
$$ packed form
4401a68770830Q6996Q1493J95182J27437j84795j45016O09416J489407J887160
4392a64623550J701371J146136J040872J600032J559417P50676J84481J7533m11597
4383a57034629n12802J77089N11201Q0924l0643K98855O67341J024230J131437
4374a53686997Q36055N07903L83863L01315K33663K14620O04158P64028j28306
4365a49969698q91086m99608M45005Q43923M59892j56523j32351O02446J105081
4356a48192919J268037Q70962J01890m00508m51863l49375j74731L24843N60149
4347a46443515J96978m85818q24691o90660o63783q90145q62503l81817L66535
4338a50679419Q46444L92528k71225m01909l73535o7204M22254Q41823J276465
$$ plain form
4329 -148013778 -146836884 -146035396 -145051847 -143802939 -143006303 -142880790 -142998054 -143200826 -143665179
4320 -143665179 -144569107 -145334001 -145641214 -146071777 -146536852 -146427061 -145691359 -144770074 -144073941
4311 -144073941 -144013694 -144636240 -145372048 -145812793 -145941988 -145665324 -145048452 -144453408 -144359247 -145247371
4301 -145247371 -146679991 -147808138 -148362213 -148524342 -148241777 -147364389 -146390449 -146132240 -146752248
4292 -146752248 -147606331 -148459299 -149141699 -149301683 -149123017 -148455781 -147178266 -146197114 -146291845
4283 -146291845 -147202775 -147800005 -147622798 -147317454 -147441318 -147770210 -147729935 -147165685 -146923867
4274 -146923867 -147649871 -148677515 -149010699 -148363082 -147012928 -145556245 -144534643 -143822434 -142807353
4265 -142807353 -141342664 -139890417 -139020685 -139084554 -140424056 -142751506 -144786947 -146164300
$$ packed form
4329a48013778J176894Q01488R83549J248908P96636J25513j17264k02772m64353
4320a43665179r03928p64894l07213m30563m65075J09791P35702R21285O96133
4311a44073941O0247o22546p35808m40745j29195K76664O16872N95044R4161q88124
4301a45247371j432620j128147n54075j62129K82565Q77388R73940K58209o20008
4292a46752248q54083q52968o82400j59984J78666O67236J277515R81152r4731
4283a46291845r10930n97230J77207L05344j23864l28892M0275N64250K41818
4274a46923867p26004j027644l33184O47617J350154J456683J021602P12209J015081
4265a42807353J464689J452247Q69732o3869j339502k327450k035441j377353
$$ plain form
4257 -146164300 -147776805 -149836390 -151301855 -151024520 -149054085 -146142247 -142969348 -140072781
4249 -140072781 -137882925 -136843897 -136860090 -137384539 -138058054 -138416308 -138175739 -137464614 -136669286
4240 -136669286 -136384736 -136623600 -136869136 -137112003 -137690386 -138768729 -139660888 -139596888 -138912816
4231 -138912816 -138504962 -138841023 -139398664 -139310927 -138725073 -138398587 -138423855 -138472440 -138612787 -138897221
4221 -138897221 -138995607 -139025384 -139301429 -139774595 -140154517 -140205781 -139967520 -139594131 -139469520 -139834050
4211 -139834050 -140344624 -140477599 -139981926 -138539202 -136165932 -133948439 -133233563 -134137988 -135543440
4202 -135543440 -136991393 -138265065 -139052749 -139458521 -139478146 -139025821 -138240699 -137603460 -137422643
4193 -137422643 -137840824 -138537917 -138822353 -138409719 -137388385 -136223014 -135517348 -135436840 -135725417
$$ packed form
4257a46164300j612505k059585j465465K77335J970435K911838L172899K896567
4249a40072781K189856J039028j6193n24449o73515l58254K40569P11125P95328
4240a36669286K84550k38864k45536k42867n78383j078343q92159O4000O84072
4231a38912816M07854l36061n57641Q7737N85854L26486k5268m8585j40347k84434
4221a38897221r8386k9777k76045m73166l79922n1264K38261L73389J24611l64530
4211a39834050n10574j32975M95673J442724K373270K217493P14876r04425j405452
4202a35543440j447953j273672p87684m05772j9625M52325P85122O37239J80817
4193a37422643m18181o97093k84436M12634J021334J165371P05666Q0508k88577
$$ plain form
4184 -135725417 -136099457 -136457281 -136972733 -137754579 -138392501 -138473796 -138064034 -137552276 -137204531
4175 -137204531 -136928735 -136643557 -136328790 -135834246 -134980421 -134097458 -133863353 -134451775 -135492981
4166 -135492981 -136224280 -136007543 -134812687 -133174289 -131978029 -131750739 -132142547 -132336123 -131926838
4157 -131926838 -131092737 -130432678 -130687783 -131758729 -132829531 -133524890 -134169107 -135318949 -136969278
4148 -136969278 -138520852 -139403940 -139611376 -139328827 -138845154 -138637570 -138423201 -138047563 -137954662
4139 -137954662 -138151880 -138069114 -137191378 -135456048 -133358617 -131688196 -130784959 -130852306 -132130253
4130 -132130253 -134381161 -137132705 -140111427 -142708496 -144463075 -145333688 -145216057 -143706071
4122 -143706071 -140962437 -138117026 -136448122 -136358850 -137028924 -137377747 -137023042 -136256362 -136023409
$$ packed form
4184a35725417l74040l57824n15452p81846o37922q1295M09762N11758L47745
4175a37204531K75796K85178L14767M94544Q53825Q82963K34105n88422j041206
4166a35492981p31299K16737J194856J638398J196260K27290l91808j93576M09285
4157a31926838Q34101O60059k55105j070946j070802o95359o44217j149842j650329
4148a36969278j551574q83088k07436K82549M83673K07584K14369L75638R2901
4139a37954662j97218Q2766Q77736J735330K097431J670421R03237o7347j277947
4130a32130253k250908k751544k978722k597069j754579q70613J17631J509986
4122a43706071K743634K845411J668904Q9272o70074l48823L54705P66680K32953
$$ plain form
4113 -136023409 -136701314 -137594477 -137907161 -137468403 -136629886 -135926095 -135878363 -136425094 -136995919
4104 -136995919 -137639762 -138677648 -139775134 -140480929 -140650795 -140366711 -139459308 -137544107 -134953674
4095 -134953674 -132637258 -131247686 -131098852 -131862556 -132505486 -132262471 -131552413 -131142896 -131100775
4086 -131100775 -131308724 -131570710 -131741808 -131907361 -131974498 -132131775 -132535587 -132918326 -133494024
4077 -133494024 -134566819 -135769985 -136525778 -136686403 -136380140 -135795638 -134757793 -133419013 -132430991
4068 -132430991 -132081085 -132220602 -132857430 -133908107 -134935154 -135334699 -135405304 -135737202 -136398999
4059 -136398999 -137200797 -137876210 -138088708 -137394606 -136174942 -135561606 -135894284 -136527956 -137333894
4050 -137333894 -138406466 -139046222 -138596544 -137573893 -136564064 -135521099 -134403199 -133642251
$$ packed form
4113a36023409o77905q93163l12684M38758Q38517P03791M7732n46731n70825
4104a36995919o43843j037886j097486p05795j69866K84084R07403J915201K590433
4095a34953674K316416J389572J48834p63704o42930K43015P10058M09517M2121
4086a31100775k07949k61986j71098j65553o7137j57277m03812l82739n75698
4077a33494024j072795j203166p55793j60625L06263N84502J037845J338780R88022
4068a32430991L49906j39517o36828j050677j027047l99545p0605l31898o61797
4059a36398999q01798o75413k12498O94102J219664O13336l32678o33672q05938
4050a37333894j072572o39756M49678J022651J009829J042965J117900P60948
$$ plain form
4042 -133642251 -133283097 -132911008 -132399986 -131848917 -131423296 -131628767 -132641541 -133691979 -133563961
4033 -133563961 -132059387 -130157296 -128540833 -127537685 -127337557 -127754556 -128594135 -129668776
4025 -129668776 -131097480 -132573652 -133818579 -134951743 -135579891 -135558565 -135157100 -134536395 -133804649
4016 -133804649 -133096576 -132696757 -132685400 -132864288 -133366502 -134095600 -134760547 -135059001 -134594596
4007 -134594596 -133337207 -132222123 -131733708 -131472985 -131463723 -132168184 -134128206 -136963971 -139845156
3998 -139845156 -142335974 -143753336 -143259763 -141421261 -139892380 -139395943 -139414918 -139621587 -140021691
3989 -140021691 -139962114 -139012184 -137699674 -136630630 -135892375 -135329975 -134879596 -134251110 -133275691
3980 -133275691 -132580415 -132257182 -131496047 -130369435 -129864785 -130344952 -131173805 -131768807 -132145147
$$ packed form
4042a33642251L59154L72089N11022N51069M25621k05471j012774j050438J28018
4033a33563961J504574J902091J616463J003148K00128m16999q39579j074641
4025a29668776j428704j476172j244927j133164o28148K1326M01465O20705P31746
4016a33804649P08073L99819J1357j78888n02214p29098o64947k98454M64405
4007a34594596J257389J115084M88415K60723R262p04461j960022k835765k881185
3998a39845156k490818j417362M93573J838502J528881M96437j8975k06669m00104
3989a40021691N9577R49930J312510J069044P38255N62400M50379O28486R75419
3980a33275691O95276L23233P61135J126612N04650m80167q28853n95002l76340
$$ plain form
3971 -132145147 -132407592 -132526667 -132724257 -132834415 -132363934 -131762538 -131394429 -130839290 -130208609
3962 -130208609 -130347606 -131264751 -132213837 -133435706 -135123705 -136343270 -136662232 -136353293 -135842164
3953 -135842164 -135153278 -134596353 -135118927 -136419446 -137055612 -136121502 -134334863 -133186633 -133673236
3944 -133673236 -135354018 -136932890 -138109026 -139045751 -139298089 -138414235 -136721198 -134951914
3936 -134951914 -133741246 -133497518 -134288585 -135349062 -135707304 -135281813 -135010887 -135266348 -135256830
3927 -135256830 -134534671 -133275379 -132201462 -132349384 -133463640 -134334482 -134206995 -133153957 -131985056
3918 -131985056 -131115502 -130506511 -130269120 -130658393 -131951384 -133851585 -135425150 -136373202 -137096569
3909 -137096569 -137748599 -138261092 -138769120 -139283081 -139199886 -137816127 -135799834 -134451323 -133624582
$$ packed form
3971a32145147k62445j19075j97590j10158M70481O01396L68109N55139O30681
3962a30208609j38997r17145r49086j221869j687999j219565l18962L08939N11129
3953a35842164O88886N56925n22574j300519o36166R34110J786639J148230m86603
3944a33673236j680782j578872j176136r36725k52338Q83854J693037J769284
3936a34951914J210668K43728p91067j060477l58242M25491K70926k55461R518
3927a35256830P22159J259292J073917j47922j114256q70842J27487J053038J168901
3918a31985056Q69554O08991K37391l89273j292991j900201j573565r48052p23367
3909a37096569o52030n12493n08028n13961Q3195J383759K016293J348511Q26741
$$ plain form
3900 -133624582 -132566662 -131109336 -129751198 -129482942 -130401447 -131761806 -132825157 -133121526
3892 -133121526 -132759517 -132023769 -131195688 -130342249 -129765258 -129726003 -130057088 -130302141 -130130737
3883 -130130737 -129471749 -128672541 -128327943 -128438885 -128574571 -128590884 -128685707 -128888502 -129087457 -129004701
3873 -129004701 -129012795 -129582760 -130638416 -131443675 -131396925 -130548736 -129117725 -127580464 -126819314
3864 -126819314 -126995388 -127328564 -127432571 -127678621 -128267436 -128907406 -129433374 -129833308 -130002811
3855 -130002811 -130037047 -129967364 -129591607 -128844916 -127772634 -126261687 -124475484 -122908392 -121910957
3846 -121910957 -121711620 -121962690 -121860382 -121112359 -120688855 -121612441 -123413121 -125097481 -126451617
3837 -126451617 -127413807 -128077921 -128884563 -129595673 -129877643 -130076700 -130059403 -129556060 -129161814
$$ packed form
3900a33624582J057920J457326J358138K68256r18505j360359j063351k96369
3892a33121526L62009P35748Q28081Q53439N76991L9255l31085k45053J71404
3883a30130737O58988P99208L44598j10942j35686j6313r4823k02795j98955Q2756
3873a29004701q094n69965j055656q05259M6750Q48189J431011J537261P61150
3864a26819314j76074l33176j04007k46050n88815o39970n25968l99934j69503
3855a30002811l4236O9683L75757P46691J072282J510947J786203J567092R97435
3846a21910957J99337k51070J02308P48023M23504r23586j800680j684360j354136
3837a26451617r62190o64114q06642p11110k81970j99057J7297N03343L94246
$$ plain form
3828 -129161814 -129156739 -129362147 -129564289 -129422869 -129133410 -128856838 -128236925 -127336447 -127015093 -127689658
3818 -127689658 -128865616 -129980955 -130741891 -130907953 -130534069 -129825009 -129070071 -128570153 -128111943
3809 -128111943 -127725812 -127751408 -128052215 -128504926 -129326567 -130101253 -130179370 -129791483 -129308890 -128612715
3799 -128612715 -127953029 -127464861 -127149126 -127231509 -127361248 -126949006 -126544758 -126533786 -126651176 -127064669
3789 -127064669 -128090600 -129491980 -130629113 -131394443 -131842005 -131769801 -131242485 -130603911 -129937852
3780 -129937852 -129465792 -129108215 -128761610 -128872606 -129583191 -130367951 -130758733 -130787687 -130586110
3771 -130586110 -129976321 -129162640 -128233641 -126900363 -125553715 -124631668 -123747888 -122698666 -121992565
3762 -121992565 -121974871 -122533092 -123340937 -124107078 -124650464 -125196659 -125839432 -126365647 -126697826
$$ packed form
3828a29161814N075k05408k02142J41420K89459K76572O19913R00478L21354o74565
3818a27689658j175958j115339p60936j66062L73884P09060P54938M99918M58210
3809a28111943L86131k5596l00807m52711q21641p74686p8117L87887M82593O96175
3799a28612715O59686M88168L15735q2383j29739M12242M04248J0972j17390m13493
3789a27064669j025931j401380j137133p65330m47562P2204N27316O38574O66059
3780a29937852M72060L57577L46605j10996p10585p84760l90782k8954K01577
3771a30586110O09789Q13681R28999J333278J346648R22047Q83780J049222P06101
3762a21992565J7694n58221q07845p66141n43386n46195o42773n26215l32179
$$ plain form
3753 -126697826 -127155081 -127927104 -128490211 -128713544 -129126724 -129923997 -130692564 -131240863 -131731951
3744 -131731951 -132245144 -132805932 -133255469 -133048975 -132078789 -130780813 -129596996 -129012732 -129085177
3735 -129085177 -129169653 -128663564 -127745651 -127169549 -127701238 -129082481 -130172969 -130593781 -130977039
3726 -130977039 -131328339 -130738304 -129276581 -127905539 -126984047 -126497271 -126377625 -126849266 -128098433
3717 -128098433 -129854048 -131612311 -132978936 -133774756 -134089009 -134014065 -133288657 -132516129 -132426513
3708 -132426513 -132908371 -133759731 -134620793 -134807816 -133917365 -132283992 -130849041 -130089272 -129791079
3699 -129791079 -129959099 -130669129 -131650609 -132627036 -133273944 -133274399 -132883496 -132817140 -133374296 -134180831
3689 -134180831 -134667898 -134731836 -134631424 -134541258 -134781098 -135347384 -135488595 -134881876 -134012622 -132861325
$$ packed form
3753a26697826m57255p72023n63107k23333m13180p97273p68567n48299m91088
3744a31731951n13193n60788m49537K06494R70186J297976J183817N84264p2445
3735a29085177q4476N06089R17913N76102n31689j381243j090488m20812l83258
3726a30977039l51300N90035J461723J371042R21492M86776J19646m71641j249167
3717a28098433j755615j758263j366625p95820l14253P4944P25408P72528Q9616
3708a32426513m81858q51360q61062j87023Q90451J633373J434951P59769K98193
3699a29791079j68020p10030r81480r76427o46908m55L90903O6356n57156q06535
3689a34180831m87067o3938J00412R0166k39840n66286j41211O06719Q69254J151297
$$ plain form
3679 -132861325 -131045481 -128878358 -127000824 -125138532 -123064059 -121791350 -121634928 -121678385
3671 -121678385 -121500977 -121355687 -121497432 -122039698 -122903413 -123519553 -123487152 -123033627 -122560752
3662 -122560752 -122857589 -124302392 -126114866 -127492692 -128364098 -128697624 -128361034 -127889834 -128045157
3653 -128045157 -128893896 -130118140 -131390271 -131973540 -131672726 -131460344 -131925503 -132655799 -133042709
3644 -133042709 -132819874 -132094280 -130947680 -129723337 -128811957 -128511602 -128914060 -129480302 -129913834
3635 -129913834 -130515518 -131190882 -131509878 -131518217 -131619849 -131759947 -131899430 -131937167 -131670069 -131246798
3625 -131246798 -130982032 -130691674 -129943828 -128945494 -128362169 -128670405 -129520108 -130256861 -130948597
3616 -130948597 -132089953 -133483179 -134653613 -135598246 -136580788 -137316073 -137042981 -136107128 -135102178
$$ packed form
3679a32861325J815844K167123J877534J862292K074473J272709J56422m3457
3671a21678385J77408J45290j41745n42266q63715o16140L2401M53525M72875
3662a22560752k96837j444803j812474j377826q71406l33526L36590M71200j55323
3653a28045157q48739j224244j272131n83269L00814K12382m65159p30296l86910
3644a33042709K22835P25594J146600J224343R11380L00355m02458n66242m33532
3635a29913834o01684o75364l18996q339j01632j40098j39483l7737K67098M23271
3625a31246798K64766K90358P47846R98334N83325l08236q49703p36753o91736
3616a30948597j141356j393226j170434r44633r82542p35285K73092R35853J004950
$$ plain form
3607 -135102178 -133863369 -132360286 -131349669 -131170734 -130938600 -130232222 -129394128 -128330550 -127083457
3598 -127083457 -126075526 -125542940 -125499008 -125882289 -126868953 -128100245 -129062988 -129608955 -129713745
3589 -129713745 -129153638 -127943209 -126813277 -126586472 -127390539 -129120019 -131251772 -133170988
3581 -133170988 -134561835 -135253214 -135657281 -136131981 -136460370 -136273484 -135695217 -135113681 -134582519
3572 -134582519 -134003733 -133841657 -134722540 -135842131 -136224773 -135637803 -134088925 -132164132 -130743002
3563 -130743002 -130506047 -131137131 -132033566 -132715966 -132940236 -132783630 -132328946 -131958450 -131901333
3554 -131901333 -132210675 -132686134 -132853696 -132591721 -132196570 -132022493 -132077526 -131987393 -131865270 -132104332
3544 -132104332 -132489648 -132656667 -132506537 -132217973 -132168812 -132555912 -133258231 -133965750 -134236841
$$ packed form
3607a35102178J238809J503083J010617J78935K32134P06378Q38094J063578J247093
3598a27083457J007931N32586M3932l83281r86664j231292r62743n45967j04790
3589a29713745N60107J210429J129932K26805q04067j729480k131753j919216
3581a33170988j390847o91379m04067m74700l28389J86886N78267N81536N31162
3572a34582519N78786J62076q80883j119591l82642N86970J548878J924793J421130
3563a30743002K36955o31084q96435o82400k24270J56606M54684L70496N7117
3554a31901333l09342m75459j67562K61975L95151J74077n5033R0133J22123k39062
3544a32104332l85316j67019J50130K88564M9161l87100p02319p07519k71091
$$ plain form
3535 -134236841 -134050748 -133934173 -134109341 -134313281 -133691769 -132190816 -130979252 -130721921 -130687244
3526 -130687244 -130138251 -129438050 -129509936 -130243237 -130546501 -129952951 -128930779 -127724509 -126563681
3517 -126563681 -126209182 -126832424 -127741345 -128248032 -128506849 -129201237 -130565867 -131968885 -132662001
3508 -132662001 -133143677 -134217274 -135458026 -135560029 -134287892 -132685196 -131535315 -130621658
3500 -130621658 -129879538 -130121437 -131524723 -133188254 -133981293 -132854983 -130102602 -127417452
3492 -127417452 -125725176 -124966008 -125305152 -126232813 -126704990 -126495726 -125911179 -125466135 -125280065
3483 -125280065 -125518881 -126403232 -127753061 -129427286 -131006440 -132128220 -132983981 -133766945 -134259450
3474 -134259450 -134165097 -133589068 -132702335 -131628933 -130363372 -129021391 -128142818 -128261574 -129393729
$$ packed form
3535a34236841J86093J16575j75168k03940O21512J500953J211564K57331L4677
3526a30687244N48993P00201p1886p33301l03264N93550J022172J206270J160828
3517a26563681L54499o23242r08921n06687k58817o94388j364630j403018o93116
3508a32662001m81676j073597j240752j02003J272137J602696J149881R13657
3500a30621658P42120k41899j403286j663531p93039J126310K752381K685150
3492a27417452J692276P59168l39144r27661m72177K09264N84547M45044J86070
3483a25280065k38816q84351j349829j674225j579154j121780q55761p82964m92505
3474a34259450R4353N76029Q86733J073402J265561J341981Q78573j18756j132155
$$ plain form
3465 -129393729 -131083135 -132640417 -133266927 -132803637 -131584099 -130278282 -129384607 -128763866 -128062287
3456 -128062287 -126893799 -125308290 -123989531 -123501374 -123864107 -124750167 -125773802 -126845511
3448 -126845511 -128006274 -128981242 -129502887 -129721441 -130021734 -130407442 -130261488 -129288153 -128304738
3439 -128304738 -128304994 -129324220 -130391074 -130581892 -130165301 -130080194 -130858970 -131964472 -132825186
3430 -132825186 -133562254 -133805373 -133071857 -131584163 -129478083 -126964661 -124533930 -122609135
3422 -122609135 -121407968 -121231186 -122169389 -123703566 -125080703 -125781166 -125751949 -125654344 -125884971
3413 -125884971 -126475033 -127600036 -129003474 -129873390 -129544877 -128399786 -127471884 -127119016 -127021609
3404 -127021609 -126904313 -126768740 -126895420 -127423176 -128244046 -129687725 -131584549 -132758033 -132801621
$$ packed form
3465a29393729j689406j557282o26510M63290J219538J305817Q93675O20741P01579
3456a28062287J168488J585509J318759M88157l62733q86060j023635j071709
3448a26845511j160763r74968n21645k18554l00293l85708J45954R73335R83415
3439a28304738k56j019226j066854j90818M16591Q5107p78776j105502q60714
3430a32825186p37068k43119P33516J487694K106080K513422K430731J924795
3422a22609135J201167J76782r38203j534177j377137p00463K9217R7605k30627
3413a25884971n90062j125003j403438q69916L28513J145091R27902L52868R7407
3404a27021609J17296J35573j26680n27756q20870j443679j896824j173484m3588
$$ plain form
3395 -132801621 -132382889 -131772474 -130781355 -129404455 -128014159 -127201775 -127419175 -128262191 -129403085
3386 -129403085 -130515355 -131193003 -131347922 -130896246 -129340118 -127211326 -125927676 -125853132 -126375820
3377 -126375820 -126942781 -127736824 -128595292 -128728621 -128152127 -127431318 -127004527 -126991612 -127414782
3368 -127414782 -128473620 -130000422 -131180681 -131480715 -130744059 -129398823 -128360208 -128213503
3360 -128213503 -128872919 -129637036 -129941690 -129926638 -129932366 -129917328 -129318988 -128139981 -127279094 -127010254
3350 -127010254 -127022506 -127221568 -127639017 -128114780 -128526733 -128830225 -128945812 -128779791 -128624990
3341 -128624990 -128749433 -129048570 -129209112 -128968308 -128234721 -127293044 -126484625 -125859340 -125352062
3332 -125352062 -125173835 -125426784 -126101737 -127540923 -129653256 -131831386 -133490907 -134315801 -134467449
$$ packed form
3395a32801621M18732O10415R91119J376900J390296Q12384k17400q43016j140894
3386a29403085j112270o77648j54919M51676J556128K128792J283650P4544n22688
3377a26375820n66961p94043q58468j33329N76494P20809M26791J2915m23170
3368a27414782j058838j526802j180259l00034P36656J345236J038615J46705
3360a28213503o59416p64117l04654J5052n728J5038N98340J179007Q60887K68840
3350a27010254j2252j99062m17449m75763m11953l03492j15587J66021J54801
3341a28624990j24443k99137j60542K40804P33587R41677Q08419O25285N07278
3332a25352062J78227k52949o74953j439186k112333k178130j659521q24894j51648
$$ plain form
3323 -134467449 -134222412 -133837477 -133476128 -133102144 -132491772 -131436811 -130206899 -129372561 -129404589
3314 -129404589 -130049782 -130437443 -130419525 -130695302 -131815499 -133501876 -134762059 -134853533 -134186737
3305 -134186737 -134012736 -134805237 -135874163 -136374555 -136610552 -137115297 -137249291 -136305788 -135042669
3296 -135042669 -134623893 -134907361 -134966474 -134310625 -132955614 -131406573 -130160007 -129258779 -128639923
3287 -128639923 -128173023 -127906271 -127607190 -126853660 -125511677 -123804442 -122297349 -121613396 -122075030
3278 -122075030 -123556665 -125676454 -127810833 -129332038 -130321768 -131453221 -132784649 -133732831
3270 -133732831 -133837334 -133251668 -132414387 -131730523 -131367010 -131643216 -132854949 -134494235 -135892737
3261 -135892737 -136778305 -137207254 -137226638 -137276398 -137668350 -137692323 -136958674 -136131651 -135865397 -136109824
$$ packed form
3323a34467449K45037L84935L61349L73984O10372J054961J229912Q34338l2028
3314a29404589o45193l87661J7918k75777j120197j686377j260183r1474O66796
3305a34186737J74001p92501j068926n00392k35997n04745j33994R43503J263119
3296a35042669M18776k83468n9113O55849J355011J549041J246566R01228O18856
3287a28639923M66900K66752K99081P53530J341983J707235J507093O83953m61634
3278a22075030j481635k119789k134379j521205r89730j131453j331428r48182
3270a33732831j04503N85666Q37281O83864L63513k76206j211733j639286j398502
3261a35892737q85568m28949j9384m9760l91952k3973P33649Q27023K66254k44427
$$ plain form
3251 -136109824 -136336276 -136007814 -134943256 -133289859 -131097465 -128914452 -128118555 -129048190 -130326437
3242 -130326437 -130677326 -130199611 -129639964 -129463012 -129522572 -129290174 -128898769 -128710882 -128254465
3233 -128254465 -127098251 -125546889 -124054271 -123312964 -123230791 -123228554 -123319500 -123585961 -124017136
3224 -124017136 -124997920 -127062850 -129624625 -131145134 -130769011 -128962671 -126920003 -125624141
3216 -125624141 -125370162 -125687085 -126318902 -127141754 -127738637 -128010785 -128511776 -129363710 -129620995
3207 -129620995 -129289587 -129069341 -128843575 -128519333 -128029378 -127285500 -126387839 -125589947 -125307185
3198 -125307185 -125842771 -126975295 -128071741 -128775688 -129177142 -129862550 -130995536 -132002499 -132593610
3189 -132593610 -132672694 -132042020 -130882609 -129667561 -128463771 -127404391 -126386026 -125061787
$$ packed form
3251a36109824k26452L28462J064558J653397K192394K183013P95897r29635j278247
3242a30326437l50889M77715N59647J76952n9560K32398L91405J87887M56417
3233a28254465J156214J551362J492618P41307Q2173K237r0946k66461m31175
3224a24017136r80784k064930k561775j520509L76123J806340K042668J295862
3216a25624141K53979l16923o31817q22852n96883k72148n00991q51934k57285
3207a29620995L31408K20246K25766L24242M89955P43878Q97661P97892K82762
3198a25307185n35586j132524j096446p03947m01454o85408j132986j006963n91111
3189a32593610p9084O30674J159411J215048J203790J059380J018365J324239
$$ plain form
3181 -125061787 -124046380 -124389329 -125883655 -127407199 -128553324 -129512395 -130251699 -130401214 -129740735
3172 -129740735 -128492259 -127254937 -126431965 -126059450 -125962840 -125865055 -125865793 -126254874 -126869250 -127273918
3162 -127273918 -127651021 -128172951 -128169051 -126982957 -124862124 -122878952 -121705796 -121497590 -122282804
3153 -122282804 -123546180 -124840288 -126564608 -128785600 -130579305 -131143352 -130204639 -128248249
3145 -128248249 -126212856 -124715031 -123929285 -123450336 -122940159 -122624947 -122836279 -123303006 -123731954
3136 -123731954 -124308910 -124864677 -125531281 -126503013 -127505662 -128359385 -129292197 -130366399 -131073804
3127 -131073804 -130980723 -130564479 -130338310 -130255500 -130258252 -130582485 -131191608 -132041384 -133394127 -134847247
3117 -134847247 -135560246 -135405737 -134525824 -132992395 -131527326 -131339572 -132394885 -133198095 -132827125
$$ packed form
3181a25061787J015407l42949j494326j523544j146125r59071p39304j49515O60479
3172a29740735J248476J237322Q22972L72515R6610R7785p38l89081o14376m04668
3162a27273918l77103n21930L900J186094K120833J983172J173156K08206p85214
3153a22282804j263376j294108j724320k220992j793705n64047R38713J956390
3145a28248249K035393J497825P85746M78949N10177L15212k11332m66727m28948
3136a23731954n76956n55767o66604r71732j002649q53723r32812j074202p07405
3127a31073804R3081M16244K26169Q2810k752l24233o09123q49776j352743j453120
3117a34847247p12999J54509Q79913J533429J465069J87754j055313q03210L70970
$$ plain form
3108 -132827125 -131747568 -130591511 -129765330 -129885544 -130770593 -131231832 -130951289 -130788087 -131262599
3099 -131262599 -131442253 -130669122 -129801263 -129308987 -128678127 -127964899 -127474320 -126947848 -126294400
3090 -126294400 -125991812 -126609078 -128300900 -130806285 -133219357 -134982890 -136243612 -137280844
3082 -137280844 -137912996 -138090715 -137894953 -136887455 -134977286 -132579647 -130145873 -128226626
3074 -128226626 -127137412 -126117275 -125294576 -125925796 -127734864 -129438422 -130724427 -131540156
3066 -131540156 -131566016 -130899961 -130304506 -130211022 -130532191 -130809201 -130498756 -129516720 -128325417
3057 -128325417 -127292361 -126325735 -125662518 -125443570 -125108396 -124652672 -124861347 -125844678 -127134419
3048 -127134419 -128382144 -129613301 -131059248 -132602774 -133914113 -134773453 -134984153 -134994247 -135726589
$$ packed form
3108a32827125J079557J156057Q26181j20214q85049m61239K80543J63202m74512
3099a31262599j79654P73131Q67859M92276O30860P13228M90579N26472O53448
3090a26294400L02588o17266j691822k505385k413072j763533j260722j037232
3082a37280844o32152j77719J95762J007498J910169K397639K433774J919247
3074a28226626J089214J020137Q22699o31220j809068j703558j286005q15729
3066a31540156k5860O66055N95455R3484l21169k77010L10445R82036J191303
3057a28325417J033056R66626O63217K18948L35174M55724k08675r83331j289741
3048a27134419j247725j231157j445947j543526j311339q59340k10700j0094p32342
$$ plain form
3039 -135726589 -137226066 -138465162 -138723651 -138129652 -137017081 -135731573 -134315973 -132801189
3031 -132801189 -131590723 -130838397 -130476692 -130426671 -130580380 -131095648 -131819844 -132415227 -133019322
3022 -133019322 -133684663 -134073787 -134193102 -134309176 -134017671 -132741499 -131139644 -130615116 -131394905
3013 -131394905 -132601549 -133596054 -134156307 -134113322 -134084064 -134567307 -135204390 -135674130 -135567861
3004 -135567861 -134848802 -133804803 -132529102 -131312480 -129977093 -128198486 -126372266 -124886277
2996 -124886277 -123681197 -122717910 -122171628 -122279345 -122389262 -122194031 -122760786 -124987386 -128226316
2987 -128226316 -131148486 -132739831 -133130556 -133135093 -133286952 -133820236 -134583454 -134936751 -134523076
2978 -134523076 -133883681 -133679887 -133909823 -134515202 -135222391 -135531543 -135158967 -133726795 -131708134
$$ packed form
3039a35726589j499477j239096k58489N93999J112571J285508J415600J514784
3031a32801189J210466P52326L61705N0021j53709n15268p24196n95383o04095
3022a33019322o65341l89124j19315j16074K91505J276172J601855N24528p79789
3013a31394905j206644r94505n60253M2985K9258m83243o37083m69740J06269
3004a35567861P19059J043999J275701J216622J335387J778607J826220J485989
2996a24886277J205080R63287N46282j07717j09917J95231n66755k226600l238930
2987a28226316k922170j591345l90725m537j51859n33284p63218l53297M13675
2978a34523076O39395K03794k29936o05379p07189l09152L72576J432172K018661
$$ plain form
2969 -131708134 -130345377 -130222576 -131104177 -132214882 -132813319 -132669120 -131873773 -130717571 -129908570
2960 -129908570 -129728736 -129628595 -128952196 -127935534 -126969610 -125855547 -124583587 -123835468 -124095369
2951 -124095369 -124943905 -125785400 -126594921 -127530135 -128653279 -130194050 -132255187 -134245475 -135589026
2942 -135589026 -135968000 -135120476 -133403944 -131564184 -130069433 -129033308 -128579776 -128694258 -129076592
2933 -129076592 -129247622 -128683303 -127481957 -126408460 -125900316 -125953972 -126475833 -127486539 -128975863
2924 -128975863 -130586329 -131951904 -132768210 -133005099 -133095123 -133379463 -133903868 -134108723 -133499994
2915 -133499994 -132508173 -131610685 -130605158 -129373499 -128471554 -128408183 -129129745 -130485404 -131997383
2906 -131997383 -132990246 -133462534 -133703290 -133642891 -133324008 -133320708 -133457588 -132997072 -132124534 -131123397
$$ packed form
2969a31708134J362757J22801q81601j110705n98437J44199P95347J156202Q09001
2960a29908570J79834J00141O76399J016662R65924J114063J271960P48119k59901
2951a24095369q48536q41495q09521r35214j123144j540771k061137j990288j343551
2942a35589026l78974Q47524J716532J839760J494751J036125M53532j14482l82334
2933a29076592j71030N64319J201346J073497N08144n3656n21861j010706j489324
2924a28975863j610466j365575q16306k36889r0024k84340n24405k04855O08729
2915a33499994R91821Q97488J005527J231659R01945O3371p21562j355659j511979
2906a31997383r92863m72288k40756O0399L18883L300j36880M60516Q72538J001137
$$ plain form
2896 -131123397 -130201009 -130198703 -130868858 -130975723 -130650412 -130485803 -130047781 -129120832 -128303465 -128089503
2886 -128089503 -128616280 -129385712 -129763298 -129959070 -130686826 -131945644 -132931918 -133500546 -134304251
2877 -134304251 -135219234 -135540469 -134950669 -133804352 -132691590 -131385812 -129517461 -127605509
2869 -127605509 -126609904 -126686417 -127278789 -128022445 -128497670 -128651144 -128901107 -129436075 -130213176
2860 -130213176 -131291105 -132403086 -133074226 -133073731 -132696903 -132581279 -132610258 -132393677 -132113032 -131796960
2850 -131796960 -131551873 -131320920 -130828332 -130075245 -128912154 -127715376 -127060723 -126772392 -126368614
2841 -126368614 -125773156 -124917992 -123984564 -123633573 -124175024 -125340664 -126446526 -126814456 -126528394
2832 -126528394 -126216421 -126416670 -127140779 -128224844 -129403483 -130092603 -130210192 -130223966 -130606171
$$ packed form
2896a31123397R22388K306o70155j06865L25311J64609M38022R26949Q17367K13962
2886a28089503n26777p69432l77586j95772p27756j258818r86274n68628q03705
2877a34304251r14983l21235N89800J146317J112762J305778J868351J911952
2869a27605509R95605p6513n92372p43656m75225j53474k49963n34968p77101
2860a30213176j077929j111981o71140M95L76828J15624k8979K16581K80645L16072
2850a31796960K45087K30953M92588P53087J163091J196778O54653K88331M03778
2841a26368614N95458Q55164R33428L50991n41451j165640j105862l67930K86062
2832a26528394L11973k00249p24109j084065j178639o89120j17589j3774l82205
$$ plain form
2823 -130606171 -131863651 -133854730 -135492877 -135786610 -134505876 -132221115 -129779529 -128034751
2815 -128034751 -127545100 -128192123 -129226560 -129991925 -130515404 -130868581 -130696883 -129770873 -128038705
2806 -128038705 -125515269 -123132160 -122183851 -122660076 -124010311 -126339253 -129156369 -131468928
2798 -131468928 -132916509 -133774756 -134305279 -134282366 -133954641 -133865723 -133922812 -133768310 -133829659 -134834825
2788 -134834825 -136246476 -137384316 -138363355 -139117075 -139467458 -139356336 -139040926 -138959769 -139194822
2779 -139194822 -139477018 -139174671 -137768907 -135609329 -133798659 -132902897 -132610142 -132602805 -133036439
2770 -133036439 -133757807 -134566816 -135634349 -136889340 -137763862 -137903560 -137481631 -136480279 -135313235
2761 -135313235 -134691030 -134669000 -134920121 -135291437 -135953595 -137255666 -139050186 -140491880 -140896423
$$ packed form
2823a30606171j257480j991079j638147k93733J280734K284761K441586J744778
2815a28034751M89651o47023j034437p65365n23479l53177J71698R26010J732168
2806a28038705K523436K383109R48309m76225j350235k328942k817116k312559
2798a31468928j447581q58247n30523K2913L27725Q8918n7089J54502o1349j005166
2788a34834825j411651j137840r79039p53720l50383J11122L15410Q1157k35053
2779a39194822k82196L02347J405764K159578J810670Q95762K92755P337m33634
2770a33036439p21368q09009j067533j254991q74522j39698M21929J001352J167044
2761a35313235O22205K2030k51121l71316o62158j302071j794520j441694m04543
$$ plain form
2752 -140896423 -140006882 -138085222 -136266017 -134995235 -134009984 -133709908 -134393788 -135281346 -135610497
2743 -135610497 -135620658 -135898032 -136398199 -136631406 -136332368 -135190826 -133465150 -132273401 -131630110
2734 -131630110 -130522528 -128543615 -126386208 -125086397 -124907590 -125169814 -125288238 -125434491 -126180810
2725 -126180810 -127657781 -129344912 -130947775 -132300541 -132738091 -132443826 -131908793 -131154053 -130236403
2716 -130236403 -129495645 -128847567 -128003150 -127546963 -128091194 -129126087 -130004878 -130705367 -131278332
2707 -131278332 -131747132 -132496055 -134108758 -136539246 -138876379 -140353357 -140696934 -140165643 -139822858
2698 -139822858 -140201729 -140474962 -139800534 -138336580 -136567291 -134580140 -132454693 -130686448
2690 -130686448 -129642353 -129327174 -129183494 -128687225 -128154370 -127987270 -128608036 -129921922 -131083601
$$ packed form
2752a40896423Q89541J921660J819205J270782R85251L00076o83880q87558l29151
2743a35610497j0161k77374n00167k33207K99038J141542J725676J191749O43291
2734a31630110J107582J978913K157407J299811J78807k62224j18424j46253p46319
2725a26180810j476971j687131j602863j352766m37550K94265N35033P54740R17650
2716a30236403P40758O48078Q44417M56187n44231j034893q78791p00489n72965
2707a31278332m68800p48923j612703k430488k337133j476978l43577N31291L42785
2698a39822858l78871k73233O74428J463954J769289J987151K125447J768245
2690a30686448J044095L15179J43680M96269N32855J67100o20766j313886j161679
$$ plain form
2681 -131083601 -131684606 -131701763 -131028151 -130039843 -129461231 -129511703 -129564449 -128962227 -127739685 -126515961
2671 -126515961 -125899223 -126094831 -126956067 -128101884 -129366403 -130314091 -130381695 -129883417 -129474173
2662 -129474173 -129452887 -129784942 -130549022 -131939080 -133541041 -134788499 -135375410 -135177824 -134427964
2653 -134427964 -133464092 -132699374 -132027457 -130819410 -128983088 -127289615 -126250122 -125903290 -126239656
2644 -126239656 -126949968 -127653551 -128157004 -128575997 -129128503 -129864552 -130361620 -130609558 -131120024
2635 -131120024 -132016001 -132908112 -133343806 -133241825 -133320330 -133724392 -133966782 -134124801 -134324348
2626 -134324348 -134392381 -134429491 -134654375 -134929847 -134858698 -134406349 -134064870 -134050831 -134265890 -134561432
2616 -134561432 -134657282 -134119919 -132845838 -131184282 -129666486 -129241662 -129926398 -130924806 -131601731
$$ packed form
2681a31083601o01005j7157O73612R88308N78612n0472n2746O02222J222542J223724
2671a26515961O16738j95608q61236j145817j264519r47688o7604M98278M09244
2662a29474173K1286l32055p64080j390058j601961j247458n86911J97586P49860
2653a34427964R63872P64718O71917J208047J836322J693473J039493L46832l36366
2644a26239656p10312p03583n03453m18993n52506p36049m97068k47938n10466
2635a31120024q95977q92111m35694J01981p8505m04062k42390j58019j99547
2626a34324348o8033l7110k24884k75472P1149M52349L41479J4039k15059k95542
2616a34561432r5850N37363J274081J661556J517796M24824o84736r98408o76925
$$ plain form
2607 -131601731 -131897965 -132272089 -132576153 -132435590 -132178612 -131969676 -131730289 -131364081 -130691955
2598 -130691955 -129401677 -128059992 -127385869 -126825248 -126019889 -124976917 -123608923 -122195952
2590 -122195952 -121501511 -121955939 -123145454 -123952944 -123990993 -124250673 -125229663 -126340614 -126980005
2581 -126980005 -127476347 -128122895 -128652371 -129079074 -129697789 -130531052 -131218509 -131721044 -132153384
2572 -132153384 -132487242 -132984693 -134083409 -135690742 -137291342 -138390571 -138594710 -137960280 -137193935
2563 -137193935 -136581631 -136190014 -136403406 -137202120 -137979334 -138452525 -138963629 -139770958 -140479237
2554 -140479237 -140292679 -138913081 -136793295 -134572754 -132606421 -130962251 -129978190 -130061565 -131011022
2545 -131011022 -132204267 -133140286 -133828092 -134280980 -134175785 -133423517 -132213198 -130807894 -129834331
$$ packed form
2607a31601731k96234l74124l04064J40563K56978K08936K39387L66208O72126
2598a30691955J290278J341685O74123N60621Q05359J042972J367994J412971
2590a22195952O94441m54428j189515q07490l8049k59680r78990j110951o39391
2581a26980005m96342o46548n29476m26703o18715q33263o87457n02535m32340
2572a32153384l33858m97451j098716j607333j600600j099229k04139O34430P66345
2563a37193935O12304L91617k13392p98714p77214m73191n11104q07329p08279
2554a40479237J86558J379598K119786K220541J966333J644170R84061q3375r49457
2545a31011022j193245r36019o87806m52888J05195P52268J210319J405304R73563
$$ plain form
2536 -129834331 -129627436 -129898982 -130514802 -131229465 -131604753 -131303058 -130241358 -129008049 -128349356
2527 -128349356 -128381567 -128806585 -129084394 -128716848 -127656322 -126391319 -125569059 -125047136 -124492171
2518 -124492171 -124041850 -123869741 -123951726 -124256284 -124559792 -124510686 -124128841 -123766843 -123749079 -124007281
2508 -124007281 -124300905 -124629654 -125064362 -125787960 -126890468 -127977765 -128642101 -128828450 -128720683
2499 -128720683 -128613741 -129140514 -130529611 -132024449 -132798908 -132764810 -132500218 -132595512 -132809964
2490 -132809964 -132499378 -131332451 -129629267 -128085784 -127240907 -127372791 -128136574 -128831363 -129487090
2481 -129487090 -130413175 -131309170 -131506993 -130513487 -128802684 -127425164 -126896265 -127349656 -128371406
2472 -128371406 -129263988 -129805361 -130504984 -131798091 -133160528 -133945469 -133978948 -133325077 -132146867
$$ packed form
2536a29834331K06895k71546o15820p14663l75288L01695J061700J233309O58693
2527a28349356l2211m25018k77809L67546J060526J265003Q22260N21923N54965
2518a24492171M50321J72109q1985l04558l03508M9106L81845L61998J7764k58202
2508a24007281k93624l28749m34708p23598j102508j087297o64336j86349J07767
2499a28720683J06942n26773j389097j494838p74459L4098K64592r5294k14452
2490a32809964L10586J166927J703184J543483Q44877j31884p63783o94789o55727
2481a29487090r26085q95995j97823R93506J710803J377520N28899m53391j021750
2472a28371406q92582n41373o99623j293107j362437p84941l3479O53871J178210
$$ plain form
2463 -132146867 -130342786 -128017976 -125894286 -124439613 -123522631 -123070333 -122975816 -123144144 -123815336
2454 -123815336 -125227292 -126778047 -127357831 -127338740 -127608651 -128308288 -129598220 -131267531 -132849400
2445 -132849400 -134079844 -134550426 -134244278 -134162959 -135001327 -136134257 -136721428 -136669779 -136226218
2436 -136226218 -135346820 -134249609 -133574817 -133884187 -134779011 -135372715 -135276098 -134746295 -134259342
2427 -134259342 -134417619 -135184675 -135693964 -135513972 -134858392 -134105654 -133240348 -132330683 -131395610
2418 -131395610 -130356944 -129698583 -129409160 -128677598 -127551160 -126778252 -126154511 -125222686 -124034352
2409 -124034352 -123155965 -123043620 -124025135 -126189735 -128732619 -131363973 -133811018 -135020835
2401 -135020835 -134686608 -133288217 -131598713 -130659325 -130685963 -130893492 -131140824 -132130613 -133937878
$$ packed form
2463a32146867J804081K324810K123690J454673R16982M52298R4517j68328o71192
2454a23815336j411956j550755n79784J9091k69911o99637j289932j669311j581869
2445a32849400j230444m70582L06148Q1319q38368j132930n87171N1649M43561
2436a36226218Q79398J097211O74792l09370q94824n93704R6617N29803M86953
2427a34259342j58277p67056n09289J79992O55580P52738Q65306R09665R35073
2418a31395610J038666O58361K89423P31562J126438P72908O23741R31825J188334
2409a24034352Q78387J12345r81515k164600k542884k631354k447045j209817
2401a35020835L34227J398391J689504R39388k6638k07529k47332r89789j807265
$$ plain form
2392 -133937878 -135811269 -136950054 -136940748 -136225429 -135409300 -134828495 -134743387 -134917403 -135198870
2383 -135198870 -135715599 -136058074 -135675571 -134693234 -133825159 -133472072 -133652273 -134158112 -134643286
2374 -134643286 -134547619 -133839894 -133137560 -132714725 -132562851 -132450160 -132108901 -131430743 -130626873
2365 -130626873 -130078818 -129953920 -130270986 -130739762 -131080467 -131735108 -133031894 -134424620 -135371068
2356 -135371068 -135713697 -135718928 -135331927 -134341245 -133231636 -132660136 -133083129 -134355669 -135891577
2347 -135891577 -136870146 -136739906 -135700792 -134381878 -133383996 -132955311 -132630389 -131913317 -131164406
2338 -131164406 -131152341 -131916080 -132619212 -132793575 -132916564 -133169202 -133420712 -133593714 -133339810
2329 -133339810 -132301554 -130837590 -129918437 -129827164 -130421971 -131369594 -132109635 -132224079 -131601434
$$ packed form
2392a33937878j873391j138785R306P15319Q16129N80805Q5108j74016k81467
2383a35198870n16729l42475L82503R82337Q68075L53087j80201n05839m85174
2374a34643286R5667P07725P02334M22835J51874J12691L41259O78158Q03870
2365a30626873N48055J24898l17066m68776l40705o54641j296786j392726r46448
2356a35371068l42629n231L87001R90682J109609N71500m22993j272540j535908
2347a35891577r78569J30240J039114J318914R97882M28685L24922P17072P48911
2338a31164406J2065p63739p03132j74363j22989k52638k51510j73002K53904
2329a33339810J038256J463964R19153R1273n94807r47623p40041j14444O22645
$$ plain form
2320 -131601434 -130002059 -127769376 -125818378 -124887503 -125321973 -126662803 -128382589 -130307181
2312 -130307181 -132103008 -133464463 -133976531 -133461749 -132806344 -132742414 -132921222 -132963048 -132975965
2303 -132975965 -132987471 -132554652 -131614724 -130222019 -128547810 -127616827 -127997781 -129088123 -129802394
2294 -129802394 -129832843 -129296837 -128236853 -127467917 -127420212 -127476195 -127251565 -127402458 -128674841
2285 -128674841 -130814386 -133296513 -135712749 -137731592 -138821937 -138631994 -137216866 -135115764
2277 -135115764 -133298446 -132311102 -131775627 -131263724 -131421699 -132609624 -133521253 -133483842 -133316312
2268 -133316312 -133824213 -134694217 -134831926 -133978255 -132553700 -131087143 -130041287 -129227356 -128098833
2259 -128098833 -126761322 -125811481 -125663157 -126203562 -126903144 -127736113 -129024622 -130836433 -132607031
$$ packed form
2320a31601434J599375K232683J950998R30875m34470j340830j719786j924592
2312a30307181j795827j361455n12068N14782O55405O3930j78808m1826j2917
2303a32975965j1506M32819R39928J392705J674209R30983l80954j090342p14271
2294a29802394l0449N36006J059984P68936M7705n5983K24630j50893j272383
2285a28674841k139545k482127k416236k018843j090345J89943J415128K101102
2277a35115764J817318R87344N35475N11903j57975j187925r11629L7411J67530
2268a33316312n07901q70004j37709Q53671J424555J466557J045856Q13931J128523
2259a28098833J337511R49841J48324n40405o99582q32969j288509j811811j770598
$$ plain form
2250 -132607031 -133594069 -133380962 -132366551 -131668869 -131781939 -132588162 -134097196 -136168658 -137961951
2241 -137961951 -138925019 -138883908 -137938571 -136583771 -135061901 -133317751 -131518084 -130262175 -130198782
2232 -130198782 -131690857 -134091662 -136031205 -136538330 -135915164 -135184023 -135026799 -135196148 -134509023
2223 -134509023 -132678268 -131243868 -131047061 -131581214 -132008352 -131715098 -130876672 -129984249 -129365392
2214 -129365392 -129178255 -129380473 -130218093 -132353969 -135302443 -137421930 -137456929 -135991970 -134822601
2205 -134822601 -134586298 -134876485 -135152819 -135193708 -134879914 -134343983 -133940880 -134165148 -134938566
2196 -134938566 -135599384 -135695677 -135278859 -134678028 -134098022 -133884786 -134080219 -134160442 -133703375 -132741711
2186 -132741711 -132145292 -132783530 -134036506 -134913565 -135191565 -134990228 -134346658 -133063622 -131114322
$$ packed form
2250a32607031r87038K13107J014411O97682j13070q06223j509034k071462j793293
2241a37961951r63068M1111R45337J354800J521870J744150J799667J255909O3393
2232a30198782j492075k400805j939543n07125O23166P31141J57224j69349O87125
2223a34509023J830755J434400J96807n34153m27138K93254Q38426Q92423O18857
2214a29365392J87137k02218q37620k135876k948474k119487l4999J464959J169369
2205a34822601K36303k90187k76334m0889L13794N35931M03103k24268p73418
2196a34938566o60818r6293M16818O00831N80006K13236j95433q0223M57067R61664
2186a32741711N96419o38238j252976q77059k78000K01337O43570J283036J949300
$$ plain form
2177 -131114322 -129626948 -129850160 -131561696 -133600195 -134831269 -134895603 -134703883 -134985440 -135423750
2168 -135423750 -135597946 -135606859 -135670904 -135644958 -135473011 -134959093 -133867297 -132517508 -131712440 -132200776
2158 -132200776 -133578927 -134605732 -134835465 -135075969 -135889052 -137021313 -137679402 -137284213 -136221623
$$ packed form
2177a31114322J487374k23212j711536k038499j231074o4334J91720k81557m38310
2168a35423750j74196q913o4045K5946J71947N13918J091796J349789Q05068m88336
2158a32200776j378151j026805k29733k40504q13083j132261o58089L95189J062590
$$ [...]
##END NTUPLES=NMR SPECTRUM
##END=
