##TITLE=C13_DE-75k_TFA2
 CDCl3, 22000sc

 27.11.2024
##JCAMPDX= 6.0         $$ Bruker NMR JCAMP-DX V2.0
##DATA TYPE= NMR SPECTRUM
##DATA CLASS= NTUPLES
##ORIGIN= UXNMR, Bruker Analytische Messtechnik GmbH
##OWNER= root
$$ XWIN-NMR		Version 3.5
$$ Thu Nov 28 13:39:46 2024 Russian Standard Time (UT+4h)  she@DPX200
##.OBSERVE FREQUENCY= 50.327896
##.OBSERVE NUCLEUS= ^13C
##.ACQUISITION MODE= SIMULTANEOUS
##.ACQUISITION SCHEME= undefined
##.AVERAGES= 18890
##.DIGITISER RES= 17
##SPECTROMETER/DATA SYSTEM= spect
##.PULSE SEQUENCE= zgpg30
##.SOLVENT NAME= CDCl3
##.SHIFT REFERENCE= (INTERNAL, CDCl3, 0, 222.565)
##AUDIT TRAIL= $$ (NUMBER, WHEN, WHO, WHERE, WHAT)
$$ ##TITLE= Audit trail, XWIN-NMR		Version 3.5
$$ ##JCAMPDX= 5.01
$$ ##ORIGIN= Bruker BioSpin GmbH
$$ ##OWNER= she
$$ F:/spectra/data/she/nmr/c13/1/pdata/1/auditp.txt
$$ ##AUDIT TRAIL=  $$ (NUMBER, WHEN, WHO, WHERE, WHAT)
(   1,<2024-11-28 10:41:01.45 +0400>,<she>,<DPX200>,
      <created by zg, POWCHK disabled, PULCHK disabled
       terminated by command 'halt'
       configuration hash MD5:
       00 E9 B6 7A A2 85 ED C7 34 08 36 98 17 FE 4E 26
       data hash MD5: 32K
       A9 2D 1D 68 3F 09 DE 02 35 7E F9 C8 B0 24 47 1D>)
(   2,<2024-11-28 13:36:59.04 +0400>,<she>,<DPX200>,
      <Start of raw data processing
       efp BC_mod = 2 LB = 2 FT_mod = 6 PKNL = 1 PHC0 = -535.337 PHC1 = 13.08832 SI = 32K 
       data hash MD5: 32K
       BD B3 B7 08 25 91 58 09 AC 02 BD 32 F9 B5 4B 99>)
(   3,<2024-11-28 13:37:01.78 +0400>,<she>,<DPX200>,
      <abs ABSG = 5 
       data hash MD5: 32K
       11 5F 45 84 0A 0D 46 1A 2D 6C 97 4E 1E 19 0D 5C>)
(   4,<2024-11-28 13:37:22.70 +0400>,<she>,<DPX200>,
      <pk PHC0 = 0.1310221 PHC1 = 1.2 
       data hash MD5: 32K
       68 D7 E6 CD B3 43 0A F4 3D 74 2E 54 4E ED 48 88>)
(   5,<2024-11-28 13:37:26.40 +0400>,<she>,<DPX200>,
      <abs ABSG = 5 
       data hash MD5: 32K
       B1 3C A4 B0 58 E2 FD 21 30 6F 70 BE 34 9B 5F 71>)
(   6,<2024-11-28 13:37:52.14 +0400>,<she>,<DPX200>,
      <pk PHC0 = -15.84852 PHC1 = 24.60001 
       data hash MD5: 32K
       04 DC 75 6B 4F 52 81 FF 74 E1 C3 21 9B B1 1E 17>)
(   7,<2024-11-28 13:37:55.67 +0400>,<she>,<DPX200>,
      <abs ABSG = 5 
       data hash MD5: 32K
       63 73 52 73 25 B8 4F AA 1E 68 1A 5E EC 0F 35 4E>)
$$ ##END=
$$ 
$$ hash MD5
$$ F3 F2 36 83 40 2C 2E 1D 7A DE AB 67 A5 34 15 FD
##$RELAX= 
##$RELAX= 
##$RELAX= 
##$RELAX= 
##$RELAX= 
##$RELAX= 
##$RELAX= 
##$RELAX= 
$$ Bruker specific parameters
$$ --------------------------
##$DU= <F:/spectra>
##$EXPNO= 1
##$NAME= <c13>
##$PROCNO= 1
##$TYPE= <nmr>
##$USER= <she>
##$AMP= (0..31)
100 100 100 100 100 100 100 100 100 100 100 100 100 100 100 100 100 100 
100 100 100 100 100 100 100 100 100 100 100 100 100 100 
##$AQSEQ= 0
##$AQ_mod= 1
##$AUNM= <au_zg>
##$AUTOPOS= <>
##$BF1= 50.322709
##$BF2= 200.13
##$BF3= 50.322709
##$BF4= 500.13
##$BF5= 500.13
##$BF6= 500.13
##$BF7= 500.13
##$BF8= 500.13
##$BYTORDA= 1
##$CFDGTYP= 0
##$CFRGTYP= 5
##$CHEMSTR= <none>
$$ [...]
##$SUBNAM4= <"">
##$SUBNAM5= <"">
##$SUBNAM6= <"">
##$SUBNAM7= <"">
##$SUBNAM8= <"">
##$SUBNAM9= <"">
##$SW= 239.972175391363
##$SWIBOX= (0..15)
0 1 3 0 0 0 0 0 0 0 0 0 0 0 0 0 
##$SW_h= 12077.2946859903
##$TD= 32768
##$TD0= 1
##$TE= 0
##$TE2= 300
##$TE3= 300
##$TEG= 300
##$TL= (0..7)
120 120 120 120 120 120 120 120 
##$TP= (0..7)
150 150 150 150 150 150 150 150 
##$TP07= 0
##$TPNAME0= <>
##$TPNAME1= <>
##$TPNAME2= <>
##$TPNAME3= <>
##$TPNAME4= <>
##$TPNAME5= <>
##$TPNAME6= <>
##$TPNAME7= <>
##$TPOAL= (0..7)
0.5 0.5 0.5 0.5 0.5 0.5 0.5 0.5 
##$TPOFFS= (0..7)
0 0 0 0 0 0 0 0 
##$TUNHIN= 0
##$TUNHOUT= 0
##$TUNXOUT= 0
##$USERA1= <user>
##$USERA2= <user>
##$USERA3= <user>
##$USERA4= <user>
##$USERA5= <user>
##$V9= 5
##$VALIST= <valist>
##$VCLIST= <CCCCCCCCCCCCCCC>
##$VD= 0
##$VDLIST= <DDDDDDDDDDDDDDD>
##$VPLIST= <PPPPPPPPPPPPPPP>
##$VTLIST= <TTTTTTTTTTTTTTT>
##$WBST= 1024
##$WBSW= 4
##$XGAIN= (0..3)
0 0 0 0 
##$XL= 0
##$YL= 0
##$YMAX_a= 29436301
##$YMIN_a= -113506217
##$ZGOPTNS= <>
##$ZL1= 120
##$ZL2= 120
##$ZL3= 120
##$ZL4= 120
##$ABSF1= 222.5654
##$ABSF2= -17.4314
##$ABSG= 5
##$ABSL= 3
##$ALPHA= 0
##$AQORDER= 0
##$ASSFAC= 0
##$ASSFACI= 0
##$ASSFACX= 0
##$ASSWID= 0
##$AUNMP= <proc_1d>
##$AZFE= 0.1
##$AZFW= 0.5
##$BCFW= 0
##$BC_mod= 2
##$BYTORDP= 0
##$COROFFS= 0
##$CY= -3
##$DATMOD= 1
##$DC= 0
##$DFILT= <>
##$DTYPP= 0
##$F1P= 0
##$F2P= 0
##$FCOR= 0.5
##$FTSIZE= 32768
##$FT_mod= 6
##$GAMMA= 0
##$GB= 0
##$INTBC= 1
##$INTSCL= 4.134877e-10
##$ISEN= 128
##$LB= 2
##$LEV0= 0
##$LPBIN= 0
##$MAXI= 10000
##$MC2= 0
##$MEAN= 0
##$ME_mod= 0
##$MI= 0.1934396
##$NCOEF= 0
##$NC_proc= 2
##$NLEV= 6
##$NOISF1= 120.0001
##$NOISF2= 80.00006
##$NSP= 0
##$NTH_PI= 0
##$NZP= 0
##$OFFSET= 222.5654
##$PC= 1.4
##$PHC0= -551.0544
##$PHC1= 38.88833
##$PH_mod= 1
##$PKNL= yes
##$PPARMOD= 0
##$PSCAL= 0
##$PSIGN= 0
##$REVERSE= no
##$SF= 50.3227345484362
##$SI= 32768
##$SIGF1= 140
##$SIGF2= 120
##$SINO= 11.81781
##$SIOLD= 32768
##$SREGLST= <13C.CDCl3>
##$SSB= 0
##$STSI= 32768
##$STSR= 0
##$SW_p= 12077.2946859903
##$SYMM= 0
##$S_DEV= 0
##$TDeff= 32768
##$TDoff= 0
##$TI= <>
##$TILT= no
##$TM1= 0
##$TM2= 0
##$TOPLEV= 0
##$USERP1= <user>
##$USERP2= <user>
##$USERP3= <user>
##$USERP4= <user>
##$USERP5= <user>
##$WDW= 1
##$XDIM= 32768
##$YMAX_p= 301897626
##$YMIN_p= -1709282
$$ End of Bruker specific parameters
$$ ---------------------------------
##NTUPLES= NMR SPECTRUM
##VAR_NAME=  FREQUENCY,     SPECTRUM/REAL,   SPECTRUM/IMAG
##SYMBOL=    X,             R,               I
##VAR_TYPE=  INDEPENDENT,   DEPENDENT,       DEPENDENT
##VAR_FORM=  AFFN,          ASDF,            ASDF
##VAR_DIM=   32768,         32768,           32768
##UNITS=     HZ,            ARBITRARY UNITS, ARBITRARY UNITS
##FACTOR=    0.368581032318806, 1,           1
##FIRST=     11200.0995020947, 0,            0
##LAST=      -877.195183895579, 0,           0
##MIN=       -877.195183895579, -1709282,    0
##MAX=       11200.0995020947, 301897626,    0
$$ Real data points
##PAGE= N=1
##DATA TABLE= (X++(R..R)), XYDATA
$$ [...]
15966C56416k3399m693k6639m2298o6223q2268j0797Q0425Q7372n458j24011j68695
15954c0268j30198m8689M215j7319l4557L7661J01204R2843J07153J38024J69855
15943C89924K11238J69601J5565q8578l8964Q1144J71809J21239o8803k20703
15933G43472k29991j60482r5496n3391p411J1400r677k7830k5246k9266k8010
15922H8072N2747J41325J23596M863o7749l4663M259l5281j02397j26160j19748
15911g1136n1197P9180J13330J242p9422n1802j3491Q344J7019j4409l7699j8108
15899a18149n983n5463r7892o6632l7959m8053l0130O76K2871M8537N3669K6196
15887c08312k2272p1980p3875l7817N437O6000J01160J29377J79304K31957K43181
$$ y = [356416, 333017, 328324, 301685, 259387, 193164, 110896, 100099, 180524, 267896, 262438, 138427, -30268, -160466, -209155, -204940, -222259, -256816, -219155, -117951, -25108, 82045, 220069, 389924, 601162, 770763, 786328, 697750, 658786, 739930, 911739, 1032978, 964175, 743472, 513481, 352999, 257503, 204112, 196701, 208101, 198424, 170594, 145348, 116082, 88072, 140819, 282144, 405740, 410603, 342854, 308191, 312450, 277169, 174772, 48612, -71136, -122333, -43153, 70177, 71419, -8003, -59805, -73296, -64952, -47933, -62342, -100041, -118149, -124132, -179595, -277487, -344119, -382078, -430131, -460261, -459585, -436714, -388177, -334508, -308312, -330584, -402564, -476439, -514256, -508819, -442819, -341659, -212282, -32978, 198979, 442160]
15876D42160J41727k4778j30121j72916j46771m5556j6284r3659j43624j25321
15866c15143p4569r128L9961N9927O0662L6904o60n439o925n4869q7801n8275
15854d15355J7793P5757J03714J06900O6128K9084J6355q427k3526p632J7780
15843b1429O6071R1278N1974k7831q1724m1859K4553L8094k2483j10632j54158
15832a88146j08396q621N5172Q2694P3872M2258N180m2271o0245k4422J3157j4812
15820a74580r0151j60078j84542j41895l0056P2120P1735L7284M4543N3421O8476
15809d33723J24682J50905J01397O160o0467p2516q3627m1605O6809R2777M8428
15798a00780N6316J18150J77894J70675N2098o5550k5253J24188J68454M7049
$$ y = [442160, 583887, 559109, 428988, 256072, 109301, 63745, 47461, -46198, -189822, -315143, -389712, -398840, -358879, -298952, -238290, -201386, -202046, -207485, -214410, -269279, -357080, -415355, -397562, -321805, -218091, -111191, -45063, -15979, 376, -8051, -31577, -39209, -21429, 44642, 135920, 187894, 160063, 78339, 36480, 61033, 99127, 76644, -33988, -188146, -296542, -305163, -249991, -167297, -93425, -51167, -45987, -88258, -148503, -172925, -159768, -174580, -264731, -424809, -609351, -751246, -781302, -709182, -637447, -600163, -555620, -502199, -433723, -309041, -158136, -56739, -50579, -111046, -183562, -267189, -308794, -241985, -149208, -100780, -44464, 73686, 251580, 422255, 474353, 408803, 383550, 507738, 676192, 723241]
15788G23241p5495j32907j68917j79209j42631m2865L7910L5516j6827m1613r829
15777a3626L4706K4465j0191k1854j5254L1941N3789R183o85Q7221J75885J59782
15765E15362R3017K4488o8129j75319k43395k88988k87452k07873j09391m6834
15755g94514k2630l623J8549l4228q4301J2032J46844K07340K24626K33523J55520
15744E9138J4050r9019j23062p6220k4994o963m6665j24419j88955j92102j52199
15733i61410j06468m6880L1267Q0787J24449J70756J72256K00932K81631L18114
15723B65434L07592K73364J41541j7512p3544p7198p7579p8204n4837l1465o6986
15712E10606j25926j65514j96582j92891j58520j25298p9415l5181j1277l107
$$ y = [723241, 647746, 514839, 345922, 166713, 24082, -18783, 19127, 54643, 37816, -3797, -13626, 21080, 45545, 35354, 13500, -1754, 30187, 83976, 93159, 92474, 179695, 355580, 515362, 608379, 632867, 564738, 389419, 146024, -142964, -430416, -638289, -747680, -794514, -817144, -820767, -802218, -836446, -920747, -908715, -761871, -554531, -329905, -96382, 59138, 73188, -25831, -148893, -225113, -250107, -257070, -303735, -428154, -617109, -809211, -961410, -1067878, -1114758, -1083491, -1002704, -878255, -707499, -535243, -334311, -52680, 265434, 573026, 846390, 987931, 970419, 896875, 819677, 742098, 663894, 609057, 577592, 510606, 384680, 219166, 22584, -170307, -328827, -454125, -533540, -568721, -579998, -583105]
15702e83105J2042O8743R7397Q8370Q0628Q7441J09494Q7516Q21p6637j06563
15691a33853j38183j49067r5718j6286Q0327J79355J76342P5586J1487o826m8266
15680f5102p1148n7778m8526q5713j10511j7066J60803K61448K02109L9722r6126
15669A12112j71099k43444k81949k15276n9441J31300K16867K01381J76622J43890
15659A0963R4022K8125o9418k03713k60606j91148j15491p2808m1194p809M6953
15648g82124J01421P9190J2914K532L8225Q1770R8030N5908J9397K9845N8174
15637b04718Q3854P8460M0886m179k4289k7574m8465o5386m5280N02M0168L8898
15625a37123K9397O1218Q8919O2063j2246q3581o8210K8323J01677Q3176J7776
$$ y = [-583105, -571063, -502320, -404923, -316553, -235925, -148484, -38990, 48526, 49347, -27290, -133853, -272036, -421103, -516821, -533107, -452780, -273425, -97083, -21497, -10010, -16836, -65102, -136250, -194028, -242554, -328267, -438778, -455844, -295041, -33593, 168516, 208238, 112112, -58987, -302431, -584380, -799656, -859097, -727797, -510930, -309549, -132927, 10963, 104985, 133110, 63692, -140021, -400627, -591775, -707266, -780074, -821268, -829077, -782124, -680703, -601513, -588599, -586067, -547842, -466072, -368042, -312134, -292737, -262892, -204718, -120864, -42404, -1518, -5697, -29986, -57560, -106025, -171411, -216691, -216189, -176021, -137123, -107726, -46508, 42411, 104474, 92228, 8647, -59563, -31240, 70437, 153613, 171389]
15614A71389J1468J0278n9159q8528j6550O2116N5392l2941q9852m9401L9575
15603A3787R3512P5479K5763L172k1588p1317r8041p2149m3994l1328R429N7807
15591e9468P1888R5379R8616K5006p1470j04984q9104j02354j45561j40675l8755
15580d61482M9640M1278L1516Q5211J33441R5678k0566j37872j84907j45944n2650
15569e66657N0010R6355Q8988R2343J21634J28570Q0117K2413m529K84M4860Q6753
15557B41141N5907j9427r830O2958Q9113K8166m7435m0745K5876O8969O6552L7482
15545E58727J2091Q989K9145j0301j13497j45378n1604L6037j217j26267j62282
15534C4443k9218R4985J32295J29080P6026j3959q9501j07741j6523J25882J48036
$$ y = [171389, 182857, 193135, 133976, 45448, 28898, 91014, 146406, 113465, 23613, -25788, 13787, 107299, 182778, 208541, 211713, 190125, 118808, 20767, -51382, -95376, -126704, -117275, -59468, 12420, 107799, 206415, 231421, 159951, 54967, -34137, -136491, -282052, -422727, -461482, -411842, -370564, -339048, -253837, -120396, -24718, -45284, -183156, -368063, -514007, -566657, -516647, -420292, -331304, -238961, -117327, 11243, 91360, 113773, 109244, 109528, 154388, 241141, 297048, 277621, 267791, 330749, 419862, 448028, 400593, 359848, 385724, 454693, 521245, 558727, 570818, 579807, 608952, 598651, 485154, 339776, 288172, 324209, 322992, 196725, 34443, 5225, 100210, 232505, 361585, 437611, 423652, 334151, 226410, 209887, 335769, 483805]
15523D83805L2149o7457j28659j47969r5614M571P1676M4235k096J269L7445O3609
15511B96964M3068l9186j08230o6143N7724J29819J15847Q4342M3837m5268j01740
15500D11034p1749J299N1104K3227n5557r2311l2315O7977P4981m9011j10795
15489B17884l3213N5015J00648R4379P3401K4654j08983k40787k39006j36834
15479a92842m2636J4647K8374p502n2568n6449l2140l6923l4522L0379J41328
15468b40854K23989K08502J20423L0159K2875j976j03053j45280q7168K315k4909
15457E023j44787k32058k40307j42071j3853M6059N2364K8756M281J7431Q2728
15446e36434J80955K21659J81115J07397L7168L1824P1776Q0237O8214L9358N733
$$ y = [483805, 515954, 448497, 319838, 171869, 76255, 80826, 152502, 196737, 194641, 195910, 233355, 296964, 340032, 300846, 192616, 126473, 184197, 314016, 429863, 514205, 558042, 512774, 411034, 339285, 340584, 391688, 414915, 359358, 267047, 234732, 302709, 377690, 328679, 217884, 184671, 239686, 340334, 434713, 508114, 532768, 423785, 182998, -56008, -192842, -235478, -220831, -192457, -199959, -252527, -308976, -341116, -378039, -412561, -382182, -240854, -16865, 191637, 312060, 342219, 365094, 363118, 260065, 114785, 27617, 29932, 5023, -139764, -371822, -612129, -754200, -768053, -721994, -669630, -640874, -636593, -619162, -536434, -355479, -133820, 47295, 154692, 191860, 223684, 295460, 375697, 443911, 483269, 489002]
15435D89002k0748l6388l3340j9847K7546R9340J80994J66887J5033j11610j42639
15424F14230j39254j32396j09578n9159k7079m0848p7528r4681q1960m6320n0103
15413b44676p2197o4862o4383p2843o1718L0253J25443Q4958j3793j3759P0055
15402b97522J30528J18691N8213L87m2117n1461k9610l5938l7324n6090j20601
15391c62844j28514k9843R3882J89687K22187J73887R6335j1070j67092k84005
15381b07390k48634j18016k3382M4162J01072J12108R4746O4112J9676m0444n2406
15370b54396M8558J85383K31701J95184J14639M591j18961k46279l00055k22002
15360c61637o1743P4926J19717Q7703j2221j08079p4182l609K5747L3656J896
$$ y = [489002, 468254, 431866, 398526, 378679, 406225, 505565, 686559, 853446, 868479, 756869, 614230, 474976, 342580, 233002, 173843, 146764, 105916, 28388, -66293, -148253, -194573, -244676, -316873, -381735, -446118, -518961, -580679, -550426, -424983, -340025, -353818, -367577, -297522, -166994, -48303, 9910, 10297, -31820, -83281, -112891, -148829, -186153, -242243, -362844, -491358, -521201, -427319, -237632, -15445, 158442, 254777, 243707, 76615, -207390, -456024, -574040, -597422, -553260, -452188, -340080, -245334, -181222, -161546, -201990, -254396, -205838, -20455, 211246, 406430, 521069, 525660, 406699, 160420, -139635, -361637, -423380, -348454, -228737, -141034, -153255, -261334, -335516, -339125, -313378, -279722, -277826]
15349b77826m2710o0611o1118k5338K1096K9092L6130O9107J00935J34169J57695
15338H0621J61488J61824J41950J11732O9667R379k6552l1332o5759j11074j04246
15327C97698n8080k1299J000M194j5948j6388p229k9402o3872p2790n5869m1146
15315B0869m9639n3545m9028n5251o1165k3666M7638R6815R3940P0232Q2957J63955
15303B84112K07505R3310p5806j25013n9471l0333n4426r1632j01819r6287r7528
15292a47388n0284J6600M3495N6237O1724L6725M4382R8299R8839M636j00631
15281A62634j66190j57860r1882l1332j1777p3105j58105j37628j2879J10643
15271e67481J37742M9459q211N074J5296J4893L3836K7113l6511q6752o1751M5048
$$ y = [-277826, -320536, -381147, -442265, -467603, -446507, -417415, -381285, -312178, -211243, -77074, 80621, 242109, 403933, 545883, 657615, 727282, 736661, 710109, 678777, 613018, 501944, 397698, 339618, 318319, 319319, 323513, 307565, 291177, 283948, 254546, 190674, 117884, 62015, 20869, -28770, -82315, -131343, -186594, -247759, -271425, -223787, -126972, -33032, 37200, 120157, 284112, 491617, 584927, 509121, 384108, 324637, 294304, 239878, 148246, 46427, -49860, -147388, -197672, -181072, -137577, -81340, -19616, 17109, 61491, 159790, 258629, 263265, 162634, -3556, -161416, -253298, -284630, -296407, -369512, -527617, -665245, -678124, -567481, -429739, -380280, -388491, -383417, -368121, -353228, -319392, -292279, -328790, -415542, -477293, -432245]
15259d32245J65004J90586J01998l1591r3242n2960r075q05k037j3858n200q109
15247a91534p8181j00260p767J06691J65675J54886J42072J34075N4141q6688
15237B93110k12106k10420j41702j12199m5644O0180J19807J27455J31135J17185
15227A26801M6381m9025p2987M072J16090J70618J09664j2144p2288k9715K4160
15216C61627k9477j61194k46464k18006n5733J69707K65266K07970J18273J9518
15206D31487p1688j35265j53073j32044o1057L2405O6036O0081N6925J9167m3701
15195F9273p9585j03295j28148j02285n4475m2957m8796j1164P0125J23973P7603
15184b29731l5271r5166p3358m3320l780O1323J05192R5926J2760j19236k15183
$$ y = [-432245, -267241, -76655, 25343, -6248, -99490, -152450, -161525, -162330, -164367, -178225, -183425, -191534, -269715, -369975, -377742, -271051, -105376, 49510, 191582, 325657, 379798, 293110, 81004, -129416, -271118, -383317, -428961, -368781, -248974, -121519, 9616, 126801, 173182, 124157, 51170, 55242, 171332, 341950, 451614, 439470, 367182, 337467, 361627, 332150, 170956, -75508, -293514, -349247, -179540, 85726, 293696, 411969, 431487, 359799, 224534, 71461, -60583, -121640, -89235, -23199, 36882, 93807, 112974, 69273, -10312, -113607, -241755, -344040, -398515, -441472, -490268, -501432, -431307, -307334, -229731, -265002, -360168, -433526, -476846, -480626, -419303, -314111, -218185, -205425, -324661, -539844]
15173e39844k53685k09276n6895J09968J50826N5400k6839O715J14627K06121
15163d42882K12345J49507R6402O4379J6500l7037p9488q9197m0489L0958O0595
15152e8407K1995n1230j15063j65352j22564J5480R8529Q7109P1518J30426J79498
15141I1939J24652P970j33095k19919j83228q9556n0746r5817r8128j0910O1325
15130e95513O9690O1496P2391J02302J28938J15600Q1805N2481L5764j8859j21722
15119a5627j39781m1540P2056R8617J8233q1657o2648N7884J35278J21433P9351
15108B41599P1601P3201M0334J0900j8722o9754q9024n6176L3962R7993N9831
15097C95745r442j8751M3085J30620J54735O5603q7031k50163l57079k87866m9786
$$ y = [-539844, -793529, -1002805, -1059700, -949732, -798906, -743506, -770345, -763630, -649003, -442882, -230537, -81030, 15372, 79751, 96251, 59214, -20274, -109471, -149960, -119002, -58407, -36412, -87642, -202705, -368057, -490621, -475141, -376612, -289503, -217985, -87559, 91939, 216591, 224561, 91466, -128453, -311681, -401237, -451983, -547800, -645928, -656838, -595513, -525823, -464327, -391936, -289634, -160696, -45096, 36709, 89190, 124954, 106095, -15627, -155408, -196948, -124892, -26275, -8042, -89699, -152347, -94463, 40815, 162248, 241599, 313200, 386401, 426735, 437635, 418913, 349159, 260135, 203959, 237921, 335914, 395745, 386303, 367552, 410637, 541257, 695992, 761595, 674564, 424401, 67322, -220544, -270330]
15086b70330J66702K04304R7138n8115j42043j02461n4622m3645m1139n7888n4104
15075c56203k3609R174K4114J0432m782Q22K6995L7573N9255P9323M1507k4799
15063a20198o6050p2162m2135j3036J3912M8399N7102O6369Q9811R1397R3028
15052A46437Q7363P1441O7560M1259k7859r2124j26654j08222m9468J0221M1249
15041F1203l5131j65821k25593j69711n1370K6848N4472P1100R4167R8072L5521
15030b06243o447j4365r116J0140k2920p4111p9799o7061o3879m0478n2969r9228
15018g26476p0781K8026J01492Q4808O6536R3561R5940M6059O696L7685R5697
15007a40757J24352J03646N6462P593n2960j25794j26163j4832N2639k3656p6757
$$ y = [-270330, -103628, 100676, 197814, 139699, -2344, -104805, -159427, -203072, -244211, -302099, -356203, -379812, -370638, -346524, -336092, -340874, -340052, -313057, -275484, -216229, -136906, -95399, -120198, -186248, -258410, -300545, -313581, -299669, -251270, -194168, -127799, -37988, 53409, 146437, 233800, 305241, 372801, 414060, 386201, 294077, 167423, 59201, 9733, 19954, 61203, 26072, -139749, -365342, -535053, -586423, -559575, -505103, -434003, -339836, -241764, -206243, -212690, -227055, -236171, -226031, -248951, -323062, -402861, -469922, -533801, -574279, -627248, -726476, -797257, -769231, -667739, -582931, -516395, -422834, -326894, -280835, -274139, -236454, -140757, -16405, 87241, 143703, 151296, 98336, -27458, -153621, -168453, -115814, -139470, -216227]
14996b16227l0111n936n4654j17314j29247o9387M7565J53899K01028J95851J42119
14985A17586Q2002N5919k657j34882k41988j99387n0459Q3074J09718M3795J9679
14974a17600R0084J29667J03518M7724k1247l6325K4047P3031J0009o4051q8517
14963A50340q6261k3596O8375R8606K1192p1692o5160k3658k8341J79J04671J81080
14951C25735J45938J0951q7539p1978j1734J6642m933q049M6354J35441K23480
14940G20308K17571R3413k8372j35822k50874k69797j90419j21897j29267j73243
14930b68399j38401n8193k8224k5432J8556Q6913J16291O3313k5108o7004l0554
14919c56242K5439M5680K7612j2007m5758n7314r506R9853K02831J60674J9873
$$ y = [-216227, -246338, -252274, -306928, -424242, -553489, -622876, -575311, -421412, -220384, -24533, 117586, 199588, 255507, 252850, 117968, -124020, -323407, -373866, -290792, -181074, -137279, -117600, -27516, 102151, 205669, 253393, 232146, 195821, 219868, 292899, 302908, 238857, 150340, 64079, 40483, 108858, 207464, 228656, 156964, 91804, 68146, 39805, 39984, 144655, 325735, 471673, 482624, 395085, 323107, 311373, 328015, 323082, 315033, 361387, 496828, 720308, 937879, 1031292, 1002920, 867098, 616224, 346427, 156008, 34111, -95156, -268399, -406800, -464993, -493217, -518649, -500093, -413180, -296889, -233576, -258684, -325688, -356242, -330803, -285123, -257511, -269518, -315276, -372590, -382096, -282243, -79412, 81262, 101135]
14908A01135l8331K5260P6460L0112n1951n9722k1688k9346m7563j708N8007O0569
14896A01234P30m3334L9095J27020J04372k0020j77029k36594j75011n6663L6260
14885b99940M5894R603j7188m9367p7718p6331k5584O1793R3490O3464M6887r374
14873b34371j36054k26652k48729k64847k63672k03858o2893R3185J85591J97139
14863a165161J69900J64012J80023J59401P1792M452k392j7049m6035n886P0264
14852d16679M9994j5479j9694M0942R3273N2422m3034j06457j15646q2225l9904
14841f02487L173N4404P8992O6092N8128R2711R0969L0148j9584k8487k0908k5837
14829b22686j8372Q095M0492M2527j4631m1333k9503m5901l6853m3363j23745
$$ y = [101135, 62804, 88064, 164524, 194636, 142685, 82963, 61275, 31929, -15634, -17342, 40665, 101234, 101964, 58630, 97725, 224745, 329117, 309097, 132068, -104526, -279537, -336200, -299940, -254046, -244443, -261631, -310998, -388716, -465047, -490631, -428838, -335348, -271884, -224997, -234371, -370425, -597077, -845806, -1110653, -1374325, -1578183, -1641076, -1547891, -1362300, -1165161, -995261, -831249, -651226, -491825, -420033, -415581, -417973, -435022, -481057, -486943, -416679, -366685, -382164, -401858, -360916, -267643, -215221, -258255, -364712, -480358, -562583, -602487, -599314, -544910, -465918, -399826, -341698, -248987, -158018, -127870, -147454, -175941, -196849, -222686, -241058, -232963, -192471, -149944, -164575, -205908, -235411, -281312, -318165, -361528, -485273]
14818d85273j75027j15500j5871P0216J68169K03104J60561R2399K3433o029j2154
14807i1972o687N897r049o22R6043K03538K29937J37887j593p7841j05834j30241
14795B49463j41193j57107j71489j61953j54843j70909j92546j19641P9295K44215
14785f96708K18344J8862j56258j60267l8440P1538Q6324K8407l3710n5815o7405
14774g85128o0229P977J15123J87581J79482R6340l0733j34536j33121k4651J04506
14763d77389J67768J63507J55541K20285K84919K39602J43739N6229m6183j11715
14753G96303j42014j67127j79311j51626q7713o9812j05381j37638j23491p2530
14743d40340K731P4416O5334L6762P3989R0561L7676K869K3892J4996n2822j00392
$$ y = [-485273, -660300, -775800, -791671, -721455, -553286, -350182, -189621, -97222, -73789, -79818, -91972, -98659, -92762, -101811, -102433, -6390, 197148, 427085, 564972, 563379, 485538, 379704, 249463, 108270, -48837, -220326, -382279, -537122, -708031, -900577, -1020218, -940923, -696708, -478364, -459502, -615760, -776027, -814467, -742929, -656605, -628198, -661908, -717723, -785128, -845357, -837380, -722257, -534676, -355194, -258854, -289587, -424123, -557244, -581895, -477389, -309621, -146114, 9427, 229712, 514631, 754233, 897972, 954201, 908018, 796303, 654289, 487162, 307851, 156225, 68512, -1300, -106681, -244319, -367810, -440340, -437609, -363193, -297859, -261097, -187108, -96547, -58871, -56002, -32110, -17114, -69936, -170328]
14731a70328q3216o069Q3943Q4746L9937O4523Q9448N435j00557p8713J3364J9800
14719c7687n5148r4348k5086R0951J42828J04919L9244l100j6322m119j6362m1072
14707H4698k4103K27l488l3960n3179j3109N4454N1733k8428j22774j27142l0647
14695b45718J4555j2614m2466j06617j55354j14769n7908k2139O249K3926J2607
14684g00248l6873r4034p7109K8398J30532J83386K23794K57002K20850J10937
14674B46635l9034j68246k21947k16748j56060p8799k1602M9114P8617M1084M8099
14663d38887R8741J26572R4490K7753k7192m6683l5251k9977q2354r7190K303
14652d07675J16779J42519O3241l9491r9748q7944k6182M0420M3045m197j4178
$$ y = [-170328, -253544, -259613, -175670, -90924, -50987, 13536, 102984, 108419, 7862, -70851, -57487, -37687, -92835, -187183, -212269, -121318, 21510, 126429, 165673, 162573, 146251, 142132, 125770, 84698, 60595, 60822, 57334, 23374, -29805, -42914, 11540, 63273, 34845, -87929, -215071, -245718, -231163, -243777, -286243, -392860, -548214, -662983, -720891, -743030, -736781, -712855, -700248, -737121, -831155, -908264, -879866, -749334, -565948, -342154, -85152, 135698, 246635, 207601, 39355, -182592, -399340, -555400, -634199, -655801, -606687, -528070, -486986, -438887, -340146, -213574, -119084, -91331, -118523, -165206, -200457, -230434, -312788, -409978, -407675, -290896, -148377, -85136, -124627, -224375, -312319, -338501, -298081, -255036, -259233, -273411]
14641b73411j1320J2123J35294K44502K37290J65292N2164o3228j61475k15331
14631A21900j55835k3400O3064N8172J1319n5921j00127m8057K5162Q689r461
14620a04495k7990o2602q0909j26503j58197j41223o0742M0573N0527j5839n2686
14609g40086m948K3541O178K0169Q6726J71930K18978J45232L4400N3258J29204
14598A44582J39779J00229M3503q299k5898n2928n6677l033L7120P224l2858k3392
14586B69352k1441q3516j36534j17851o1097l3488j3042L3844j7535j18457j19152
14575d18917o2657J0054J06552J51303J52607J42864J04658O1728j5772j32171
14565A00249k17628k19570j49011m9625K5116P0840J15844J44448J12687M1307
$$ y = [-273411, -284731, -272608, -137314, 107188, 344478, 509770, 561934, 498706, 337231, 121900, -33935, -57335, 5729, 63901, 75220, 19299, -80828, -128885, -103723, -95034, -104495, -132485, -195087, -275996, -402499, -560696, -701919, -762661, -722088, -671561, -687400, -740086, -745034, -721493, -715315, -695146, -608420, -436490, -217512, -72280, -37880, 15378, 144582, 284361, 384590, 428093, 419794, 393896, 340968, 284291, 281258, 318378, 325602, 292744, 269352, 247911, 164395, 27861, -89990, -151087, -184575, -197617, -163773, -181308, -299765, -418917, -481574, -471520, -364968, -213665, -61058, 81806, 186464, 248192, 232420, 100249, -117379, -336949, -485960, -535585, -510469, -439629, -323785, -179337, -66650, -25343]
14555b5343q032K1255P0414K1929q0900j33044j04858j2349O1287N9573N3357
14544g6711J17534J48592O8509l1908n5338j9083o3643j90431k03387j03319M18
14533d08767N5998L5978m842j531K1944P4786J25507R2658M8817O2479O4003k879
14521A64151j07736j69583j37138n3653K0412P3835J16375J11623M3526P175l886
14510F5101q730N0986J05312P4223K6339j4401n8079o3308m944L6361K8309K4102
14498B61271p443p7148j12983r0126k1331P9918J55711J37840R2701Q1846N9540
14487E59796J9610j5769p1027j08698q7528p5622r4982j36476j60178j00789q808
14476b80471M7196L0209m607J9982O0618M4269K3872Q6663J44556J07815M0328
$$ y = [-25343, -33375, -12120, 58294, 80223, -677, -133721, -238579, -250928, -189641, -130068, -76711, 40823, 189415, 257924, 226016, 170678, 151595, 87952, -102479, -305866, -409185, -408767, -352769, -316791, -321633, -323164, -301220, -226434, -100927, -8269, 40548, 103027, 167030, 164151, 56415, -113168, -250306, -303959, -283547, -209712, -93337, 18286, 61812, 68987, 65101, 56371, 107357, 212669, 286892, 313231, 298830, 240751, 177443, 172499, 208860, 237169, 261271, 253828, 176680, 63697, -26429, -47760, 32158, 187869, 325709, 418410, 500256, 559796, 579406, 563637, 492610, 383912, 296384, 220762, 125780, -10696, -170874, -271663, -280471, -233275, -203066, -207673, -187691, -127073, -82804, -58932, 27731, 172287, 280102, 320430]
14465C20430J0937k2215n5055l8904l8808j21912k06149j76972o3173m4450j07382
14454e43653q1107M2230J47502J19679R067l7272m6477l7335J3495O2671P8118
14443b73082Q4266J07864R7893L7259l8232j11505j42412j19053m7374L9295J27770
14432b37311J68990J17150K0523p2805j09080p6215j7862N9678J16441R4134M566
14421F8209p8598r6473o3889p4986j28507j30618r2465p6549l2503P9170J83546
14410d43663J97853J53920J39348J32681N2083j2625L1006Q1479O3621n410n5964
14399C34329r0876j07045n2611N2366J30481J01359J9570n6597q9135o8146l4223
14388A39472n3266j25602j94433j59175l3846P2402J06046P3501M8535O4022P4077
$$ y = [320430, 331367, 309152, 254097, 215193, 176385, 54473, -151676, -328648, -391821, -436271, -543653, -624760, -582530, -435028, -315349, -306282, -343554, -390031, -427366, -413871, -351200, -273082, -188816, -80952, 16941, 54200, 15968, -95537, -237949, -357002, -404376, -365081, -237311, -68321, 48829, 69352, -3453, -112533, -188748, -206610, -146932, -30491, 63643, 68209, -10389, -106862, -170751, -245737, -374244, -504862, -597327, -673876, -706379, -627209, -443663, -245810, -91890, 47458, 180139, 232222, 219597, 250603, 332082, 395703, 390293, 334329, 243453, 136408, 83797, 136163, 266644, 368003, 387573, 330976, 241841, 173695, 139472, 86206, -39396, -233829, -393004, -426850, -354448, -248402, -174901, -126366, -62344, 11733]
14377A1733N1483K2793J2453L3434O4627O4737M9222P1577J00313M7851l8237
14366D91986o5993p3047o1604r647K1767p260m1874m1870N814R7298J55623R7881
14354E69074k9455j18021j71807k26210k03977r8985p868j0803q1568q1697l1102
14343d92419R996K4047j3626l5518J0432O1648M6607j6058n4886r1305j02826
14332f53908l9049M1130J12188J73881J67811R2351J4360J7499Q7998J05555M6718
14321A66534l5640j22436j53968n2632O9692M6128m9089n9719J8142P4992M7225
14310e0771l458m2344p2594n3514R966M7325M6575M8447P2306Q4260M9851n1401
14298H4648j80387k41615j79719r4296n0682J2862J03334J81276J98301J23898
$$ y = [11733, 63216, 86009, 98462, 131896, 196523, 261260, 310482, 382059, 482372, 530223, 491986, 425993, 352946, 291342, 281695, 303462, 296202, 254328, 212458, 218272, 315570, 471193, 569074, 539619, 421598, 249791, 23581, -180396, -279381, -287249, -298052, -379620, -461317, -492419, -482423, -458376, -472002, -507520, -497088, -435440, -388833, -404891, -459777, -551082, -653908, -692957, -651827, -539639, -365758, -197947, -105596, -91236, -73737, 14261, 119816, 166534, 130894, 8458, -145510, -198142, -128450, -82322, -131411, -191130, -172988, -97996, -50771, -54229, -96573, -169167, -222681, -212715, -165390, -118815, -70368, 1938, 86198, 136049, 84648, -95739, -337354, -517073, -611369, -662051, -649189, -545855, -364579, -166278, -42380]
14288d2380p075r7072q1805J3198P2750M4101J9407O6373J06973M2161q2529j45856
14276i1754r9417K7980J77638K91496K62159J60377Q1648k3067j22338j28853
14266E35869o9427K0814J02340J03435N7202O0205R6723M2044r0540k02067k10521
14255D46077j19245l4260l1146r2482j31694j39725j17253n0997J6667J5767n0921
14244b89212p3600j141R4855R8820J8510m5736o4983r0386j23186q4084J8490
14233e41653O7188K9060k1387k3125K503M7993N0369j0949o1992p8999j13777
14222f54769j15934j694J35101K03760K10519J62322Q0905l7637j33270j24902
14212b75599o4869j7048O0771J40695J77266J55256J05460O5196M945q2997j57659
$$ y = [-42380, -49455, -146527, -228332, -215134, -142384, -98283, -78876, -12503, 94470, 136631, 54102, -91754, -191171, -163191, 14447, 305943, 568102, 728479, 810127, 787060, 664722, 535869, 466442, 487256, 589596, 693031, 750233, 810438, 907161, 949205, 858665, 656598, 446077, 326832, 292572, 261426, 168944, 37250, -102475, -219728, -270725, -254058, -238291, -289212, -362812, -363953, -269098, -170278, -151768, -197504, -262487, -352873, -476059, -560143, -541653, -474465, -445405, -466792, -489917, -487414, -439421, -389052, -400001, -461993, -540992, -654769, -770703, -772397, -637296, -433536, -223017, -60695, 20210, -17427, -150697, -275599, -340468, -357516, -296745, -156050, 21216, 176472, 281932, 347128, 352073, 269076, 111417]
14201A11417j85457j31194l7613J3823L4756M3717N9778J16301J63140J14224
14191C02892r872j04816j20747p9572q5885j44272j58768j03297j4299M4287R2658
14180c81691J44562J43842O7892k8491j25114k11019k12865j15426K9780J10476
14170e78054L5713q1459j18565j07817q0115n7230k3575M8793J08707J04568Q4781
14159f64253Q6852R8769J02247L4074n5496r0727j08459j21325n9108N3402J39262
14148e84762J48069Q8884P4354J08688J18568J04497R0601J03434J59640K37511
14138F49484K51082J83287L9275j54541k60063k25444j48276j05001r4611j01349
14128C3843j34151j70495j29831p0990p2137j27962j44132k9669J56805K44865
$$ y = [111417, -74040, -205234, -242847, -229024, -194268, -150551, -90773, 25528, 188668, 302892, 293020, 188204, 67457, -12115, -98000, -242272, -401040, -504337, -518636, -474349, -381691, -237129, -93287, -25395, -53886, -179000, -390019, -602884, -718310, -688530, -578054, -542341, -623800, -742365, -850182, -930297, -987527, -1011102, -962309, -853602, -749034, -664253, -577401, -478632, -376385, -342311, -397807, -488534, -596993, -718318, -777426, -724024, -584762, -436693, -347809, -273455, -164767, -46199, 58298, 148899, 252333, 411973, 649484, 900566, 1083853, 1123128, 968587, 708524, 483080, 334804, 229803, 135192, 33843, -100308, -270803, -400634, -471624, -543761, -671723, -815855, -845524, -688719, -443854]
14118d43854J96641J10380M0514l2905r6393r0324m0363k3075k1823j2738k714
14107d16654j5229L5101J57950K24192J79129Q8816L8105N1910O8700N1249J7931
14096D81200l9434j20992j84551k23172k14738j37288o7254k3516J6333N6788
14086d56624N1323p155m0689m0354R294O7121L8891o2183j26785j15809j09779
14075g92749q1100N3323J96649K04176R6464j0887n0639k4453O5654J49491J72099
14064b1972J97443K05727J87950J53524R0272L3439n8498j42028j66833j76778
14054C02246k36901l30013l24359j76903j224J35753K09103K13040J70659J53787
14044A15188J18579P529j02757j51575j33955q2256m4436p983M2454N7904J7398
$$ y = [-443854, -247213, -136833, -96319, -129224, -225617, -315941, -356304, -379379, -401202, -413940, -416654, -431883, -396782, -238832, -14640, 164489, 253305, 291410, 343320, 412020, 463269, 481200, 441766, 320774, 136223, -86949, -301687, -438975, -506229, -529745, -513412, -456624, -405301, -412456, -453145, -493499, -484205, -417084, -378193, -440376, -567161, -682970, -792749, -873849, -820526, -623877, -419701, -323237, -334124, -384763, -409216, -343562, -194071, -21972, 175471, 381198, 569148, 722672, 812944, 846383, 787885, 645857, 479024, 302246, 65345, -264668, -589027, -765930, -767154, -631401, -422298, -209258, -38599, 115188, 233767, 241296, 138539, -13036, -146991, -229247, -273683, -281666, -239212, -181308, -163910]
14033a63910o5687j32073j38249j22243j06248o097J69375K49793K01350J57009
14023D3020R7672k8925j70059k60549k14897o8853L8348J05565J81932K17509
14013e9237J64901N9127j9293m0956l7302m1299m6971o1172m7412L0424J00656
14002A466J16281Q1650r35p5372p1164L1402J58279K20431J65992N070j65146
13991D67954k62361k72953j96718r9523n0799j825M0205L7880J3692j8184n124
13980c47756Q0392J43637J21586J4205r6707o1972N3244J19951J50080J41676
13970C18336P1094j181p8731j41802j14447m0340j7884n7181r0800j16258j21556
13959c90750l5374N9001R5851J49450J88587J70874J49944J16477J9601j20939
$$ y = [-163910, -229597, -361670, -499919, -622162, -728410, -734507, -565132, -315339, -113989, 43020, 140692, 111767, -58292, -318841, -533738, -602591, -564243, -458678, -276746, -59237, 105664, 164791, 145498, 104542, 67240, 25941, -21030, -82202, -129614, -99190, 1466, 117747, 199397, 198462, 123090, 51926, 83328, 241607, 462038, 628030, 633100, 467954, 205593, -67360, -264078, -363601, -414400, -416225, -376020, -338140, -324448, -342632, -347756, -267364, -123727, -2141, 12064, -84643, -146615, -93371, 26580, 176660, 318336, 389430, 388249, 309518, 167716, 53269, 12929, -4955, -62136, -152936, -269194, -390750, -426124, -367123, -271272, -121822, 66765, 237639, 387583, 504060, 523661, 402722]
13949D02722k14926k27196j63625j08326j03792j30474j60652j64054j08424j2574
13939i91321M3226J7909k5752n580L4679j2352r0410m6348R0624J80816J74069
13928f30440J26160J31472J78524J88992J34449N5557j1822r7108j41741j11601
13918a77558p9466k3945N1162J01854J36297J60700J40117O3982m449k7940J011
13907C41765J5754k6769r1472j53849j83061j94811j94595j30694k0559O0912
13897e77379J26730J63044J20087M0779k2186p7498j11630p4607j1462l3899r1508
13886e49529j09319j09086n9557N6518J70240J89959J34948J24493J15324P028
13876b8981j43664j95372j51526q0247k558M0172K2317K4654Q2751J15428P2242
$$ y = [402722, 187796, -39400, -203025, -311351, -415143, -545617, -706269, -870323, -978747, -991321, -948095, -930186, -955938, -961518, -926839, -939191, -1029601, -1075949, -985325, -804509, -630440, -504280, -372808, -194284, -5292, 129157, 184714, 172892, 75784, -65957, -177558, -257024, -280969, -229807, -127953, 8344, 169044, 309161, 373143, 368694, 340754, 341765, 357519, 330750, 239278, 85429, -97632, -292443, -487038, -617732, -638291, -577379, -450649, -287605, -167518, -126739, -148925, -226423, -338053, -412660, -424122, -458021, -549529, -658848, -767934, -827491, -770973, -600733, -410774, -275826, -151333, -36009, -28981, -172645, -368017, -519543, -599790, -602348, -562176, -539859, -515205, -432454, -317026, -244784]
13865b44784m4890j54917j50621n1541L7684Q4331J22475J49272J38889J03550
13855a0552M7901l3455r7705o6512J1036P512m8075k9120M6264Q2081P1882P8893
13843F0150P0163l9455j94082k28881j52464o6444m33J09173K00342J56392K9636
13832e5903p2985j25013j55043j63025j27257m2306N6176J32262J37296Q4284
13822c31514N932q5928j32859o4967M2065P7674N3853n723o6866j25711j52098
13811g86142r5454N525O8130N9665O0441R8157J17910J05149J12959J45375J51193
13800D2908J33111J00971L6219k8214p4187j18142j29099r1968l3435Q819J3773
13789a39244q410p516K2536L9121K228n2717p7863o8931J6201J19271J27486N2995
$$ y = [-244784, -289674, -444591, -595212, -646753, -609069, -524738, -402263, -252991, -114102, -10552, 37349, 3894, -93811, -160323, -149287, -141775, -189850, -218970, -172706, -90625, -18743, 60150, 130313, 90858, -103224, -332105, -484569, -551013, -551446, -442273, -241931, -85539, -55903, -128888, -253901, -408944, -571969, -699226, -741532, -685356, -553094, -415798, -331514, -325582, -411510, -544369, -609336, -567271, -489597, -435744, -441467, -508333, -634044, -786142, -881596, -876071, -807941, -748276, -687835, -589678, -471768, -366619, -253660, -108285, 42908, 176019, 276990, 313209, 284995, 210808, 92666, -36433, -128401, -161836, -153017, -139244, -147654, -155170, -132634, -93513, -91285, -144002, -221865, -290796, -274595, -155324, -27838, 25157]
13777B5157m0788j18618j38522j22897r1725j0154O7889P9870O3462L8708k2078
13766b69696n7244Q407J18348J61752J23707O9065N5336N2043N8383J21425J77013
13755F18539J32511k9529k11645k73664k10942j06219k9064K103r817l6715m9274
13744b03716K5066J08194J18180J00122P8254O7622Q0643J5260r2729j19616n8867
13733A18413K3567N2674J5952p0783j50359j38041l6453N3475R6760J47243J76474
13722B88922J22074K3122p8306k20105l15654k45706q5909P092k2276q5113o6319
13711f78178N1143J64680K37407K97949K61888J01109o2808j25145j15628p1467
13701F0950j2100L2563N9321R1189O9349j9872j07880j93242k21460j69456o4367
$$ y = [25157, -15631, -134249, -272771, -395668, -487393, -497547, -429658, -349788, -286326, -247618, -269696, -326940, -318533, -200185, -38433, 85274, 154339, 209675, 261718, 320101, 441526, 618539, 751050, 721521, 509876, 236212, 25270, -80949, -110013, -107910, -117727, -154442, -203716, -178650, -70456, 47724, 147846, 226100, 293722, 374365, 389625, 296896, 177280, 118413, 141980, 194654, 210606, 139823, -10536, -148577, -185030, -131555, -34795, 112448, 288922, 410996, 434118, 355812, 135707, -179947, -425653, -511562, -504470, -526746, -611859, -678178, -627035, -462355, -224948, 73001, 334889, 435998, 373190, 248045, 132417, 60950, 48850, 81413, 140734, 231923, 301272, 281400, 173520, -19722, -241182, -410638, -475005]
13690d75005Q7771K13828K59924K13695Q5621o4542j69253j55106p5699o4951
13680a43717j32817j63598p0116Q8303K19973K40847J22111L15j6291J1883m004
13669A52889m6042m8754P383J01513J56793J62858J12797j7958j71353j79617
13659B30509l1485J08450J24296L9421K3729O3727O2444J228j22024k43594k65544
13648h843j75302p8615l2978K613M6739L5503l7601j10371j62999j73395j58601
13637h53850j34111q7270m1010J8379J28386J89344Q6691q3849j54638r1076K0379
13626a002625J30406K56464K97554J56805p7029k19451j99649j11067m3609N2264
13616g59937J65371J89668J22458K766j21206j63822q0713P8364K01664K38227
$$ y = [-475005, -387234, -173406, 86518, 300213, 385834, 321292, 152039, -3067, -78766, -143717, -276534, -440132, -510248, -421945, -201972, 38875, 160986, 161301, 145010, 156893, 152889, 106847, 58093, 65476, 166989, 323782, 486640, 599437, 581479, 410126, 230509, 199024, 307474, 431770, 471191, 494920, 558647, 621091, 622319, 500295, 256701, -8843, -184145, -262760, -295738, -293125, -246386, -210883, -248484, -358855, -521854, -695249, -853850, -987961, -1075231, -1116241, -1097862, -969476, -780132, -693441, -777290, -931928, -1023004, -1002625, -872219, -615755, -318201, -161396, -238425, -457876, -657525, -768592, -812201, -759937, -594566, -404898, -282440, -279674, -400880, -564702, -645415, -567051, -365387, -127160]
13606a27160J88551Q7612o42k2430j5091m7056j05907j25144j17852j36952j29119
13595e51190l4003O6381J09076J33126J64269J61574J39782J00774K5614j6628
13585B98775K2134O8960L8134J7325Q8082J35173N0653o6188r5343p5056n1080
13574D31569l9849k4269P246R57l9281j6197R0414K03701K12807R6345p6489j96919
13562F50035k02113j23112j2680L7483K6870J8132N266k2867l6307n4994j42305
13551A43408k55036k74654j97454q8585j4723J2385K5445N0706Q6956P7683L4604
13540c99265k564l8780q2007q7822n2183j8785J8372L5513J7626p789q82M9004
13528e69562R6560Q0948M7468Q3448J47200J54729J16284O8626p212q6444j68646
$$ y = [-127160, 61391, 149003, 148361, 125931, 110840, 63784, -42123, -167267, -285119, -422071, -551190, -585193, -518812, -409736, -276610, -112341, 49233, 189015, 289789, 315403, 298775, 320909, 389869, 428003, 445328, 533410, 668583, 719236, 653048, 557705, 482649, 431569, 391720, 367451, 374697, 375654, 336373, 320176, 410590, 614291, 827098, 923443, 846954, 650035, 447922, 324810, 312130, 349613, 376483, 394615, 399881, 377014, 340707, 285713, 143408, -111628, -386282, -583736, -672321, -687044, -674659, -649214, -598508, -511552, -433869, -399265, -401829, -440609, -522616, -610438, -662621, -681406, -663034, -627521, -609895, -617684, -618566, -569562, -473002, -392054, -344586, -261138, -113938, 40791, 157075, 225701, 218489, 132045, -36601]
13517c6601k54637l31369l25913j94696m1879N4696R9916J32042J90232K14707
13507d93502J96916J80386J62788J30857R2367J7892j14346j78359j24565m8084
13497a77650K3508R7132J58021J14532m5545j99859k60723k00656j13393q0458
13487f85091k0182R3492J41043M0999r4053j25744r7235r0053n6102J1910P2917
13476h08099J36381J61549J44687J18007R4588J25279K21694K12309L2774q4690
13466C54479m6633M3684P9044L5595j1869K503M4553O4306P0298L3316o6569j99111
13454D03596k97217k54423r7674M1320R9561J17764J47014J65509J72701J75903
13444F74054J24520L1136k1620o1338q8946r0809m3473M7771J03212R7927O9313
$$ y = [-36601, -291238, -622607, -948520, -1143216, -1185095, -1130399, -1030483, -898441, -708209, -493502, -296586, -116200, 46588, 177445, 269812, 287704, 173358, -5001, -129566, -177650, -154142, -57010, 101011, 215543, 169998, -29861, -290584, -491240, -604633, -685091, -705273, -611781, -470738, -429739, -523792, -649536, -746771, -836824, -892926, -881016, -808099, -671718, -510169, -365482, -247475, -152887, -27608, 194086, 406395, 439169, 354479, 307846, 351530, 430574, 466169, 454300, 456803, 501356, 565662, 635960, 669276, 602707, 403596, 106379, -148044, -245718, -204398, -104837, 12927, 159941, 325450, 498151, 674054, 798574, 829710, 808090, 746752, 657806, 566997, 523524, 571295, 674507, 772434, 841747]
13433H41747K6454m8782j26634j89439k29712k30111j61546m0088J5747j8577
13423a60941l7681m2163n8160k3855Q8460J65016J32110P3626M6879j2477j13783
13412E7031j76326j49227p4435k0631J8106O6654Q2427j4962j14366j03298j7107
13401d46134Q2510Q8976j4716r8245r6069k0695N5751J02069J24875J09692R7483
13390a4503P7371j975r1439j12626m6544M6831R4276J11450J25290J15756Q5428
13379C89315P243m9644j6622J3510m107m1358r0538j25079j27566p2550L1477
13368h5919O5297N3325P4842R0098Q1512Q6139R0984O5119k6001j10917n6815
13357C27664O4849R0737L3967J2652M0100N2516N1533O1109L0570m8458j11713
$$ y = [841747, 868201, 819419, 692785, 503346, 273634, 43523, -118023, -158111, -142364, -160941, -198622, -240785, -298945, -322800, -234340, -69324, 62786, 136412, 183291, 170814, 57031, -119295, -268522, -342957, -363588, -345482, -278828, -196401, -211363, -325729, -429027, -446134, -363624, -274648, -289364, -387609, -483678, -504373, -448622, -346553, -221678, -111986, -14503, 62868, 60893, -30546, -143172, -189716, -142885, -48609, 62841, 188131, 303887, 389315, 396558, 346914, 330292, 343802, 339695, 298337, 207799, 82720, -44846, -117396, -85919, -20622, 32703, 107545, 197643, 279155, 365294, 456278, 521397, 495396, 384479, 327664, 392513, 483250, 517217, 529869, 569969, 622485, 674018, 735127, 765697, 717239, 605526]
13346F05526j10160n7021M243K8914L747l2730O237J04938J44983P5476j7218
13335G56935r2542j08978p1676p4931o9438l0559n709n6716j19734q9111J8617
13324E6158J24325J33384N9560J3718J1459J4325N5107Q1029K1463m1474K1965
13313E51019J34152J47578K2686j39650k49065k39474j00741K6152O2888M9262
13303B64807L1571j846k6099j7911r224P165Q0366J37824P6011p6651j93009j67008
13291A05996o8685O764M2824N3594N9391K6764k0875o432L7066L6106N1234J18894
13279D42641J42655J10071L9918l5111q1327j15823j06952m2290l0974m6553K6518
13268C02773J33159J95186J93888J29427J00694J11612L2184j14215k02947k01727
$$ y = [605526, 495366, 438345, 442588, 471502, 475249, 442519, 448756, 553694, 698677, 774153, 756935, 664393, 555415, 483739, 408808, 339370, 308811, 303102, 246386, 126652, 37541, 56158, 180483, 313867, 373427, 387145, 398604, 412929, 468036, 549065, 570528, 529054, 551019, 685171, 832749, 855435, 715785, 466720, 227246, 126505, 152657, 215545, 264807, 296378, 294532, 268433, 250522, 241298, 248463, 328829, 466653, 542664, 466013, 273004, 105996, 37311, 44075, 86899, 140493, 199884, 226648, 205773, 199341, 236407, 272513, 323747, 442641, 585296, 695367, 735285, 700174, 618847, 503024, 396072, 353782, 322808, 276255, 302773, 435932, 631118, 825006, 954433, 1055127, 1166739, 1198923, 1084708, 881761, 680034]
13258F80034j34858p2768k7477n722k4304m041O6109J22887J40380R5331L6030
13247H71601l001m7386n7894K7650J54260J91349J03663J960k8889l6630n3811
13236A122872k4577O2768J01485Q3458P5866R0335O4910m7255j41834j32753j10115
13225A145160j16073p2407J404L9757N8372Q5425J37648J95610J84656R2916k392
13214A750076o6924j15492j33369j24826q0124k0442L9197J08292J70686J96361
13204A723435J59074R4859L9239m6451j49039j92849j83577j05486K406P6332
13194A417943J01471P4539m82m1864j5968N7970Q9668N6056J8633j8983k6843
13183A712140j2831L9419J13741J55470J19458n885j26287j80639j77896j80554
$$ y = [680034, 545176, 472408, 444931, 439209, 414905, 410864, 476973, 599860, 740240, 835571, 871601, 868600, 821214, 763320, 790970, 945230, 1136579, 1240242, 1242202, 1213313, 1176683, 1122872, 1098295, 1161063, 1262548, 1346006, 1421872, 1512207, 1577117, 1529862, 1388028, 1255275, 1145160, 1029087, 956680, 958084, 997841, 1056213, 1141638, 1279286, 1474896, 1659552, 1752468, 1750076, 1683152, 1567660, 1434291, 1309465, 1229341, 1208899, 1248096, 1356388, 1527074, 1723435, 1882509, 1977368, 2016607, 1970156, 1821117, 1628268, 1444691, 1339205, 1341611, 1417943, 1519414, 1593953, 1593471, 1551607, 1535639, 1593609, 1683277, 1739333, 1757966, 1738983, 1712140, 1699309, 1738728, 1852469, 2007939, 2127397, 2121512, 1995225, 1814586, 1636690, 1456136]
13173A456136j75768j56338j64063j48252o6320K1637Q5330J48669J43905P7614
13163A222550M6664K1460l6880m7472o51J6524p915j8819M592K1596m63j6966
13151A204220l429Q556j337k3651m3814j9761O7683J41443J77083J78347R4698
13140A780038l0830j10310p7888K9042R3416Q3425o971q9072l0732P1931Q6030
13129A798079M9654K9635N8110P2771L1774N502j3727o6035q4049p1699p4497
13118A735518r0688r0765l6117Q3465K01745K50106K02255R4012K8927J2584j9212
13107B371830p2230j06392q2592l7600l9838m0400k1681n158J2037N5175J27188
13096B160339J99872K36802J98921J05289K1891l4076r5021j30554p0110J6617
$$ y = [1456136, 1280368, 1124030, 959967, 811715, 745395, 767032, 852362, 1001031, 1144936, 1222550, 1269214, 1290674, 1253794, 1206322, 1205671, 1222195, 1214280, 1195461, 1200053, 1221649, 1221186, 1204220, 1200791, 1209347, 1208010, 1184359, 1140545, 1120784, 1188467, 1329910, 1506993, 1685340, 1780038, 1749208, 1638898, 1561010, 1590052, 1683468, 1766893, 1759922, 1670850, 1640118, 1712049, 1798079, 1847733, 1877368, 1935478, 2008249, 2040023, 2045525, 2031798, 1965763, 1881714, 1810015, 1735518, 1644830, 1554065, 1517948, 1601413, 1803158, 2053264, 2255519, 2349531, 2378458, 2391042, 2371830, 2299600, 2193208, 2110616, 2073016, 2033178, 1992778, 1971097, 1965939, 1977976, 2033151, 2160339, 2360211, 2597013, 2795934, 2901223, 2923114, 2889038, 2794017, 2663463, 2593353, 2609970]
13086B609970L3662M2166P2820J24831J96095K08861J12549m0990j48168j71510
13076C040286j49780o6403L9943Q3335N2930K1250O3447J35623J62528J65313
13066C548472J82643J81170J49026P9181K3552m007p7709j70029k06080j59161
13056C547058p2946q769N6321J00928Q7904N3952Q7489J95533K86563L18789K65188
13045D918010J63968J03226J10462R6593J5948q3715p6280N4412J41374J47164
13035E591162J12609N5679k2193q2454l7547Q2950J22484O1797N4146J37403K04618
13024F280654K00646J65748J60410J67790J74653K39439L02068K74608K11135
13015H177151K19547L27601M34753M85497M97931M97396M51242L55912L86413
$$ y = [2609970, 2643632, 2685798, 2758618, 2883449, 3079544, 3288405, 3400954, 3359964, 3211796, 3040286, 2890506, 2824103, 2864046, 2947381, 3000311, 3021561, 3085008, 3220631, 3383159, 3548472, 3731115, 3912285, 4061311, 4140492, 4164044, 4160037, 4082328, 3912299, 3706219, 3547058, 3474112, 3465343, 3521664, 3622592, 3710496, 3764448, 3851937, 4047470, 4334033, 4652822, 4918010, 5081978, 5185204, 5295666, 5392259, 5408207, 5324492, 5248212, 5302624, 5443998, 5591162, 5703771, 5759450, 5737257, 5654803, 5617256, 5700206, 5822690, 5884487, 5938633, 6076036, 6280654, 6481300, 6647048, 6807458, 6975248, 7149901, 7389340, 7691408, 7966016, 8177151, 8396698, 8724299, 9159052, 9644549, 10142480, 10639876, 11091118, 11447030, 11833443]
13006A1833443N43478O50887O74060O64080O92226P45934Q25580R56705J030968
12997A8617361J077304J200495J435795J713867J930875K110013K329384K606123
12989C3021217K939817L353577L834206M381212N062019N991565P197474Q633002
12981G4414089J0329950J2339194J4700223J7429934K0572833K4139710K7748251
12974B01674184L0363054L0061486K4133763J1158993n938929k0831340k9121971
12967B41499240l0970669k8931256k5290924k1395813j7896173j4955946j2494629
12960H9563830j0435227q747194p397147o341171n460492m716159m135025l631974
12952C8699441l135094k690553k350972k093651j824822j567675j413750j310484
$$ y = [11833443, 12376921, 13027808, 13701868, 14365948, 15058174, 15804108, 16629688, 17586393, 18617361, 19694665, 20895160, 22330955, 24044822, 25975697, 28085710, 30415094, 33021217, 35961034, 39314611, 43148817, 47530029, 52592048, 58583613, 65781087, 74414089, 84744039, 97083233, 111783456, 129213390, 149786223, 173925933, 201674184, 232037238, 262098724, 286232487, 297391480, 291452551, 270621211, 241499240, 210528571, 181597315, 156306391, 134910578, 117014405, 102058459, 89563830, 79128603, 70381409, 62984262, 56643091, 51182599, 46466440, 42331415, 38699441, 35564347, 32873794, 30522822, 28429171, 26604349, 25036674, 23622924, 22312440]
12944B2312440j137762r10773p10782o04492n43678m68316m31191l82588k86612
12935A6836246k57214k50417j74128j14444j38871j22065j0960P3126J12836J70036
12925A6124145K81360M64080O35285O95954P67129R85606J303204J595329J797071
12916B4649163J933997K023671K013601J787429J324598P15825J80280r0924p6999
12907C4460641K00330O11519J050419J542091K054527K499387K878931L337330
12899D8635175M022097M967369O130531P447580Q936152J0643965J2637895J5044178
12891A18464942J7995999K1545828K5482857K9194247L1369786K9727335K1597994
12884B95378988O518638j1129042k4785952l1215935l1584370k8679791k4650784
$$ y = [22312440, 21174678, 20263905, 19553123, 18948631, 18404953, 17936637, 17505446, 17122858, 16836246, 16579032, 16328615, 16154487, 16040043, 15901172, 15779107, 15768147, 15841273, 15954109, 16124145, 16405505, 16869585, 17504870, 18200824, 18967953, 19953559, 21256763, 22852092, 24649163, 26583160, 28606831, 30620432, 32407861, 33732459, 34448284, 34628564, 34537640, 34460641, 34660971, 35272490, 36322909, 37865000, 39919527, 42418914, 45297845, 48635175, 52657272, 57624641, 63755172, 71202752, 80138904, 90782869, 103420764, 118464942, 136460941, 158006769, 183489626, 212683873, 244053659, 273780994, 295378988, 301897626, 290768584, 265982632, 234766697, 203182327, 174502536, 149851752]
12877A49851752k0608651j7049378j4137650j1833477r985024q442463p183128
12870F0611981o223902n467783m757336m056446l470664l042694k738797k479487
12862B8374872k120238j694757j385654j243509j157385r94555q10045p21147
12854A8247582o95052o63515n84503m74182l85993l29471l06098l26236l40906
12845A4141626k83622j93281j80591k16569j28869N2004J37425J27442P8499L9712
12835A3573776P7411J92007L44910M88807N68046N83826N82202N91832O55930
12826A7658747P75961R14141J039299J158665J309971J464995J618960J820402
12818B7761141K071143K373079K775766L253812L736339M287697N000355N865566
$$ y = [149851752, 129243101, 112193723, 98056073, 86222596, 76237572, 67795109, 60611981, 54388079, 48920296, 44162960, 40106514, 36635850, 33593156, 30854359, 28374872, 26254634, 24559877, 23174223, 21930714, 20773329, 19778774, 18968729, 18247582, 17552530, 16889015, 16304512, 15830330, 15444337, 15114866, 14808768, 14482532, 14141626, 13858004, 13664723, 13484132, 13267563, 13138694, 13190698, 13328123, 13455565, 13534064, 13573776, 13651187, 13843194, 14188104, 14676911, 15244957, 15828783, 16410985, 17002817, 17658747, 18434708, 19348849, 20388148, 21546813, 22856784, 24321779, 25940739, 27761141, 29832284, 32205363, 34981129, 38234941, 41971280, 46258977, 51259332, 57124898]
12810E7124898O868180Q007228R354577J1076101J3287904J5961567J9017660
12803A40698115K2414755K6013963K9187328L0408588K7124991J7022320J028839
12796B93898899j5495333k6802683l1187287l0426999k7076994k3066594j9351005
12789A20492004j6215439j3651623j1525420r708928q152205o886225n885118
12782D8467046n083967m458732l962236l540254l084426k598814k172452j824942
12774B1741223j590728j448611j343475j223571j083020r85126r67085q94078
12766A2205529o52892l84622l35655n00365o54566p03176p09046o75175n63555
12757G026477l83238k16555j49807j71181k31468l11912l34698k38904j34352
$$ y = [57124898, 63993078, 72000306, 81354883, 92430984, 105718888, 121680455, 140698115, 163112870, 189126833, 218314161, 248722749, 275847740, 292870060, 293898899, 278403566, 251600883, 220413596, 189986597, 162909603, 139843009, 120492004, 104276565, 90624942, 79099522, 69390594, 61238389, 54352164, 48467046, 43383079, 38924347, 34962111, 31421857, 28337431, 25738617, 23566165, 21741223, 20150495, 18701884, 17358409, 16134838, 15051818, 14066692, 13099607, 12205529, 11552637, 11168015, 10832360, 10331995, 9677429, 8974253, 8265207, 7590032, 7026477, 6643239, 6426684, 6276877, 6105696, 5874228, 5562316, 5227618, 4988714, 4854362]
12748D854362n3959L6j5401q1045j21655j29507j47723j62474j60828j79899j61182
12737C640725j17662j43628k12853k28223j57324r2161q3860j00930r7101o6250
12727B340733m9881o0340n3737j8995M2759O7790R665p4639j28713j23294o4073
12716A887275j5098j28j0619n7042j18342j46441r7959m45M3166K1097l7646j29649
12704A338169j39652l4891M8911K7224m5117o7457m4204o608K2970L2765L9695
12693A171805q309j59480k81223k48827j15705R065O6089M1944k4894n1491r904
12682C89070P1641J01446N5121O0687J36308J69213J53162Q9508l9700j12211
12672A074245r6978p5078o3999l5394K1150N4007k9928j71097j87545o1156K1797
$$ y = [4854362, 4800403, 4800439, 4785038, 4703993, 4582338, 4452831, 4305108, 4142634, 3981806, 3801907, 3640725, 3523063, 3379435, 3166582, 2938359, 2781035, 2688874, 2605014, 2504084, 2406983, 2340733, 2290852, 2230512, 2176775, 2157780, 2200539, 2268329, 2277994, 2203355, 2074642, 1951348, 1887275, 1872177, 1872049, 1861430, 1804388, 1686046, 1539605, 1441646, 1441201, 1484367, 1505464, 1467818, 1338169, 1198517, 1163626, 1212537, 1239761, 1194644, 1127187, 1082983, 1076375, 1099345, 1132110, 1171805, 1163496, 1004016, 722793, 473966, 358261, 367326, 433415, 475359, 450465, 398974, 389070, 460711, 562157, 617278, 677965, 814273, 983486, 1136648, 1226156, 1186456, 1074245, 977267, 902189, 838190, 802796, 823946, 877953, 848025, 676928, 489383, 428227, 450024]
12661D50024K5582L8099P4061P4041L4503K3138O6663Q6023J9352o3905j24736
12650G02845j66052j28690o6200l9076Q756O6974P0774M6008O5386Q0621R157
12639F50503j04946j72523j48056o7826O052K3041l0273j24086j81709j14697
12629b64520j483N1085J01204J58145J59131J37801J25992J30410J56514J39928
12619H94207N4840m2180j28154j59632j19585n3072N63N2897J00511N9787n4456
12608F05726r5280l9706K8779O2159R4612R6778M8049J3662j2232o0311q3076
12597F59160k4971R7973J64404P1218p5702j21310p0794n6439q5834j37256j80365
12586B40084j46346p1215l0062p3339j18297p0395N5057J87787K52417K31919
$$ y = [450024, 475606, 513705, 587766, 661807, 696310, 719448, 786111, 872134, 891486, 827581, 702845, 536793, 408103, 341903, 302827, 311583, 378557, 449331, 495339, 560725, 641346, 650503, 545557, 373034, 224978, 157152, 163204, 186245, 155972, 31886, -149823, -264520, -266003, -214918, -113714, 44431, 203562, 341363, 467355, 597765, 754279, 894207, 949047, 906867, 778713, 619081, 499496, 446424, 446987, 499884, 600395, 660182, 605726, 510446, 470740, 499519, 561678, 656290, 753068, 801117, 814779, 802547, 742236, 659160, 634189, 732162, 896566, 967784, 892082, 770772, 699978, 643539, 557705, 420449, 240084, 93738, 22523, -7539, -80878, -199175, -269570, -214513, -26726, 225691, 457610]
12576D57610J08019q6703k33555k84574k70268j89348m9631O5121J00560P0919
12566c11850J2088j027P4663J71702J96470J35288L9642n3819j08476j08517n5770
12555i606K7897P1752K3535m4586q0304j03655j14985j18421o7862L6371R8150
12544b81714R4488N4723o108p9317l6221J06917K10003K29096J61444M5636k8434
12533D70513k225M9494J2129j20648k23499k31373j65403q1373m488P1463J22494
12522a02916J63722J96421J62408J04576R2300O6036k8170j46132j87161j19121
12512B01963l0853p568k7923m3699n8536m7577l2411o2711p0362n94Q7222R9936
12500F887L0550m8257m3614J5383N5808P9909P7979K9869p3031j64807j39837
$$ y = [457610, 565629, 478926, 245371, -39203, -309471, -498819, -548450, -483329, -382769, -311850, -299762, -300789, -226126, -54424, 142046, 277334, 316976, 263157, 154681, 46164, -9606, 18291, 90043, 113578, 68992, -11312, -114967, -229952, -348373, -416235, -379864, -281714, -187226, -132503, -138611, -217928, -254149, -147232, 62771, 291867, 453311, 498947, 470513, 468288, 517782, 529911, 409263, 185764, -45609, -211012, -292385, -296873, -225410, -102916, 60806, 257227, 419635, 524211, 616511, 682547, 654377, 508245, 321084, 201963, 171110, 163542, 135619, 91920, 33384, -14193, -46604, -109315, -179677, -180271, -93049, 6887, 37437, -10820, -54434, -39051, 16757, 96666, 174645, 204514, 131483, -33324, -173161]
12489a73161n1196p721J0699K3606k6146j16665j59438j45127o7180P3707J77963
12478d60659J71301J02796K6586j9373j6464K7766L1485p0729j34142m8130N5089
12467c34474O1192m547n7517n1352l58K9066L3501K9133m1543j38823j38760m7274
12455f61756N0505O3283j3500l6218j5847k7260l5830J66R0766J16621J7152j02701
12443e54619j38665o4409M3126Q7648M4279m5046q2270k8452K2924K1165K5953
12432f68366N3770R4913J49471K29645K70023J63847n268j07240j00052o046R0013
12421A64710J24220J02640P8802O4920M2604l9697j79204k38231j91366j42843
12411b13445j22993q8616k3389Q8537K01387K22474J25708J6680N237J6959j6498
$$ y = [-173161, -224357, -232078, -221379, -197773, -223919, -340584, -500022, -645149, -712329, -638622, -460659, -289358, -186562, -159976, -179349, -195813, -168047, -136562, -207291, -341433, -389563, -334474, -273282, -277829, -335346, -386698, -387056, -357990, -324489, -295356, -336899, -475722, -614482, -661756, -611251, -547968, -561468, -597686, -613533, -640793, -676623, -676457, -585691, -469070, -451918, -554619, -693284, -757693, -714567, -626919, -582640, -627686, -709956, -738408, -715484, -694319, -668366, -614596, -519683, -370212, -140567, 129456, 293303, 288035, 180795, 80743, 74697, 164710, 288930, 391570, 470372, 535292, 577896, 538199, 358995, 120764, -70602, -213445, -336438, -425054, -448443, -359906, -158519, 63955, 189663, 206343, 211580, 228539, 212041]
12400B12041k0512R521O9539J17625N6411n7696q0612o091k2452j29504j65247
12389a6977j52274j37659q9220m703N3326L7981J7860K1054M0353P0950R8645
12378f0664J25185J14523R5597Q6202J6446q2518j17990j06974r6181q9253o3954
12367a79581l2727k1815k3301j0962M5606J36187J71712Q0012l8323m3513n441
12356G7854k4521n7811j08312j74940j44281J195J14671J22487M7800q6870k16738
12345d49466k71961k49705j75453o1121Q6634J68353J47321J13158R6493J02689
12335d93058J39018J09722L2766n712k1159k9880m1680l7905l1015m9861p6176
12324e04940j15098r8050J2594R8360P9371K9001m712l848M5060K2318o9435j30217
$$ y = [212041, 191529, 201050, 270589, 388214, 444625, 386929, 306317, 300226, 277774, 148270, -16977, -169251, -306910, -396130, -400833, -347507, -309526, -291666, -270612, -230259, -159309, -60664, 64521, 179044, 274641, 360843, 377289, 294771, 176781, 69807, -26374, -115627, -179581, -212308, -234123, -257424, -268386, -222780, -86593, 85119, 165131, 126808, 83295, 77854, 53333, -4478, -112790, -287730, -432011, -430816, -316145, -193658, -145858, -232728, -449466, -721427, -971132, -1146585, -1207706, -1121072, -952719, -805398, -692240, -595747, -493058, -354040, -244318, -211552, -217264, -238423, -268303, -309983, -347888, -378903, -428764, -504940, -620038, -718088, -705494, -607134, -527763, -498762, -503474, -507322, -462262, -439944, -509379, -639596]
12312f39596j14547O802J47372J71118J10535M0478K6673N5697O3397M9928O2252
12301a9891Q4464J350j25096j62578j07812m3531m0055p6381j01421o7903M2334
12290f16520J61405J93182J33568O6838M7554M1353K9725M7725P6381O7837M5507
12279B94555l030p5951r0323m0849J8179M5437J9708k6726o5440p8906k9483O6760
12267C3931J10455Q8829Q3154J01504Q6787O0709O6860N3738j8792j27151j97025
12256C42999j52111m2003L3225L3942l4468p2652p6865o2616l8307o8633j57576
12245b95065j99093j20719m2160j5592J7464J15453K32865K35536J12536K5976
12235F7201j1014p3195j30773j57707j59604j46087p7081K8299L3957n1519n3665
$$ y = [-639596, -754143, -747341, -599969, -428851, -318316, -277838, -251165, -195468, -132071, -82143, -19891, 64573, 65923, -59173, -221751, -329563, -373094, -413149, -489530, -590951, -658854, -616520, -455115, -261933, -128365, -61527, -13973, 27380, 57105, 104830, 181211, 249048, 294555, 291525, 215574, 125251, 84402, 102581, 148018, 167726, 141000, 75560, -3346, -32829, 33931, 144386, 233215, 316369, 417873, 504660, 565369, 632229, 685967, 667175, 540024, 342999, 190888, 148885, 182110, 216052, 181584, 108932, 32067, -30549, -68856, -137489, -295065, -494158, -614877, -657037, -672629, -655165, -539712, -306847, -71311, 41225, 67201, 56187, -17008, -147781, -305488, -465092, -611179, -688260, -659961, -626004, -677523, -731188]
12224g31188L1144J03722J19860P7878J0192L7528J50896J63764K4921j05294
12214a16577j10385j04549j33024j03925k41P9849J26879J39651P3172M777L2779
12203a11594J30562J98675K02248J33313O1758J9189n8404j58155k08319k72011
12193f2738l32948k89983j72881p9233o046Q2489J10967Q0135L9782R953O9284
12182e51219J52985J18293R824q1285j02836p5614m4127l982L8277N7124J06765
12171c75795J75698J42739n567j12490j24511r5274p6062p0359l5999J2417L1623
12160e33580l1852j24079j20680r0577j14642p9084M1959J16987J26918J49796
12150f58834J73047J57145J17505P7321L2177l5494p8435l3036K5499R350l8439
$$ y = [-731188, -700044, -596322, -476462, -398584, -388392, -350864, -199968, -36204, -11283, -116577, -226962, -331511, -464535, -568460, -568701, -488852, -361973, -222322, -149150, -144373, -111594, 18968, 217643, 419891, 553204, 614962, 634151, 575747, 417592, 209273, -62738, -395686, -685669, -858550, -937783, -943829, -861340, -750373, -670238, -630456, -620503, -551219, -398234, -279941, -270117, -351402, -454238, -529852, -573979, -577961, -539684, -482560, -375795, -200097, -57358, -62925, -175415, -299926, -395200, -471262, -541621, -577620, -565203, -533580, -565432, -689511, -810191, -900768, -1015410, -1094494, -1052535, -935548, -808630, -658834, -485787, -328642, -211137, -133816, -101639, -137133, -215568, -248604, -223105, -213755, -252194]
12139b52194m6466l3065o3721j08993j29407j71371k36485k17523o6518J22984
12129a202759K59718K27875P2494M114K4738L8970N1598K6578o7809j35494j17973
12118h17950p9374o7286o7095K140J23342J74209J36050O3584J7100N3744J10616
12107c50920J01227M6445J0476J1094Q5131J58011J31622N2504l1914r1282j28486
12096f092j50926j52822j04080n3984o5613n3274R616Q3354J42610J69407J68071
12085a3733J39215R5058K1325q2241r1507p619N9239N2697k572k4841j9771O240
12073A31490R4291J77124J44026K1383q9196j37267j54984j50249j46470j21335
12063b31187n4129O847J3640R491N9440J49369J83318J54418J15945Q9316J2505
$$ y = [-252194, -298660, -331725, -395446, -504439, -633846, -805217, -1041702, -1259225, -1325743, -1202759, -943041, -715166, -642672, -638558, -613820, -574850, -523252, -496674, -564483, -699977, -817950, -897324, -964610, -1031705, -1029565, -906223, -732014, -595964, -532380, -515280, -461536, -350920, -249693, -203248, -192772, -181678, -96547, 61464, 193086, 245590, 213676, 122394, -6092, -157018, -309840, -413920, -467904, -533517, -586791, -577175, -493821, -351211, -181804, -13733, 125482, 220540, 241865, 159624, 68117, 60498, 119737, 172434, 169862, 145021, 125250, 131490, 225781, 402905, 546931, 568314, 479118, 341851, 186867, 36618, -109852, -231187, -285316, -278469, -264829, -255338, -195898, -46529, 136789, 291207, 407152, 496468, 508973]
12052E08973j30987k40424k64804k25904j26058j6123J9088j437p053j3417m3341
12041e41487l1171K7447Q7962J14559J10371O1359m4325j61971j90400j14302
12031f81958K428J14574J62931J39606O2953R06k9069p6320j12840q3090m7472
12020e47351m4477k8621k298J3560O821L5760R5842R2433O0361K1110o0832n9479
12008d17171M9642J23513J52590J37403Q2461N5796L1476k7891p2657n5015j7420
11997D2727o336o4472j62156k23644k35892j64963k6248M6915K4006k0683l0310
11986h21056L0347P2300N7263O2046P0193L2701j578j6305n3154p8223j0165N1486
11974f04145K3733j2K1753N4419O4974K3079m0654n5006m0146m4829j3046N0213
$$ y = [508973, 377986, 137562, -127242, -353146, -479204, -495327, -476239, -477676, -484729, -498146, -541487, -572658, -545211, -457249, -342690, -232319, -170960, -215285, -377256, -567656, -681958, -679530, -564956, -402025, -262419, -199466, -198560, -227629, -303949, -416789, -499879, -547351, -591828, -620449, -622747, -609187, -602366, -566606, -470764, -378331, -317970, -296860, -357692, -417171, -367529, -244016, -91426, 45977, 128438, 184234, 215710, 187819, 115162, 60147, 42727, 36391, -28081, -190237, -413881, -649773, -814736, -840984, -794069, -770063, -790746, -821056, -790709, -718409, -661146, -599100, -528907, -496206, -497784, -514089, -567243, -645466, -655631, -604145, -580412, -580424, -558671, -504252, -439278, -416199, -456853, -511859, -552005, -596834, -609880, -559667]
11962e59667R4556R4521L4885r218K6349J06641J54238J15068J5671p0225j15688
11951a12869q2484j8419j0344M454L8040n308r0092j22847j10757o8707o469K0026
11939e65776K2596J1269k1120q500M6554K5301r4391k01417k50179k52764j78911
11928a467338r2080n3268l7158l4757k4681K8920J51266K66186K65152J88008
11918h09750J19414Q0712K9330k7432n7768j00861j16999n5934M9518R9140M0100
11907g50530j3751l9022m5520J3702Q0448N2281N814N1023J18127J57678J90587
11896a79163K02171K08070J99381J45471O4495k0605j05226j49756r7607j6450
11886B50781J5239M181k4894o7945r8723k6155R9123J39126P6574l7495j40418
$$ y = [-559667, -465111, -370590, -335705, -344923, -318574, -211933, -57695, 57373, 73044, 2819, -112869, -195353, -213772, -224116, -219662, -181622, -186930, -277022, -399869, -510626, -579333, -585802, -565776, -543180, -531911, -553031, -561531, -514977, -489676, -584067, -785484, -1035663, -1288427, -1467338, -1559418, -1612686, -1649844, -1684601, -1709282, -1680362, -1529096, -1262910, -997758, -809750, -690336, -609624, -580294, -607726, -665494, -766355, -883354, -939288, -889770, -790630, -750530, -764281, -803303, -848823, -835121, -754673, -702392, -696578, -645555, -527428, -369750, -179163, 23008, 231078, 430459, 575930, 640425, 619820, 514594, 364838, 267231, 250781, 266020, 270201, 245307, 177362, 78639, 52484, 151607, 290733, 367307, 329812, 189394]
11875A89394j86324j25320M9070J82976J96971J57227J01587O2194K9823l0409
11865F27189q5689j09120j72094k50331k41521j41186l3206K0822L3996N7899
11855b93241R2722Q2191K2564j8395L816K9228N8366J38617K16387K32664K01313
11844G66232J19399m5352k34220l18928k62582j83133j88069k02526j35110m3715
11834g28004J3815K7938k8237p6759m2938K9884L1843m4018q3724o7218n4246
11823a021664m0719j0570M9648Q9297M4788K2463P4052Q8097M8026O2173J28028
11812d66381J37454O0663k6923m7882k5174K8555J34415K19905J91275M6312j02795
11801A49424j46163r8711l9064K5076J05096J28597j09420m35390n55955m08447
$$ y = [189394, 3070, -122250, -73180, 109796, 306767, 463994, 565581, 627775, 657598, 627189, 541500, 432380, 260286, 9955, -231566, -372752, -405958, -385136, -351140, -293241, -200519, -118328, -95764, -114159, -110343, -81115, -22749, 115868, 332255, 564919, 766232, 885631, 840279, 606059, 287131, 24549, -158584, -346653, -549179, -684289, -728004, -714189, -686251, -714488, -791247, -834185, -804301, -772458, -816476, -900200, -967418, -1021664, -1062383, -1072953, -1023305, -934008, -889220, -866757, -792705, -704608, -656582, -594409, -466381, -328927, -268264, -295187, -343069, -368243, -339688, -205273, 14632, 205907, 252219, 149424, 3261, -95450, -134514, -109438, -4342, 124255, 14835, -420555, -976510, -1384957]
11791a384957L7540M44857M72746K71426R6086J4520l45J3605J1130m6490j36097
11780b05979j33562l5963J2118j1284j1652M985J719j0798J1264O1363J09646
11769b08143J72772J79932J01154k4316j65455k45940j95200o9820O2512J64104
11759b28400K09502J60444L5706l2453j7228j327m858m6369j83385k90693k44538
11748f43599r6461L7789O6778K7945o328j3198k3240l2899J7952Q8054O9068N0916
11736d57223J06833J49629J28547R0269O7954L6417P918K4161N4212K7559m9775
11725A86501j15904j12682l3769L1839J4046l1446m0886R186N8039K6359k3712
11714c2429K20O5596N5367q828n5624n2170m2497m7597J5124P2749K0819m7866
$$ y = [-1384957, -1347417, -902560, -429814, -158388, -62302, -47782, -48127, -34522, -23392, -69882, -205979, -339541, -375504, -363386, -374670, -386322, -381337, -379618, -390416, -379152, -317789, -208143, -35371, 144561, 245715, 221399, 55944, -189996, -385196, -455016, -392504, -228400, -18898, 141546, 177252, 144799, 127571, 126244, 121386, 75017, -108368, -399061, -643599, -740060, -702271, -635493, -607548, -613876, -627074, -650314, -683213, -665261, -577207, -508139, -457223, -350390, -200761, -72214, 18055, 86009, 122426, 130344, 154505, 208717, 236276, 186501, 70597, -42085, -75854, -44015, -29969, -61415, -102301, -93115, -35076, -8717, -32429, -32209, 33387, 88754, 79926, 24302, -27868, -70365, -117962, -102838, -30089, -9270, -57136]
11702e7136K7378J45718J16019m4393j73698k03662j79980r9836O903P7110J08558
11691b77019R3437L2554m2879p8743j0709J24799K10971J96464J46230N4342r1059
11680C58388j85081k31142k47246k15302j84626k14558k92422l31601o6804L70175
11670a240219N09436L84462K30817J29319O3213J9865K354J1901L8769O0287Q3950
11659B94154R3449N5147j5222r7098j45076j33747j00327q7545q4867p8849p7425
11648c77406p7553q4329o2355l7877k9667k390J3864M8265R7069Q8526N4194K7527
11636c42132J9856M8135O6459N105j13343j43476n1078L6593R4211J70317K46426
11625C7073K66388K12380J21570K8822l7967l2682N8873J36300J05288O764j09417
$$ y = [-57136, -29758, 115960, 231979, 187586, 13888, -189774, -369754, -469590, -462687, -385577, -277019, -183582, -151028, -193907, -272650, -283359, -158560, 52411, 248875, 395105, 449447, 358388, 173307, -57835, -305081, -520383, -705009, -919567, -1211989, -1543590, -1610394, -1240219, -730783, -346321, -115504, 13815, 77028, 96893, 99247, 111148, 149917, 210204, 294154, 387603, 442750, 427528, 330430, 185354, 51607, -48720, -136265, -221132, -299981, -377406, -454959, -539288, -601643, -639520, -669187, -671577, -657713, -609448, -512379, -423853, -369659, -342132, -322276, -274141, -207682, -202577, -315920, -459396, -510474, -473881, -379670, -209353, 37073, 303461, 515841, 637411, 666233, 628266, 595584, 654457, 790757, 896045, 902809, 793392]
11614G93392k32215l13388k82229j44475j3522L6230L8098K7508L259n857J4373
11603g8826M9345N5632J681m3199m0846k8205m0293n1173k0568L6019L9203L410
11591a17820j7586n4476j07532j28065o2655N7915J33105J15867R8960J09949
11581B7662P0717k218o4603j08341j19140j34978j20910m7229p638n402K3410
11570d88670O8998O9347J7679j7062K3615J01558J52237J78323J66422Q2924k1624
11559C33747p9363j43727k06788j50033j0417P4828K3619j09504j65834r0715
11549e24187K8268P1790j6750j17892q3904K9797J48929K37310K29718J21678
11539A24757k7381j12166j27756j35403j23594l4924Q2204J16234P5193L9100
$$ y = [793392, 561177, 247789, -34440, -178915, -192437, -156207, -118109, -90601, -87342, -93199, -78826, -29481, 26151, 27832, -15367, -56213, -84418, -124711, -175884, -196452, -160433, -121230, -117820, -135406, -189882, -297414, -425479, -488134, -430219, -297114, -181247, -82287, 27662, 98379, 96161, 31558, -76783, -195923, -330901, -451811, -499040, -506678, -512080, -488670, -419672, -350325, -332646, -349708, -326093, -224535, -72298, 106025, 272447, 355371, 333747, 254384, 110657, -96131, -246164, -256581, -181753, -158134, -267638, -433472, -524187, -495919, -424129, -440879, -558771, -642675, -612878, -463949, -226639, 3079, 124757, 97376, -14790, -142546, -277949, -401543, -436467, -354263, -238029, -162836, -123736]
11529a23736k5223j07555r7821r17J08075J61565J86470J80325J29007M5342o5625
11518C89907j86751k51881j99083q7169l7529n2429k9855O7305K11023K74085
11508I7623J64754L8583O989j8239p6189j27601j27919j13760j36531j53006o8228
11497e13524N7137J01296P0530K9968J3920L9135N7871O3222L2195l7329m6982
11486a32561p128j3793l6865j3300J9880J6674J3377K702o3174r8134l2488N5543
11474b89267O3969N063n6029p6703m4432r23k7496q7738p5589M1202J30212O3008
11462c54723l4138l0647M4497J43187J73356J16956M2078L6092Q6599P6815R036
11451C09108k7248q875O338l6260j37235k28820k20446j63066j61680k17549k29889
$$ y = [-123736, -148959, -256514, -354335, -355252, -247177, -85612, 100858, 281183, 410190, 455532, 389907, 203156, -48725, -247808, -334977, -372506, -424935, -454790, -387485, -176462, 97623, 262377, 300960, 307949, 289710, 213521, 85920, -41999, -155759, -292290, -445296, -513524, -456387, -355091, -284561, -254593, -240673, -201538, -143667, -80445, -48250, -85579, -132561, -139689, -153482, -190347, -203647, -183767, -167093, -153716, -151014, -214188, -312322, -344810, -289267, -225298, -220235, -276264, -352967, -397399, -398322, -425818, -513556, -589145, -547943, -417731, -354723, -388861, -419508, -375011, -231824, -58468, 58488, 100566, 136658, 223257, 300072, 309108, 281860, 272985, 279323, 243063, 105828, -122992, -343438, -506504, -668184, -885733, -1115622]
11440a115622j27347M3226J69845K34744K57591J97588N9282p9834j36616r1284
11430e88427k4869Q208L3678O3564J13503J82974J77536N3716l9907l3981n622
11419e9627n197k263j3900r5627j48753j24273l4275Q6869J55073J29348O2040
11408e0585k1878r3581m2283O9718P3975j8353o6383l0659K0055K9076K2877K8574
11396g9447O932k7327l832O3983R9956P4701R373q6555j82882j75933q0381N329
11384c76083N6096P2433L8149l4767m4542J8191L9350L0685p240p9718o7376P6684
11372b78138K14943K29027J23487l0144j09174q0125j7478K3072N1524Q0953O9567
11361B77514j064o2746j17305j79158j77642j24938p1556j6791J2519L4123P1039
$$ y = [-1115622, -1242969, -1199743, -1029898, -795154, -537563, -339975, -280693, -360527, -497143, -588427, -613296, -605088, -571410, -507846, -394343, -211369, -33833, 19883, -20024, -54005, -59627, -64824, -67087, -80987, -176614, -325367, -449640, -483915, -397046, -241973, -112625, -50585, -72463, -166044, -208327, -138609, -64634, -82987, -149370, -180029, -159974, -130898, -108021, -79447, -72515, -99842, -103674, -39691, 60265, 134966, 144339, 57784, -125098, -301031, -381412, -376083, -319987, -247554, -209405, -244172, -288714, -270523, -231173, -200488, -207728, -287446, -354822, -278138, -63195, 165832, 289319, 259175, 150001, 69876, 52398, 75470, 126994, 207947, 277514, 276450, 213704, 96399, -82759, -260401, -385339, -456895, -473686, -461167, -427044, -356005]
11350c56005R2214J12777J40254J52039J30183M2451j03297j64416n9133P4824
11340F1891J48081K02044K34900J39151j16097l53731l95369k84121j18220M2285
11330d39186J03190Q2734J15145J32300N4107n1844p7237k7489L9173N8859j5820
11319b6068q1743n9238m3586j00935j53538j32402o2925m649K4355K2882K1885
11308e95962M4153N6412M5107M5324O7702N9546l8712j55011k00402j66088n8472
11297h96403O0033J22288J35224Q3838K4386M4590J11213J27876Q5127N4705N5971
11286H848L5790l3051k4167Q5441J46541J19652K6415p2275j10593j12739q0535
11275a0673m4555o6448p2088q089J18458K29746J80482O117j05789q2009l9233
$$ y = [-356005, -263791, -151014, -10760, 141279, 271462, 313913, 210616, 46200, -12933, 61891, 209972, 412016, 646916, 786067, 669970, 316239, -79130, -363251, -481471, -439186, -335996, -253262, -138117, -5817, 48290, -3554, -80791, -108280, -69107, -10248, -26068, -107811, -167049, -210635, -311570, -465108, -597510, -660435, -665084, -640729, -617847, -595962, -551809, -495397, -450290, -404966, -337264, -277718, -316430, -471441, -671843, -837931, -896403, -836370, -714082, -578858, -495020, -470634, -426044, -314831, -186955, -101828, -47123, 8848, 44638, 11587, -12580, 72861, 219402, 339054, 365469, 293194, 182601, 69862, -10673, -55228, -121676, -193764, -201853, -83395, 146351, 326833, 332950, 227161, 145152, 105919]
11264A05919k9040k0723P801K8580K3792K0324j9470r3896n6646Q1661J64520
11253B12822J34216N8970P3m3729p6233r7988q5290l9180n226R589M9853Q9593
11241B07470R4782R5623R3377Q6120Q4895O5580j4819j25327j85360j83785j57801
11230F0755j02304N880J04417J28897J03640N2567k1127r1587j53571j78816j35424
11219b26673m8215j3335m6411m2076J069J1231J0011K5928K6505L739k542k5912
11207c26681r1497j33290p5126K7489O4294Q6004J07658P1152K6224N1240J27846
11196f4687J87813J83814Q0337o2417j18365r0822k4554P6611J01626J5986p6657
11185B08685q2631j3022K6019N224l5639l8326K5952J49249K47885K07654L9612
$$ y = [105919, 76879, 56156, 63957, 92537, 116329, 136653, 117183, 23287, -33359, 48302, 212822, 347038, 406008, 406081, 362352, 286119, 188131, 102841, 63661, 58435, 68024, 117877, 207470, 302252, 397875, 491252, 577372, 662267, 727847, 713028, 587701, 402341, 218556, 60755, -41549, -35669, 68748, 197645, 301285, 353852, 332725, 241138, 87567, -91249, -226673, -274888, -288223, -334634, -376710, -375641, -364410, -354399, -328471, -301966, -298227, -300769, -326681, -418178, -551468, -626594, -599105, -534811, -448807, -341149, -269997, -243773, -192533, -64687, 123126, 306940, 387277, 324860, 206495, 115673, 91119, 167730, 269356, 285342, 208685, 126054, 113032, 139051, 144275, 108636, 70310, 96262, 245511, 493396, 701050, 740662]
11174G40662q6284o7257J2324N7615L9406k4868r8527j38689j55423j88206k04169
11163a13416j20930K0208J04872Q9457O6419R5065O4656l0252p3807p4859j11662
11152h4249j48380j35134p9058n0223m2851K3601J10945J22332Q3497k198j07601
11141c09319j24981n9332J8983K5509m3552r4673n4079J8998O0545O6006O3719
11130d32176J00554J49464J39923M9608p3079j27348j20805j32547j15276k3959
11120e85641Q3989J36376J47491J47835J37863J08588N5229n882p3452j31312
11110B1084j62096j37320l8142P8158R7738R500q2990j01823m7288K4999M2816
11099b95364O833K6536R1109R2996O7771J9881p4008j77962j90944n9204Q2650
$$ y = [740662, 654378, 587121, 599445, 657060, 696466, 671598, 573071, 434382, 278959, 90753, -113416, -234346, -214138, -109266, -19809, 46610, 141675, 206331, 176079, 102272, 27413, -84249, -232629, -367763, -446821, -497044, -539895, -516294, -405349, -283017, -199520, -201718, -309319, -434300, -493632, -474649, -449140, -492692, -587365, -641444, -622446, -561901, -495895, -432176, -331622, -182158, -42235, 7373, -65706, -193054, -313859, -446406, -561682, -585641, -501652, -365276, -217785, -69950, 67913, 176501, 231730, 225848, 152396, 21084, -141012, -278332, -316474, -238316, -140578, -131078, -214068, -315891, -363179, -338180, -295364, -288531, -261995, -170886, -77890, -10119, 9762, -64246, -242208, -433152, -492356, -409706]
11088d09706J15934O5622K0316J7518L6784L6518J8650K5104K6509l5705j30316
11077b12772j64966p7028M3524Q7365J13013J88385K44287J93821J08774P7000
11067F01403K6474n0782k4537O2998R0907R0142J48243K16973J95099J09658k3437
11056A443141j44315j67602j25558q7454r7574j07215n830J71613K28865J35571
11046A243642O1661N7187K0352k024M5850J03834J24298J13657R9409N9961k9764
11035A898063j53908k36351j83227q0759m5895k3770N574K4495L8121L6846R101
11024A288290j0364J7704Q0477Q3959L8599J4497L4810Q8251J47831J67938J08528
11013B060520l264j29157k53950k62334j32485j9178L9247P8526P2757O6728L3314
$$ y = [-409706, -293772, -228150, -207834, -190316, -153532, -117014, -98364, -73260, -46751, -82456, -212772, -377738, -454766, -411242, -323877, -210864, -22479, 221808, 415629, 524403, 601403, 627877, 577095, 552558, 615556, 706463, 796605, 944848, 1161821, 1356920, 1466578, 1443141, 1298826, 1131224, 1005666, 918212, 820638, 713423, 707593, 879206, 1108071, 1243642, 1305303, 1362490, 1382842, 1380818, 1426668, 1530502, 1654800, 1768457, 1867866, 1927827, 1898063, 1744155, 1507804, 1324577, 1243818, 1197923, 1174153, 1179727, 1204222, 1242343, 1279189, 1288290, 1277926, 1295630, 1376107, 1460066, 1498665, 1513162, 1547972, 1636223, 1784054, 1951992, 2060520, 2057256, 1928099, 1674149, 1411815, 1279330, 1260152, 1299399, 1377925, 1450682, 1517410, 1550724]
11002A550724p1126j17357p9431j7442L0705n531j07372j72554j37550j6143K2323
10991H79246m5911q5816r0757o6191J2137P6083P5211N6942j2806j04926j10484
10980E82728l2743R0413J57378J55909J49673J09140M3021p898l8817m6547k2518
10969A139739N5781J59269K25153K17556J27828L2297l839M6873R1691N6602L144
10958B152094m6827q0961n4327K6284R3554J30119J30609M5797o4796p3216K8132
10947B286462J46401K10927K44149K38989K20907K47981K88960L57192M51111
10938D693079M59697L45654J97774Q4089P065o303N0445J21986J34873P4095j7355
10927F145099p7580p1653p9637j79888k87441l19640l35417l54323l29824l15383
$$ y = [1550724, 1479598, 1362241, 1282810, 1265368, 1296073, 1290542, 1183170, 1010616, 873066, 856923, 879246, 833335, 747519, 656762, 590571, 602708, 678791, 754002, 810944, 798138, 693212, 582728, 549985, 640398, 797776, 953685, 1103358, 1212498, 1255519, 1247621, 1208804, 1162257, 1139739, 1195520, 1354789, 1579942, 1797498, 1925326, 1957623, 1953784, 2000657, 2092348, 2148950, 2152094, 2105267, 2024306, 1969979, 1996263, 2089817, 2219936, 2350545, 2396342, 2331546, 2258330, 2286462, 2432863, 2643790, 2887939, 3126928, 3347835, 3595816, 3884776, 4241968, 4693079, 5152776, 5498430, 5696204, 5780293, 5787358, 5781055, 5831500, 5953486, 6088359, 6162454, 6145099, 6067519, 5995866, 5916229, 5736341, 5448900, 5129260, 4793843, 4439520, 4109696, 3794313]
10917C794313l31374l39234l65645l81420l30436k30675j67577j66233j65029
10908A316690j66388j93011k01902k15000j99828r3822J9482R8369J58151J66756
10898F89497P7546k3831l1289j7649p5043j50857j26609l088J17941J41963R8050
10887F96631Q4440J45655J87151J50728J11463R2092Q049j42367j99193j64933
10877I69716j28356r8691n2982k0906p1747j62723j41133j9416L2915R989J1363
10866C28029K2279J5333P447M1934Q3927P8712O8826P5716O8789K957j16409k07893
10854D69647k28297j76052j16109q7016k8313N6082Q9277O5463K6490J5140m675
10843H1637j10683k22021k22799j53323r0068p723O7865R0183J14026J83984K17316
$$ y = [3794313, 3462939, 3123705, 2758060, 2376640, 2046204, 1815529, 1647952, 1481719, 1316690, 1150302, 957291, 755389, 540389, 340561, 246739, 266221, 364590, 522741, 689497, 767043, 743212, 711923, 694274, 619231, 468374, 341765, 338677, 456618, 598581, 696631, 781071, 926726, 1113877, 1264605, 1376068, 1468160, 1476209, 1333842, 1134649, 969716, 841360, 742669, 689687, 668781, 597034, 434311, 293178, 273762, 306677, 316666, 328029, 350308, 365641, 373088, 415022, 498949, 577661, 646487, 722203, 790992, 793949, 677540, 469647, 241350, 65298, -50811, -137827, -166140, -110058, -20781, 44682, 71172, 86312, 81637, -29046, -251067, -473866, -627189, -717257, -724980, -657115, -566932, -452906, -268922, -51606]
10832e1606J86751J31935P5875L0886J5690L1188M7413K9677L6955R0537J05163
10821G30464L2208j20699k66392l24264k92352j72151J2564Q5829L1257j950P859
10810b77627L6478J1931j0747M1999P0818K1185n5755j27255j35093o9020l061
10799d96147M7488J13478J93120K24958J52566O5276L6114M947j03258k51860
10789a3318k87016j67917P059P5225M538o0498J7537J84898K50844J59886j4937
10778A56301j56670j37644l0945K9642L451l9275l4923j9678m7496j37814k01311
10767f16362j75158j12204p0366m6776l622R1912K10383K87218K55281J03579
10757g6115q7099j75049j36669n0579K8583Q0844P8828J9887j9182j9383m1667
$$ y = [-51606, 135145, 267080, 342955, 373841, 389531, 420719, 468132, 497809, 534764, 625301, 730464, 762672, 641973, 375581, 51317, -241035, -413186, -400622, -314793, -283536, -285486, -277627, -241149, -229218, -239965, -197966, -127148, -105963, -161718, -288973, -424066, -493086, -496147, -448659, -335181, -142061, 82897, 235463, 300739, 336853, 341800, 238542, -13318, -300334, -468251, -461192, -385967, -381429, -441927, -424390, -239492, 11352, 171238, 156301, -369, -138013, -168958, -139316, -135865, -175140, -210063, -229741, -277237, -415051, -616362, -791520, -903724, -974090, -1020866, -1024488, -932576, -722193, -434975, -179694, -76115, -163214, -338263, -474932, -525511, -496928, -416084, -337256, -317369, -336551, -355934, -397601]
10746c97601p1990l7611M1530J17346J62088J82167J47308N5412J7713L4275M0549
10735B91186P119n0696q1101o7193L5218J20639P1703k6061p0584q8000r5266
10724D6964p0564j6515K5812M6591O9058Q9814Q3624L4620j6763l2396j7493K1492
10712B64244K3130o9408j32063l8253Q7511J03433M8201j1830k0619L2856P0991
10701C58193L1628j8759k760O3183Q8742L0621k9980j0937L3317O5643P6874L7819
10689G23584k7521r0937j35006j12524p1122p9018j11747j54007j82662k03229
10679d44189j84043j14953n9518k1090p721m0318k9277L9463N8593l1733j35344
10668i70130j40540j26839j33616j19187q4976J0447J35968J54996Q6689Q9873
$$ y = [-397601, -469591, -507202, -465672, -348326, -186238, -4071, 143237, 198649, 216362, 250637, 291186, 298305, 247609, 166508, 99315, 134533, 255172, 326875, 300814, 230230, 142230, 46964, -23600, -40115, -14303, 32288, 101346, 191160, 274784, 309404, 292641, 260245, 242752, 264244, 287374, 217966, 85903, 47650, 135161, 238594, 286795, 274965, 254346, 287202, 358193, 389821, 371062, 368302, 431485, 520227, 550848, 520868, 509931, 543248, 608891, 685765, 723584, 696063, 605126, 470120, 357596, 286474, 207456, 95709, -58298, -240960, -444189, -628232, -743185, -802703, -823793, -831514, -871832, -901109, -861646, -803053, -834786, -970130, -1110670, -1237509, -1371125, -1490312, -1575288, -1564841, -1428873, -1273877, -1187188, -1097315]
10658a097315J44137J47601J34885J12599P2211N8077R1873J09138N0173k9106
10648b05727n0883n9696n5839J5531J20373J58787J17360L6775n2560j11527j58070
10637b45476j92494k10749k24626j86185j17068j0042J61088K51387K06559J18873
10627d48733J1073j07729j33862r6752m8705P1852K02199K04129O1371o0114q4044
10616d29315r8518j05843n9296j93K8669M5705L0932N084N5200J47147J74892
10605b05536J65214J77017J86997J82844R8689n7189j18686r6664q2350j04173
10595A46163j31737j20979o3478m3339r1184j03765n8617K8350P9551L1618J7489
10584c09928J22367J83261J44979J04642R5106Q6744M0768K68j1676k7594n8606
$$ y = [-1097315, -953178, -805577, -670692, -558093, -485882, -427805, -335932, -226794, -176621, -205727, -256610, -316306, -372145, -356614, -236241, -77454, 39906, 76681, 24121, -87406, -245476, -437970, -648719, -873345, -1059530, -1176598, -1186640, -1025552, -774165, -567606, -448733, -437660, -545389, -679251, -776003, -824708, -752856, -550657, -346528, -285157, -345271, -429315, -527833, -633676, -692972, -693165, -664496, -618791, -587859, -582775, -527575, -380428, -205536, -40322, 136695, 323692, 506536, 605225, 548036, 429350, 332686, 250336, 146163, 14426, -106553, -170031, -213370, -304554, -408319, -466936, -438586, -359035, -327417, -309928, -187561, -4300, 140679, 245321, 340427, 427171, 467939, 468207, 456531, 428937, 370331]
10573C70331o8597o1280q6383j33437j47932q3152J4893M7818k82p4879j12019
10562c34919m0208M4475M2358j3303r3009j58805j33963l2071P6902J21261Q8451
10551d32831P1843P2322O5990O1591M2355J8212k0835n6033m9514n0652o5643
10540c43195j9423O3524J21635J53053J69481J77261K04107K19411J47404L3336
10530I26594p0603j29404j12220p1757p8614q9439r9744j09264l9100O7728J25686
10519C19863J13324J01637J29275P6452m0341r7262q7210o7760r3310j42923j82798
10508B8947k09609j74470n3525O9460Q8214L4820J3678Q5718J75983J95621J41489
10497C96326O0625p076j5514M5271O5778m0683j75056k25238j79499l7126R3889
$$ y = [370331, 301734, 240454, 154071, 20634, -127298, -210450, -195557, -147739, -148021, -222900, -334919, -375127, -330652, -288294, -301597, -394606, -553411, -687374, -719445, -642543, -521282, -432831, -360988, -288666, -222676, -161085, -118730, -100518, -121353, -177386, -226900, -277552, -343195, -362618, -299094, -177459, -24406, 145075, 322336, 526443, 745854, 893258, 926594, 855991, 726587, 614367, 542610, 463996, 374557, 274813, 165549, 126449, 194177, 319863, 433187, 534824, 664099, 740551, 700210, 602948, 515738, 447978, 354668, 211745, 28947, -180662, -355132, -408657, -339197, -250983, -216163, -202485, -116767, 59216, 254837, 396326, 456951, 449875, 434361, 479632, 545410, 504727, 329671, 104433, -75066, -112192, -18303]
10486a8303J09913K7157m7026j8756Q2925J14353O2232K8681M5575J11971J50725
10475F49447J08229L8604J1322M612m1431j02687j40092j31285n6911M0501P9371
10464D59680L6984m6870j26998j62693r9632k670K2577n892M295M3938J5197r4372
10452D3544j87495j64663p2527J8440J02561J19055J363j88693l11388k75449
10442i15252j81327j34915m7375N5285N9764N6896Q6718R7964J16165J19697J15270
10431e71110J43221J68692J43966R1888J0358q5565j33867p5035M9528R7975P3916
10420h6033L8216j4580n8187n3603n2893p3790n1697l0398l5048r362P3883J66918
10408a86574K11230J64827P0135J2403P35J9324m430k9300J3438N2273L1775k3568
$$ y = [-18303, 91610, 118767, 71741, 52985, 135910, 250263, 312495, 341176, 386751, 498722, 649447, 757676, 796280, 807602, 812214, 770783, 668096, 528004, 396719, 339808, 380309, 459680, 496664, 449794, 322796, 160103, 60471, 57801, 80378, 74486, 78781, 122719, 137916, 43544, -143951, -308614, -381141, -362701, -260140, -141085, -139722, -328415, -639803, -915252, -1096579, -1231494, -1278869, -1223584, -1163820, -1106924, -1020206, -922242, -806077, -686380, -571110, -427889, -259197, -115231, -23343, -12985, -98550, -232417, -307452, -257924, -159949, -86033, -47817, -62397, -120584, -174187, -227080, -300870, -352567, -382965, -418013, -427375, -353492, -186574, 24656, 189483, 259618, 272021, 272756, 292080, 287650, 258350, 271788, 324061, 355836, 332268]
10396C32268n5588n5549o7961j27925j94522k15359j70595q0545K2196Q6425N5625
10385d71530k271m9899q5593j03206j18352q9166k7432L5025Q7991J22938J38657
10374e62838R3396M1119N9794P0497K8882j1554m3138n6274l6866K5430J12409
10363b79143J49372J31483J15351P7268N889l0605j3619L518j1205m6246m8047
10352E4016J6735Q8401J06669L8791q3550j46985j33518n3426P8012J38795J12675
10341B16615M8244m4232p3939M6465J74043J34520j2974j18183o7649L8790K5769
10330C67469p7722j31558j08343k5374J01745J75259J56897P7654j8302r6274
10320D21451j26447j28597j25915o0586J1641J4134j5683n0945q1541j01895r4685
$$ y = [332268, 276680, 221131, 153170, 25245, -169277, -384636, -555231, -635776, -613580, -527155, -471530, -473801, -523700, -609293, -712499, -830851, -920017, -947449, -912424, -824433, -701495, -562838, -469442, -428323, -368529, -298032, -269150, -280704, -323842, -380116, -416982, -391552, -279143, -129771, 1712, 117063, 194331, 200220, 169615, 155996, 159514, 148309, 102063, 54016, 70751, 159152, 265821, 304612, 221062, 74077, -59441, -112867, -34855, 103940, 216615, 264859, 220627, 146688, 193153, 367196, 501716, 488742, 370559, 302910, 341700, 367469, 289747, 158189, 49846, 24472, 126217, 301476, 458373, 536027, 517725, 421451, 295004, 166407, 40492, -20094, -8453, 5681, -10002, -60947, -142488, -244383, -339068]
10309c39068k4293L7584m380o8531n2115J6129J02195J94298K22472J80283R6300
10298C60874m7007j51793j41661q5205j8194L1248L8997P2416J05169M4827m6926
10287A62745n4511J1700O8713J01358J37121J25578L5284n0517j11390j41814
10277B84267j35799j58769j96699j49080l4573M1722O7011P6966N7096J0913l5905
10266a72850p3663p1615j5198L6888O5521J04880R1286J2885m8946m4985p709
10255a23506J8870R4630J67423R3933n8425q6350j1383N8322R7947P1396N804
10244C28661n2023r5647j20847j27338j13958o8111J967P2748P3758K8948k311
10233g4153p0877j17834n5277K1371M0039O2053Q4659q135j46921j76966j36675
$$ y = [-339068, -363361, -325777, -330157, -398688, -450803, -434674, -332479, -138181, 84291, 264574, 360874, 313867, 162074, 20413, -64792, -82986, -51738, -12741, 59675, 164844, 209671, 162745, 108234, 119934, 188647, 290005, 427126, 552704, 587988, 537471, 426081, 284267, 148468, -10301, -207000, -356080, -390653, -348931, -281920, -204954, -147858, -136945, -172850, -246513, -318128, -333326, -296438, -230917, -126037, -34751, -21866, -70812, -115797, -123506, -104636, -10006, 157417, 251350, 192925, 106575, 95192, 153514, 251461, 322857, 328661, 276638, 180991, 60144, -67194, -181152, -249263, -247296, -174548, -100790, -71842, -74153, -145030, -262864, -318141, -296770, -256731, -194678, -110019, -118154, -265075, -442041, -578716]
10222e78716j03034p9959k8869J5495J3647K8563M5562J8157K6429J34440J94632
10211c13653J45684J15734J63748K01041J40738L5523o2951j34735j93617k43088
10201a45576k26592j16333M107P5862J42567J74257J24899L4258o724j709o0691
10190a675j29548r0619l7567p7148j73324j83006n2146O7029R5000O0792k1919
10179e44131q1082m9952K0459N5408J06363J84183J83756J22889N5555J4375M0118
10168A07941O9680K7680m1704m6949M2172Q5292Q789p9498j12263q8243j4639
10157d1742Q0261J29899Q5160O519k1702k6978m8462r8842j17871q3352m0202
10146a77312O480P3219J21523R2275O2046R5577J22932Q4518J6498j4179l8555
$$ y = [-578716, -681750, -761709, -790578, -775083, -761436, -732873, -687311, -669154, -642725, -508285, -313653, -167969, -52235, 111513, 312554, 453292, 488815, 425864, 291129, 97512, -145576, -372168, -488501, -484394, -408532, -265965, -91708, 33191, 67449, 60725, 59016, -1675, -131223, -221842, -259409, -336557, -509881, -692887, -745033, -678004, -583004, -522212, -544131, -625213, -675165, -654706, -599298, -492935, -308752, -124996, -2107, 53448, 67823, 107941, 177621, 205301, 163597, 116648, 158820, 244112, 252901, 173403, 61140, -27103, -41742, 38519, 168418, 253578, 260097, 238395, 211417, 162955, 64113, -53758, -137110, -177312, -170832, -97613, 23910, 116185, 178231, 273808, 396740, 481258, 497756, 483577, 445022]
10135D45022p4984p8451j04673j72773j98249j38218m6790L5543J03327J26119
10125a04127J08122P8796N7003L5162N260K2670L9766p206p2287j13910j17871
10114f8622p8776k5615J2353J0779k556l6157q4364j41726k22441j99190j8477
10103h54792J28141J24890P1417Q2688J39987J46695R2684J8359o1991q8694k6432
10092b27048J0922k4920n4339o4770l4150L6635N4314K5008K9700M3814m734q7861
10080b97429j08691n7745K5453R5616J34731J78663K35758K31139J50173P7744
10070F65412J8530k8001q2121j71596k54339k40088j10982N0739J48163J46713
10060A42430R9263L6057m3458j23840j44255n5377N3566Q7875P8047O9673O9519
$$ y = [445022, 370038, 291587, 186914, 14141, -184108, -322326, -369116, -333573, -230246, -104127, 3995, 82791, 139794, 174956, 180216, 202886, 242652, 235446, 163159, 49249, -68622, -147398, -173013, -160660, -149881, -152437, -188594, -272958, -414684, -637125, -836315, -854792, -726651, -601761, -530344, -447656, -307669, -160974, -68290, -49931, -111922, -200616, -227048, -216126, -241046, -295385, -360155, -394305, -357670, -303356, -278348, -248648, -204834, -209568, -297429, -406120, -463865, -438412, -342796, -208065, -29402, 206356, 437495, 587668, 665412, 683942, 655941, 573820, 402224, 147885, -92203, -203185, -152446, -4283, 142430, 241693, 277750, 234292, 110452, -33803, -89180, -35614, 52261, 130308, 199981, 269500]
10049B69500M8827k2069p8585r5382m3291Q7931K03598K27272J84372J01006j2560
10038H70619j29649j80749k11106k99317l01816j60223l5307K1114K1599l1513
10028d36348o1083m7385j3858k003J6971R1580J54864J49851Q3955P4563J39664
10017A50771J32072K6313m1994m5146p0971j35593k04593k44783j92890o3075
10007f89889O9271J31270J14027O2116M6374R6674J30228Q8698M6504Q6574J43317
9996C25164J16480J3418p8038o4804k868j8729m9943l852P0016P2597l1514j38591
9984B09336j16880j7805N9475Q0752N9256r634j09268j71937j39201o5359l9107
9973b60372o2230l8489M0588Q2377R1328Q2046N2859P551j00719k03324j89387
$$ y = [269500, 318327, 296258, 217673, 122291, 79000, 166931, 370529, 597801, 782173, 883179, 870619, 740970, 560221, 349115, 49798, -252018, -412241, -447548, -426434, -404835, -436348, -497431, -544816, -558674, -560677, -543706, -452126, -297262, -147411, -63456, 11107, 150771, 282843, 309156, 267162, 222016, 151045, 15452, -189141, -433924, -626814, -689889, -620618, -489348, -375321, -313205, -266831, -170157, -39929, 48769, 95273, 181847, 325164, 441644, 455062, 377024, 312220, 309352, 290623, 240680, 236828, 306844, 379441, 347927, 209336, 92456, 74651, 134126, 214878, 274134, 264500, 155232, -16705, -155906, -221265, -260372, -322602, -361091, -320503, -238126, -146798, -64752, -11893, -4342, -105061, -308385, -497772]
9962d97772j12334m5376j5451k0489l0507l6586k4595J3526M1995r306q2895r5151
9950i14941n0845K2831N4538K3914o6265j59892j16090N9972J88165J70597Q4516
9939g03500P0022J13131J41569J60183J80150J34798R370p7276n2664N852O4494
9928D6129J49776J96172J53956L2669o1830o4292R483J04506J31692Q1701K1409
9917H01371l5237j34753k20361k22527j80589j26764p3055l5713k3304k6858J8941
9906b58849R5210N5723m4583l8419L8910O9340L7503p696n6268m7126L1626J00121
9894b4508R5545M0959M33j260J4495k8306j43156k17036j89184j25629q7317o1040
9882g26004k9086j5270K2529J17118J87169J60878J04358N5099k8871j02819p8642
$$ y = [-497772, -610106, -655482, -670933, -691422, -721929, -758515, -783110, -769584, -727589, -736895, -819790, -914941, -965786, -942955, -888417, -864503, -930768, -1090660, -1206750, -1146778, -958613, -788016, -703500, -633478, -520347, -378778, -218595, -38445, 96353, 105723, 28447, -24217, -18365, 46129, 195905, 392077, 546033, 578702, 516872, 452580, 462063, 566569, 698261, 779962, 801371, 766134, 631381, 411020, 188493, 7904, -118860, -191915, -227628, -250932, -277790, -258849, -163639, -107916, -152499, -190918, -152008, -82668, -45165, -52861, -109129, -156255, -124629, -24508, 71037, 111996, 112429, 111169, 125664, 97358, -45798, -262834, -452018, -577647, -664964, -726004, -755090, -770360, -747831, -630713, -443544, -282666, -178308, -123209, -152080, -254899, -333541]
9871c33541J2061R5310J38515J47403J36008P2482q165k5162r512R450l112m3588
9859A88149k0257q225m3798p6510m1826K6197M7100O1855N6784n506n5775j1807
9847A16381O2726L0050m4098p324P6954Q0079N418q5606j31023q8750k9179O920
9835g452M7578O5031L0028P419M1921Q3880R8742O4433j0374o0446k0635P4650
9823D14775Q4533J095k2097M8062R9610J21426R3349L0934K0579P6978J22679
9812A091923O2548q9842k42927k89744k40507j60511n2630P793j9626l9425P683
9801C4735O1045P3583M9172L7923M8065O9512Q8145Q0601O8752O5496L5358J0352
$$ y = [-333541, -321480, -226170, -87655, 59748, 195756, 268238, 260073, 234911, 225399, 234849, 231737, 188149, 167892, 159667, 115869, 39359, -2467, 23730, 70830, 132685, 189469, 183963, 128188, 116381, 179107, 209157, 165059, 157735, 234689, 314768, 320186, 234580, 103557, 14807, -14372, -7452, 40126, 105157, 135185, 142604, 184525, 268405, 367147, 431580, 421206, 360760, 340125, 414775, 499308, 500403, 478306, 526368, 625978, 747404, 840753, 871687, 892266, 969244, 1091923, 1154471, 1064629, 821702, 531958, 291451, 130940, 78310, 86103, 66477, 27052, 34735, 95780, 169363, 218535, 256458, 304523, 374035, 462180, 542781, 611533, 677029, 712387, 722739]
$$ [...]
##END NTUPLES=NMR SPECTRUM
##END=
