##TITLE=C13_DE-75K3_NaOH
 D2O, 22100sc

 13.1.2025
##JCAMPDX= 6.0         $$ Bruker NMR JCAMP-DX V2.0
##DATA TYPE= NMR SPECTRUM
##DATA CLASS= NTUPLES
##ORIGIN= UXNMR, Bruker Analytische Messtechnik GmbH
##OWNER= root
$$ XWIN-NMR		Version 3.5
$$ Tue Jan 14 13:40:25 2025 Russian Standard Time (UT+4h)  she@DPX200
##.OBSERVE FREQUENCY= 50.327896
##.OBSERVE NUCLEUS= ^13C
##.ACQUISITION MODE= SIMULTANEOUS
##.ACQUISITION SCHEME= undefined
##.AVERAGES= 22101
##.DIGITISER RES= 17
##SPECTROMETER/DATA SYSTEM= spect
##.PULSE SEQUENCE= zgpg30
##.SOLVENT NAME= CDCl3
##.SHIFT REFERENCE= (INTERNAL, CDCl3, 0, 222.565)
##AUDIT TRAIL= $$ (NUMBER, WHEN, WHO, WHERE, WHAT)
$$ ##TITLE= Audit trail, XWIN-NMR		Version 3.5
$$ ##JCAMPDX= 5.01
$$ ##ORIGIN= Bruker BioSpin GmbH
$$ ##OWNER= she
$$ F:/spectra/data/she/nmr/c13/1/pdata/1/auditp.txt
$$ ##AUDIT TRAIL=  $$ (NUMBER, WHEN, WHO, WHERE, WHAT)
(   1,<2025-01-14 13:39:19.68 +0400>,<she>,<DPX200>,
      <created by zg, POWCHK disabled, PULCHK disabled
       terminated by command 'halt'
       configuration hash MD5:
       00 E9 B6 7A A2 85 ED C7 34 08 36 98 17 FE 4E 26
       data hash MD5: 32K
       BE 0C DC 87 36 7C FC B4 C5 90 74 16 BD A7 B2 D1>)
(   2,<2025-01-14 13:39:22.64 +0400>,<she>,<DPX200>,
      <Start of raw data processing
       efp BC_mod = 2 LB = 2 FT_mod = 6 PKNL = 1 PHC0 = -423.994 PHC1 = 45.28833 SI = 32K 
       data hash MD5: 32K
       DE B2 50 60 08 95 F8 E1 93 11 CD A4 48 F4 BD A0>)
(   3,<2025-01-14 13:39:25.39 +0400>,<she>,<DPX200>,
      <abs ABSG = 5 
       data hash MD5: 32K
       BF 9D EB C9 D7 52 C8 D7 03 81 B1 BD 14 98 FC 62>)
(   4,<2025-01-14 13:39:45.00 +0400>,<she>,<DPX200>,
      <pk PHC0 = 14.62992 PHC1 = -22 
       data hash MD5: 32K
       F8 FB 34 00 09 06 60 84 D3 85 5F 61 E7 FE 38 7F>)
(   5,<2025-01-14 13:39:48.46 +0400>,<she>,<DPX200>,
      <abs ABSG = 5 
       data hash MD5: 32K
       B1 29 C9 B9 8E 4E FA DF 82 85 F1 0D 14 74 23 AD>)
$$ ##END=
$$ 
$$ hash MD5
$$ 6D 16 2E 78 69 70 EA E0 7E 10 04 35 43 87 20 96
##$RELAX= 
##$RELAX= 
##$RELAX= 
##$RELAX= 
##$RELAX= 
##$RELAX= 
##$RELAX= 
##$RELAX= 
$$ Bruker specific parameters
$$ --------------------------
##$DU= <F:/spectra>
##$EXPNO= 1
##$NAME= <c13>
##$PROCNO= 1
##$TYPE= <nmr>
##$USER= <she>
##$AMP= (0..31)
100 100 100 100 100 100 100 100 100 100 100 100 100 100 100 100 100 100 
100 100 100 100 100 100 100 100 100 100 100 100 100 100 
##$AQSEQ= 0
##$AQ_mod= 1
##$AUNM= <au_zg>
##$AUTOPOS= <>
##$BF1= 50.322709
##$BF2= 200.13
##$BF3= 50.322709
##$BF4= 500.13
##$BF5= 500.13
##$BF6= 500.13
##$BF7= 500.13
##$BF8= 500.13
##$BYTORDA= 1
##$CFDGTYP= 0
##$CFRGTYP= 5
##$CHEMSTR= <none>
##$CNST= (0..31)
1 1 145 1 1 1 1 1 1 1 1 1 1 1 1 1 1 1 1 1 1 1 1 1 1 1 1 1 1 1 1 1 
##$CPDPRG= <waltz16>
##$CPDPRG1= <>
##$CPDPRG2= <waltz16>
##$CPDPRG3= <>
##$CPDPRG4= <mlev>
##$CPDPRG5= <mlev>
##$CPDPRG6= <mlev>
##$CPDPRG7= <mlev>
##$CPDPRG8= <mlev>
##$CPDPRGB= <>
##$CPDPRGT= <>
##$D= (0..31)
$$ [...]
##$SUBNAM4= <"">
##$SUBNAM5= <"">
##$SUBNAM6= <"">
##$SUBNAM7= <"">
##$SUBNAM8= <"">
##$SUBNAM9= <"">
##$SW= 239.972175391363
##$SWIBOX= (0..15)
0 1 3 0 0 0 0 0 0 0 0 0 0 0 0 0 
##$SW_h= 12077.2946859903
##$TD= 32768
##$TD0= 1
##$TE= 0
##$TE2= 300
##$TE3= 300
##$TEG= 300
##$TL= (0..7)
120 120 120 120 120 120 120 120 
##$TP= (0..7)
150 150 150 150 150 150 150 150 
##$TP07= 0
##$TPNAME0= <>
##$TPNAME1= <>
##$TPNAME2= <>
##$TPNAME3= <>
##$TPNAME4= <>
##$TPNAME5= <>
##$TPNAME6= <>
##$TPNAME7= <>
##$TPOAL= (0..7)
0.5 0.5 0.5 0.5 0.5 0.5 0.5 0.5 
##$TPOFFS= (0..7)
0 0 0 0 0 0 0 0 
##$TUNHIN= 0
##$TUNHOUT= 0
##$TUNXOUT= 0
##$USERA1= <user>
##$USERA2= <user>
##$USERA3= <user>
##$USERA4= <user>
##$USERA5= <user>
##$V9= 5
##$VALIST= <valist>
##$VCLIST= <CCCCCCCCCCCCCCC>
##$VD= 0
##$VDLIST= <DDDDDDDDDDDDDDD>
##$VPLIST= <PPPPPPPPPPPPPPP>
##$VTLIST= <TTTTTTTTTTTTTTT>
##$WBST= 1024
##$WBSW= 4
##$XGAIN= (0..3)
0 0 0 0 
##$XL= 0
##$YL= 0
##$YMAX_a= 118066024
##$YMIN_a= -34716452
##$ZGOPTNS= <>
##$ZL1= 120
##$ZL2= 120
##$ZL3= 120
##$ZL4= 120
##$ABSF1= 222.5654
##$ABSF2= -17.4314
##$ABSG= 5
##$ABSL= 3
##$ALPHA= 0
##$AQORDER= 0
##$ASSFAC= 0
##$ASSFACI= 0
##$ASSFACX= 0
##$ASSWID= 0
##$AUNMP= <proc_1d>
##$AZFE= 0.1
##$AZFW= 0.5
##$BCFW= 0
##$BC_mod= 2
##$BYTORDP= 0
##$COROFFS= 0
##$CY= -3
##$DATMOD= 1
##$DC= 0
##$DFILT= <>
##$DTYPP= 0
##$F1P= 0
##$F2P= 0
##$FCOR= 0.5
##$FTSIZE= 32768
##$FT_mod= 6
##$GAMMA= 0
##$GB= 0
##$INTBC= 1
##$INTSCL= 4.134877e-10
##$ISEN= 128
##$LB= 2
##$LEV0= 0
##$LPBIN= 0
##$MAXI= 10000
##$MC2= 0
##$MEAN= 0
##$ME_mod= 0
##$MI= 0.1934396
##$NCOEF= 0
##$NC_proc= -1
##$NLEV= 6
##$NOISF1= 120.0001
##$NOISF2= 80.00006
##$NSP= 0
##$NTH_PI= 0
##$NZP= 0
##$OFFSET= 222.5654
##$PC= 1.4
##$PHC0= -409.3641
##$PHC1= 23.28833
##$PH_mod= 1
##$PKNL= yes
##$PPARMOD= 0
##$PSCAL= 0
##$PSIGN= 0
##$REVERSE= no
##$SF= 50.3227345484362
##$SI= 32768
##$SIGF1= 140
##$SIGF2= 120
##$SINO= 11.81781
##$SIOLD= 32768
##$SREGLST= <13C.CDCl3>
##$SSB= 0
##$STSI= 32768
##$STSR= 0
##$SW_p= 12077.2946859903
##$SYMM= 0
##$S_DEV= 0
##$TDeff= 32768
##$TDoff= 0
##$TI= <>
##$TILT= no
##$TM1= 0
##$TM2= 0
##$TOPLEV= 0
##$USERP1= <user>
##$USERP2= <user>
##$USERP3= <user>
##$USERP4= <user>
##$USERP5= <user>
##$WDW= 1
##$XDIM= 32768
##$YMAX_p= 326872600
##$YMIN_p= -15622000
$$ End of Bruker specific parameters
$$ ---------------------------------
##NTUPLES= NMR SPECTRUM
##VAR_NAME=  FREQUENCY,     SPECTRUM/REAL,   SPECTRUM/IMAG
##SYMBOL=    X,             R,               I
##VAR_TYPE=  INDEPENDENT,   DEPENDENT,       DEPENDENT
##VAR_FORM=  AFFN,          ASDF,            ASDF
##VAR_DIM=   32768,         32768,           32768
##UNITS=     HZ,            ARBITRARY UNITS, ARBITRARY UNITS
##FACTOR=    0.368581032318806, 1,           1
##FIRST=     11200.0995020947, 0,            0
##LAST=      -877.195183895579, 0,           0
##MIN=       -877.195183895579, -15622000,   0
##MAX=       11200.0995020947, 326872600,    0
$$ Real data points
##PAGE= N=1
##DATA TABLE= (X++(R..R)), XYDATA
$$ [...]
24620 5037780 3443451 2035821 1747186 2340907 3296251 4831064 6639875 7901932 8359713
24611 8359713 7743531 6363442 5175006 4565272 4079853 3434688 2842332 2754723 3184255
24602 3184255 3419061 2969752 2048706 977669 58434 -582783 -1413594 -2536496 -3194128
24593 -3194128 -2284938 -176431 1626858 2663336 3322020 3751014 3662357 2472751 601014
24584 601014 -1329505 -3430560 -5454807 -6640922 -6510020 -5026253 -2786180 -556811
24576 -556811 1323119 2681534 3394677 3349931 3044183 3407939 4138128 4462166 4312007
24567 4312007 3732567 3340544 3584079 4124406 4360372 4101561 3593173 3166943 2841568
24558 2841568 2252368 1646747 1351144 1252364 1475756 1735759 1514480 1217796 1693934 2913754
24548 2913754 3789928 3183615 1479595 -149277 -1082259 -1537904 -1818755 -2231857 -3233728
24539 -3233728 -4203312 -4147032 -2999152 -1540688 -468108 315610 967420 1265402 1138278
24530 1138278 635745 -34966 -1073530 -2663993 -3950397 -3924278 -2724114 -1480191 -716367
24521 -716367 90914 859999 855447 595194 1160759 2601707 3998746 4454971 4231653 4077397
24511 4077397 4049060 3817554 3718490 4049401 4398964 4224733 3307338 2021547 1003003
24502 1003003 504349 322561 713923 1830337 2995847 3801709 4343172 4699989 4880816
24493 4880816 4981099 4876540 4331975 3367762 2379930 1926058 2022780 2195351 2102827 1668422
24483 1668422 581992 -1361985 -3157671 -3919179 -3406282 -1653938 609471 2588761
24475 2588761 3796020 4031994 3770981 3447482 2726414 1591059 792761 717065 1366206
24466 1366206 2874126 4667920 5725338 5653467 4445555 2592647 1079772 343267 350467
24457 350467 889490 1179672 866676 198639 -602591 -1030612 -681244 210926 1255040
24448 1255040 2260051 3347867 4490247 5438815 6045481 6309514 6302260 6114755 6145602
24439 6145602 6428984 6171162 4765911 2736142 1036917 -93854 -987200 -1489819 -1188355
24430 -1188355 -747463 -1443000 -2840888 -3641215 -3682440 -3688640 -3872435 -4029367 -4344669 -5075958
24420 -5075958 -5934160 -6274588 -5778573 -4842654 -3982612 -3293453 -2486139 -1803636 -1843349 -2535926
24410 -2535926 -3325525 -3817096 -3603386 -2497490 -899349 315653 554913 94147 -1016692
24401 -1016692 -2875853 -4847233 -6234204 -6782903 -6268058 -5075624 -3816306 -2584825
24393 -2584825 -1324992 -342102 65309 -144336 -459341 -527169 -222832 557783 1705845
24384 1705845 2818959 3416619 3357421 2843165 1888975 609126 -333248 -633658 -709372
24375 -709372 -607886 -391220 -226169 42878 306043 274791 -54111 -522155 -1124388 -1845206
24365 -1845206 -2272026 -1745621 -459990 924608 1976698 2300591 1932834 834456 -1093260
24356 -1093260 -2870438 -3508839 -2865617 -1369868 79995 921337 1392710 1657152 1561579
24347 1561579 1140467 566199 -185530 -1183894 -1999572 -2102537 -1404599 -349929 751485
24338 751485 1921992 3070133 3670617 3350542 2590047 2207940 2279807 2466233 2695702
24329 2695702 3023952 3655560 4349224 4555768 4727357 5852501 7627681 8922477 8762111
24320 8762111 7126265 5078368 3134333 1697753 959126 682503 918847 1299852 1445220
24311 1445220 1337492 910978 365869 141280 348118 917905 1622597 2018458 2098346 1887250
24301 1887250 1461237 1530570 2211630 2504013 1967421 956393 -173709 -1190875 -1591242
24292 -1591242 -1118321 -327522 213949 284458 144448 97672 263540 714439 1461649 2299831
24282 2299831 3273777 4372102 4916594 4515847 3802017 3246794 2368421 1032397 -148808
24273 -148808 -290429 654879 1571527 1657205 709845 -1063363 -3394563 -5943288 -8196264
24264 -8196264 -9664041 -10135344 -9754629 -8866991 -7989453 -7267963 -6322590 -5089623 -3931094
24255 -3931094 -2655528 -912673 552533 1121736 949042 229983 -860319 -2179521 -3109286
24246 -3109286 -3170338 -2783920 -2112761 -1278568 -621972 -122444 484864 1191659 1623860 1549651
24236 1549651 1086643 591142 471702 559866 291982 277577 1248176 2692758 3584876 3537616
24226 3537616 3053601 2440468 1407334 -125579 -1410706 -1547626 -448081 630489 640667
24217 640667 -279788 -1625399 -2699195 -2995202 -2922822 -2957006 -2980991 -2723996 -2464238 -2718415
24207 -2718415 -3537192 -4503315 -5152563 -5155699 -4437999 -3386582 -2281380 -1095491 315598
24198 315598 1955792 3500753 4523867 5171328 5531535 5280974 4236004 2839378 1784208
24189 1784208 998269 -292081 -2280335 -4289123 -5105921 -4436407 -3430398 -2724363 -2239556
24180 -2239556 -2013029 -2013589 -2019239 -2041823 -2239056 -2668503 -3098277 -3091436 -2727029 -2435834 -2224226
24169 -2224226 -1690374 -705589 284171 878023 1237547 1424029 909220 3051 -434919
24160 -434919 -204930 602147 1711043 2773239 3558266 3476668 2194064 644538 -78081
24151 -78081 48465 321803 407769 186279 -163225 -225164 132493 499089 208264 -554747
24141 -554747 -1126101 -1326213 -1736166 -2468696 -2787830 -2485575 -2053941 -1653027 -1285141 -1157089
24131 -1157089 -1118324 -514067 618594 1725817 2493604 2436473 1452467 43308 -1491204
24122 -1491204 -2793516 -3471166 -3148401 -1854321 -28573 1754530 3007647 3436930 2971129
24113 2971129 2225873 1867503 1724466 1191011 -31510 -1509843 -2178412 -1177047 870860
24104 870860 2291731 2476159 2036212 1480181 1005782 598042 91534 -634245 -1509829
24095 -1509829 -1856145 -1086418 425550 1790069 2609370 2977723 2845716 2520345 2644215
24086 2644215 3102916 3509243 4044104 5055762 6293258 7336154 8109761 8575230 8614596
24077 8614596 8021759 6789901 5414301 4334341 3472599 2559424 1766459 1318085 757253
24068 757253 49283 -277689 -104338 -52785 -702246 -1807243 -2703085 -3120440 -3310651 -3448073
24058 -3448073 -3417044 -2847418 -1708368 -745114 -396559 -80059 719470 1932327 2921552
24049 2921552 3364998 3693496 4238555 4979171 4990557 3359683 1312673 208369 -316813
24040 -316813 -848944 -1259478 -1502121 -1934017 -2795209 -3830582 -4198900 -3207561 -1293562
24031 -1293562 548976 2163361 4041512 6360475 8973732 11455650 13268566 14138646
24023 14138646 14257139 14389019 14843540 15044311 14639053 13702160 13002728 13649569 15623986
24014 15623986 17710173 19152663 20071367 20727412 21086198 21124012 20791591 20266385 20317492
24005 20317492 21649710 24086719 27234852 30589421 33388146 35390824 36764273 37216699
23997 37216699 36591642 35394710 33805492 31935684 30172705 28884294 28213064 28134289 28491392
23988 28491392 29358893 30987966 32989977 34749805 36109858 37531810 38963329 39374213
23980 39374213 38524596 37185075 35619534 33662461 31975075 31463279 32115351 32852020 33260677
23971 33260677 33684739 33882856 33339509 32139519 31138383 30864066 30995316 31031474 30474305
23962 30474305 29515635 28935853 28868264 28711787 28072019 27290386 27299160 28296247 29556317 30752321
23952 30752321 31862917 32581639 32735901 32298703 31187645 29634347 28114407 26662023
23944 26662023 24774067 22737563 21457304 21102714 21012142 20644530 19693544 18293660 17036514
23935 17036514 16233885 15647946 15177435 15233948 15799497 16118294 15689025 14673547 13072315
23926 13072315 11232035 9883523 9446399 10588027 12989950 15125003 16161128 16328558
23918 16328558 15950477 15503221 15302318 15548711 16410871 17369812 17879033 17730318 16977468
23909 16977468 15513216 13307841 10742309 8178585 5992226 4555006 4340663 5401521
23901 5401521 7102016 8153059 7871432 6958473 6317961 6053131 5800915 5552619 5308879
23892 5308879 5065358 5141859 5563674 5243350 3248947 597679 -883546 -1022516 -369259
23883 -369259 898399 2097950 2639348 2757432 3082920 3334489 2908151 2173509 1662489
23874 1662489 1186140 580755 265832 392882 612043 884921 1298336 1735760 2056211
23865 2056211 1853681 1257945 1087531 1866993 3316033 4682243 5088212 4611003 4144969
23856 4144969 4209895 4415868 4148555 3269263 2003023 352866 -1052845 -1083087 86931
23847 86931 1534359 2904338 4154073 5241177 6093258 6470884 6448467 5819195 4613003
23838 4613003 3081750 970118 -1405352 -3194666 -3635375 -2524402 -883650 3308
23830 3308 29079 -219756 -427770 -774554 -1526587 -2273606 -2538538 -2430346 -2218286 -2088804
23820 -2088804 -2428051 -2905127 -2751005 -2079546 -1349294 -849025 -371297 528067 2048167
23811 2048167 3893166 5576531 6525503 6461593 5833072 5164061 4459761 3718243 3214144
23802 3214144 3067737 3014960 2799260 2401512 1843126 1405307 1515240 2355020 3569567
23793 3569567 4779955 5996713 7233190 8126741 7951999 6799807 5639381 4900048 4506394
23784 4506394 4402770 4524389 4718834 4473860 3558201 2539823 1970812 1951963 2446148
23775 2446148 2907436 2757737 2041537 1199967 542631 -283085 -1489544 -2594336 -3111953
23766 -3111953 -2952361 -2597195 -2543087 -2466367 -1669788 -354744 199463 -404100 -1103596 -1241014
23756 -1241014 -922103 -467488 -235975 -239414 -363435 -587868 -577177 -24302 832992 1973320
23746 1973320 3505659 5044692 6043221 6451999 6343675 5721549 4869354 4331841 4504166
23737 4504166 5218471 6049688 6661601 6825335 6533030 5873777 4893468 4017616 3601971
23728 3601971 3282497 2665785 1968200 1334216 495557 -169058 -477566 -770200 -1525453
23719 -1525453 -2739301 -3953608 -4892406 -5471440 -5867191 -6336999 -6912707 -7175001 -7137346
23710 -7137346 -7062985 -6479576 -4936377 -2848589 -1434971 -1417164 -2268960 -3318370 -3818786
23701 -3818786 -3668014 -3603600 -3960675 -4383066 -4501871 -4442177 -4510196 -4721087 -5072598 -5463187
23691 -5463187 -5412181 -5198205 -5379079 -5754969 -5834123 -5379905 -4900995 -4787501 -4970609 -5201809
23681 -5201809 -5112150 -4837240 -4672627 -4443334 -3883870 -2808366 -1223836 302380 1206060
23672 1206060 1536743 1739290 2306080 3332961 4215346 4423476 4110178 3194345 1653011
23663 1653011 461771 118546 288090 595297 697012 454851 336405 629937 895987
23654 895987 944659 1194265 1908026 2444426 2590864 2888058 3383153 3463712 2971806 2396943
23644 2396943 1906009 1190828 76281 -1277870 -2653640 -3802566 -4777356 -5744957 -6198935
23635 -6198935 -5709415 -4587849 -3285206 -1953238 -751945 264126 1256159 2081982 2527975
23626 2527975 2616182 2358423 1953998 1734084 1893933 2271185 2296121 1733800 1230986 1656887
23616 1656887 3092725 4692730 5875031 6350398 5548789 3960709 2976368 2613287 2100385
23607 2100385 1093746 -102892 -1076718 -1565843 -1404793 -551999 783191 2038773 2874514
23598 2874514 3579720 4306871 4854167 5355401 6011534 6233562 5439974 4176834 2921453
23589 2921453 1584397 324498 -387538 -654687 -972416 -1769416 -3076945 -4179204 -4888128
23580 -4888128 -5403305 -5434036 -4871428 -3877448 -2543309 -1406936 -925000 -911431 -1313930
23571 -1313930 -1905836 -2371675 -2722755 -3138110 -3791171 -4533454 -4963529 -5343927 -6047723
23562 -6047723 -6523115 -6400476 -6144938 -6237992 -6371634 -5744287 -4488243 -3304528 -2411337
23553 -2411337 -1730073 -1252514 -921115 -606919 -486592 -516436 -243491 106429 315293 419647
23543 419647 868406 1572843 1733656 993723 -679198 -2522924 -3444642 -3421855 -3367096 -3632933
23533 -3632933 -3835281 -3670122 -3459038 -3404463 -3157854 -2592528 -1932569 -1623965 -1630696 -1709318
23523 -1709318 -1750060 -1791061 -2103580 -2576857 -2966158 -3084767 -3020686 -2981638 -2910463 -2735489
23513 -2735489 -2909031 -4109746 -5804611 -6879920 -7218148 -6954042 -6051065 -4872545 -3412557
23504 -3412557 -1504883 193264 1073244 1323464 858552 -332976 -1927770 -3484860 -4585641
23495 -4585641 -5291238 -5592511 -5337236 -4635310 -4125355 -4378881 -4762632 -4494157 -3994800
23486 -3994800 -3815435 -3950726 -4228082 -4260342 -3569671 -2546836 -2161423 -2652238 -3587800
23477 -3587800 -4219441 -4099523 -3377471 -2566195 -2092107 -1949399 -1766303 -1337177 -866091
23468 -866091 -671636 -771135 -998384 -1170303 -1011878 -656730 -855262 -2358215 -4816237
23459 -4816237 -7172812 -8749050 -9442269 -9416453 -8870375 -7564396 -5541957 -3973045 -3604260
23450 -3604260 -3741901 -3555535 -3291330 -3070624 -2807005 -2820501 -2694710 -2056608 -1184450 -228554
23440 -228554 1092073 2594156 3552003 4313872 5495221 6610740 6982495 6337840 4722543
23431 4722543 2603388 597638 -766892 -1081201 -899363 -873988 -844744 -677681 -390532
23422 -390532 -32889 277962 722129 1012268 548080 -489557 -1451860 -1870217 -1998458
23413 -1998458 -2315557 -2853070 -3333016 -3765981 -4040880 -3867706 -3182083 -2053213 -1102293
23404 -1102293 -1116471 -2078887 -3587511 -5315230 -6699204 -7025711 -6334485 -5065227 -3609128
23395 -3609128 -2432829 -1629950 -1015609 -888578 -1547592 -2526553 -3257581 -3506349 -3360234
23386 -3360234 -2998860 -2375591 -1647356 -1018282 -45983 1321374 2173872 2355306 2759274
23377 2759274 3525730 4116303 4363479 4232395 3510846 2026728 397967 -348542 -173444
23368 -173444 513014 1278044 1679717 1824162 1993808 2374891 2939826 3483168 3598006 3098745
23358 3098745 2309737 1409920 619498 273426 52656 -283618 -684199 -1055691 -1201311
23349 -1201311 -1034097 -454662 60216 4496 -252414 -728029 -1820587 -2833531 -2921242
23340 -2921242 -2097157 -1239867 -1146123 -1615253 -2234025 -2697244 -2844660 -2786795 -2296264 -1209151
23330 -1209151 -13503 884471 1602770 2204159 2708462 3018218 2877430 2156013 1160254
23321 1160254 337951 -419759 -1171033 -1834290 -2381904 -2853279 -3457695 -4002158 -4071671 -3705502
23311 -3705502 -3124581 -2755431 -2669193 -2184809 -1085528 -111014 156227 148840 241969 560148
23301 560148 859377 906204 880062 579863 -283495 -1498764 -2969135 -4602695 -5833607
23292 -5833607 -6197183 -5861361 -5406306 -4876018 -3995051 -3199627 -2772738 -2738632 -2927953 -2906903
23282 -2906903 -2591809 -2648537 -3295549 -3724795 -3572421 -3782697 -5068835 -6441428 -6786916
23273 -6786916 -5869441 -3982309 -1912543 -518290 105295 479301 956217 1820919 3395556
23264 3395556 5316948 6697607 7124960 6741926 5971623 5036586 3935418 2879139 2292555
23255 2292555 2365438 3111088 3950679 4153734 3481725 2034893 256166 -1630341 -3060162
23246 -3060162 -3101757 -1948654 296612 3651666 6603607 7613081 6882291 5494372 3883433
23237 3883433 2286488 1166809 965034 1504860 2172067 2223797 1562158 385150 -1165934
23228 -1165934 -2399003 -3002091 -3512692 -4249403 -4772109 -4683343 -4353130 -4174781 -4121783 -4007257
23218 -4007257 -3594550 -2939368 -2074543 -947796 -83955 -135553 -1138641 -2464011 -3754017
23209 -3754017 -4921532 -6059432 -7257310 -8115985 -8358795 -7868776 -6906827 -6103336 -5562725
23200 -5562725 -5009906 -4150248 -3208482 -2566626 -2203197 -2122884 -2240913 -2383864 -2630774 -3046447
23190 -3046447 -3520810 -3859366 -4180797 -4219170 -3449919 -2512378 -2196428 -2492511 -2849138 -3006616
23180 -3006616 -3124921 -3196370 -2591299 -954395 1023275 2739768 4461945 5823021 6082304
23171 6082304 5062834 3542590 2605021 2316413 2194601 2517196 3416962 4078244 3716614
23162 3716614 2377275 841218 -375329 -804606 -788750 -1019885 -1424339 -1481208 -879011
23153 -879011 432181 2052028 3646901 5061091 6147884 7005147 7488198 7034408 5472495
23144 5472495 3388945 1497624 4742 -1309314 -2624205 -3357409 -2902296 -1597685
23136 -1597685 -434287 5711 285894 546094 140585 -1143851 -2716154 -3714501 -4071016
23127 -4071016 -3867221 -3000446 -1720683 -387022 789225 1272279 864614 -27744 -1033612
23118 -1033612 -1674453 -1516700 -653451 44260 -85085 -857697 -1651097 -2027664 -2171546
23109 -2171546 -2698340 -3748678 -4752205 -5198285 -5216872 -5178166 -4890782 -4643688 -5266681
23100 -5266681 -6439321 -7178698 -7162888 -6741884 -6206053 -5926165 -6297329 -6842421 -6669749
23091 -6669749 -5757013 -4188770 -1714885 1074759 3130805 3868444 3338013 2429070 2039134
23082 2039134 2100748 2462874 2887587 2698959 2082331 1938283 2246771 2128002 1309755 167531
23072 167531 -722633 -782725 -108387 424273 529429 746665 1107590 1188267 595635 -687523
23062 -687523 -2157055 -3159759 -3577724 -3498592 -2835065 -1753931 -823744 -369790 -228438
23053 -228438 848 497276 1128131 1951450 2699355 3251368 4056379 5335096 6583267
23044 6583267 7412328 7593541 6889339 5190255 2539591 -544357 -3203672 -4966615 -5812662
23035 -5812662 -6067928 -6350423 -6852391 -7224219 -7546975 -7819858 -7640415 -6414357 -3818272
23026 -3818272 -934495 725723 844768 504564 785996 1557938 2255093 2489442 2135929
23017 2135929 1557624 1073647 833321 1000186 1369823 2005331 2726172 2962348 2658588
23008 2658588 2325332 2406680 2814290 3015356 2697172 2152677 1616603 1049396 266913 -638884
22998 -638884 -1171426 -1226453 -1358761 -1922605 -2749514 -3399615 -3247332 -2315112 -1556413 -1578311
22988 -1578311 -1854940 -1737389 -1404682 -1181838 -1036832 -813011 -93340 1356671 3272145
22979 3272145 5135698 6138506 5678560 4369509 3205389 2328678 1592294 1260215 1338146
22970 1338146 995146 -156314 -1699952 -2768868 -2570029 -1331996 -203876 472037 918123
22961 918123 812698 288356 397731 1422258 2295197 1987527 652286 -666719 -1013776
22952 -1013776 -583299 -135418 191098 243395 -511400 -1824770 -3018970 -3940521 -4351920
22943 -4351920 -3670589 -2286674 -941163 -210231 -463936 -1144001 -1602823 -1950307 -2608610
22934 -2608610 -3473984 -3891299 -3166939 -1461914 289882 1736533 2947609 3695238 3554745
22925 3554745 2703889 1796238 1614704 2563656 3941715 5034356 5464337 5175631 4335428
22916 4335428 3171592 1904258 813839 226894 -46173 -512038 -1368891 -2432328 -3285055
22907 -3285055 -3238044 -2137887 -1248620 -1593247 -2636446 -3410522 -3429452 -2500435 -1397346
22898 -1397346 -1144864 -1479170 -1549105 -808350 250445 866769 1241265 1660826 2027600
22889 2027600 2144130 1802217 1524924 1713108 2171289 2402799 1874577 348617 -1742810
22880 -1742810 -3445691 -4294130 -4596454 -5028616 -5568422 -5412691 -4612506 -4158653 -4654983
22871 -4654983 -5895240 -6918003 -7051984 -6787664 -6992167 -7567570 -7734973 -7515219 -7299498
22862 -7299498 -6962190 -6668135 -6655296 -6589605 -6233037 -5633169 -5427101 -6084918 -6918098 -7169198
22852 -7169198 -6612642 -5571477 -4591843 -3808180 -2887677 -1866778 -1064905 -574115 -245681
22843 -245681 -202683 -892063 -1956010 -2178230 -1195858 278332 1009266 164824 -1608323
22834 -1608323 -2986335 -3566429 -4041866 -5038790 -6281342 -7033191 -7295905 -7665065 -8391214
22825 -8391214 -9458568 -10348741 -10056477 -8516184 -6797613 -5427180 -3862388 -1798104
22817 -1798104 -205198 -170509 -1372676 -2645152 -3258826 -3148585 -2686513 -1969799 -1013847
22808 -1013847 -129156 403459 464397 221638 -123289 -559219 -1039000 -1777048 -2918707
22799 -2918707 -3951477 -4435865 -4502646 -4216670 -3406673 -2653684 -2772863 -3730763 -4672684
22790 -4672684 -5054589 -5213535 -5148835 -4824790 -4702307 -4639820 -4129385 -3244565 -2470282 -2287348
22780 -2287348 -2698415 -3514900 -4592155 -5538236 -6101995 -6104721 -5949441 -6193304 -6565057 -6487622
22770 -6487622 -5490657 -3467694 -980476 1123280 2280072 2651608 2820347 2690121 1903853
22761 1903853 788732 -87862 -625401 -856525 -965261 -1122760 -1204778 -983602 -952807 -1533749
22751 -1533749 -2044528 -2228452 -2333707 -2446014 -2514488 -2121045 -828707 1022157 2117295
22742 2117295 1985681 1432058 764378 -113537 -841966 -678991 493444 1955866 3244444
22733 3244444 4351243 4798986 4553398 4386105 4578290 4610262 3978793 2855553 1748492
22724 1748492 1067023 1148324 1551318 1210199 334492 -126697 131755 961875 1813081 1991450
22714 1991450 1398947 801298 466583 -324518 -1687912 -2658407 -2810072 -2930435 -3721820
22705 -3721820 -4916215 -5933622 -6199824 -5585502 -4560057 -3571548 -3021821 -3046254 -3321037
22696 -3321037 -3390610 -2765189 -1304298 298532 956878 472245 -219811 -532667 -487112
22687 -487112 -243258 -117065 -6735 463026 713249 -453999 -2755555 -4699350 -5710395
22678 -5710395 -6054380 -5684257 -4384729 -2953084 -2477593 -2706401 -3126510 -3705864 -4264113
22669 -4264113 -4852747 -5394437 -5915045 -6433602 -6722892 -7159706 -8023230 -8880298 -9285456
22660 -9285456 -9493434 -9898174 -10434116 -10597718 -9648937 -7526159 -5111635 -3267674 -2238536
22651 -2238536 -1409555 -206657 953458 1676349 1684429 708147 -493425 -1170625 -1660844
22642 -1660844 -2660371 -4296413 -5976064 -6820851 -6366898 -4985447 -3232533 -1640649 -667418
22633 -667418 -207554 -35022 127576 417777 452583 -229914 -1271928 -2148114 -2615558 -2274800
22623 -2274800 -1422038 -1057049 -1806855 -3188937 -4571025 -5863336 -6903983 -7073208 -6129576
22614 -6129576 -4465632 -2390353 26121 2477042 4310851 5394217 5956337 6068456
22606 6068456 5853691 5561935 4961634 3712240 1856258 -258849 -1811338 -2185730 -1593845
22597 -1593845 -887476 -938495 -1644222 -2261045 -2149125 -1347877 -330453 768884 1676330
22588 1676330 1926070 1871293 2042420 2254207 2226286 2125414 2548885 3391409 3686469 2867901
22578 2867901 1631894 1086300 1309940 1145800 37789 -1090731 -1303115 -668315 749426
22569 749426 2745121 4258871 4592554 3855669 2310184 605107 -935086 -2679954 -4067232
22560 -4067232 -4772918 -5777630 -6993067 -7548505 -7549602 -7468345 -7485440 -8055751 -8921096 -9089051
22550 -9089051 -8310246 -6784145 -4762951 -2484759 -493774 490135 638123 632347 659961
22541 659961 673524 815637 1204983 1234761 343784 -1112572 -2483654 -3811282 -5312028
22532 -5312028 -6480932 -7056813 -7318531 -7264113 -6475452 -4788260 -2822331 -1413846 -1361724
22523 -1361724 -2456034 -3814540 -5012909 -5770383 -5912713 -5422986 -4610028 -3619373 -2599515
22514 -2599515 -2163475 -2529737 -3434382 -4720689 -6175423 -7604610 -8671512 -8984841 -8497301
22505 -8497301 -7498252 -6529386 -5889346 -5391236 -5176109 -5430703 -6053350 -6447309 -5926169
22496 -5926169 -4892424 -4002064 -3728428 -3953414 -4124375 -4601757 -5338865 -5456849 -5062436
22487 -5062436 -4644333 -4251797 -4126157 -4251072 -4414924 -4781293 -5515211 -6210738 -6203217 -5021447
22477 -5021447 -2916346 -615977 1259712 2563640 3175763 3266330 3266594 3352027 3300212 2928302
22467 2928302 2152039 788786 -851372 -2265067 -3445046 -4346875 -4255257 -3168057 -1683480
22458 -1683480 -198730 562226 -260190 -2384847 -4395396 -5214058 -5289671 -5397381 -5348974
22449 -5348974 -4908823 -4447678 -4495383 -4944806 -5106527 -4688505 -4115946 -3625621 -2806372 -1476449
22439 -1476449 31280 1365725 2359690 2382036 1328105 -25607 -1226646 -2044375 -2572730
22430 -2572730 -3099575 -3025499 -1763815 297844 2376527 3698765 3771049 2909708 2193431
22421 2193431 2119740 2236167 2147617 2136518 2141536 1631352 750189 -11629 -320092 -132476
22411 -132476 400621 816288 1143327 2077373 3425958 4267286 4656501 4864035 4745978
22402 4745978 4377718 3648289 2631502 2051976 1845493 1299186 116196 -1749145 -3877461
22393 -3877461 -5472498 -5939741 -5079633 -3690458 -2798335 -2228029 -1765413 -1670227 -1534634
22384 -1534634 -705003 506057 1719141 2671824 3044060 3128429 3542485 4297610 4843784
22375 4843784 4901285 4468926 3378406 1860056 542480 -399329 -974198 -1020077 -495721
22366 -495721 662267 2267613 3116886 2389832 407907 -2223590 -4480777 -5155136 -4292459
22357 -4292459 -3110839 -2336338 -2182309 -2804940 -4079678 -5626836 -6963080 -7441962 -7132432
22348 -7132432 -6880183 -6718139 -6104885 -5277812 -4731636 -4329725 -3946550 -3503347 -2732677
22339 -2732677 -1807613 -1474722 -1861355 -2537495 -3395926 -4032925 -3903676 -3283388 -2502731
22330 -2502731 -1606529 -591105 547087 1245900 897721 164396 403271 1827888 3726524
22321 3726524 5292305 6169045 6775496 7535177 8595855 9658710 10411306 10718982 10920710
22312 10920710 11414936 11562548 10263263 7840519 5354499 3272656 1707857 259985
22304 259985 -1093800 -1770130 -1761594 -1350038 -899411 -702569 -244754 728141 1613246 1880562
22294 1880562 1387570 434910 -611896 -1698785 -2904029 -3882136 -3857223 -3303924 -2876346
22285 -2876346 -2455800 -2213088 -2325956 -2448768 -2228888 -1707375 -1252558 -1113706 -1210615 -1579239
22275 -1579239 -2255289 -3284056 -4695443 -5986378 -6708064 -6800040 -6264467 -5196661 -4184734
22266 -4184734 -3593613 -3409857 -3456194 -3067955 -1705911 298860 2013065 2979275 3445958
22257 3445958 3868122 4208473 4088336 3443602 2625175 1879413 1194864 400405 -921712
22248 -921712 -2566060 -3308916 -2307208 -396588 974679 1310807 1208285 1346914 2156423
22239 2156423 3739062 5395375 6350185 6425980 5991541 5595149 5244349 4998576 5187726
22230 5187726 5672858 6072710 6404860 6742919 7013799 7480140 8355166 9186068 9279084 8276714
22220 8276714 6496136 4721778 3939782 4370878 5460021 6715796 7728905 8027638 7545718
22211 7545718 6954169 6647039 6403943 5788055 4355531 2420483 981031 357431 51783
22202 51783 -166300 -377962 -501859 -200687 597114 1608384 2480375 3077070 3193192 2661880
22192 2661880 1594419 156154 -986594 -974304 -289669 -149748 -407077 -330446 127544
22183 127544 829139 1433376 1637866 1771738 1919601 1511705 941538 972635 851887 42212
22173 42212 -1186535 -2161415 -2261174 -1843996 -1230864 -540156 -402753 -1207209 -2739408 -4502728
22163 -4502728 -5983444 -6914446 -7026416 -6474973 -5434354 -4395581 -4149925 -4666679 -5423893
22154 -5423893 -6036293 -6246928 -6009605 -5256271 -3979274 -2577073 -1557542 -1070960 -560644
22145 -560644 307750 959586 956579 335495 -534530 -1490759 -2547037 -3394044 -3874449 -4310738
22135 -4310738 -4955937 -5612465 -6151072 -6543002 -6522451 -6181989 -6041630 -6141794 -5883888 -5178582
22125 -5178582 -4384633 -3345419 -2382556 -2514983 -4069061 -6116483 -7819109 -9139606 -9878141
22116 -9878141 -9805305 -9118368 -8148633 -7076261 -5964871 -4806388 -3743954 -3085699 -3463439
22107 -3463439 -5214672 -7250550 -8138756 -7508593 -5988125 -4261191 -2597596 -1563448
22099 -1563448 -1671007 -2303481 -3005912 -4137171 -5172221 -5260245 -4410940 -3110139 -1903006
22090 -1903006 -979109 -103810 450487 251838 -614136 -1577741 -2076474 -1928591 -1389204
22081 -1389204 -411064 1078810 2756601 4121432 4752330 4791375 4799864 5053422 5175833
22072 5175833 4900730 4514105 3910360 2670052 982828 -566547 -1650503 -2086267 -1535909
22063 -1535909 -669678 -511032 -757127 -712655 -307102 30547 -58688 -553399 -1364432 -2174587
22053 -2174587 -2720957 -3164398 -3598643 -4051114 -4360679 -4643095 -5164730 -5999742 -6708135
22044 -6708135 -6933100 -6766272 -6542594 -6482825 -6419269 -6345530 -6415939 -6846252 -7289390 -7139749
22034 -7139749 -6661104 -6461965 -6516528 -6507563 -6023089 -4931762 -3457590 -2216962 -1747514
22025 -1747514 -1728083 -1620981 -1495776 -1675855 -2183113 -2471694 -2272016 -1931551 -1793934 -2083654
22015 -2083654 -2810579 -3949991 -5173298 -5506851 -4767336 -3929465 -3546190 -3479702 -3224862
22006 -3224862 -2522197 -1602813 -533860 548933 1374126 1580928 1224708 961436 1101423
21997 1101423 1166154 830928 657637 1260823 2338691 3170431 3203865 2410979 991095
21988 991095 -649528 -1839922 -2235426 -1694016 -373729 1088701 2353432 3256478 3574646
21979 3574646 3606046 3704541 4069887 4773741 5598060 6633206 8244279 10419470 12105908
21970 12105908 11788712 9377808 6350179 4093061 2889660 2235666 1477904 197266
21962 197266 -1219175 -2151974 -2224658 -1543429 -862400 -502164 -162727 187594 640384 1411725
21952 1411725 2243333 2828541 3212549 3287772 3087013 2961703 2865818 2419831 1443857 460025
21942 460025 -44394 -415447 -1369348 -2914302 -4418969 -5130614 -4689815 -3140380 -1030712
21933 -1030712 462764 954683 1194238 1805572 2697249 3817777 5311262 6533225 6347606
21924 6347606 4461784 1839203 -312406 -1274958 -845351 500488 2185982 3987195
21916 3987195 5289632 5335776 4320254 3050970 2188984 1607676 679012 -771349 -2189041
21907 -2189041 -2664558 -1807364 130123 2140381 3118717 3020643 1965489 501809 -287359
21898 -287359 -203494 368101 1457893 2736758 2930920 1446496 -692494 -2267102 -3164277
21889 -3164277 -3920879 -4388884 -3819916 -2293629 -641808 741283 1766371 2163949 2022583
21880 2022583 1694629 1391537 1425364 2094425 3329923 4647807 5196961 4821768 4265420
21871 4265420 3883673 3475067 2828702 2151958 1692629 1226101 671941 465079 859599
21862 859599 1293232 1415838 1717741 2502622 3454243 4540427 5733460 6386668 5968247
21853 5968247 4791578 3603547 2740932 2243456 2187287 2763478 3632916 4098279 3882325
21844 3882325 3314260 2978937 3249193 4080530 5034210 5400344 5149378 4733569 4056482
21835 4056482 3027647 1510566 87995 -95465 1209110 3148070 4451106 4483366 3834172
21826 3834172 3279303 2734662 1773027 674832 -27149 -316957 -284257 -193891 -160225 490042
21816 490042 2091287 4147679 6057966 7191709 7615226 7427539 6594661 5632726 4905945
21807 4905945 4338332 3804158 3548198 3535920 3000118 2125799 2095395 3351277 5485791
21798 5485791 7649668 8882256 9156624 9151338 8966822 8522021 8087117 7827929 7544492
21789 7544492 7210525 7012920 7151019 7673053 8280814 8525869 8344536 8156899 8108251 8330091
21779 8330091 8891836 9248788 8950920 8051947 6945331 5921450 4841898 3591642 2394667
21770 2394667 1452790 982223 1185489 1726330 1651497 790998 -143816 -622397 -541905 -62833
21760 -62833 478126 750995 812904 1087294 1631177 2319937 2948809 3267949 3172171 2589069
21750 2589069 1692099 801779 447563 1035604 2375120 3869200 4676908 4396569 3295936
21741 3295936 1956139 738521 -141331 -354925 62567 557274 829580 1000264 1369477
21732 1369477 1973600 2393238 2256063 1516384 561171 -107092 -476041 -715090 -514964
21723 -514964 -28793 255105 304551 13867 -765095 -1444065 -1217100 -22991 1311271
21714 1311271 2054958 1911845 1203226 238351 -891178 -1727906 -2141270 -2507559 -3010879
21705 -3010879 -3187222 -2505838 -991054 1154920 3554281 5563676 6807753 7470054 8065972
21696 8065972 8478874 8170163 7192345 6142859 5513079 5011905 4103970 3069998 2438797
21687 2438797 2364055 2118111 845482 -719681 -1386282 -1446237 -1808967 -2152439 -2009658
21678 -2009658 -1651970 -1255312 -900511 -789511 -1002946 -1671279 -2748764 -3783766 -3863228
21669 -3863228 -2522167 -332260 1833147 3724090 5189612 5841008 5714520 5342355 5038946
21660 5038946 4430598 3255569 2369358 2470596 2847006 2521374 1736930 1463300 1453054
21651 1453054 862679 -315715 -1373460 -1713574 -1280226 -642954 -640466 -1652368 -3212143
21642 -3212143 -4392769 -5056056 -5598447 -5516949 -4168122 -1961421 336852 2483286 4302035
21633 4302035 5592412 6396606 6711672 6980289 7652090 8460809 8473545 7481186 6273138
21624 6273138 5461429 5023841 5062031 5612513 6169140 6720546 7535734 8379989 8997268 9002865
21614 9002865 7852972 5962261 4401301 3224971 1964937 638920 -740174 -2078972
21606 -2078972 -2719082 -2089788 -449387 1628188 3871243 6135212 8113546 9337454
21598 9337454 9707304 9463297 8798916 8011644 6921426 5725157 5087976 5135678 5866970
21589 5866970 6806869 7108304 6742068 6333466 5975935 5345733 4341918 2981880 1473775
21580 1473775 486594 779490 2570198 5349741 8244592 10623122 11929376 11931819 10936213
21571 10936213 9482649 8099157 7156054 6864538 7197729 7543065 7396173 7076350 6796619
21562 6796619 6119783 4940164 3562972 2011535 444512 -468410 -442158 195642 1089097
21553 1089097 1446482 697623 -445464 -801975 -317519 30394 -69051 -191962 -374524
21544 -374524 -922037 -1588634 -2102321 -2380583 -1995117 -975502 -216693 48152 551053
21535 551053 1476540 2342046 2964461 3212177 2885130 1848635 270343 -1257434 -1958191
21526 -1958191 -1731433 -1276611 -972215 -633008 -398065 -578410 -894217 -1016637 -928859 -864479
21516 -864479 -892433 -801164 -530826 -187352 97132 402319 914644 1537235 1631371 1043940
21506 1043940 453762 269554 355307 279358 123654 406244 882109 1213553 1454859 1615347
21496 1615347 1982760 2719504 3643311 4402793 4649803 4521647 4379978 4446411 4477998 4404889
21486 4404889 4683938 5425093 6013584 5994113 5615926 5584229 6069483 6498058 6658151 7004840
21476 7004840 7644559 8116842 8569450 9229489 9821833 10261732 10761898 11097672 10883977
21467 10883977 10251438 9468807 8860407 8408586 7356870 5259055 2945327 1439728 917042
21458 917042 1365177 2657762 4076899 4848625 4886661 4405916 3652755 2880466 1910524
21449 1910524 594116 -822371 -1776451 -1520290 -385959 342857 292018 479369 1181640
21440 1181640 1937997 2883611 4051548 5475328 6788798 7717833 8410824 9011205 9670747
21431 9670747 9991092 9328440 7765493 5883121 4247623 3273157 2605629 1606639 381347
21422 381347 -696164 -1478255 -1772036 -1603186 -1316481 -1001277 -410280 205273 505198
21413 505198 1087674 2555951 4395532 5683434 5821426 5252929 4582707 3392646 1332061
21404 1332061 -519405 -827503 520992 2513344 4007186 5154691 6348593 7309710
21396 7309710 7871643 8156684 7786325 6902740 6848643 7852049 8613902 8474232 7826934
21387 7826934 7065808 6461386 6026801 5920859 6275314 6492926 6158460 5367008 4390781
21378 4390781 3553611 3146270 3434167 4847045 7331126 9790043 11116015 11340051 11597597
21369 11597597 12402971 13155183 13656945 14573069 16136039 17766267 18888341 19703847 20136362
21360 20136362 19701910 18794156 18189495 18153528 18475268 18832516 19192274 19715970 20631104
21351 20631104 21955397 22810499 22473554 20938042 19004632 17380763 15960587 14937369
21343 14937369 14284740 13815490 14051275 14919616 15642924 15916741 16114360 16533211 16924979
21334 16924979 16657582 15811414 14951361 14448631 14558684 15259935 16371999 17724796 19256396
21325 19256396 20667608 21544931 21336363 19914663 18039059 16598437 15575794 14824456
21317 14824456 14935106 16561953 19070380 21316268 23034901 24242036 24937227 25613025
21309 25613025 26701981 28122613 29215926 29620671 29860188 30932937 33339331 36792365
21301 36792365 40437607 43410425 45483767 46885075 47536984 47296052 45841392 42938558
21293 42938558 39658583 37566923 36619860 36126683 35914395 36303504 37436879 38671584 39316445
21284 39316445 39228292 38600725 37875482 37457864 37136042 36912485 36798009 36608180 36288407
21275 36288407 36017747 35916908 36050100 36796270 38209951 39581450 40567044 40875593 40400532
21266 40400532 39717157 39095620 38225540 36974373 35414524 33801812 32437980 31777423 32018684
21257 32018684 32785995 33256946 32807770 31583155 30376818 29802676 29681355 29281016 28754261
21248 28754261 28688492 28817594 28760893 28385595 27791813 27584239 27682720 27145241 25959002 24752132
21238 24752132 23643302 22588685 21317199 19379419 17306289 16120877 15829270 15892253
21230 15892253 15792160 15027087 13947610 13598280 13825556 13790204 13127637 11967637 10519838
21221 10519838 9118097 8444789 8536629 8584727 8140003 7818231 7975918 8220259 7699452
21212 7699452 6348432 4985664 4180664 4062476 4425558 4923261 5088279 4763990 4366929
21203 4366929 4339129 4510433 4521662 4573727 5232539 6724044 8851220 11124502 12874983
21194 12874983 13797069 13834389 12890751 11536952 10348682 9606159 9618609 10655934 12537200
21185 12537200 14237967 14910640 14606524 14157308 13876287 13329044 12420227 11581452 10607813
21176 10607813 8907380 6606690 4827102 4519603 5755480 7878247 9742204 10718409
21168 10718409 11355906 12330810 13197729 13086883 11852773 9972622 8012032 6184824 4638983
21159 4638983 3329120 2101152 1197919 511799 -182246 -682479 -682649 -10841 1103093
21150 1103093 1882904 1771434 831076 -200839 -463125 71589 763188 1139915 969045
21141 969045 468217 151014 95355 289656 887478 1568791 1655926 1307881 1479396 2605969
21131 2605969 3813571 4191989 3731864 2860203 2193558 2274729 3259156 4332666 4702051
21122 4702051 4702204 4613176 4092694 3085084 2195516 2217509 2866510 3266295 3237504 3151230
21112 3151230 3061918 2717017 2259356 1654954 957758 615371 554600 585426 795112 1129432
21102 1129432 1408166 1507344 1313767 811651 184441 -463968 -835280 -566325 243947 1011179
21092 1011179 1202414 978543 592943 7639 -760424 -1649245 -2380928 -2464650 -1894136 -1647097
21082 -1647097 -2236261 -2844032 -2545189 -1257972 304468 1069379 602175 -390083 -948212
21073 -948212 -942923 -674093 -546599 -1169107 -2689254 -4110104 -4606883 -4406674 -3790099 -3230396
21063 -3230396 -2963517 -2514249 -1915312 -1674489 -1914756 -2146310 -1964735 -1672029 -1553973
21054 -1553973 -1783879 -3033439 -4956492 -6281599 -6507723 -5912387 -4923118 -3552369 -1946941
21045 -1946941 -599646 585845 1891637 3365052 4923783 6335776 7140404 7114034 6550298
21036 6550298 6127038 6139606 6785708 8148550 9392698 9628702 8542489 6778633 5478635
21027 5478635 5048478 5181605 5943152 6968110 7421090 7100769 6263661 5199414 4210667
21018 4210667 3706773 3965426 4398631 4326954 3762618 2904534 1835837 715053 46858
21009 46858 248125 1054710 1873046 2507192 2960891 3144684 3152064 3357183 3739616 3949690
20999 3949690 3816372 3205895 2360387 1581810 613982 -573573 -1556209 -2169110 -2286097
20990 -2286097 -2030017 -1996893 -2358565 -2524307 -2240784 -2129049 -2317629 -2037025 -996977
20981 -996977 248204 1131732 1716683 2309294 2840291 2929653 2731334 2542023 2627631 3043900
20971 3043900 3506952 3455237 2886235 2537699 3110938 4672947 6734212 8851343 10396041
20962 10396041 11281582 12148610 12702343 12246904 11139450 10315672 9907761 9073916 7225701
20953 7225701 4737005 2502901 813093 -120231 -110840 634309 1758402 2732341 2891245
20944 2891245 1995175 232973 -1517744 -2622228 -3345050 -3487760 -2746003 -1515024 -142603
20935 -142603 953593 1444510 1468647 1201372 755390 -60665 -1237544 -2183102 -2646394
20926 -2646394 -2890643 -2945441 -2329338 -996821 448090 1287429 1027593 199250 -416440
20917 -416440 -1149621 -2040303 -2191882 -1390484 -695611 -1199109 -2425682 -3219378 -3434261
20908 -3434261 -3630115 -3980613 -4711974 -5716924 -6196272 -6042800 -5895131 -6052499 -6436255
20899 -6436255 -6717878 -6520697 -5756549 -4798001 -3832843 -2911235 -2372267 -2310139 -2511661 -2896839
20889 -2896839 -3040279 -2603615 -2153707 -2364534 -2933788 -3210556 -3284372 -3328364 -3222914 -2571690
20879 -2571690 -1094310 669154 1839326 2164701 2094909 2069929 1965080 1558903 962158
20870 962158 112176 -1209448 -2886856 -4577734 -5619364 -5368783 -3972327 -2070523 -266930
20861 -266930 1054572 1520344 1144919 -50370 -2014622 -4272998 -6254944 -7534306 -8041806
20852 -8041806 -7841984 -7150132 -6466168 -6246420 -6170930 -5731405 -4949292 -3966139 -2816587
20843 -2816587 -1690877 -655145 323320 1138100 1760416 2288123 2766409 2911063 2511729
20834 2511729 1908776 1633632 1908228 2539429 3088359 3134810 2425203 1290684 784788
20825 784788 1494240 2765822 3167960 2301823 1073245 215212 -243347 -412475 -568948
20816 -568948 -1152876 -2144321 -2715953 -2439531 -1834368 -789860 990732 3097828 4493998
20807 4493998 4724661 4372579 3383541 1500347 -815847 -2887891 -4017701 -3877642 -2959066
20798 -2959066 -1898164 -857656 -240281 -545765 -1494431 -2195556 -2070774 -1475589 -943735
20789 -943735 -648156 -667152 -1026063 -1878368 -3180431 -4649839 -6272157 -7597976 -7975652
20780 -7975652 -7355161 -6408039 -5415943 -4288176 -3512271 -3240158 -3473213 -4062705 -4428219
20771 -4428219 -4431615 -4279130 -3701997 -2651397 -1805960 -1563605 -1784428 -2025136 -2138242 -2296432
20761 -2296432 -2549440 -2856226 -3076170 -2904334 -2159547 -1590673 -2311903 -3994418 -5265918
20752 -5265918 -5195711 -4015976 -2873354 -2216385 -1929894 -2249336 -2947540 -3472060 -3808771
20743 -3808771 -4074092 -4320777 -4619072 -5169876 -5699914 -5794402 -5600357 -5212236 -4571494 -3339082
20733 -3339082 -1744595 -837220 -734187 -737265 -501495 99650 1035287 1444699 888337 -57312
20723 -57312 -1024659 -2103554 -2930283 -3045097 -2592765 -1768365 -863510 -88274 916851
20714 916851 1822870 1639561 635906 112863 483466 941223 924518 525625 9037 -379403
20704 -379403 -650216 -1198499 -2050056 -2547961 -2227921 -1423731 -879420 -753280 -433949 -208688
20694 -208688 -665660 -1693319 -2853474 -3700763 -4270352 -4574594 -4210519 -3337681 -2619850
20685 -2619850 -2364856 -2639884 -3298141 -3472321 -2779172 -1953059 -1599138 -1335859 -371041
20676 -371041 980927 2129323 2976653 3105693 2542399 1938097 1181097 262200 -54995
20667 -54995 375308 867342 1282333 1579260 1518887 1321874 1295322 1432975 1257990 442630
20657 442630 -429288 -760656 -511609 383281 1789363 3133881 3696707 3589276 3479244
20648 3479244 3348502 3026850 3109533 3627008 4380813 5618762 7095547 8017085 8333499
20639 8333499 8777352 9368315 9401426 8407235 6734330 4971422 3817418 3502340 3556681
20630 3556681 3465289 2947273 2172756 1046964 -208894 -864842 -633678 157036 593651
20621 593651 355138 -634642 -2418889 -3817705 -3812417 -2424583 -415517 744590 592608
20612 592608 -147891 -885513 -1296598 -1530194 -1474628 -869802 -183472 368257 1121120 2148098
20602 2148098 3034804 3096954 2190456 1142023 795823 1316211 2130482 2796913 3515459
20593 3515459 4464882 5450949 6292067 6767037 6738046 6579328 6401908 6101274 5838349 5793390
20583 5793390 5885319 5717131 5226722 4817968 4906262 5420944 6291216 7210099 7637355 7441655
20573 7441655 6830587 5965225 5223458 5049285 5388896 5910081 5997428 5489050 4785102 4488507
20563 4488507 4956388 5660279 5592510 4841164 4384513 4487352 4804307 4873011 3993969 2230600
20553 2230600 487531 -950162 -2082575 -2354995 -1365399 440661 2255637 3441499
20545 3441499 3448578 2283808 607385 -883157 -1725056 -1636588 -924008 -113086 742912
20536 742912 1973176 3590275 5070949 6087245 6631243 6613879 5858270 4082969 1690996
20527 1690996 -461713 -2347869 -3812082 -4472727 -4250652 -3337763 -2290917 -1534521 -641091
20518 -641091 740220 1839949 1873817 1473558 1169039 708271 77670 -601017 -1253319
20509 -1253319 -1982641 -2839022 -3655376 -4357665 -4648457 -4269843 -3086783 -1238503 492579
20500 492579 1322215 1110968 720111 1282047 3200420 5710445 7473737 7915749 7294975
20491 7294975 6278306 5187422 4293290 3971594 3893980 3376494 2499205 1944380 1919221
20482 1919221 2276022 2707127 2515010 1382358 -113985 -1326101 -1763390 -1369982 -468181
20473 -468181 710051 2017852 3085765 3363211 2927250 2404809 2504203 3010719 2980263
20464 2980263 2473289 2172679 2041542 1476610 17609 -1657289 -2046175 -852742 1214982
20455 1214982 3066353 3879563 3843245 3505934 3142934 3080954 3085568 2518704 1730143 1011457
20445 1011457 -158447 -1741294 -3124442 -3744453 -3431130 -2760665 -2437230 -2551517 -2515085
20436 -2515085 -1870990 -1021642 -703562 -941090 -1492828 -2149987 -2319488 -1490975 -293425
20427 -293425 426971 863432 1424950 1932755 2208802 2594365 3056928 3206674 3070829 3389549
20417 3389549 4591477 6355204 8131760 9028039 8323720 6728818 5531749 5375657 6169347
20408 6169347 7052903 7378817 7307309 6870747 6158974 5634644 4878550 3402703 1690123
20399 1690123 142130 -1155430 -1801951 -1773915 -1373639 -538692 532173 1449799 1950572
20390 1950572 1856372 1529723 1348397 1407100 1586457 1635572 1711169 2037951 2263771 2374399
20380 2374399 2649644 2611090 1896116 900217 80598 -359947 -783504 -1527300 -2262955 -2945384
20370 -2945384 -3273991 -2820638 -1970423 -1033797 -17901 667321 741868 257021 -719438
20361 -719438 -2107507 -3953894 -5809723 -6710584 -6422078 -5021325 -2857595 -932835 -33775
20352 -33775 -107785 -541455 -855124 -1188275 -1722704 -1799866 -888705 544137 2146943 4413364
20342 4413364 7388815 9791037 10424082 9663552 8673703 7937705 6929492 5416520 4050387
20333 4050387 3379458 3361284 3606377 3795519 3783109 3340444 2354754 1297152 884230 1399944
20323 1399944 2467764 3808330 5306089 6872616 8355509 9514504 10077360 10159105 10145070
20314 10145070 9809280 9023599 8062543 6751245 4939838 3114724 1388667 -222999
20306 -222999 -826392 26132 1220499 1568724 1512473 1612802 2051458 3085543 4363211
20297 4363211 5409809 5863636 5762321 5170094 3758147 1926447 903502 1095089 1921054
20288 1921054 2782197 3323243 3365244 3001759 2545507 2382642 2814094 3847018 4732586
20279 4732586 4688585 3781152 2536151 1495049 998025 1046794 1121454 967741 814697 809474
20269 809474 1230968 2583064 4799419 7345112 9471019 10335213 9872537 8891518 7858785
20260 7858785 6511262 5022156 4075885 3708766 3531874 3144792 2278720 1223960 552898
20251 552898 774194 1986285 3793678 5771572 7672404 9311846 10467612 10766428 10119897
20242 10119897 9010589 8264195 8197915 8616774 9301841 9704004 9783095 10104732 10643515
20233 10643515 10855235 10258350 9056016 7691693 6713284 6451907 6724269 7010979 6645335
20224 6645335 5555892 4412193 3420725 2451799 1798905 1662547 1771439 1969689 2412950
20215 2412950 2997354 3474359 3932881 4577408 5489506 6848374 8493322 9512670 9467977
20206 9467977 8566853 7249680 5990740 4895851 4132433 4102507 4734233 5430625 5578749
20197 5578749 5576858 5704989 5630074 5158238 4477854 3955029 3427485 2888020 2501899 2322322
20187 2322322 2262233 1934447 1224733 788222 1341615 2918398 4618980 5765114 6248018
20178 6248018 5809094 4785870 4268191 4843288 6050840 7227256 8388515 9418101 10249663
20169 10249663 11165825 11679825 11111544 10108830 9846664 10070865 9899334 9473578 9717537
20160 9717537 10925134 12044350 11984391 10603060 8607547 6736058 5620229 4994964 4546977
20151 4546977 4835542 5831706 6615381 6823504 6875609 7081651 7680239 8641073 9638786 10416658
20141 10416658 10744069 10734640 11101150 11762647 12258199 12856203 13660181 14435535 14749896 14513363
20131 14513363 14110644 13434404 12094086 10532045 9551042 9386846 9961484 11010818 12096171
20122 12096171 12827009 13385052 14302870 15622060 17309879 19401619 21176644 22057809 22263806
20113 22263806 22116717 21818837 21417226 21106119 20905565 20315031 19245229 18594353 19027246
20104 19027246 20625826 22717225 24070126 24245797 23639910 22775756 22033397 21710328 21713059
20095 21713059 22233956 23846923 25961448 27769716 29576700 31251937 32288468 32925031
20087 32925031 33330315 33113532 32337231 31676551 31133734 30737791 31039802 31745678 32006759
20078 32006759 31960356 32316688 33094405 33816317 33938933 33798316 34413956 35845564 37597636
20069 37597636 39939497 43059727 45587140 46524238 46456663 46085792 45587572 45164626 45214938
20060 45214938 45782437 46257669 46179913 45935184 46116745 46909712 48529364 51271419 54526433
20051 54526433 57440630 59906441 62295250 64935278 67885735 71260996 75065175 78974460
20043 78974460 82726870 86354147 89857762 92777422 95173650 97737931 101023096 105256294
20035 105256294 110016970 114935094 120167824 125818381 131684357 137206982 142039151 146634018
20027 146634018 151499421 156631471 161451160 165531834 168732798 171225090 173680266 176640662
20019 176640662 180665071 185683483 190609582 194198922 196131967 197430652 199097256 200702404
20011 200702404 201379799 200482724 197250863 191956811 185875167 180060442 175140005 171334670
20003 171334670 168420235 166199307 164801262 163926693 163477062 164085389 165620619 167057156
19995 167057156 167612585 166751509 164197278 160109139 153734816 144908604 135490185 126920755
19987 126920755 119246133 112131751 105674589 100267312 96077884 92921412 90228157 87404676
19979 87404676 84229449 80932718 77972083 76178752 75901617 76322781 76869695 77107492 76582330
19970 76582330 75447435 74498494 74282984 74695667 75134447 74925585 73884367 72121804 70354166
19961 70354166 69828834 70725539 71968063 72714099 72826158 72446534 71867926 71554766 71716955
19952 71716955 72341895 73676336 75863682 78295829 79816003 80446051 81499795 83814513
19944 83814513 87166557 90823023 93955500 96033875 97346386 98630431 100116967 101909997
19936 101909997 104487555 107807922 111839049 116364595 120878845 125378593 130213891 135155750
19928 135155750 139563473 143464123 147210399 150816848 154425961 158473803 162872337 167504966
19920 167504966 172531497 177684103 182375462 186463657 190684901 195913220 202731048 211201844
19912 211201844 220951934 231610091 243185170 255578242 268244818 280935980 293241422
19905 293241422 304067224 312585852 319010875 323659486 326342878 326872600 325048686 320116440
19897 320116440 311842278 300738786 287507495 273061983 257974733 242928706 228616980
19890 228616980 215438432 203291961 191874422 181488792 172594646 164919561 157610517
19883 157610517 150509535 144110023 138673709 134068228 130078492 126875549 124450391 122358535
19875 122358535 120450098 118603787 116916421 115462347 114024115 112288270 110131018 107843910
19867 107843910 105186199 101816561 98041654 94255640 90429629 86386758 82128289 77918482
19859 77918482 73981884 70915872 68994256 67270705 65005484 62162398 59017916 55781979
19851 55781979 52896563 50591988 48529592 46619959 44981198 43820123 43501460 43646380
19843 43646380 43495867 42717780 41631968 40883691 40926567 41506665 41717110 41274037 40664284
19834 40664284 40334778 40114345 39778783 39562241 39564106 39353557 38799011 38325144 37565615 35726173
19824 35726173 33151235 30846107 29146270 27574945 25928893 24594188 23975139 23962669
19816 23962669 23901417 23105929 21612215 19686582 17945359 17172321 17617720 19071356 20963095
19807 20963095 22801696 24575241 26274053 27469781 27923083 27746357 27346459 27110855 27058175
19798 27058175 27079215 26678938 25282905 23534395 22454057 22040068 21922174 21665642 20855724
19789 20855724 19911560 19511945 19493048 19631621 20372015 21887419 23425698 24156392 23977797
19780 23977797 23335024 22516426 21734317 21262483 21309685 21924553 22873198 23626541 23913671
19771 23913671 24395698 25305539 26134395 26317284 25766601 25244891 25220943 25444640 25817956
19762 25817956 26549439 27207712 27102115 26314170 25290992 24342412 23638048 23455828 24030270
19753 24030270 25360475 27080550 28903054 30790410 32386002 32890483 32097155 30752962
19745 30752962 29604687 28459876 27069125 25745333 24797562 24180820 23672765 23715000 24598832
19736 24598832 25737379 26434524 26501794 26172707 25267965 23587519 21784642 20547300 19852201
19727 19852201 19311474 18397581 16983004 15836947 15783174 16753620 18215749 19670846 21009696
19718 21009696 22630147 24145566 24810782 24764381 24583720 24759882 25311496 25865743 26246650
19709 26246650 26423048 25902925 24300859 21967923 19465618 17134370 15175559 13348714
19701 13348714 11715501 11243218 12431154 14489546 16772068 19384454 21956401 23885666
19693 23885666 25144866 25556845 24785220 23603256 23313668 24338632 25981484 27114204
19685 27114204 27389991 27180865 26875097 26654214 26349949 26188626 26339346 26660917 27162236
19676 27162236 27856474 28747017 29839884 30840325 31300482 31447846 31898966 32341232 32207089
19667 32207089 31974827 32498676 34002844 35735964 37437862 39536258 41901621 43818372
19659 43818372 45021941 46046789 47320800 48745244 50446555 52961857 56135075 59171783
19651 59171783 61770362 64747752 68418605 72154611 75903874 80056352 84660517 89579094
19643 89579094 94903259 100731335 106659974 112140011 117453534 122936376 128621594 134527692
19635 134527692 139774063 142804890 142690929 139418253 133704608 126672550 119238981 112185601
19627 112185601 106074031 100717729 95678834 90740912 85606685 80595628 76658197 73728041
19619 73728041 70751848 66904994 62212911 57628758 53924734 51264604 49972672 49808935
19611 49808935 49736636 48764704 46870791 45177474 44080695 42993755 41936108 41213651 40609207
19602 40609207 39751134 38498138 37111274 35529302 33741812 31978897 30317873 28830123
19594 28830123 27727350 26987236 26457133 25859712 24713662 23039681 21609432 21149189 21644030
19585 21644030 22209768 22329464 22527707 23396148 24607140 25457329 25535669 24785964 23362350
19576 23362350 21559334 19858847 18547641 17768895 17672096 18144518 18613384 18237555 17236426
19567 17236426 16824933 16968194 16955508 16314512 14887927 13369538 12220029 11175514 10207117
19558 10207117 9727914 9956654 10256367 10013201 9649893 9683776 10017745 10341584 10518436
19549 10518436 10800438 11774955 13654413 15226929 15414015 14767902 14276278 13979902 13643588
19540 13643588 13589142 13642142 13115075 11842197 10275248 9115200 8402022 7788949 7355641
19531 7355641 7294760 7620662 8007943 8083572 8031971 8055039 7456058 5825638 4028981 3303202
19521 3303202 3616805 3761221 3363286 3324367 4182738 5205577 5795997 6080946 6500168
19512 6500168 7167384 7715807 7656402 7321311 7503273 8056244 7993725 6913892 5599707
19503 5599707 4758892 4129416 3304150 2520262 1913930 1764623 2425817 3526380 4072216
19494 4072216 3432739 2080224 1162604 1163973 1494708 1558623 1189163 547601 396590 1166816
19484 1166816 2510717 4082569 5366273 5864238 6193471 7544311 9783417 11618986
19476 11618986 12040654 10954231 9163169 7480892 5704549 3742587 2318539 1878074
19468 1878074 2195948 3074494 4119819 4558588 4253169 3575147 2895568 2429923 1803071
19459 1803071 1259793 2009044 3780018 5008167 5312708 5700216 6578571 7715912 8537760
19450 8537760 8649431 8256930 7675513 7043047 6298351 5414882 4466234 3950438 4203396
19441 4203396 4439312 4075306 3379531 2577712 1765435 1291645 1365641 1907767 2305398 2363889
19431 2363889 2424591 2722573 3203049 3390105 3224023 2971726 2849709 3155140 3447901 2789310
19421 2789310 1258792 -386044 -1473002 -1633474 -697720 1121206 2931539 3741742 3603568
19412 3603568 3303479 2868967 1770961 667420 788362 2082787 3512719 4374336 4286294
19403 4286294 3675214 3552846 4146655 4788076 4711740 3588114 2197178 1242455 436546
19394 436546 -299417 -695110 -990048 -1813813 -3414763 -5238510 -6165785 -5821468 -5034481
19385 -5034481 -4695245 -4699625 -4887360 -5177329 -4621550 -2761269 -394579 1305744 1862836
19376 1862836 1559442 933607 799432 1683710 3583100 5961826 8084898 9664216 10803265
19367 10803265 11595769 11800994 11284991 10168492 8547028 6244518 3374356 906704
19359 906704 -637402 -1402230 -1498862 -1409812 -1561083 -2124423 -2853333 -2782521 -1467264 236975
19349 236975 1429640 1812752 1741425 1787062 2299950 2928663 3018088 2383450 1428219 838825
19339 838825 842975 1123122 1299411 1164862 690959 7907 -739902 -1166828 -1135906 -793639
19329 -793639 -207872 411860 1021248 1782942 2400599 2332272 2111243 2634165 3644313 4024231
19319 4024231 3216618 1945987 1255747 1146159 1016937 801218 1107540 2577555 4559832
19310 4559832 5201176 3835913 1785284 -71057 -1952349 -3655650 -4540498 -4378937 -3555311
19301 -3555311 -2703875 -1961262 -1082786 -298239 -175126 -630381 -1150379 -1319719 -851008
19292 -851008 4816 861059 1393518 1194257 268078 -1067675 -2585728 -3987230 -5012604
19283 -5012604 -5144916 -4225709 -2630283 -562377 1779885 3866860 4994015 5238694 5506165
19274 5506165 6128369 6534594 6763455 7463511 8287788 8168299 7059076 6113322 6062234
19265 6062234 6516943 6775903 6653823 6358537 5821382 4954033 3859268 2990981 2564099
19256 2564099 2369212 2451939 3220279 4703239 6175050 6952544 7149138 7301684 7347797
19247 7347797 6705129 5316843 3752680 2414753 1338031 556309 150677 112307 180307
19238 180307 -8695 -454997 -330903 257139 733601 898141 748887 670685 732845 897468
19228 897468 1569029 3071258 4407173 4566992 3982077 3263715 3085934 3847018 4790631
19219 4790631 5407836 5456113 4884870 4149627 3348925 2585054 2032276 1555404 984528 142441
19209 142441 -1015181 -2534539 -4225169 -5276255 -5056568 -3732980 -2097886 -1338267 -1718852
19200 -1718852 -2684210 -3709537 -4164941 -3714264 -2649633 -1500673 -687519 -248524 78487
19191 78487 482602 851622 740730 -69886 -896199 -790401 165844 1404259 2904385
19182 2904385 4587699 5870020 6368573 5862795 4391628 2561239 808083 -820616
19174 -820616 -2377573 -3602393 -4153413 -4083771 -4127561 -4581483 -4671413 -3596134 -1681361
19165 -1681361 423179 2289351 3461453 3937009 4139479 4294212 4501299 4854016 5136568
19156 5136568 4994279 4676993 4869096 5409134 5878015 6175669 6155799 5712684 5046361 4661622
19146 4661622 4698580 4736495 4260270 3510561 3464453 4173174 4916237 5479857 6289306 7320928
19136 7320928 7895958 7899287 7244466 5432008 2783349 193902 -2105018 -3889885 -4347355
19127 -4347355 -3155825 -1393593 -429186 -402541 -514912 -244556 -306409 -995411 -1586677
19118 -1586677 -1761128 -1418666 -1075438 -1450862 -2266612 -2860922 -2924539 -2363802 -1140851
19109 -1140851 476136 1420724 908859 -493858 -2185264 -3418458 -3595768 -2936119 -1962713
19100 -1962713 -1238548 -1385352 -2408692 -3356068 -3433152 -2903497 -2635577 -3489959 -5399363
19091 -5399363 -7149087 -8008242 -8270140 -7950396 -6939014 -5536751 -4161378 -3097015 -2004536
19082 -2004536 -629240 760146 1814723 2217045 2070851 1772898 1364390 899680 536544
19073 536544 243890 -341255 -1494512 -2808914 -4020538 -4940972 -5391799 -5694160 -5984418
19064 -5984418 -5850678 -5319564 -4477025 -3366273 -2511780 -2041302 -1892229 -2134197 -2501194
19055 -2501194 -2518799 -2132202 -1476572 -753409 -240791 261242 1157149 2393532 3713491
19046 3713491 4627916 5020517 5224111 5562144 6079847 6018400 4965622 3496175 2418254
19037 2418254 1954664 1691576 1039143 28574 -1132222 -2230823 -2710829 -2516435 -2004826
19028 -2004826 -1261670 -92048 1570596 3493866 5282425 6666329 7207243 6587904 5258559
19019 5258559 3992232 3489534 3921710 4795035 5408121 5343681 4107358 1843145 -327495
19010 -327495 -1390685 -1477298 -1405165 -1401374 -1369926 -1732791 -3015883 -4438233 -4893790 -4621245
19000 -4621245 -4545155 -4872786 -5169759 -4970243 -3846212 -1808561 589404 2242756 2477605
18991 2477605 1499016 60991 -1012767 -1514131 -1836256 -1793457 -1241300 -419811 826405
18982 826405 2111973 2384290 1428865 88133 -1258669 -2515822 -3219598 -3386057 -3387488
18973 -3387488 -3081129 -2095639 -727735 88062 -82 -251554 350835 1797498 3154360
18964 3154360 3404460 2479776 1236340 230725 -343072 -610118 -654845 -697045 -1331663
18955 -1331663 -2670438 -4301819 -5877468 -7329065 -8500128 -8995277 -8886971 -8112706 -6194582
18946 -6194582 -3597333 -1462362 -250204 57300 -408379 -1021913 -1392373 -1472175 -937420
18937 -937420 110867 662645 -40279 -1499498 -2459698 -2313692 -1630321 -969452 -587652
18928 -587652 -402024 -182418 301576 955178 1120556 1310480 2319279 3789023 4956011
18919 4956011 5383986 5243391 5007415 4649465 4035506 3367476 2911389 2746276 2661314 2278830
18909 2278830 1725424 1429756 1353675 838672 -470130 -2313627 -3776429 -4338522 -4576963
18900 -4576963 -4756643 -4471723 -3455798 -2014086 -650225 115549 50007 -617126 -1699411
18891 -1699411 -2880454 -3744149 -4180877 -4424305 -4594035 -4492928 -3937747 -2943228 -1388563
18882 -1388563 255720 956960 791813 665192 604464 890893 2323588 4297604 5885463
18873 5885463 6671226 6261656 5121043 4074246 3060113 1897665 984112 662579 992980
18864 992980 1730486 2636779 3396190 3579308 2928476 1774389 974368 688835 500467
18855 500467 18884 -547539 -588167 -47227 1179813 2924629 4369869 5143881 5699306
18846 5699306 6243294 6146839 4958625 3150260 1357053 -95653 -944562 -1396147 -2140701
18837 -2140701 -3514956 -4623497 -4836576 -4336951 -3168264 -1368530 631219 2000703
18829 2000703 2523780 3023722 3552940 3179827 1800066 521161 231354 805026 1738827
18820 1738827 2553802 2705826 1736467 -101458 -1931014 -2584910 -2047005 -1763564 -2323761
18811 -2323761 -2869636 -2953749 -2885830 -2929736 -3397225 -4078890 -4368603 -3846693 -2343539 -316479
18801 -316479 1003906 992345 406724 379062 787034 857061 618220 874131 1481867 1627225
18791 1627225 1332545 843387 414240 236813 277479 464632 973736 1458021 1844014 2379916
18781 2379916 2936528 2928557 2054825 539673 -1030436 -2087165 -2539559 -2691298 -2662573
18772 -2662573 -1808109 238895 2733165 4463552 4825324 4465131 4509170 4687769 3737106
18763 3737106 1898072 599722 667011 1935207 3308399 4012106 4106950 3614398 2375777
18754 2375777 1044129 559281 735318 812518 494243 32883 -243643 -539981 -1547216
18745 -1547216 -3276250 -4629123 -5013536 -4488085 -3345112 -2166538 -1211047 -685263 -466255
18736 -466255 103369 1002600 1789224 2515719 2896940 2524372 1494560 199139 -1187909
18727 -1187909 -2374245 -3224829 -4091568 -5429790 -6993802 -8171144 -8624615 -7787112 -5693775
18718 -5693775 -3279296 -1236706 95616 478113 217569 108006 704763 1806089 2498892
18709 2498892 2347792 1872520 1560797 1633481 2638374 4487300 6102230 6738225 6518167
18700 6518167 5709963 4423553 3268570 2549536 2030608 1738467 1737632 1832649 1835469 2375197
18690 2375197 3754458 4687686 4171914 2720750 1599530 1788300 2708216 3141206 3191524
18681 3191524 3353959 3814089 4442055 4760955 4628360 4239716 3814683 3779782 4209982 4732027
18671 4732027 4699184 3753130 2785213 2607785 2736918 2461741 2153470 2605395 3449693 4067895
18661 4067895 4296763 4370904 4310839 4233374 4221512 4480988 5513014 7049619 7995761 7864497
18651 7864497 7119846 6809001 7647195 8946625 9492297 9018701 8175139 7598154 7327195
18642 7327195 7147302 7008557 6921772 6982585 7665245 9013074 10250397 11041536 11244384
18633 11244384 10592955 9317149 8089679 7428009 6892985 5903982 4974721 4895035 5514795
18624 5514795 5978719 5862917 4923197 3283760 1949182 1487050 1223812 253065 -1344657
18615 -1344657 -3140439 -4985232 -6598557 -7300078 -6907663 -6241675 -6050337 -6406386 -6773243
18606 -6773243 -6523526 -5083766 -3010922 -1427133 -835987 -999723 -1405006 -1664686 -1292382
18597 -1292382 -396894 446707 570603 75302 -433255 -843237 -1497431 -2327453 -2417508 -1182212
18587 -1182212 965235 2961082 3920519 3831233 3361113 2999410 2719532 2366743 2062343
18578 2062343 1891848 1841767 1741511 1137947 -114386 -1750591 -2826883 -2104558 401793
18569 401793 3588849 6338505 7994997 8280777 7594703 6877764 6470431 5962403 4925447
18560 4925447 3495353 2038733 973949 548713 850981 1797247 3130855 4492439 5357122
18551 5357122 5397152 4993113 4369958 3223538 1686886 600296 433277 817743 909286
18542 909286 422051 -478613 -1809967 -3444582 -5152266 -6895420 -8295391 -8623139 -7924165
18533 -7924165 -6798733 -5724785 -4939216 -4766653 -4778165 -3815376 -2083196 -710495 -313126
18524 -313126 -792656 -1573839 -2360294 -2994541 -3153056 -2563852 -1859684 -1768115 -2323816 -3417980
18514 -3417980 -4984831 -6659080 -7670315 -7889607 -7748660 -7550896 -7286283 -7193245 -7297948
18505 -7297948 -7212530 -6788930 -6313505 -5968985 -6101240 -7377364 -9318569 -10678142 -11119214
18496 -11119214 -11109035 -10936235 -10482439 -10122329 -10153606 -10173150 -9870442 -9458366 -9223626 -8997018
18486 -8997018 -8312163 -7370649 -6863614 -6625596 -5903229 -4762366 -3697057 -2622814 -1436349
18477 -1436349 -609241 -573212 -1065698 -1496402 -1562233 -1418168 -1470712 -1775652 -1652141 -682516
18467 -682516 542218 1119268 924053 457018 52966 -333658 -1090805 -2645179 -4782914
18458 -4782914 -6905736 -8615479 -9632110 -9850786 -9580868 -9490886 -9647219 -9358349 -8546489
18449 -8546489 -7411774 -6129133 -5078299 -4203582 -2931935 -1894640 -1737962 -1852454 -2064458
18440 -2064458 -2307578 -2221623 -1969292 -1796764 -1802145 -2135828 -2475680 -2287931 -1882737 -2168150
18430 -2168150 -3171156 -4215447 -4889962 -5161976 -5414440 -5774352 -5694915 -4790458 -3498698
18421 -3498698 -2101953 -517522 961784 2019478 2517699 2287685 1604397 878526 181140
18412 181140 -322187 -193794 120911 -197379 -1412600 -3095076 -4524911 -5352768 -5740732
18403 -5740732 -5441895 -4543441 -4032246 -4172197 -4023194 -3069321 -1865558 -1318681 -1564063
18394 -1564063 -1421071 -158567 1548626 3105057 4194285 4315465 3389296 1644000 -587124
18385 -587124 -3010458 -5083534 -6316255 -6818119 -6598558 -5867557 -4845255 -3639756 -2360281
18376 -2360281 -1208141 -234395 453255 597519 409848 638220 1725963 3024532 3701884
18367 3701884 3772909 3770480 4273103 4936701 5212956 5138088 4583896 3061268 944816 -565257
18357 -565257 -1256709 -1600474 -1869303 -2251040 -2825096 -3583523 -4009030 -3568424 -2595021 -1611465
18347 -1611465 -485880 618044 1033725 403530 -430372 -488060 -100353 38438 -191322
18338 -191322 -404734 -332671 -322560 -1063454 -2076364 -2728055 -3377046 -4125009 -4280962 -3713667
18328 -3713667 -2714443 -1232711 427693 1570336 1610470 754443 -219168 -748126 -456447
18319 -456447 775347 2355939 3391082 3154174 1818501 347931 -837399 -1858046
18311 -1858046 -2780579 -3180558 -3170779 -3552301 -4912791 -7123653 -9384917 -11091677 -11654982
18302 -11654982 -10825489 -9430324 -8206031 -7138699 -6227441 -5728951 -5369007 -5058597 -4726324
18293 -4726324 -4029564 -3114813 -2458848 -2120440 -1786374 -878425 668426 1993592 2289046
18284 2289046 1810257 1359977 1293660 1300978 1048193 379563 -696041 -1787028 -2401429 -2445764
18274 -2445764 -2131456 -1738991 -1318687 -728687 -7478 415350 470539 -7698 -1076774
18265 -1076774 -2300242 -3199161 -3717368 -4393004 -5309230 -5744575 -5249534 -4259173 -3241390
18256 -3241390 -2140915 -981364 15567 904799 1550289 1519990 1080467 630449 -18263
18247 -18263 -726380 -1563515 -2644344 -3613460 -4150849 -4566969 -5536984 -6722533 -7064741
18238 -7064741 -6485731 -5762597 -4979489 -4039819 -3299312 -3098719 -3411492 -3980377 -4787347
18229 -4787347 -5892120 -7193467 -8242107 -8858777 -9343389 -9481803 -9195546 -8855323 -8404360
18220 -8404360 -7919829 -7630465 -7330001 -6433486 -4792681 -3072478 -2143759 -2175070 -2937306
18211 -2937306 -4248972 -5856753 -7549087 -9026764 -9992964 -10798525 -11552929 -11513258 -10510739
18202 -10510739 -9190433 -7934752 -6802241 -6011445 -5476691 -4921350 -4457212 -4196947 -4013060
18193 -4013060 -3761908 -3631079 -3690919 -3495434 -2938397 -2827341 -3369603 -3522892 -2768585 -1305794
18183 -1305794 404671 1866108 2726658 3458198 4595773 5414430 5382251 4880901 4246639
18174 4246639 3572913 2878313 2308742 2134088 2787570 4071447 5033157 5160352 4468526
18165 4468526 3199593 1647251 271502 -596070 -704234 -655064 -1494526 -2839089 -3781069
18156 -3781069 -4336086 -5419841 -7046353 -8155930 -8485611 -8451273 -8078962 -7511492 -7022387
18147 -7022387 -6293413 -4747526 -2293701 427309 2644369 4005259 4417778 4221395 4289602
18138 4289602 5186715 6354976 6839269 6092776 4542855 3235626 2242856 1268062 466403
18129 466403 -36805 -178075 -152854 66611 547689 1177415 1964911 2676470 2912452 2592242
18119 2592242 2068430 1799516 1756865 1664010 1303178 709424 154642 -314851 -709691 -1139958
18109 -1139958 -1774516 -2087102 -1642131 -763882 107430 681745 828109 673856 121733
18100 121733 -822190 -1825179 -2496255 -2404115 -1634429 -622711 623844 2107916 3131361
18091 3131361 3008697 1682182 -232883 -1673508 -1951758 -1386509 -593620 -474884 -1914113
18082 -1914113 -4445639 -6710133 -7892509 -8080016 -7727971 -7083216 -6283878 -5412295 -4960522
18073 -4960522 -4901524 -4828012 -4760596 -4562883 -4012722 -3019708 -1655026 60698 1743200
18064 1743200 2670409 2924333 2747775 2228540 1751091 1328329 651129 110253 92167 102368
18054 102368 -153212 -8522 827288 1435684 840873 -315405 -982523 -1282337 -1452798
18045 -1452798 -1290098 -1062240 -1442952 -2190787 -2490279 -2142696 -1658262 -1726895 -2624900 -3794084
18035 -3794084 -4454836 -4813357 -5743169 -7540426 -9499102 -10343013 -9589683 -8239824 -7302116
18026 -7302116 -6934946 -7083345 -7623595 -8079123 -8003487 -7514725 -6712464 -5745712 -5177414 -5144782
18016 -5144782 -4986679 -3982389 -2392698 -1231083 -1007019 -1181673 -1472641 -2244871 -3232531
18007 -3232531 -3527173 -2767739 -1621359 -587543 112124 472265 724908 1207659 2119871
17998 2119871 2864571 3170055 3367858 3475150 3530306 3679220 4301601 5532553 6767988
17989 6767988 7422379 7556446 7220237 6037942 4430095 3190366 2025343 455864 -958351
17980 -958351 -1495014 -992655 -283496 178252 940551 2371502 4191315 5679687 6105239
17971 6105239 5397412 4389253 3905560 3856318 3649582 3172706 2556835 1961599 1475840
17962 1475840 986699 370390 -505120 -1455321 -2086404 -2201868 -1383077 478315 2603681
17953 2603681 3743649 3313237 1785460 -16480 -1508563 -2389882 -2424405 -1576860 -550719
17944 -550719 -71437 57171 397316 783079 369348 -509537 -370860 1274813 3083195
17935 3083195 3655700 2863037 1669258 640895 -319309 -1246191 -2293884 -3505772 -4401536
17926 -4401536 -4224797 -3126009 -1681374 -180780 634931 167008 -1063822 -2188874 -2979088
17917 -2979088 -3233729 -2087059 43962 2046981 3912588 5408785 5701903 5103486 4355483
17908 4355483 3763099 3730207 4035392 3867107 3095746 2063667 742573 -538457 -1066912
17899 -1066912 -602150 520974 2111234 3857366 5482852 7238299 8886894 9748297
17891 9748297 9458073 8135304 6666136 5602656 4398332 2705683 1052709 160887
17883 160887 4605 281522 863402 1610112 2340051 2598311 2187678 1658042 1404887 1525496
17873 1525496 1976391 2073519 1223182 -173889 -1358203 -1817094 -1078889 499712 1926838
17864 1926838 2442856 1896322 684170 -539513 -1078042 -808482 3967 1317219 2742958
17855 2742958 3418447 3244022 2650604 2125846 2351799 3279873 4074201 4262609 4235200 4746478
17845 4746478 5805112 6828474 7777936 9115410 10284240 10110034 8686301 6986999
17837 6986999 5509080 4560772 4496549 4814754 4733276 4115606 3189707 2151667 1438118
17828 1438118 1162390 921824 853188 1364026 2223592 2762875 2933723 2827262 2019081 533130
17818 533130 -815018 -1619045 -2019250 -1912303 -1316616 -857669 -820314 -1070836 -1341119 -762501
17808 -762501 1022796 2882482 3962041 4535818 4787564 4284019 2425831 -634914 -4183199
17799 -4183199 -7207616 -9283862 -10751004 -11985003 -13101781 -13555086 -12770055 -11035558
17791 -11035558 -8812140 -6428478 -4063770 -1927804 -405114 16592 -600294 -1500723
17783 -1500723 -1843742 -1559420 -1307788 -1286965 -1278670 -1195525 -1015989 -817135 -939399 -1524851
17773 -1524851 -2142017 -1887115 -521987 980403 1582216 1339535 780626 -142601 -1313844
17764 -1313844 -2306487 -3149599 -3816015 -4257556 -4320327 -3705214 -2534900 -1246415 -84020
17755 -84020 511651 606269 682692 497373 -243682 -1307280 -2411034 -3020157 -2411686 -879181
17745 -879181 933178 2734083 3934000 4043724 3272903 2497989 1754157 633149 -705763
17736 -705763 -2051251 -2914746 -3053857 -2866135 -3127604 -3929528 -4592497 -4536663 -3784397 -2764889
17726 -2764889 -1995758 -1585320 -960484 115630 1143652 1583361 1596464 1465918 1096024
17717 1096024 824063 1176595 2152118 3264822 4031311 4185133 3864818 3471787 3335203
17708 3335203 3333070 3163870 3086508 3383292 3928969 4481535 5017279 5260822 4938724 4304867
17698 4304867 3526133 2600266 1780891 1311027 1174738 1060888 686600 127937 -607158
17689 -607158 -1621226 -2844011 -3649177 -3737416 -3520659 -3060194 -2396591 -1609696 -360884
17680 -360884 1114775 2613445 3816768 4023390 3357464 2418147 1389462 840650 1195250
17671 1195250 1757269 2071140 2188370 2077864 1786528 1343289 758225 490757 871940
17662 871940 1507904 1698755 1462563 1196327 905599 415348 -168676 -837527 -1957531
17653 -1957531 -3229732 -4074006 -4301813 -3747079 -2734036 -2017762 -1470363 -574252 314878
17644 314878 962557 1840642 2723587 3064970 2992268 3106018 3323401 3216473 2803162 2134088
17634 2134088 1619841 1438007 1232681 881717 525896 303759 788984 2175936 3580941
17625 3580941 4417500 4944465 5386227 5636635 5392117 4685166 3690400 2614445 1643121
17616 1643121 1003077 781606 854643 834893 358199 -338867 -796164 -984405 -802612 11537
17606 11537 954317 1375769 1054419 -211709 -1984341 -3106354 -2966510 -1898673 -506282
17597 -506282 833063 2011247 2751348 2619111 1397038 -830459 -3548989 -5685539 -6182273
17588 -6182273 -5536384 -5011069 -5183605 -5541680 -5393630 -4707322 -3747064 -2772655 -1880891
17579 -1880891 -936271 103444 813927 655124 -129873 -674853 -262512 746470 1456713
17570 1456713 1550274 1369116 1339305 1633339 2259810 2808692 2664925 1355527 -901214
17561 -901214 -2798773 -3170847 -2515962 -2314803 -3249379 -4731573 -5685065 -5743603 -5453153
17552 -5453153 -5461026 -5975519 -6174943 -5163584 -3591057 -2835453 -3167819 -3667644 -3596598 -3119395
17542 -3119395 -2321735 -1164810 -156124 -113342 -606830 -1068618 -1779831 -2970958 -4612334
17533 -4612334 -5973438 -6279682 -5922140 -5482389 -4844957 -4164485 -3845139 -3685495 -3084655
17524 -3084655 -1868464 -382898 887617 995585 84142 -768111 -1004358 -585008 99976
17515 99976 536726 643380 1189212 2409520 3530021 3949183 3730904 3218085 2622842
17506 2622842 2139289 1872603 1583197 1380070 1393079 1502388 1321913 201785 -1762141
17497 -1762141 -3864916 -5430138 -6220473 -6232728 -5690466 -4742508 -3767587 -3400755 -3846198
17488 -3846198 -4551236 -4588877 -3910983 -3440140 -3493490 -3575681 -3665981 -4005403 -4355002 -4766221
17478 -4766221 -5613646 -6879161 -8283788 -9100460 -8959609 -8230351 -7262521 -6305175 -5815526
17469 -5815526 -6404605 -7947523 -9240837 -9441446 -8648480 -7023556 -4608742 -2331507 -1354123
17460 -1354123 -1672137 -2321756 -2901640 -3705535 -4324038 -4239583 -3553526 -2455254 -1271015
17451 -1271015 -49545 1384775 2823775 3571576 3104161 1802679 607630 147905 165944
17442 165944 -81539 -845974 -1885821 -2870704 -3136885 -2266352 -972463 -187593 -248497
17433 -248497 -685971 -810574 -260634 789559 1685850 2047607 1980485 1561026 924396 294286
17423 294286 -3723 -194447 -1009547 -2368676 -3492780 -4138948 -4603028 -4652465 -3950094
17414 -3950094 -2908396 -2347369 -2203112 -1825322 -1237731 -774855 -624140 -743428 -878391
17405 -878391 -1227299 -2061201 -3053754 -3908920 -4720966 -5320895 -5507741 -5391156 -5236820 -5164974
17395 -5164974 -5037903 -5026795 -5299066 -5472366 -4914603 -3548004 -1908028 -206349 1668888
17386 1668888 3225218 3798358 3463107 2658286 1973424 1338156 482204 -459377 -1402841
17377 -1402841 -1919078 -1466272 -447632 273855 917499 2027874 3368851 4428278 4903200
17368 4903200 4563981 3622749 2458858 1366019 166233 -1584045 -3146264 -3741691 -3728820
17359 -3728820 -3779076 -4133672 -4433772 -4068740 -3054220 -2089256 -1425387 -614141 418665
17350 418665 1115414 1365885 1594174 1973043 2236619 2165402 1685136 1086838 371577 -770656
17340 -770656 -2232895 -3748442 -4927731 -5381188 -5068786 -4371591 -3733119 -3543790 -3731002
17331 -3731002 -3943605 -4224819 -4586135 -4809892 -4552434 -3877722 -2835412 -1564293 -391951
17322 -391951 699323 1290065 997791 781677 1218134 1812201 2327312 2387856 1460433 -100846
17312 -100846 -1547152 -2948233 -4348885 -5536722 -6427291 -6919613 -7267211 -7689737 -8008885
17303 -8008885 -7745686 -6669287 -4688532 -2203108 -219114 735738 813935 410448 198053
17294 198053 233118 -363998 -1816840 -3223866 -3788273 -3491136 -2893407 -2656306 -3065356
17285 -3065356 -3757371 -4199457 -4056741 -3321335 -2143989 -842416 304034 1095557 1055771
17276 1055771 40439 -1479203 -2697841 -3137071 -2756237 -1815874 -1243450 -1763920 -3149319
17267 -3149319 -5008975 -6746190 -7983399 -8782519 -8990201 -8673343 -8289186 -7877035 -7154595
17258 -7154595 -6077185 -5125472 -4858170 -4856616 -4308055 -2564994 81779 1917089 1874932
17249 1874932 369141 -1455875 -2808987 -3727161 -4171326 -3675251 -2689739 -1990608 -1741128
17240 -1741128 -1927993 -2341896 -2537737 -2083698 -1309607 -1150039 -1719486 -2482288 -2863786
17231 -2863786 -2445020 -1699218 -949341 65139 1327275 2926602 4900809 6533147 6986372
17222 6986372 6558018 5974124 5754025 5643631 5178221 4759178 4441220 3756004 2232810
17213 2232810 248222 -1069887 -1744923 -2208497 -2273766 -1841376 -1064063 -67662 968024
17204 968024 1746735 2115050 2198039 2250220 1774608 84817 -2462708 -4769162 -6250767
17195 -6250767 -7138856 -7681856 -8389899 -9702208 -10757374 -10250553 -8116047 -5189918 -2631202
17186 -2631202 -1061016 -318763 198437 1117054 2868718 5165488 6533659 6065049 4505849
17177 4505849 3156170 2603614 2639884 2949405 3552491 4438200 4995420 4954080 5065133 5378386
17167 5378386 5294656 4365828 2536189 296315 -1383785 -1428304 16274 1424122 1751770
17158 1751770 1183686 149780 -762629 -1114481 -1045453 -719650 -105696 663326 1108367
17149 1108367 1064302 1121701 1667996 2185948 1862137 960771 615106 1222391 2200905 3015933
17139 3015933 3691060 4128964 3890293 3157499 2460024 1588990 -11477 -1882611 -3192148
17130 -3192148 -3753400 -4039635 -4068554 -3330259 -1864049 -183680 1396355 3012292 4790916
17121 4790916 6561744 7736661 7891496 7189413 6206861 5258042 4156510 3343852 3188496
17112 3188496 2987714 2324579 1834246 2105074 2894638 4319921 5839658 6060897 4844785
17103 4844785 3042807 1312294 -209271 -1003344 -1070551 -917515 -618091 -599649 -1566096
17094 -1566096 -3296386 -4835985 -5608870 -5521622 -4791973 -4534825 -5265550 -5672195 -4806830
17085 -4806830 -3124477 -1712366 -1218934 -1695079 -2832984 -3931601 -4456312 -4506002 -4348114
17076 -4348114 -3877683 -2995165 -1935200 -999848 -394533 -486930 -1360695 -2306470 -3347227
17067 -3347227 -4533578 -4902558 -4433378 -4258737 -4225033 -3162696 -1362098 69288 863075
17058 863075 1304437 1225000 764901 376156 -293024 -1193796 -1937159 -2529972 -3020650 -3154940
17048 -3154940 -2745627 -2136949 -2136466 -2890347 -3789693 -4197325 -3853738 -3210640 -3077606 -3686694
17038 -3686694 -4313110 -3860343 -2169266 314658 3153981 5390836 6071826 5442673 4475000
17029 4475000 3326307 2340392 2150950 2831071 3775898 3962079 2951852 1368749 230325
17020 230325 -563374 -1398163 -1755903 -1338759 -546022 429952 1338982 1665724 1555684 1363847
17010 1363847 868477 2288 -818777 -1278380 -1078186 -366644 -171977 -1108220 -2644581
17001 -2644581 -4181350 -5014831 -4816701 -4375961 -4662924 -5619583 -6540274 -7092441 -7220592
16992 -7220592 -6785354 -6003654 -5525506 -5707558 -6069476 -5978027 -5372854 -5057229 -5550472 -6034384
16982 -6034384 -5460818 -3849494 -1997873 -615538 18449 -492828 -1843137 -3063197 -3630930
16973 -3630930 -3243816 -2004086 -410714 1193615 2616143 3233895 2753918 1799526 608903
16964 608903 -1405266 -4172748 -6733243 -8194037 -8167200 -7088575 -5651361 -4221926 -3006940
16955 -3006940 -2097976 -1701475 -1949798 -2612241 -2988266 -2377515 -1061423 516090 2369175
16946 2369175 3761357 3898099 3277105 2574296 1594220 2045 -2067051 -3628016 -3787154
16937 -3787154 -3221703 -2495551 -1446147 -535071 -231480 -326331 -269570 354727 1269391 1860798
16927 1860798 1941904 1518134 652362 -488020 -1521014 -2055074 -2220029 -2323400 -2341481
16918 -2341481 -2183491 -2137170 -2356991 -2477683 -2114866 -1341265 -456590 440383 1461735
16909 1461735 2724031 3808088 4316777 4161660 3620292 3354911 3421420 2834043 1268838
16900 1268838 -452941 -1685229 -2296964 -2482711 -2814071 -3397388 -4160915 -5342469 -6327905
16891 -6327905 -6393704 -5740166 -4861327 -3517911 -1630340 127668 738370 83800 -824962
16882 -824962 -1673815 -2715180 -3684839 -4305254 -4560412 -4797680 -5621594 -6592291 -7116683
16873 -7116683 -7107789 -6276790 -4418814 -2070979 -310462 147017 -406266 -1389824 -2103506
16864 -2103506 -1749857 -420226 764643 1089250 568564 -370403 -1268281 -2061942 -2904380
16855 -2904380 -3809892 -4275667 -3453831 -1517747 433821 1583661 1205804 -706574 -3238017
16846 -3238017 -5678572 -7493994 -8052708 -7574648 -6978671 -6165483 -4478355 -2272669 -260337
16837 -260337 1293764 2521195 3626863 4459409 4600270 4088153 3200140 2446628 2314490
16828 2314490 2329056 2002075 1955990 2751515 3794544 4262118 3663454 2145015 518522
16819 518522 -290844 198166 1175326 1561097 1090959 70339 -809545 -739730 251222 1310025
16809 1310025 1544201 583487 -1008844 -2390956 -2865381 -2606340 -2514953 -2733350 -2872205
16800 -2872205 -2387129 -985514 616147 1248422 673887 -614277 -1922767 -2909166 -4026565
16791 -4026565 -5192390 -5638864 -5353528 -4892909 -4621965 -4587622 -4668893 -5124926 -5788159 -6160724
16781 -6160724 -6172361 -5906053 -5602441 -5321125 -4969669 -4722485 -4760780 -5064558 -5705721 -6680865
16771 -6680865 -7625359 -8144338 -7832221 -6585678 -4686062 -2479953 -243634 1608660 2812331
16762 2812331 3455946 3596303 3176271 2586675 2308437 2418616 3086440 4266278 5049513
16753 5049513 4843424 4313204 3894640 3611191 3899674 4739763 5354749 5083044 4092746
16744 4092746 2986188 1802497 543999 -200358 -74554 695707 1959985 3689836 5131770
16735 5131770 5290125 3970138 1724126 -638529 -2254026 -2674244 -2349663 -1844897 -1194873
16726 -1194873 -765392 -1152377 -2175473 -3000340 -3341081 -3375357 -3080182 -2641875 -2754985
16717 -2754985 -3526163 -4155322 -4211267 -4102402 -4494486 -5426956 -6046609 -5559164 -4433334
16708 -4433334 -3287156 -1976963 -467091 591135 566300 141022 456815 1471203 2484230
16699 2484230 3023406 2869747 2250146 1264222 72358 -1134846 -2472557 -3538063 -3849994
16690 -3849994 -3264742 -1926859 -531794 94846 -96979 -205119 601765 2062018 3324020
16681 3324020 3728942 3101315 1676201 192214 -701712 -980326 -888110 -645176 -887936
16672 -887936 -1989371 -3359933 -4571664 -5834656 -7438920 -9109244 -10230885 -10389267
16664 -10389267 -9278516 -7260328 -5547743 -4557114 -3659223 -2490964 -1313862 1142
16656 1142 1493925 2261695 1671932 644418 781550 2367862 4513038 6334209 7328215
16647 7328215 7244666 6535490 6025339 6180624 7187675 8647500 9474656 9452795 9357276 9358885
16637 9358885 8733298 7341693 5879372 4766548 3625753 2107134 316681 -1699356
16629 -1699356 -3432390 -3947506 -3405373 -3013306 -2998283 -2529355 -1823410 -1627405 -1471358
16620 -1471358 -598042 928210 2521022 3506865 3362006 2067303 399127 -426582 248597
16611 248597 1508286 2100699 1492834 -140049 -1881641 -2789696 -2437549 -1130295 638502
16602 638502 2066223 2574741 2281494 1259714 -22187 -1023922 -1729547 -1982436 -1734972
16593 -1734972 -1380417 -993940 -568186 -269889 -84515 241638 255668 -614476 -1628611
16584 -1628611 -1672919 -591412 788897 1490802 937871 -389920 -1259901 -1028009 -338919
16575 -338919 -477413 -1411423 -2554638 -4064308 -5802313 -6971300 -7286542 -6962787 -6126589
16566 -6126589 -5307828 -4891780 -4846765 -5261404 -6056419 -6762837 -6892888 -6562674 -5761801 -4625643
16556 -4625643 -3883692 -3764122 -3998093 -4171893 -3958066 -3363686 -2719239 -2349550 -2438409 -2738453
16546 -2738453 -3066702 -3598331 -4621426 -5926806 -6642688 -6448821 -5550915 -4213968 -2412939
16537 -2412939 -201208 1506961 2058000 1915689 1544343 956323 64339 -876825 -1300192
16528 -1300192 -960429 -6123 1394200 2714418 3268541 3000986 2549102 2360308 2373056
16519 2373056 2292763 1491767 -316693 -2391415 -3596554 -3816110 -3809073 -3745017 -3677694 -4327166
16509 -4327166 -5812125 -7564620 -8985396 -9562725 -9278800 -8357084 -7224692 -6174397 -4859406
16500 -4859406 -2902332 -834238 442997 680614 404566 116640 254104 1118342 2367933
16491 2367933 3358414 3435573 2612542 1383119 211022 -602858 -1287799 -1979884 -2144340
16482 -2144340 -1571970 -437747 1102322 2874056 4192596 4464029 3939496 3234278 2489162
16473 2489162 1299398 -488910 -2027492 -2419585 -2245802 -2109656 -1647343 -916113 -268646
16464 -268646 226350 719752 1061242 818491 -240031 -1885940 -3926642 -6050153 -7405432
16455 -7405432 -7343025 -6277773 -5314493 -5094241 -5244710 -5043944 -4283156 -3542798 -2956416
16446 -2956416 -1854371 -134955 1819374 3556180 4517517 4528479 3956573 3353407 2944417
16437 2944417 2651316 2361937 1881738 1139500 385976 -22300 -63821 222335 862372 1719834
16427 1719834 2425378 2194438 818438 -908006 -2016357 -2155398 -1287848 329468 1557356
16418 1557356 1451184 610759 -320413 -1584706 -3007172 -4233883 -5374517 -6501244 -7408103
16409 -7408103 -7702496 -7278906 -6396874 -5272298 -4222526 -3419228 -2652135 -1597953 -913871
16400 -913871 -1349199 -2390285 -3067564 -3524229 -4326298 -4990181 -5039851 -4883640 -4792180 -4174479
16390 -4174479 -2910711 -1659117 -1132545 -1584668 -2960547 -4935594 -6435507 -6561401 -5615245
16381 -5615245 -4186418 -2431666 -751692 247512 686541 1145780 1853081 2479790 2850443
16372 2850443 2974879 2815983 2529006 2403354 2339589 1938712 1218036 798017 1467579 2700496
16362 2700496 3441884 3387281 2536218 746679 -1729758 -3729186 -4723322 -5066755 -4592709
16353 -4592709 -3670052 -3362985 -4041445 -4997451 -5264810 -4707563 -3905783 -3496778 -3270039
16344 -3270039 -2757437 -1862099 -599709 825210 1833032 1813308 989643 -94891 -1166960
16335 -1166960 -1857495 -1916650 -1850764 -2390457 -3181990 -3642726 -3849302 -3892138 -4101764 -4459926
16325 -4459926 -4610372 -4432475 -3586793 -2333626 -1790873 -2187086 -2629954 -2505425 -1924134
16316 -1924134 -1444324 -1385420 -1378250 -1095994 -882242 -949595 -1179676 -1474341 -1729090 -2045816
16306 -2045816 -2883614 -4273981 -5077195 -4352642 -2700578 -1170857 -56269 682164 901326
16297 901326 620351 29603 -163918 942165 2755994 3883973 4033449 4015790 4305824
16288 4305824 4613063 4411947 3234397 1264711 -696993 -1861433 -1911209 -1539645 -1741843
16279 -1741843 -2284924 -2277910 -1865720 -1739134 -2062687 -2353915 -2097894 -1500040 -964133 -223823
16269 -223823 855277 1570179 1265858 42487 -1484952 -2767804 -2873112 -1797763 -1099625
16260 -1099625 -916306 -134319 1546424 3552386 5499006 7023231 7529110 7430125 7526331
16251 7526331 7578638 6901055 5482342 3826870 2330304 763581 -1148079 -3265844 -5531077
16242 -5531077 -7411036 -8113019 -7400051 -6222310 -6160642 -7498684 -8901159 -8955453 -7767266
16233 -7767266 -6436127 -5128314 -3203694 -700974 1411449 2728675 3443083 3332389
16225 3332389 2091840 455155 -630225 -1060507 -1134123 -1237574 -1701101 -2209175 -1996436
16216 -1996436 -788215 1134948 2732357 3174365 2686246 1759004 721569 128126 353236
16207 353236 1123713 1962826 2599436 2793377 2135625 899699 416033 1342050 2963746
16198 2963746 4369077 5218690 5712110 5800209 5348603 4302657 2792223 1045008 -893850
16189 -893850 -2637901 -3745341 -4134581 -3784222 -2875087 -1818677 -1171780 -1085595 -1084473 -960608
16179 -960608 -831311 -819657 -1177540 -2305605 -4063987 -5659753 -6464870 -6239729 -4898987
16170 -4898987 -3362935 -2991444 -3504348 -3994245 -4241220 -4257966 -4030745 -3560886 -2691912
16161 -2691912 -1598511 -544334 434115 1138331 1697989 2260944 2927600 3615855 3830378
16152 3830378 3274923 2488744 2012405 1912618 2276716 2985064 3674306 3892439 3484333 2706240
16142 2706240 2075420 1953385 1928884 1636193 1437600 1661100 2156724 2651101 2949021 3108792
16132 3108792 3081124 2971851 2957098 2780424 2289610 1482914 771421 559198 728670 1033405
16122 1033405 1157664 795939 331848 29056 -240976 -110962 497547 1244489 2492811
16113 2492811 4751859 7263237 8954027 9785165 9891777 9218283 8047039 6645667 5188926
16104 5188926 3760166 2491414 1569989 894318 302912 -269915 -658501 -657041 -260332
16095 -260332 35842 95768 293105 435142 26535 -1111559 -2511989 -3369508 -3644422
16086 -3644422 -3503881 -2798155 -1459217 237874 1793167 2685016 2865504 2741323 2257287
16077 2257287 1181357 -372392 -1981862 -3000551 -3079376 -2464925 -1802646 -1435922 -885122
16068 -885122 324444 1679097 2329095 2170624 1403563 501099 153839 357492 462760
16059 462760 -82878 -392118 582802 2136643 3068700 3115150 2635590 1598012 -102094
16050 -102094 -2113480 -3729330 -4455107 -3967479 -2544351 -1052735 -316559 -187982 215701
16041 215701 1192694 2130500 2598707 2686400 2594778 2413533 2005736 1606992 1693399 1866910
16031 1866910 1787518 1482918 1025601 860071 1281198 2162161 3052929 3347077 2985929 2539794
16021 2539794 2628759 3063336 3222636 3063648 3093250 3651540 4689545 6060909 7305869
16012 7305869 7988925 7867291 6964638 5794676 5013776 4852570 4880851 4720730 4553091
16003 4553091 4404279 3776596 2619643 1977678 2490472 3719254 5059732 5876448 5732402
15994 5732402 4450538 1939917 -1062418 -2754715 -2416061 -1627045 -2071535 -3496777 -4997556
15985 -4997556 -6546636 -7924186 -8175875 -7034899 -5703479 -5060008 -4771441 -4042208 -2859506
15976 -2859506 -2122539 -2370737 -3209967 -4166636 -4996404 -5543660 -5762038 -5663477 -5293563 -4693485
15966 -4693485 -4158151 -4154981 -4620280 -5461346 -6683165 -7596522 -7764387 -7237981 -6432262 -5617116
15956 -5617116 -4479833 -2973789 -1256241 344301 1117632 659099 -244532 -1099284 -2541372
15947 -2541372 -4403727 -5737024 -6331342 -6569119 -6763640 -6850807 -6304657 -4882174 -2973229
15938 -2973229 -1456500 -903756 -1169064 -2178790 -3781463 -5542550 -7011727 -8183194
15930 -8183194 -9404622 -10685878 -11853359 -12424418 -12004299 -11125029 -10361773 -9579698 -8742180
15921 -8742180 -8126522 -7502355 -6423002 -5120910 -3945655 -2890719 -1938930 -1251592 -800048
15912 -800048 -568611 -789867 -932370 87220 2513787 5351337 7044818 6387519 3973031
15903 3973031 1664185 278479 -794075 -1990977 -2873029 -3243728 -3272752 -2997397 -2436084
15894 -2436084 -1687627 -885370 -259359 -339453 -1422566 -2442777 -1953693 -210278 1299701
15885 1299701 1809724 1599988 1160802 670508 178949 -330101 -903604 -1400722 -1454279 -923225
15875 -923225 -207452 299725 510025 542241 297412 -488871 -1518631 -2785240 -4503368
15866 -4503368 -6213980 -6929035 -5742746 -2973453 248224 3149888 5465586 6913334
15858 6913334 7358492 6733920 5336239 4049452 3440796 3178941 2849156 2921343 3620174
15849 3620174 4570739 5558747 6140402 6031150 5034961 3356944 1951642 1576033 2218422
15840 2218422 3282424 4049247 3822667 2939327 2191160 1627681 1150763 684043 243215
15831 243215 -113325 -380942 -491843 -459982 -389005 -165457 103362 97185 -20886 21584
15821 21584 115824 -79700 -105326 396441 654923 175802 -549180 -876330 -931369 -1427605
15811 -1427605 -2237417 -2887421 -3159001 -2624176 -1556716 -888208 -801001 -1256619 -2114123
15802 -2114123 -2714559 -3063305 -3543525 -4049250 -4219573 -3883658 -3409969 -3289592 -3839679
15793 -3839679 -4846231 -5825964 -6597124 -7100537 -7512731 -7885254 -7668638 -6456350 -4807167
15784 -4807167 -3320159 -2364055 -1787450 -1395130 -837451 298107 1315774 1405939 954581
15775 954581 380685 -558841 -1891197 -3124523 -3962703 -4341353 -4419975 -4368418 -4409882 -5005645
15765 -5005645 -6172886 -6926543 -6865008 -6390158 -5217084 -3207398 -830924 1311887 2988508
15756 2988508 3967409 4185454 3832970 3235447 2759581 2273715 1606696 895569 441958
15747 441958 636579 1251868 1772058 2098107 2021016 1109366 -717214 -2832064 -4471126
15738 -4471126 -4866714 -3698074 -1705312 127485 1363043 1877632 1455181 217152 -1100343
15729 -1100343 -1570837 -997031 87541 1182731 2162326 2912701 3289344 3629596 4123135
15720 4123135 4310339 4482402 5048213 5484986 5235180 4217595 2299925 -398342 -3279907
15711 -3279907 -5666988 -6997003 -7418874 -7295145 -6755183 -6237797 -6278536 -6439794 -5677028
15702 -5677028 -4108492 -2819868 -2515542 -3269552 -4580787 -5188668 -4366878 -2920331 -1971837
15693 -1971837 -1604330 -1655922 -2122370 -2333309 -1495697 318280 2197000 3007035 2453053
15684 2453053 1073999 -375750 -1270729 -1813734 -2491717 -3135705 -3708205 -4529918 -5099779
15675 -5099779 -4723534 -3627852 -2292446 -566306 1822171 4626921 6910364 7891914
15667 7891914 7710731 6850145 5508416 3915956 2594305 2029099 2095801 2375064 2653785
15658 2653785 2498641 1502134 -253228 -2093835 -2967496 -2525948 -1912100 -1996032 -2067800
15649 -2067800 -1330294 -284374 29438 -357360 -942010 -1144963 -403449 786072 1406985
15640 1406985 874099 -556926 -2248848 -3964909 -5858293 -7667268 -8543017 -7658153 -5437590
15631 -5437590 -3347785 -2153146 -1835483 -2412012 -3433429 -4128708 -4106857 -3439308 -2148641
15622 -2148641 -512693 778869 1304404 867166 -723848 -2834320 -4283186 -4869326 -5165261
15613 -5165261 -5663144 -6333963 -6807822 -6980350 -6838278 -6297499 -5765761 -5374205 -5175469
15604 -5175469 -5255156 -5555910 -6072637 -6677074 -6869741 -6556361 -6519777 -7075190 -7718718 -8063452
15594 -8063452 -8100406 -8024755 -7718820 -6767819 -5463511 -4734994 -4629473 -4162584 -3230767 -2547813
15584 -2547813 -2614399 -3483364 -4710879 -5859077 -6548832 -6453091 -5657813 -4571363 -3746314
15575 -3746314 -3404831 -3213801 -2881920 -2523980 -2201344 -2159840 -2717137 -3369906 -3436303 -2854957
15565 -2854957 -2405578 -3167727 -5060175 -6968783 -7761187 -7144342 -5779450 -4260983 -2786070
15556 -2786070 -801942 1873340 3925870 4195856 3190611 2277758 2270739 3080424 4414735
15547 4414735 5987407 7475615 8584895 8978513 8839072 8507403 7947039 7021807 5553287
15538 5553287 4037153 3282588 3005462 2816384 2905750 2952712 2780591 2519321 1924370 678759
15528 678759 -1045289 -2710085 -4096125 -5013497 -5530253 -5969741 -6160616 -6011333 -5996691
15519 -5996691 -6074235 -5577421 -4528951 -3445195 -2614550 -1831011 -947000 -638989 -1384253
15510 -1384253 -2456129 -3242888 -3965028 -5039343 -6260579 -6903507 -6608149 -5342718 -3303307
15501 -3303307 -1448238 -238314 1025213 2196447 3060439 4027074 5159757 6075820 6202496
15492 6202496 5791110 5421328 5001829 4489936 4132017 4288232 4930187 5290846 4826200
15483 4826200 3772201 2664506 1930152 1694681 1662293 1284422 342745 -603331 -1055127
15474 -1055127 -1380765 -1705488 -1867785 -2160672 -2800790 -3768427 -4397106 -4093932 -3097311
15465 -3097311 -1779925 -812285 -1053805 -1858356 -2200311 -2112103 -1731888 -956671 -254273
15456 -254273 -93914 -103106 -388524 -923054 -948080 -430973 168862 831743 1920132 3683805
15446 3683805 5958323 8376202 10356960 11560695 11393793 9945744 8869818 8656246
15438 8656246 8508157 8055830 7065988 5588134 4352032 3793936 3466993 3205810 3293452
15429 3293452 3644194 3810532 3566063 3126500 2671531 1933740 644398 -884424 -2594840
15420 -2594840 -4501691 -5808319 -5745292 -4680521 -3652193 -3166636 -3087823 -3158375 -3229902
15411 -3229902 -3438840 -3812925 -4143107 -4048683 -3076152 -1756863 -1196675 -1389207 -1400957 -509982
15401 -509982 1126333 2664730 3399136 3374699 2969721 2310615 1663607 1370130 1446483 1698071
15391 1698071 1909248 2154900 2557735 2774108 2476071 1523922 209316 -901811 -1491902
15382 -1491902 -1547384 -1087917 -529085 -258674 -261348 -583682 -981134 -1553760 -2322746 -2731294
15372 -2731294 -2661373 -2277617 -2070608 -2525575 -3225883 -3466258 -2871753 -1559859 158119
15363 158119 1773838 2777454 3455453 4071511 4171579 3785783 3788240 4684321 5926300
15354 5926300 6554052 6146674 4869237 2944211 830995 -809400 -1699646 -1799622 -1461158
15345 -1461158 -1171685 -962119 -786076 -938287 -1332832 -1497919 -1199114 -463056 381782
15336 381782 642197 9799 -1021869 -1434210 -979866 -502872 -503807 -964122 -1901277 -3230186
15326 -3230186 -4715995 -6029851 -6651072 -6292974 -5118115 -3844623 -3551320 -4513735 -5705841
15317 -5705841 -5959141 -5307796 -4451759 -3515455 -2439383 -1327283 -513785 -113785 158857
15308 158857 19979 -539769 -563992 51371 752175 1134367 376797 -1477217 -2987530
15299 -2987530 -3562425 -3632842 -3498624 -2925344 -1797958 -724580 -462417 -1533451 -3427349
15290 -3427349 -4658538 -4593495 -3717515 -2492683 -1338579 -819502 -1090287 -1377309 -969610
15281 -969610 111868 1320538 1952536 1747612 1341052 1413413 1862574 2235704 2566004
15272 2566004 3152207 4228898 5538202 6421775 6474197 5802386 4702661 3315711 1915422
15263 1915422 776905 -152346 -768279 -712492 193855 1402934 2219335 2267927 1598155
15254 1598155 614081 -47849 41560 547688 660851 -147612 -1606657 -3006852 -3625489
15245 -3625489 -3383600 -2878328 -2403815 -1801467 -757659 775037 2291333 3151244 2800125
15236 2800125 1271240 -495700 -1776669 -2454421 -2767954 -3017054 -3369392 -3736099 -3752070
15227 -3752070 -3372608 -2845750 -2417962 -2275473 -2642271 -3711468 -4919235 -5097659 -4326272
15218 -4326272 -3475140 -2755888 -2424679 -3182218 -4662354 -5632183 -5619178 -5301839 -5101650
15209 -5101650 -4497145 -3300530 -2246125 -1813800 -1532489 -797887 48731 546015 1019189
15200 1019189 1974052 3149496 3864291 3964437 3764132 3615769 3560373 3490106 3054550 1996041
15190 1996041 615507 -494139 -1053967 -1325562 -1774361 -2735432 -4085996 -5505741 -6661817
15181 -6661817 -7284257 -7266029 -6893559 -6377126 -5692159 -4606346 -3231305 -2195490 -1838308
15172 -1838308 -1762567 -1335641 -204293 1650654 3398761 3884241 3015129 1659371 1061503
$$ [...]
##END NTUPLES=NMR SPECTRUM
##END=
