##TITLE=C13_DE-75H2
 D2O, 22200sc

 6.2.2025
##JCAMPDX= 6.0         $$ Bruker NMR JCAMP-DX V2.0
##DATA TYPE= NMR SPECTRUM
##DATA CLASS= NTUPLES
##ORIGIN= UXNMR, Bruker Analytische Messtechnik GmbH
##OWNER= root
$$ XWIN-NMR		Version 3.5
$$ Fri Feb  7 13:35:34 2025 Russian Standard Time (UT+4h)  she@DPX200
##.OBSERVE FREQUENCY= 50.327896
##.OBSERVE NUCLEUS= ^13C
##.ACQUISITION MODE= SIMULTANEOUS
##.ACQUISITION SCHEME= undefined
##.AVERAGES= 22202
##.DIGITISER RES= 17
##SPECTROMETER/DATA SYSTEM= spect
##.PULSE SEQUENCE= zgpg30
##.SOLVENT NAME= CDCl3
##.SHIFT REFERENCE= (INTERNAL, CDCl3, 0, 222.646)
##AUDIT TRAIL= $$ (NUMBER, WHEN, WHO, WHERE, WHAT)
$$ ##TITLE= Audit trail, XWIN-NMR		Version 3.5
$$ ##JCAMPDX= 5.01
$$ ##ORIGIN= Bruker BioSpin GmbH
$$ ##OWNER= she
$$ F:/spectra/data/she/nmr/c13/1/pdata/1/auditp.txt
$$ ##AUDIT TRAIL=  $$ (NUMBER, WHEN, WHO, WHERE, WHAT)
(   1,<2025-02-07 13:33:42.93 +0400>,<she>,<DPX200>,
      <created by zg, POWCHK disabled, PULCHK disabled
       terminated by command 'halt'
       configuration hash MD5:
       00 E9 B6 7A A2 85 ED C7 34 08 36 98 17 FE 4E 26
       data hash MD5: 32K
       E9 70 08 B2 7D 00 79 52 41 F6 74 90 4E 7D 0B 7A>)
(   2,<2025-02-07 13:34:08.54 +0400>,<she>,<DPX200>,
      <Start of raw data processing
       efp BC_mod = 2 LB = 2 FT_mod = 6 PKNL = 1 PHC0 = -414.711 PHC1 = 43.08833 SI = 32K 
       data hash MD5: 32K
       1D 6F 9D 92 1B 8C 03 8F E7 3A 51 D5 08 3C 6C 95>)
(   3,<2025-02-07 13:34:14.57 +0400>,<she>,<DPX200>,
      <abs ABSG = 5 
       data hash MD5: 32K
       29 9F 90 32 6C E7 C9 26 1E 63 41 B8 01 0E FB 5F>)
(   4,<2025-02-07 13:34:43.70 +0400>,<she>,<DPX200>,
      <pk PHC0 = -3.761325 PHC1 = 9.000001 
       data hash MD5: 32K
       BA 3E 03 A0 FC F4 D2 42 E5 BF 73 69 E5 BA 2C 5B>)
(   5,<2025-02-07 13:34:49.95 +0400>,<she>,<DPX200>,
      <abs ABSG = 5 
       data hash MD5: 32K
       78 57 0B B2 4C 35 CF F1 E4 10 54 E9 7B C4 5E C1>)
$$ ##END=
$$ 
$$ hash MD5
$$ 7F 99 FE 70 51 EA B2 48 20 2C E9 37 E8 69 4C 87
##$RELAX= 
##$RELAX= 
##$RELAX= 
##$RELAX= 
##$RELAX= 
##$RELAX= 
##$RELAX= 
##$RELAX= 
$$ Bruker specific parameters
$$ --------------------------
##$DU= <F:/spectra>
##$EXPNO= 1
##$NAME= <c13>
##$PROCNO= 1
##$TYPE= <nmr>
##$USER= <she>
##$AMP= (0..31)
100 100 100 100 100 100 100 100 100 100 100 100 100 100 100 100 100 100 
100 100 100 100 100 100 100 100 100 100 100 100 100 100 
##$AQSEQ= 0
##$AQ_mod= 1
##$AUNM= <au_zg>
##$AUTOPOS= <>
##$BF1= 50.322709
##$BF2= 200.13
##$BF3= 50.322709
##$BF4= 500.13
##$BF5= 500.13
##$BF6= 500.13
##$BF7= 500.13
##$BF8= 500.13
##$BYTORDA= 1
##$CFDGTYP= 0
##$CFRGTYP= 5
##$CHEMSTR= <none>
##$CNST= (0..31)
1 1 145 1 1 1 1 1 1 1 1 1 1 1 1 1 1 1 1 1 1 1 1 1 1 1 1 1 1 1 1 1 
##$CPDPRG= <waltz16>
##$CPDPRG1= <>
##$CPDPRG2= <waltz16>
##$CPDPRG3= <>
##$CPDPRG4= <mlev>
##$CPDPRG5= <mlev>
##$CPDPRG6= <mlev>
##$CPDPRG7= <mlev>
##$CPDPRG8= <mlev>
##$CPDPRGB= <>
##$CPDPRGT= <>
##$D= (0..31)
$$ [...]
##$SUBNAM4= <"">
##$SUBNAM5= <"">
##$SUBNAM6= <"">
##$SUBNAM7= <"">
##$SUBNAM8= <"">
##$SUBNAM9= <"">
##$SW= 239.972175391363
##$SWIBOX= (0..15)
0 1 3 0 0 0 0 0 0 0 0 0 0 0 0 0 
##$SW_h= 12077.2946859903
##$TD= 32768
##$TD0= 1
##$TE= 0
##$TE2= 300
##$TE3= 300
##$TEG= 300
##$TL= (0..7)
120 120 120 120 120 120 120 120 
##$TP= (0..7)
150 150 150 150 150 150 150 150 
##$TP07= 0
##$TPNAME0= <>
##$TPNAME1= <>
##$TPNAME2= <>
##$TPNAME3= <>
##$TPNAME4= <>
##$TPNAME5= <>
##$TPNAME6= <>
##$TPNAME7= <>
##$TPOAL= (0..7)
0.5 0.5 0.5 0.5 0.5 0.5 0.5 0.5 
##$TPOFFS= (0..7)
0 0 0 0 0 0 0 0 
##$TUNHIN= 0
##$TUNHOUT= 0
##$TUNXOUT= 0
##$USERA1= <user>
##$USERA2= <user>
##$USERA3= <user>
##$USERA4= <user>
##$USERA5= <user>
##$V9= 5
##$VALIST= <valist>
##$VCLIST= <CCCCCCCCCCCCCCC>
##$VD= 0
##$VDLIST= <DDDDDDDDDDDDDDD>
##$VPLIST= <PPPPPPPPPPPPPPP>
##$VTLIST= <TTTTTTTTTTTTTTT>
##$WBST= 1024
##$WBSW= 4
##$XGAIN= (0..3)
0 0 0 0 
##$XL= 0
##$YL= 0
##$YMAX_a= 120168674
##$YMIN_a= -36564237
##$ZGOPTNS= <>
##$ZL1= 120
##$ZL2= 120
##$ZL3= 120
##$ZL4= 120
##$ABSF1= 222.646
##$ABSF2= -17.35081
##$ABSG= 5
##$ABSL= 3
##$ALPHA= 0
##$AQORDER= 0
##$ASSFAC= 0
##$ASSFACI= 0
##$ASSFACX= 0
##$ASSWID= 0
##$AUNMP= <proc_1d>
##$AZFE= 0.1
##$AZFW= 0.5
##$BCFW= 0
##$BC_mod= 2
##$BYTORDP= 0
##$COROFFS= 0
##$CY= -3
##$DATMOD= 1
##$DC= 0
##$DFILT= <>
##$DTYPP= 0
##$F1P= 0
##$F2P= 0
##$FCOR= 0.5
##$FTSIZE= 32768
##$FT_mod= 6
##$GAMMA= 0
##$GB= 0
##$INTBC= 1
##$INTSCL= 4.134877e-10
##$ISEN= 128
##$LB= 2
##$LEV0= 0
##$LPBIN= 0
##$MAXI= 10000
##$MC2= 0
##$MEAN= 0
##$ME_mod= 0
##$MI= 0.1934396
##$NCOEF= 0
##$NC_proc= 1
##$NLEV= 6
##$NOISF1= 120.0001
##$NOISF2= 80.00006
##$NSP= 0
##$NTH_PI= 0
##$NZP= 0
##$OFFSET= 222.646
##$PC= 1.4
##$PHC0= -418.4723
##$PHC1= 52.08833
##$PH_mod= 1
##$PKNL= yes
##$PPARMOD= 0
##$PSCAL= 0
##$PSIGN= 0
##$REVERSE= no
##$SF= 50.3227304950709
##$SI= 32768
##$SIGF1= 140
##$SIGF2= 120
##$SINO= 11.81781
##$SIOLD= 32768
##$SREGLST= <13C.CDCl3>
##$SSB= 0
##$STSI= 32768
##$STSR= 0
##$SW_p= 12077.2946859903
##$SYMM= 0
##$S_DEV= 0
##$TDeff= 32768
##$TDoff= 0
##$TI= <>
##$TILT= no
##$TM1= 0
##$TM2= 0
##$TOPLEV= 0
##$USERP1= <user>
##$USERP2= <user>
##$USERP3= <user>
##$USERP4= <user>
##$USERP5= <user>
##$WDW= 1
##$XDIM= 32768
##$YMAX_p= 313701133
##$YMIN_p= -3426815
$$ End of Bruker specific parameters
$$ ---------------------------------
##NTUPLES= NMR SPECTRUM
##VAR_NAME=  FREQUENCY,     SPECTRUM/REAL,   SPECTRUM/IMAG
##SYMBOL=    X,             R,               I
##VAR_TYPE=  INDEPENDENT,   DEPENDENT,       DEPENDENT
##VAR_FORM=  AFFN,          ASDF,            ASDF
##VAR_DIM=   32768,         32768,           32768
##UNITS=     HZ,            ARBITRARY UNITS, ARBITRARY UNITS
##FACTOR=    0.368581032318806, 1,           1
##FIRST=     11204.1544572324, 0,            0
##LAST=      -873.140228757911, 0,           0
##MIN=       -873.140228757911, -3426815,    0
##MAX=       11204.1544572324, 313701133,    0
$$ Real data points
##PAGE= N=1
##DATA TABLE= (X++(R..R)), XYDATA
$$ [...]
22941c67789J62602P1832M5793j7724k23965l86249l12985r2200L5630M2969J46648
22930h95438L43056L08465R2678M6203J77071J72348k4012j60823j90856j32679
22920b63987L4002J72683J60309n4j23982j17720p8408k5225k2342n3554n2989
22909c71267l5505N3178J81329J79212N9983k3114k4681j1941r6605k56307m36924
22898g82642n76465o05518l97219r6928N1734J93338K98106K14034R2567R6416
22888a512577J96919K31448J17878M2958l9896j17581l775J73258L39939M64284
22878a07145M52796L31769K03832J34005L9429n0800J891Q9686N7261q7492j40834
22867I24398n7588l5733j13462l07731n10845m77861j88791J44443K69826K28823
$$ y = [-367789, -205187, -133355, -87562, -105286, -329251, -715500, -1028485, -1120685, -1085055, -1042086, -895438, -552382, -243917, -151239, -105036, 72035, 244383, 220371, 59548, -131308, -263987, -229985, -57302, 103007, 102953, -21029, -138749, -217157, -242382, -264724, -318278, -371267, -406772, -353594, -172265, 6947, 66930, 43816, 19135, 7194, -89411, -345718, -782642, -1359107, -1964625, -2361844, -2458772, -2407038, -2213700, -1915594, -1701560, -1608993, -1512577, -1315658, -1084210, -966332, -923374, -963270, -1080851, -1084626, -911368, -571429, -107145, 345651, 677420, 881252, 1015257, 1054686, 1003886, 1005777, 1095463, 1152724, 1065232, 924398, 866810, 831077, 717615, 409884, -100961, -578822, -767613, -623170, -353344, -124521]
22857a24521J36680o6645k31097k46514k09044j68993j47073j94575k06849o7843
22847a526474J74958L39818K86278K30460L25931M12359L64784K38291N8213q5286
22837H19332r0643n8153p6383j60966k60873k50206j91245k80151m40739l71573
22827a361600k8490K92530L60055L13252L28080L15796J78940q6220l04562l92251
22817c84470m17282l37911j23934J40609L38782M47902M35125J95260p7695j32628
22807H3758n8745q3138j65988k73891m17118m25929l19992k36320j21108k6305
22797b044776q2361j77683j48328j0817K08007M34059N70236O04214N37092M28022
22787C17665K17428r7117l03306k76870r3355J60760L21902L74857M15266M24773
$$ y = [-124521, 12159, -54486, -285583, -532097, -741141, -910134, -1057207, -1251782, -1458631, -1526474, -1351516, -1011698, -725420, -494960, -169029, 243330, 608114, 846405, 904618, 819332, 728689, 670536, 594153, 433187, 172314, -77892, -269137, -549288, -990027, -1361600, -1390090, -1097560, -737505, -424253, -96173, 219623, 398563, 312343, 7781, -384470, -801752, -1139663, -1263597, -1122988, -784206, -336304, 98821, 294081, 216386, 83758, 25013, -58125, -224113, -498004, -915122, -1341051, -1661043, -1897363, -2018471, -2044776, -2127137, -2304820, -2453148, -2463965, -2255958, -1821899, -1251663, -647449, -110357, 317665, 535093, 437976, 134670, -142200, -235555, -74795, 247107, 621964, 1037230, 1462003]
22777A462003L23465J90290J57407J35799L3031l7629O3027R2965j29397m40197
22767A850764n38210l91808k73857k39002k69229l73292l68998k23030m9381L4511
22757h41532J8250j8830q1490j38607j34051q25K94495N69986O06514L77992P7462
22746G29364j33211k61971l35998l65031l37117l32617k51287K0164K08391J99823
22736h59490J95785K32329K31538J55979J2880j37342k32772k88158l19959l32141
22726a341351k46960m0364J51169K26551J65002Q1046Q3833N7415l8140q0799
22716i82598K3464K53597M39061M93342M09375J67123j42915k06769M5773K16535
22706G15988J69279K6466j09429k04713k26910j46214q5242j35250k10408j61835
$$ y = [1462003, 1785468, 1975758, 2133165, 2268964, 2301995, 2264366, 2327393, 2420358, 2290961, 1850764, 1312554, 920746, 646889, 407887, 138658, -234634, -603632, -826662, -876043, -841532, -823282, -842112, -923602, -1062209, -1196260, -1197085, -902590, -332604, 273910, 651902, 729364, 596153, 334182, -1816, -366847, -703964, -1036581, -1287868, -1267704, -1059313, -859490, -663705, -431376, -199838, -43859, -30979, -168321, -401093, -689251, -1009210, -1341351, -1588311, -1628675, -1477506, -1250955, -1085953, -1004907, -921074, -863659, -901799, -982598, -959134, -705537, -266476, 226866, 636241, 803364, 660449, 453680, 499453, 715988, 885267, 911733, 802304, 597591, 370681, 224467, 139225, 3975, -206433, -368268]
22696c68268M69J14494R1634M2336m1627r7635j4611J53824L43866L72884K53065
22685H50431J34838R8683Q4481N7852Q529p6152j87595k96036l32967j35951K42334
22674D48447M21061L03993J41105J10574N8763j67230l22812k44777j02818j3191
22664F33115k7101j23503j97279j59303n1010J18718J61195k4377k29765l08784
22654b08094j68064J15967L26167L44824K49469K33641K56842K11156O0033j77172
22644A244769l37107l47546k43259R16J73252J12058L4717L0186j9843q0769p7947
22633D89427j15R6423J25235J11482k430j79856k61749k49141j15940l110l4019
22622b3793p6122j19781j59730j42028l0313K47156N43863N56099L58402K11837
$$ y = [-368268, -367799, -253305, -161671, -119335, -160962, -258597, -273208, -119384, 224482, 597366, 850431, 985269, 1083952, 1168433, 1226285, 1234814, 1158662, 971067, 675031, 342064, 206113, 448447, 869508, 1173501, 1314606, 1425180, 1483943, 1316713, 993901, 749124, 646306, 633115, 606014, 482511, 285232, 125929, 74919, 193637, 354832, 330455, 100690, -208094, -376158, -260191, 65976, 410800, 660269, 893910, 1150752, 1361908, 1421941, 1244769, 907662, 560116, 316857, 317773, 491025, 603083, 637800, 667986, 648143, 567374, 489427, 489312, 585735, 710970, 822452, 820022, 640166, 378417, 129276, 13336, 10226, -23793, -99915, -219696, -379426, -521454, -551767, -304611, 239252, 795351, 1153753, 1365590]
22612A365590K47151L12102K61356Q4122m3091j20651k88012m12667m26687m35788
22602E43425l16684j04361J03623M05446N58051L44017j9379k52255k64208j82797
22592H14878j72825k24612l27392m06362l42132k06266k1547K46100M39511N14775
22582C14128M48467L64153L39616K87285J62915N6441M4969O5115K1417l2732
22572B071774l6151l0100m1418j17992k12987k70578k26707n1314r241j30570
22562I44716k11505j96620j84979k88543l22576j88142Q29J76373K39160Q4209
22552E2922j59558k91533k55842j1994K18966K19804R4232k2825j12993j92983
22542d61804k10755j28550k4648K5499O7755P7630L3373o5857j63398j42717j09379
$$ y = [1365590, 1612741, 1924843, 2186199, 2270321, 2227230, 2106579, 1818567, 1405900, 979213, 543425, 226741, 122380, 226003, 631449, 1189500, 1533517, 1514138, 1261883, 997675, 814878, 642053, 417441, 90049, -316313, -658445, -864711, -886258, -640158, -200647, 314128, 762595, 1126748, 1466364, 1753649, 1916564, 1973005, 2017974, 2083089, 2104506, 2071774, 2035623, 2005523, 1964105, 1846113, 1633126, 1362548, 1135841, 1084527, 1075286, 944716, 733211, 536591, 351612, 63069, -259507, -447649, -446820, -270447, -31287, 52922, -106636, -398169, -654011, -666005, -447039, -227235, -133003, -155828, -268821, -461804, -672559, -801109, -825757, -800258, -732503, -654873, -621500, -687357, -850755, -993472, -1102851]
22531a102851j94290k54214j45418Q4801K51710K91297K82368K84004K08197p7120
22521c71516m24848o01145n66660k70809J56920L62423L11765K28972J91670J47076
22511h36152O9639l3975j12515j28769q7082l0759J19928K98132K90535Q2146
22501c68872q6319r7879j25022r9107Q1488K73679K73985J05485j2637K180N6151
22490C132K3207o4751k30867m26657l42303n0778J32898J25285N7280N2420J5672
22479g05462q5746j34424r6359J3670N9548O0770P1022K9249k3972j4598O2066
22468g64236J04918P6065Q9278J33959J27057K7367p5212l4261Q9379J60694N4642
22457a0350j92011m30531o46457o76595m88593k80427j40568K6187K95519N41459
$$ y = [-1102851, -1297141, -1551355, -1696773, -1611972, -1360262, -1068965, -786597, -502593, -294396, -371516, -796364, -1397509, -1964169, -2234978, -2078058, -1715635, -1403870, -1174898, -983228, -836152, -766513, -800488, -913003, -1041772, -1128854, -1159613, -1039685, -741553, -451018, -368872, -455191, -553070, -678092, -777199, -695711, -422032, -148047, -42562, -55199, -53019, 3132, 26339, -38412, -269279, -695936, -1038239, -1089017, -956119, -830834, -773554, -721134, -705462, -791208, -925632, -1021991, -1008321, -948773, -888003, -816981, -787732, -811704, -826302, -764236, -659318, -583253, -493975, -360016, -232959, -205592, -280804, -315065, -225686, -64992, -10350, -202361, -632892, -1279349, -1955944, -2444537, -2724964, -2865532, -2839345, -2543826, -2002367]
22447b002367O53886O74167N63968L81722J97877R8301J16005P6655K8314J10851
22437H99379Q1099j49906k98941k80921p2788J75140K60520J50740j7901j86513
22427E59908k93153k89593k18607q1994l9965q5420n902J35596K03261J61946
22417D6077R696j42596k27354l09142l05833k01233o0787R5580J98924J93955
22407g02713J48321J84139K33966J59000m3858k03312k31303j56543o316J03632
22397e14987J18538J76649L25950K86367j016k43807k49766j06171k4030k3230
22387b55503r7365j23200n5968r1858k05664k22791j82711j32435n8622O8091
22377a358026K26660K79022K13960R9570J00865J77919J13284L8154P8946M0035
$$ y = [-2002367, -1348481, -674314, -110346, 271376, 469253, 567554, 683559, 760214, 788528, 899379, 980478, 830572, 531631, 250710, 177922, 353062, 613582, 764322, 746421, 559908, 266755, -22838, -241445, -323439, -363404, -448824, -454726, -319130, -115869, 46077, 55773, -86823, -314177, -623319, -929152, -1130385, -1191172, -1095592, -896668, -702713, -554392, -370253, -136287, 22713, -21145, -224457, -455760, -612303, -618619, -514987, -396449, -219800, 106150, 392517, 391501, 147694, -102072, -208243, -232273, -255503, -352868, -476068, -532036, -623894, -829558, -1052349, -1235060, -1367495, -1426117, -1358026, -1131366, -852344, -638384, -538814, -437949, -260030, -146746, -108592, -29646, 10389]
22367A0389m5979R242J20093J46526J97393K64864J99738O2155m7336j25725j83783
22356F07577k17319l00986l07019j05054J87433L02315J15066j56838k15171p8866
22346a68862j8679o4490j51146k18606j77055l9293J13099K05608J67293m8517
22336d00648k90280k80490l9989J49965K41863L71306K91543q7746l78919l70847
22326g94242j57972J01694K80899L94183L75911J25316k07168l67454k19308J07690
22316c60451K69522J48176R660l8646k8212l947O273k1267j00629p7244Q0609
22305a16156Q3708k1521l8350J4762J80001L27977L49872J94019j24739l83104
22295D66469l99322k81921k46884l04463k73931j59323l927J74163K06700J42754
$$ y = [10389, -35590, -26348, 93745, 240271, 437664, 702528, 902266, 964421, 917085, 791360, 607577, 390258, 89272, -217747, -322801, -135368, 166947, 282013, 125175, -89996, -168862, -187541, -252031, -403177, -621783, -798838, -838131, -725032, -519424, -352131, -400648, -690928, -971418, -1011407, -861442, -619579, -248273, 43270, -44476, -423395, -794242, -952214, -850520, -569621, -175438, 200473, 325789, 118621, -248833, -468141, -360451, -90929, 57247, 66907, 28261, 49, -3898, 2375, -18892, -119521, -196765, -116156, -32448, -53969, -92319, -77557, 102444, 430421, 780293, 974312, 849573, 466469, 67147, -214774, -461658, -766121, -1040052, -1199375, -1203302, -1029139, -822439, -679685]
22285f79685P5081n1696k17341l30497l04178k42113k42842k15102j69806j78295
22275b556474p6297K22534M49022M46324L26191K60978J90741l5899j77841j71579
22265a122300j98378k08394j2370K06080K51862J91813K0639j67498l04406m01799
22255a744751m06513k77541o9790J52344L09433K77439J00497J0397J04677K28259
22245a315549L20988L96932L04383P6073p6771q5675K5379J58920K64277L55172
22235D24129L06862K67703L13289J54820j81409l44805l19117l06593l42731k98697
22225c26549j17189Q9834J99637J67496Q0864L6570J7788o1830k37046l91385
22215e41810l51735j49219O5582J91334J84936Q8254k9541j01172o9104Q7051
$$ y = [-679685, -604604, -656300, -873641, -1204138, -1508316, -1750429, -1993271, -2208373, -2378179, -2556474, -2632771, -2410237, -1961215, -1514891, -1188700, -927722, -736981, -772880, -950721, -1122300, -1320678, -1529072, -1541442, -1335362, -1083500, -891687, -871048, -1038546, -1342952, -1744751, -2151264, -2428805, -2498595, -2346251, -2036818, -1759379, -1658882, -1648485, -1543808, -1315549, -994561, -597629, -293246, -217173, -293944, -379619, -354240, -195320, 68957, 424129, 730991, 998694, 1311983, 1466803, 1285394, 940589, 621472, 314879, -27852, -326549, -443738, -353904, -154267, 13229, 94093, 130663, 148451, 86621, -150425, -541810, -893545, -1042764, -977182, -785848, -600912, -512658, -542199, -643371, -712475, -625424]
22205f25424J83950J21325O9716P2978L4626j346J71531M10582M16245K03705
22195A057888r7123k78362k33881j96047j69116r2085M771J09389Q4608j2749
22185A77293j19136j57269n1454O4817J36447K05523K46292K42600J70059N7872
22175I73044k3995j3061R5100K05327K43482K14560J64726J04747k1647k07730
22165A734553l49327l33275j83627l5019k2898j17263j70491j61120j48002j52017
22155F1514j21387p3388q2013n9205M3197R5844O2766L963o8981k00948m39006
22144g77644o26594n02878k28283l5346Q1989K34300M40630M55203J86974j49323
22134i20972k45714l8262J76092K37847K12721K67212L86880M83597M69792K52321
$$ y = [-625424, -441474, -320149, -250433, -177455, -142829, -144175, 27356, 437938, 854183, 1057888, 960765, 682403, 448522, 252475, 83359, -8726, -3955, 105434, 190042, 177293, 58157, -99112, -150566, -85749, 50698, 256221, 502513, 745113, 915172, 973044, 949049, 935988, 1031088, 1236415, 1479897, 1694457, 1859183, 1963930, 1942283, 1734553, 1385226, 1051951, 868324, 833305, 810407, 693144, 522653, 361533, 213531, 61514, -59873, -133261, -215274, -274479, -231282, -135438, -72672, -68709, -137690, -338638, -777644, -1404238, -1907116, -2135399, -2170745, -2088756, -1854456, -1413826, -958623, -771649, -920972, -1166686, -1204948, -1028856, -791009, -578288, -311076, 75804, 559401, 1029193, 1281514]
22124A281514N4893R350O0897O7633j19968l86541n42703n43688m42172l43936
22114i04721k81662j44558O0752J47748J00635K5592N0801K01630L40563L91205
22104a2015L25768R9920j85607l32827k55820o3378J25571K63781K28618Q7137
22094B81148M266j55532l05810j92378Q2246K15953J82497O6837l3622k01024
22084e5419m17475n66258m20197Q886L17711M05787L67029K85252J48965M4279
22074A18560L8078J04903K82428M75147N59691N89842M98950L01523J19268J9404
22064C107794J504m9433j99398k91504k11536m1608K2421k6736r5110k20010l32984
22053A663400l55972l20797k47560m3909J58399Q2217j23496k60276l27958k81507
$$ y = [1281514, 1336407, 1345757, 1406654, 1474287, 1354319, 967778, 425075, -118613, -560785, -904721, -1186383, -1330941, -1270189, -1122441, -1021806, -996214, -945413, -743783, -403220, -12015, 313753, 413673, 228066, -104761, -360581, -423959, -298388, -34607, 194011, 281148, 285414, 129882, -175928, -368306, -286060, -70107, 112390, 179227, 145605, -55419, -472894, -1039152, -1459349, -1450463, -1132752, -726965, -359936, -74684, 74281, 118560, 156638, 261541, 543969, 1019116, 1578807, 2168649, 2667599, 2969122, 3088390, 3107794, 3109298, 3059865, 2860467, 2568963, 2357427, 2315819, 2338240, 2311504, 2216394, 1996384, 1663400, 1307428, 986631, 739071, 695162, 853561, 935778, 812282, 552006, 224048, -57459]
22043e7459k49241l62037l40475r4004J61413K49507J94153K11694K92599K34066
22033B40216k500k48723l65218l40842j64395J09869K61059K68609K77889K89193
22023C25157K91849L23598L02861J26515j72998m95258o48182n18287k66428o0497
22013g91670P0835J06263J23493K14224L15622L16175J68502L2906J3286l1425
22003E38211m6358k1815o4495j00721k3702O8360O0015l2020k9422J22685K86510
21992G57248K80633K5400l54110o30287o04321l54580r8096N0125O8107L2631
21982h27250L7654Q0709Q5728J10894J83132J44956L2912q0994q9209P437N9591
21971b54440L2826l1293j03315j04250j4633L2310M9779R6600J78477K33226K35902
$$ y = [-57459, -306700, -668737, -1009212, -1103216, -941803, -692296, -498143, -286449, 6150, 240216, 237716, -11007, -376225, -717067, -881462, -771593, -510534, -241925, 35964, 325157, 617006, 940604, 1243465, 1369980, 1196982, 701724, 53542, -464745, -731173, -791670, -720835, -614572, -491079, -276855, 38767, 354942, 523444, 556350, 569636, 538211, 491853, 470038, 405543, 304822, 281120, 349480, 409495, 377475, 348053, 470738, 757248, 1037881, 1063281, 709171, 78884, -525437, -880017, -978113, -927988, -859881, -827250, -789596, -708887, -623159, -512265, -329133, -184177, -151265, -232259, -321468, -314031, -254440, -221614, -252907, -356222, -460472, -475105, -442795, -393016, -296416, -117939, 115287, 351189]
21960C51189J72255J8248j72702l49122m07154k81318j09283n0166k5682J13631
21950g40104K35119K47794K37390K46246J62445p7336k36993j39456J75593M49631
21940E60329M64690L09424J38108l6998k45838m35409m55884l46150j89435N147
21930b32016Q7666r8960m48774o38578m58668l5120K59361L12901K44115J63260
21920h44813K36935L94644L80210K64564J63395K8734p5386n1093R2036K36716
21910H25942L06226K84509J32822q4751k43127l28054k77740r8752P4233J00554
21900F91862q2979l65335m98286l46039n8676J32544K53571L35997K72544J16954
21890D52157J0363N2001J23588P7524L7787J9709J1807M6837L3919j0913k662
$$ y = [351189, 523444, 541692, 368990, 19868, -387286, -668604, -777887, -828053, -853735, -740104, -504985, -257191, -19801, 226445, 388890, 311554, 74561, -64895, 110698, 560329, 1025019, 1334443, 1472551, 1435553, 1189715, 754306, 298422, -47728, -237163, -232016, -144350, -243310, -692084, -1330662, -1789330, -1824450, -1565089, -1252188, -1008073, -844813, -607878, -213234, 166976, 431540, 594935, 623669, 548283, 497190, 589226, 825942, 1132168, 1416677, 1549499, 1464748, 1221621, 893567, 615827, 517075, 591308, 691862, 608883, 243548, -254738, -600777, -659453, -526909, -273338, 62659, 335203, 452157, 462520, 514521, 638109, 715633, 753420, 773129, 784936, 831773, 865692, 854779, 852117]
21879H52117j4681o1524K7690K55232M68836N22920K87821j8674j21992j09035
21869B088710j46474k05118k84839m72356o99611p09573m53908k00017o3887L6575
21859a110498K28316M02309L88671K23569k0127j75859r1832J28095K41924J52912
21849C67480p2952k30654k68059k64522k07252L5037L18724K62695j22891l68644
21839e51038j96906J27197L67511M44845L40926J70754o3839k22990j30407J4589
21829C00642P4008q801j15974q6320K2473P2873N437l3079l6535n6055J8382K04952
21817C62003K94943J09288j55226j95433p9007j07382j83761q1490J10759K01448
21807B76142J22192q5031l52277m81230m00120l02941j62685J4135K0346o7825
$$ y = [852117, 837436, 775912, 803602, 1058834, 1527670, 2050590, 2338411, 2319737, 2197745, 2088710, 1942236, 1737118, 1452279, 979923, 280312, -429261, -883169, -1083186, -1147073, -1110498, -882182, -479873, -91202, 132367, 112240, -63619, -155451, -27356, 214568, 367480, 294528, 63874, -204185, -468707, -675959, -640922, -322198, -59503, -182394, -551038, -747944, -620747, -253236, 191609, 532535, 703289, 639450, 416460, 286053, 300642, 374650, 365849, 249875, 163555, 186028, 258901, 264338, 231259, 194724, 138669, 157051, 362003, 656946, 766234, 611008, 415575, 336568, 229186, 45425, -36065, 74694, 276142, 398334, 313303, -38974, -520204, -920324, -1223265, -1385950, -1371815, -1351469, -1419294]
21797a419294l6684P1418J48166J41550j4977j22925o6522m998O0971J41557J88361
21786i13377J40423K5863O3406K78495L90569K21783p546o4650l7171o5205o3517
21775c0927K3956N5993j3118j39234k74198l63873l09412j42058K4470K14232
21765i54169L20005L46383M67348N65636M89541K11330j84652m22479l29646q0038
21755D29259J18976J24500l1949q9487L2821J73990J56766K5185r9235j46905
21745F93921j37689r6739N3732K10598K17195N4278j05939o4873J10745K71898
21735A207127L67152L31935J42988j17006j93871j33702j51189k42962l39571
21726H70901l92997l41655j44385J20296K62974K28220K14657K61704J73715M4554
$$ y = [-1419294, -1455978, -1384560, -1236394, -1094844, -1109821, -1232746, -1299268, -1304266, -1243295, -1101738, -913377, -772954, -747091, -683685, -405190, -14621, 207162, 199616, 134966, 97795, 32590, -30927, -6971, 49022, 35904, -103330, -377528, -741401, -1050813, -1192871, -1168401, -954169, -634164, -287781, 179567, 745203, 1234744, 1446074, 1261422, 838943, 509297, 429259, 548235, 672735, 640786, 551299, 584120, 758110, 914876, 940061, 840826, 693921, 556232, 459493, 513225, 723823, 941018, 995296, 889357, 824484, 935229, 1207127, 1574279, 1906214, 2049202, 1932196, 1738325, 1604623, 1453434, 1210472, 870901, 477904, 136249, -8136, 112160, 375134, 603354, 818011, 1079715, 1253430, 1297984]
21716A297984L032j4968J1616m4199j57996j97890j83892j50426j69884j53209
21706B40168q3608m4691j5682m56J4215j5018l7641Q3203K62691K52332P9557
21695G35070j96139m48098m26228k43913j47016j79339k84343k87133j82159l0491
21685a689789J62515K48874K51447K64528K71461K20734N7636l26078o84072o56015
21675a878759l23142O0993L03315L30919J98690Q6323O3050P5856L5720l6705
21665a083740m9236p832Q8572K57453L93571L64869J75921N8745k8058j60427
21655I838l45699n23549m99907l06266J4350L93208M82470L02958K46089L67018
21645A40510L70496J86373J322o5513p6372k20896l93162m61684n10543m90166
$$ y = [1297984, 1301016, 1286048, 1297664, 1253465, 1095469, 897579, 713687, 563261, 393377, 240168, 156560, 111869, 96187, 95731, 109946, 94928, 57287, 140490, 403181, 655513, 735070, 538931, 90833, -335395, -579308, -726324, -905663, -1190006, -1477139, -1659298, -1689789, -1527274, -1278400, -1026953, -762425, -490964, -270230, -212594, -538672, -1222744, -1878759, -2201901, -2140908, -1837593, -1506674, -1307984, -1221661, -1158611, -1082755, -1047035, -1083740, -1132976, -1140808, -1052236, -794783, -401212, -36343, 139578, 198323, 170265, 9838, -335861, -859410, -1359317, -1665583, -1651233, -1258025, -775555, -472597, -226508, 140510, 511006, 697379, 698701, 633188, 556816, 335920, -57242, -518926, -1029469, -1519635]
21635a519635k74703K463K16794L66776L61327J73300n1216j15565l3374O1426
21625h12407N6050q696O5487K53908L36429K41192O2709j70203l74050l70742
21615g20323j47657J12158K25390K06754Q0138p1174p3512j7496q1646j96523
21605f83891j39508M1432P5116l9701q0792K7941J52418R8038q0959j18153j0029
21594g58088M9778N2354P3913J17767J24769Q7354Q152J102L8572M9225J9552
21583a35550k6864k2415N0125J33496J74231J27951M8841O9214J41967Q8602j37840
21572E11758l07936k62721j36234n3962R64M1825j2728k06733l44940l09049j93496
21561a273252N9992L31043M66698M64128L49624J82551J04179J57109J55405O1957
$$ y = [-1519635, -1794338, -1791875, -1575081, -1208305, -846978, -673678, -724894, -840459, -873833, -812407, -756357, -765053, -699566, -445658, -109229, 131963, 194672, 24469, -349581, -720323, -867980, -755822, -530432, -323678, -243540, -314714, -388226, -405722, -487368, -683891, -823399, -781967, -706851, -746552, -827344, -799403, -646985, -548947, -629906, -748059, -758088, -708310, -655956, -582043, -464276, -339507, -252153, -244001, -242899, -204327, -155102, -135550, -162414, -184829, -134704, -1208, 173023, 300974, 349815, 419029, 560996, 649598, 511758, 203822, -58899, -195133, -249095, -248131, -206306, -219034, -425767, -770707, -1079756, -1273252, -1213260, -882217, -415519, 48609, 398233, 580784, 684963, 842072, 997477, 1059434]
21551A059434n2137n2392J7894Q4156J37473J29916Q0561R3519R8844j8777j42251
21540A436240j42226j13040j21293j17869o5118Q8735J58875Q6915l670n2119
21530A155430j38229l31382m10871j86981J56932K94181J04560j25365k16152
21521C02123k30640j94062j03107n8726o3870N050J30144K80847L44194J61061
21511E73014j29523k72710k33450p4541J45291K95131L65708M23545L84869J31127
21501A608461k22386n18510o60501o37190n35790m37540l15183J5699M90400P24798
21491d87742N81980L69638K49129K30464L06134L56376L20067J88726P341j79133
21481A942980k82055l34953l72829l18514j25529R8788J20950n653q0637j03151
$$ y = [1059434, 1007297, 954905, 972799, 1056955, 1194428, 1324344, 1404905, 1498424, 1597268, 1578491, 1436240, 1294014, 1180974, 1059681, 941812, 876694, 965429, 1124304, 1211219, 1207549, 1155430, 1017201, 685819, 274948, 87967, 244899, 539080, 643640, 518275, 302123, 71483, -122579, -225686, -284412, -348282, -343232, -213088, 67759, 411953, 573014, 443491, 170781, -62669, -137210, 8081, 303212, 668920, 1092465, 1477334, 1608461, 1386075, 867565, 207064, -430126, -965916, -1403456, -1718639, -1702940, -1212540, -487742, 94238, 463876, 713005, 943469, 1249603, 1605979, 1926046, 2114772, 2122113, 1942980, 1660925, 1325972, 953143, 634629, 509100, 607888, 728838, 723185, 642548, 539397]
21471E39397m4793K7196L027r402L6888K050r9484j26808p4457J4948O2263N5125
21459C85950j3439q2273N6801K62570J85818j24923k96841j74780m7350o6366
21449H5167o8967N5820J37470N3037j0856m6788j81801l30505l62410k70952j14040
21438a054825K5545L1350N1735J69608J78283j2904j84328j60767L6410K18930
21428g00963J80166O070o8613n9715L8404J69270K18098K58929L03939K23592
21418E69177K9449k7153R8847J34982L6084r356Q8600J37733k9544k33736j41619
21407F53464R8169K28023K61849J75485j4656j51755j69061j15342r745P8207
21397A034638j5431j80127k40403k26028j70702p8036n2885j29158k47695l49501
$$ y = [539397, 494604, 521800, 524827, 515425, 552313, 554363, 454879, 328071, 253614, 268562, 330825, 385950, 372511, 290238, 347039, 609609, 795427, 670504, 373663, 198883, 151533, 85167, 16200, 72020, 209490, 262527, 251671, 204883, 23082, -307423, -669833, -940785, -1054825, -1029280, -997930, -946195, -776587, -598304, -611208, -795536, -956303, -919893, -700963, -520797, -514727, -583340, -643055, -604651, -435381, -217283, 41646, 345585, 569177, 598626, 571473, 670320, 805302, 841386, 832030, 920630, 1058363, 1028819, 795083, 653464, 751633, 979656, 1241505, 1416990, 1402334, 1250579, 1081518, 966176, 956431, 1034638, 1019207, 839080, 598677, 372649, 201947, 123911, 71026, -58132, -305827, -655328]
21387f55328k06953L6982J60330J90819J84317J14359N9592Q5706Q6114R6603
21377A52541J70927K78144L36460L06374K12041N3603j00229j35877j10257j45516
21367A018211k26557k57542k24262j75336q9213j57442m28461n06181l32525j89986
21357a569294p5320o830N7202K33159L78139L96518L43677K18041K8220r8547
21347i5035j14981j68026k74215l52670l61708j60352J43046L47802L29084O3312
21337f43743j59486j18833q2043k45221l18100k65967k33443r3149K32443N38122
21327a389420O28827N63288M32847K70019O3830k04906l97482l76653k69410j82958
21317h62018j53344j23987j16361m9833J45558K36094J88188M8758j60254l31495
$$ y = [-655328, -862281, -825299, -664969, -474150, -289833, -175474, -115882, -30176, 55938, 152541, 323468, 601612, 938072, 1244446, 1456487, 1510090, 1409861, 1273984, 1163727, 1018211, 791654, 534112, 309850, 134514, 45301, -112141, -540602, -1046783, -1379308, -1569294, -1644614, -1651444, -1594242, -1361083, -982944, -586426, -242749, -24708, 3512, -95035, -210016, -378042, -652257, -1004927, -1366635, -1526987, -1383941, -1036139, -707055, -643743, -803229, -922062, -1004105, -1249326, -1567426, -1833393, -2066836, -2159985, -1927542, -1389420, -760593, -197305, 235542, 505561, 569391, 364485, -32997, -409650, -679060, -862018, -1015362, -1139349, -1255710, -1305543, -1159985, -923891, -735703, -686945, -847199, -1178694]
21307a178694l03884l1864K30159L54638L75727L06760J93359O9974L444K2579
21297D2198J23661L06004L63448J14857l39225p09809p06630m95467l96609k76006
21287a973578o0998J74129M16972M53104K32464O1334j850m1977q7370p7327R3964
21276h11133L16359L94893K59919R624k35069k92661n6618K80227L30012J4403
21266B09956l23371l36980j20780K5229O9950Q8800J8408j86575k67163j13807
21256i36333P205J14456K67114L14436J94248l5686j55422r5042L4115J94944
21246i5965K57720J13262p7011q0991L1424Q7168k5697j45512j60905j37441m4050
21235b77998R5432K35560K84621K32451J52434Q7907k3495r3859J9105J12408
$$ y = [-1178694, -1482578, -1514442, -1284283, -929645, -553918, -247158, -53799, 16175, 19619, 42198, 165859, 471863, 835311, 950168, 610943, -98866, -805496, -1300963, -1697572, -1973578, -2034576, -1860447, -1443475, -990371, -757907, -696573, -698423, -740400, -827770, -905097, -811133, -494774, -99881, 160038, 169662, -65407, -358068, -414686, -134459, 195553, 209956, -113415, -450395, -571175, -545946, -475996, -387196, -368788, -555363, -822526, -936333, -929128, -814672, -547558, -233122, -38874, -74560, -229982, -325024, -290909, -95965, 161755, 275017, 198006, 117015, 148439, 235607, 209910, 64398, -96507, -233948, -277998, -182566, 52994, 337615, 570066, 722500, 810407, 786912, 693053, 712158, 824566]
21225H24566n6221k73002l14276k14794m5705Q5336P7389o0606j20868o6427l924
21214a68532J29327K62889K25417N8130p0224q4060j20581j37546p1123p7798
21204e4101j06769n1637m5744j42306k05881j33626O61J54726L24044M02538L11541
21193D53446J50025Q6256N0485J3071L7182Q6499J91487K96268K14760n3615k63791
21182A262073l53872m13603m52172m05457j62263J91315L73309L94234L80297
21173H13861L42573K12085j3473j46835j08108j2981L1921Q0713R9295L6258P3088
21162A408397J98296J94565N1998j67627l96178l53176q3628k7568j18910p9716
21152F26453l2222j54186l63478l90378k18924k6327J33058R8653j11720k21070
$$ y = [824566, 768345, 495343, 181067, -33727, -79432, 5904, 83293, 22687, -98181, -164608, -168532, -39205, 223684, 449101, 507231, 437007, 352947, 232366, 94820, 23697, -54101, -160870, -212507, -258251, -400557, -606438, -740064, -739403, -584677, -260633, 141905, 453446, 603471, 689727, 740212, 753283, 790465, 876964, 1068451, 1364719, 1579479, 1525864, 1262073, 908201, 494598, 42426, -363031, -525294, -333979, 39330, 433564, 813861, 1156434, 1368519, 1355046, 1208211, 1100103, 1087122, 1119043, 1199756, 1299051, 1335309, 1408397, 1606693, 1801258, 1853256, 1685629, 1289451, 936275, 852647, 825079, 706169, 626453, 594231, 440045, 76567, -313811, -532735, -559062, -426004, -327351, -439071, -660141]
21142f60141j43084q330O4993P1309L6397k9054j27898j36889j3616R3197J08491
21131g44625O5781O6078N3991O1351K60925N40811O51891M85509J28382k17623
21121A352471m31913n08178m89228l42421j24173Q5991K22792L00345K97875K35976
21111E99537K04948J84209J09094M7548J35145J25407m9541j59138j13906l4869
21101A048434j7863n8196j28087o2130J55869K28164J36245O371p5066j6599p662
21090A209480j05164j02741k5029O8563J36866J19128J18879J09213n5729k15670
21080A257796l03138l06039k38954k01380j84392j39522J877J21633J24025N5247
21070A87153p0012r4316m9367p2170j10726j98742k53032j47908N309J78689L97589
$$ y = [-660141, -803225, -811555, -746562, -675253, -638856, -667910, -795808, -932697, -946313, -853116, -744625, -678844, -612766, -558775, -497424, -236499, 304312, 956203, 1441712, 1570094, 1352471, 920558, 412380, -76848, -419269, -543442, -457451, -234659, 65686, 363561, 599537, 804485, 988694, 1097788, 1145336, 1280481, 1405888, 1356347, 1197209, 1083303, 1048434, 1030571, 972375, 844288, 782158, 938027, 1166191, 1302436, 1308807, 1233741, 1217142, 1209480, 1104316, 1001575, 976546, 1045109, 1181975, 1301103, 1419982, 1529195, 1473466, 1257796, 954658, 648619, 409665, 208285, 23893, -115629, -113752, 7881, 131906, 187153, 117141, 22825, -26542, -98712, -209438, -408180, -661212, -809120, -803811, -625122, -227533]
21059b27533N34629N91164O38493N07078J65304j92028m28533n23379n22762m29637
21049A12796k19371j3258J11002J46422l7365k64373k88057k02750j52119p6772
21039h83845J32763L54053M16934K87926N4581j25230k73495l18283k10774l1769
21029e97139J4416j45497k65266j77070k5056q2315k49635j36702J77130L90939
21019a096195M98019M84764K64439n3672k57618l71444m35403m19243l03369j13782
21009a803504R2631J72920L6728j53126k43409j60724K9051J79858J71627J49692
20999a528256K22806K75216K61582K86211K72039J30511m1023k05597l36569n02913
20989a165993o45956o19511m24383j45714K3L1957J70773M15519O59843P10156
$$ y = [-227533, 307096, 898260, 1536753, 2043831, 2209135, 2017107, 1588574, 1065195, 542433, 112796, -106575, -119833, -8831, 137591, 100226, -164147, -452204, -654954, -807073, -883845, -751082, -397029, 19905, 307831, 362412, 237182, -36313, -354596, -565370, -597139, -582723, -728220, -993486, -1170556, -1195612, -1277927, -1527562, -1664264, -1487134, -1096195, -598176, -113412, 151027, 97355, -160263, -531707, -967110, -1386353, -1689722, -1803504, -1710873, -1537953, -1501225, -1654351, -1897760, -2058484, -2029433, -1849575, -1677948, -1528256, -1305450, -1030234, -768652, -482441, -210402, -79891, -120914, -326511, -663080, -1165993, -1811949, -2431460, -2855843, -3001557, -3001534, -2969577, -2798804, -2383285, -1723442, -1013286]
20979a013286N66848L95159J53308j03783j49612L2226K02110J39611k2040o5458
20969A35083K3090K08860L18339L25951K45714J1978j24980l8173N4268P6272
20959A236402M3595m6639j33105j90285k47827k86798k66166k89489l69102k82438
20949h31852m1586J71387L39920M15189L00026R0444l8591l6158L2245N6054J1562
20938D68640J2662L8971m4122q4169J02200L53812L84988J08936k28140l12235
20928H01543j49796p62j6627j29932j77271j16401J4510J54462J34805m7395j16418
20917C50718O914N5284m7206p2828M1586J69967J95614P7763p1349j35045j37834
20906D33584m3664J80788M16069M05152M4553l09214m39802m25124k96377j22970
$$ y = [-1013286, -446438, -51279, 102029, -1754, -151366, -119140, 82970, 222581, 200541, 135083, 158173, 367033, 685372, 1011323, 1257037, 1269015, 1144035, 1105862, 1160130, 1236402, 1279997, 1233358, 1100253, 909968, 662141, 375343, 109177, -180312, -549414, -831852, -873438, -702051, -362131, 53058, 353084, 443528, 404937, 368779, 401024, 457078, 468640, 481302, 520273, 476151, 391982, 494182, 847994, 1232982, 1341918, 1113778, 801543, 651747, 650985, 634358, 504426, 327155, 210754, 225264, 379726, 514531, 467136, 350718, 357632, 412916, 365710, 292882, 334468, 504435, 700049, 777812, 706463, 571418, 433584, 389920, 570708, 986777, 1391929, 1436482, 1127268, 687466, 262342, -34035, -157005]
20896a57005k1904L2632J91506K66183J62358J26480K06138K62520K59873K32798
20886A561579J88368J99943K88571K68445Q1978p018R1103J73805J20751m2061
20876B925464j89476k35820k75511l41478l06216j14025P4465J71900K76429L43327
20866B329059K87604J77506J48327L01134L58667J78409N5379J24672L06753M91522
20856D759032O66878Q87479J176348J572669K025063K342475K475880K453210
20848A8359034K239044J639605O23781o04512j627566k114941k124718j891165
20840A4498562j664334j510287j234439p66270l65483k03474k56699l23367k27853
20831G946356j1852K14527L96328O17304Q54063J024825J147143J417380J915286
$$ y = [-157005, -178909, -146277, 45229, 311412, 473770, 600250, 806388, 1068908, 1328781, 1561579, 1749947, 1949890, 2238461, 2506906, 2588884, 2581866, 2672969, 2846774, 2967525, 2925464, 2735988, 2500168, 2224657, 1883179, 1576963, 1462938, 1537403, 1709303, 1985732, 2329059, 2616663, 2794169, 2942496, 3243630, 3602297, 3780706, 3836085, 3960757, 4267510, 4759032, 5425910, 6313389, 7489737, 9062406, 11087469, 13429944, 15905824, 18359034, 20598078, 22237683, 22861464, 22256952, 20629386, 18514445, 16389727, 14498562, 12834228, 11323941, 10089502, 9323232, 8957749, 8754275, 8497576, 8174209, 7946356, 7934504, 8149031, 8545359, 9162663, 10016726, 11041551, 12188694, 13606074, 15521360]
20822A5521360K378220K436287J863949P74706n65713j795054k506638k630912
20814A5476205k459281k159840j709778j247662r32422o97001n00654l18785j98315
20805E252467l09617o01755o12998l09398Q909J40705j4831l31422n46852n40155
20795B135053l21500q0245M5117k235k24119l53431k09389M9283K44995L99639
20785A683168N10543N82372O35218N28202K32745l5281k95475m58759m06689l23633
20775B652411k02081N1940K18470J72766J10872J91010L16146K57288q363k32622
20765C527837k15405j18676j98529m31905n65712n10000m08540k34082K3002J13307
20755I81297n614j06436M667K68079M04125K52838k8044k55882l31735r3826K11947
$$ y = [15521360, 17899580, 20335867, 22199816, 22974522, 22408809, 20613755, 18107117, 15476205, 13016924, 10857084, 9147306, 7899644, 6967222, 6270221, 5769567, 5450782, 5252467, 4942850, 4341095, 3728097, 3418699, 3427608, 3568313, 3553482, 3222060, 2675208, 2135053, 1813553, 1733308, 1778425, 1776190, 1552071, 1198640, 989251, 1038534, 1283529, 1683168, 2193711, 2776083, 3411301, 3939503, 4172248, 4136967, 3841492, 3382733, 2976044, 2652411, 2450330, 2502270, 2720740, 2893506, 3004378, 3195388, 3511534, 3768822, 3760459, 3527837, 3312432, 3193756, 2995227, 2563322, 1997610, 1487610, 1079070, 844988, 867990, 981297, 975683, 869247, 873914, 1141993, 1546118, 1798956, 1770912, 1515030, 1183295, 1089469, 1301416]
20744A301416J69852j01166k74296k61289j39697j14681j91862j71589j18076
20735I8612m0573Q6375Q1652j22224l46866l15076o7878J85491K66655J88149
20725A4317K5294k25799l92464l95468k18188J27941L71242L27953J82192P1864
20715a11116J2877P8186K17957K27716J84849L14818N06830N27118L74858J49033
20705B483126N6435J99745K95287J98913J5477k36099m23776m19257l12940j61457
20695A695454L1200J09916M2023j49704l70813l98797k40568j3652J15185O1254
20685H81498j4725J9843P1388L3153p8038k02115k29780j70932j17656l0695J91157
20674C53098M89654O47382O25927M15898P6852k78256n66056o47042n10451k76762
$$ y = [1301416, 1471268, 1370102, 1095806, 834517, 694820, 580139, 388277, 216688, 98612, 58039, 144414, 226066, 103842, -243024, -558100, -625978, -440487, -173832, 14317, 39611, -186188, -578652, -974120, -1192308, -1064367, -693125, -365172, -182980, -111116, -98239, -20053, 197904, 425620, 610469, 925287, 1432117, 1959235, 2334093, 2483126, 2539561, 2739306, 3034593, 3233506, 3248983, 3012884, 2589108, 2169851, 1856911, 1695454, 1726654, 1836570, 1878593, 1728889, 1358076, 959279, 718711, 705059, 820244, 881498, 866773, 886616, 958004, 991157, 913119, 711004, 481224, 310292, 192636, 161941, 353098, 842752, 1490134, 2116061, 2531959, 2608811, 2330555, 1764499, 1117457, 607006, 330244]
20664C30244j06195m1057K0722J72836L57027M25889L00311J95030K31645J39860
20654B026312k11402n37941n49330l89585k80376j60908o7032l6950N8883J97849
20644D9520K58660K60367K25897P3833k684J68230L09098J62321j2793p1521p6329
20633A344599L147J67015L69700N82252O01228L39474k1001k93888m60635n87611
20623B044280o40248m57764q3874J21188O9584o4831j36175j26110j69860j94105
20613C62085k927K00906K46118K14815R2358j71552n13510o71108m45503j56348
20603h44666r9026k9056K40500N29520O87067P07706N43627K17663n2869k28291
20593A672175m58154o24678n57626l67688k00574j53279j84556q4859K27320N02006
$$ y = [330244, 224049, 182992, 203714, 376550, 733577, 1159466, 1459777, 1654807, 1886452, 2026312, 1814910, 1276969, 727639, 338054, 57678, -103230, -170262, -207212, -148329, 49520, 308180, 568547, 794444, 868277, 865593, 1033823, 1342921, 1505242, 1492449, 1420928, 1344599, 1347746, 1514761, 1884461, 2466713, 3067941, 3407415, 3386414, 3092526, 2631891, 2044280, 1404032, 946268, 862394, 983582, 1053166, 988335, 852160, 726050, 556190, 362085, 359158, 560064, 806182, 1020997, 1113355, 941803, 428293, -242815, -688318, -844666, -943692, -972748, -732248, -202728, 484339, 1192045, 1735672, 1953335, 1900466, 1672175, 1214021, 589343, 31717, -335971, -536545, -689824, -874380, -959239, -731919, -229913]
20583b29913N60694L70882J32341Q9518K36169M11994L61494O2313k05727k19784
20573A569981n6449L8086J0393k8180k7595m8205j74344l71418m63356l80016
20563F8897k89680l01704k98362j55261l8431p8701q6753M0435J69358K56474
20553g13728L62301M22358M02263L18942K44289J88804N4246J9802K03854L84633
20543A887764M27762L76987K00744r0969l22768m46862n38969n31794l83802j35226
20533D42867Q7089K11786K44594J46782r6011k69984q1387K45540K61966k2413
20523A170829l47708n26872m05624r6811J33718K59795M07667M99914L09553j03719
20513A300742l50281k80204j11905k859k8368j81810k48341r2875J30617L04408
$$ y = [-229913, 330781, 701663, 834004, 923522, 1159691, 1571685, 1933179, 1995492, 1789765, 1569981, 1513532, 1551618, 1562011, 1533831, 1506236, 1458031, 1283687, 912269, 448913, 68897, -220783, -522487, -820849, -976110, -1014541, -1093242, -1179995, -1139560, -970202, -713728, -351427, 70931, 473194, 792136, 1036425, 1225229, 1279475, 1299277, 1503131, 1887764, 2315526, 2692513, 2893257, 2802288, 2479520, 2032658, 1493689, 961895, 578093, 442867, 529956, 741742, 986336, 1133118, 1037107, 767123, 685736, 931276, 1193242, 1170829, 823121, 296249, -109375, -206186, -72468, 187327, 594994, 1094908, 1404461, 1300742, 950461, 670257, 558352, 555493, 527125, 345315, 96974, 4099, 134716, 439124]
20503D39124K77540M5925q3899J9304J01264j356j28277j27049p1128p2038j02892
20492B96518j20869j80342l05743k84163p7742J54379J84635N3494N7423J46015
20482g6395J54360J1965k23490l52797k38869O2627L34373L96520K83871J43571
20472D95736Q274j52369k74072k20833o0696N1262J82425L05331K08320o011j53723
20461C83644k10573k39266j80178k2826Q6169J11699O3912N8517J42292J71046
20451C64436L9910j13392j52838j36556k78515n75171o41312n28897m46683l08275
20441b777293j15698M2580J13282K16396L96477N17213N29324L44742J14089K3656
20431e95232L7108J29842K01164J58187K8999p2839j12486j19467o3570Q5756
$$ y = [439124, 716664, 762589, 678690, 697994, 799258, 797902, 669625, 542576, 471448, 399410, 296518, 175649, -4693, -310436, -594599, -672341, -517962, -333327, -279833, -222410, -76395, 77965, 89930, -133560, -486357, -725226, -662599, -328226, 68294, 352165, 495736, 504010, 351641, 77569, -143264, -203960, -152698, 29727, 335058, 543378, 537367, 383644, 173071, -66195, -246373, -269199, -183030, -71331, -7419, 51098, 193390, 364436, 404346, 290954, 138116, 1560, -276955, -852126, -1493438, -2022335, -2469018, -2777293, -2892991, -2850411, -2737129, -2520733, -2124256, -1607043, -1077719, -732977, -618888, -595232, -558124, -428282, -227118, -68931, -39932, -112771, -225257, -344724, -408294, -322538]
20421c22538K27709K07476J44770J37526K0002k04889k62237j53171j07561j22846
20411d35759j95010j71520N0795K63320L28705L12767K05192J2526j10008o4332
20401A96676J9421L3722N7904J01328J80044L02903L22616K34274Q4470q7066
20391A446292k01704j55087n8729j3831L7586L9621j01256l02163l74082k33466
20381H3181N1576K77647K82274J57986M2740J4015K189j02380r8414J31231L72146
20370A214191L99955K31785n0799l67007m33848k33588l5475K2924m1542q4484
20360F22112j03940r1845L4976J14245Q7702K1959r1101k40596l51391k92225
20350b90104n8794J88158K75523K15330R7182L1425J47910K86381J86855J9093
$$ y = [-322538, -94829, 112647, 257417, 394943, 414945, 210056, -52181, -205352, -312913, -435759, -630769, -802289, -751494, -488174, -159469, 153298, 358490, 371016, 261008, 196676, 216097, 249819, 307723, 409051, 589095, 891998, 1214614, 1448888, 1533358, 1446292, 1244588, 1089501, 1030772, 1016941, 1054527, 1094148, 992892, 690729, 316647, 83181, 134757, 412404, 694678, 852664, 895404, 909419, 911608, 809228, 710814, 842045, 1214191, 1614146, 1845931, 1795132, 1428125, 994277, 760689, 725214, 748138, 706596, 622112, 518172, 426327, 461303, 575548, 663250, 685209, 594108, 353512, 2121, -290104, -348898, -160740, 114783, 330113, 427295, 458720, 606630, 893011, 1079866, 1098959]
20340A098959k7962k0372o7179j27296o3062L186L840k1451j53896l07291l24170
20329f694k29639r9953Q9663K84749L97999L35740J11205k3738J4051L9460k6344
20318H86499j54668k89005k68506j5363K64647L11954R8543j16252k1650J90408
20308H86607K00020J47862K07418K34011K9460k92616n37707n75553l63177j07666
20298a71341K7720J29585K31235K99485K25812R058j83444k90348k30308L1391
20288G8845L07891L82663L31648K58940J48798L9014o3133k15737k80891j15757
20278H72281M5952L2923j27857l18590l98580k81656p4020L7390Q5475J58862
20268C2180K70626K87454R7285r2829o4438O2847Q9563m2073j12710q3721p1847
$$ y = [1098959, 1070997, 1050625, 983446, 856150, 793088, 796274, 800114, 778663, 624767, 317476, -6694, -236333, -336286, -246623, 38126, 436125, 771865, 883070, 859332, 873383, 912843, 886499, 731831, 442826, 174320, 158957, 423604, 735558, 834101, 717849, 696199, 886607, 1086627, 1234489, 1441907, 1675918, 1705378, 1412762, 875055, 299502, -63675, -171341, -143621, -14036, 217199, 516684, 742496, 751554, 568110, 277762, 47454, 78845, 386736, 769399, 1101047, 1359987, 1508785, 1547799, 1484666, 1268929, 988038, 872281, 918233, 951156, 823299, 504709, 106129, -175527, -249547, -212157, -126682, 32180, 302806, 590260, 687545, 594716, 530278, 593125, 682688, 640615, 527905, 444184, 372337]
20257C72337k8239J7984k3169j9259J37815L05154L26199J98652R9026J08204
20247A494704J58212K05582L19425M58879N24587M74623K69268L1095j06074j45701
20237C684600j82660k11735r0841J32673K93758L74660L58934L77392L84482J96503
20227E317766m2108k63011m93854n85129n35981m65866l44164j86090k8944J22200
20217B494819K64136L27721K89342K35307J95289K2701k39704l55041l67777m19794
20207B446999l96271k28436r3814o3810r8974j49656j99197j87395m8414K3063
20197A004095m5494l4874L4168j638m2469J06276K62137J48432j04712k19175
20187A106746k44082l00839k73549r9952Q0949J90243J73979J14388Q3195N3183
$$ y = [372337, 344098, 362082, 338913, 319654, 457469, 762623, 1088822, 1287474, 1386500, 1494704, 1652916, 1858498, 2177923, 2636802, 3161389, 3636012, 3905280, 3936375, 3830301, 3684600, 3501940, 3290205, 3199364, 3332037, 3625795, 4000455, 4359389, 4736781, 5121263, 5317766, 5275658, 5012647, 4518793, 3933664, 3397683, 2931817, 2587653, 2401563, 2372619, 2494819, 2758955, 3086676, 3376018, 3611325, 3806614, 3829315, 3589611, 3234570, 2866793, 2446999, 2050728, 1822292, 1728478, 1664668, 1565694, 1416038, 1216841, 1029446, 981032, 1004095, 958601, 923727, 957895, 956257, 913788, 1020064, 1282201, 1430633, 1325921, 1106746, 862664, 561825, 288276, 188324, 269273, 459516, 633495, 747883, 831078, 884261]
20177H84261l0747k19652l94691m91294n44973l93930Q4773M92803M99084L08522
20167A94156K20249K83869M21935L89791J51709m9062p1961k9086L4034Q0220
20157A625854N9653l082o8984j58089k61070k23368j443K63446M22714L92304
20147B047935J73742P7204J23039Q0500Q7570K92402M75901L95032J69012j995
20137C920342p4471q4017K3667J42364Q3243j37794k67710k55524k68165l15090
20127B766845l15939l50633l93421l78588k57190L0276K76846L61561L49322L40281
20117B429360L86899M27087N07136M95211K86416M5462j90368m52953o57176o20892
20107B656182m03635r6355K68688N80988P02809O03175M15025K19981M392k11711
$$ y = [884261, 853514, 633862, 239171, -252123, -797096, -1191026, -1106253, -613450, -114366, 194156, 414405, 698274, 1120209, 1510000, 1661709, 1612647, 1540686, 1511600, 1545634, 1625854, 1685507, 1682425, 1613441, 1455352, 1194282, 970914, 969471, 1232917, 1655631, 2047935, 2221677, 2298881, 2421920, 2502420, 2589990, 2882392, 3358293, 3753325, 3922337, 3920342, 3845871, 3761854, 3785521, 3927885, 4011128, 3873334, 3605624, 3350100, 3081935, 2766845, 2450906, 2100273, 1706852, 1328264, 1071074, 1101350, 1378196, 1739757, 2089079, 2429360, 2816259, 3243346, 3750482, 4245693, 4532109, 4577571, 4387203, 3934250, 3277074, 2656182, 2252547, 2156192, 2424880, 3005868, 3708677, 4311852, 4726877, 4946858, 4951250, 4739539]
20097D739539l00647k53092k38917l17609k80950n2420J97264K34806N9473p8747
20087C708700o3101J37684M60098O87781O88769O23830N32444M03621L30659L60252
20077G870737M41954M37458K73309R9180J79950L52328M19598M08549K92927J74799
20067A0950789J48859K90150M84673N14551M01428J89743l9570j53711k07807
20058A2579105k42659j72861l3925J37403L65465N70446N83401K57356l29051
20049A3714680p40510q27647o87993n10944m52857m12008k44005Q1050M32119
20040A0351885O04140N31145L68780L31008N48659Q91836J143384J357897J622079
20031A7750813J811939J900844J916512J975589K278884K866785L489941L944571
$$ y = [4739539, 4438892, 4185800, 3946883, 3629274, 3348324, 3295904, 3493168, 3727974, 3787447, 3708700, 3645599, 3783283, 4243381, 4931162, 5619931, 6243761, 6776205, 7179826, 7510485, 7870737, 8312691, 8750149, 9023458, 9122638, 9302588, 9654916, 10074514, 10483063, 10775990, 10950789, 11099648, 11389798, 11874471, 12389022, 12790450, 12980193, 12940623, 12786912, 12579105, 12336446, 12163585, 12129660, 12267063, 12632528, 13202974, 13786375, 14043731, 13714680, 12974170, 12146523, 11458530, 10947586, 10494729, 10082721, 9838716, 9919766, 10351885, 10956025, 11487170, 11855950, 12186958, 12735617, 13627453, 14770837, 16128734, 17750813, 19562752, 21463596, 23380108, 25355697, 27634581, 30501366, 33991307, 37935878]
20023C7935878M317586M597022M708165M900179N644725P075179Q897827J1008826
20015H9085387J3418469J6129009J9031161K1474730K2137815K0216577J7156923
20008B18650071J5844987J7496490K0441795K1000922J5787876M478992r929465
20001C03771668k2748385k9926232l0888868k8148868k4299104k0615854j7389990
19994A29754367j4650141j2544399j1012099r995092r268639q252916o928402
19987E7102679n667729m703865l994913l330855k783205k444268k240896k165606
19979B9771342k028587j664414j154178q62399r04451q53374n56714l91817m90204
19970B0865204o53027q31639r68010j032612r44546o74128l87842k17843j62091
$$ y = [37935878, 42253464, 46850486, 51558651, 56458830, 62103555, 69178734, 78076561, 89085387, 102503856, 118632865, 137664026, 159138756, 181276571, 201493148, 218650071, 234495058, 251991548, 272433343, 293434265, 309222141, 313701133, 303771668, 281023283, 251097051, 220208183, 192059315, 167760211, 147144357, 129754367, 115104226, 102559827, 91547728, 81552636, 72283997, 64031081, 57102679, 51434950, 46731085, 42736172, 39405317, 36622112, 34177844, 31936948, 29771342, 27742755, 26078341, 24924163, 24061764, 23157313, 22303939, 21747225, 21355408, 20865204, 20212177, 19380538, 18412528, 17379916, 16435370, 15761242, 15373400, 15155557, 14993466]
19961A4993466j84564k37100l28651n28110o95280n87806k41521P7332K77326
19952A2545092L70494K51800m6584k52952k29866j24474j25227j79143k51440
19943A1957700m59729o53546o65911n22458k54794k4376N7856L4918n308J13143
19933I577495M01738O60033P54202P86266R64406J218248J356751J198606P72175
19924A7689920J86334m23288q03649q52709o33410l96375k75202j47973l168J93609
19914A4534089L44254K72918Q9521j67556m56437o33617o50862o45055o97923
19905A1989332p51869p80813q41418q90710q55594q08515o85495m55988k01031
19896E717899n113J30272K15711J59828o2927k79866k96640j73814j93023l25749
$$ y = [14993466, 14808902, 14571802, 14243151, 13715041, 13019761, 12431955, 12190434, 12267766, 12545092, 12915586, 13167386, 13120802, 12867850, 12637984, 12513510, 12388283, 12209140, 11957700, 11497971, 10844425, 10178514, 9656056, 9401262, 9376886, 9434742, 9469660, 9464352, 9577495, 9979233, 10639266, 11393468, 12179734, 13144140, 14362388, 15719139, 16917745, 17689920, 17876254, 17452966, 16649317, 15796608, 15163198, 14766823, 14491621, 14343648, 14340480, 14534089, 14878343, 15151261, 15240782, 15073226, 14616789, 13983172, 13332310, 12687255, 11989332, 11237463, 10456650, 9615232, 8724522, 7868928, 7060413, 6374918, 5918930, 5717899, 5712786, 5843058, 6058769, 6218597, 6155670, 5875804, 5579164, 5405350, 5212327, 4886578]
19886D886578l80001l86219m08245l62635j46393J63807L77834M31098L78386
19877D554210K30975L3212n4928p2355j29902j57643j59897j64245k25168k43669
19867C610590j83148k47379m57840n78165n33558l20642J00253N72408P48192
19858B710711N90619M07968K78853J09153Q425K2582J17530K06618K28711K36919
19848D918089K35794Q8481k14338m61357n37785m45581k61461j69708j57883n0669
19838B943582J21672J91920N6073k21611m00957l16898n1324K50536M25652L73732
19828C372377K29177K45551N58441R14330J085323J104331J006176Q01760O10165
19819I927631O80230R49242J156090J195210J094995R36870Q83540R93572J295710
$$ y = [4886578, 4506577, 4120358, 3712113, 3349478, 3203085, 3366892, 3744726, 4175824, 4554210, 4785185, 4818397, 4763469, 4691114, 4561212, 4403569, 4243672, 4079427, 3854259, 3610590, 3427442, 3180063, 2722223, 2144058, 1610500, 1289858, 1390111, 1962519, 2710711, 3301330, 3709298, 3988151, 4097304, 4105729, 4128311, 4245841, 4452459, 4681170, 4918089, 5153883, 5242364, 5028026, 4566669, 4028884, 3583303, 3321842, 3152134, 2994251, 2943582, 3065254, 3257174, 3313247, 3091636, 2690679, 2373781, 2322457, 2572993, 2998645, 3372377, 3601554, 3847105, 4405546, 5319876, 6405199, 7509530, 8515706, 9317466, 9927631, 10607861, 11557103, 12713193, 13908403, 15003398, 15940268, 16823808, 17817380, 19113090]
19810A9113090J869136K578863L412539M521161N998692P556343Q780192R409597
19802F3239613Q896506O802876L425034n19241m218937o869640q088381q026982
19794E4640848p197894o080834n018097m085523l261264k599134k203911k166570
19786B2027621k223226k041159j856578j871570j802785j480765j036145o17303
19778I098090l22878k10747j80590q0788o4658k86911o01277p37757o64434o20618
19768E327432n87530n00774l47767j36610M4706J66423L07710N00362N84595N06676
19758E865223L34435K04257J30884K2464o0809p0067p5383j3882J21385J67085
19748F625592l6218m23065o89116o45878m65831l74313l93870l16488q8276P0085
$$ y = [19113090, 20982226, 23561089, 26973628, 31494789, 37493481, 45049824, 53830016, 63239613, 72136119, 78938995, 82364029, 81844788, 77625851, 70756211, 62667830, 54640848, 47442954, 41362120, 36344023, 32258500, 28997236, 26398102, 24194191, 22027621, 19804395, 17763236, 15906658, 14035088, 12232303, 10751538, 9715393, 9098090, 8775212, 8564465, 8383875, 8303087, 8238429, 7951518, 7350241, 6612484, 5948050, 5327432, 4739902, 4239128, 3891361, 3754751, 3799457, 3965880, 4273590, 4773952, 5358547, 5865223, 6199658, 6403915, 6534799, 6557263, 6496454, 6426387, 6351004, 6337122, 6458507, 6625592, 6589374, 6166309, 5477193, 4831315, 4365484, 3991171, 3597301, 3280813, 3192537, 3262622]
19738C262622j4543k17928m10582n58898n41273k79705Q7505L49883M29075L38620
19728B444776K04215O4965M3003J64136J36137q1670j80932m8274N2325M8737
19718B847418L5411j4872k1793k1876j18104j53768j14750q193K36571L89867
19708C055911L59437K55493J43250R9988Q7772j18479m37295m39932j41545N8484
19698B923084p719j00186p6504m3782k4998K6035P687j38579l81052n44368m09646
19687A229972p3067R3041L4944k3628m1972n0608j08415o1296P6500J10641J43732
19676A329844K67639L50457L93574M65268N26990N90414P12292Q15673P82707
19667F234858O97017O77676O77497O32432M86158J72064k60854o59218r14773
$$ y = [3262622, 3248079, 3030151, 2619569, 2060671, 1519398, 1239693, 1327198, 1677081, 2106156, 2444776, 2648991, 2713956, 2756959, 2921095, 3057232, 2975562, 2794630, 2746356, 2798681, 2847418, 2882829, 2867957, 2846164, 2824288, 2706184, 2552416, 2437666, 2429473, 2666044, 3055911, 3415348, 3670841, 3814091, 3914079, 4001851, 3883372, 3446077, 3006145, 2864600, 2923084, 2915365, 2815179, 2738675, 2694893, 2669895, 2695930, 2703617, 2565038, 2183986, 1639618, 1229972, 1156905, 1249946, 1284890, 1261262, 1219290, 1168682, 1060267, 998971, 1075471, 1186112, 1329844, 1597483, 1947940, 2341514, 2806782, 3333772, 3924186, 4636478, 5452151, 6234858, 6931875, 7609551, 8287048, 8919480, 9405638, 9577702, 9316848, 8657630, 7742857]
19658G742857r40858p56745n09764l79434l34419k70835k48707l01273m94320
19649C506502p01708o43254l40993j7592J04537M9316m7938o7917m624P7812J17382
19638B031523N8514l0443l0993j5420j54934l10968k29243K2657J92657K06369
19628A739719J19210o3692k66041m07922m03578k57718j10362K8381K36673L93373
19618A008043L52238J17096j56432k62107k70207k32315j61745N533K44994K52686
19608H97784O7562p2517m2666J24159K29554R4074k45974n48349o12681m79624
19598e88678l14037r7413J10354Q6430K6265J37752K78647L46022K34455k4181
19588A95616j64887k29771k89151j99632N6803K98756M31318M65900M41822M52366
$$ y = [7742857, 6801999, 6045254, 5535490, 5156056, 4821637, 4550802, 4302095, 4000822, 3506502, 2804794, 2161540, 1820547, 1802955, 1907492, 1956808, 1908870, 1840953, 1836329, 1914141, 2031523, 2090037, 2059594, 2028601, 2013181, 1858247, 1547279, 1318036, 1340693, 1533350, 1739719, 1858929, 1795237, 1529196, 1121274, 717696, 459978, 349616, 377997, 614670, 1008043, 1360281, 1477377, 1320945, 1058838, 788631, 556316, 394571, 400104, 645098, 897784, 965346, 892829, 850163, 974322, 1203876, 1297950, 1051976, 503627, -109054, -588678, -902715, -1000128, -889774, -803344, -777079, -639327, -360680, -14658, 219797, 195616, 30729, -199042, -488193, -687825, -631022, -332266, 99052, 564952, 1006774, 1459140]
19578A459140N07811M74006L12747J34230k8188k18834l94852m70982l86527k23707
19568A164844j58088j17041N2852J47325J7369j63943k28028j71452m0348J60596
19558F64086K94297J77511j24423l47408l13991j57830j29756k36809l55118l63016
19548h92457k42872k4968J96616K59078J92109J52470J48506J24276J83874K60451
19538C57083J60250p4768k82087k92866j12057Q5339J84702K00881Q6038N4158
19528C66673K05143K74143J88371R7911J26844J10625p5453k23407j82376l7582
19518H50892Q5701J00588K7285q8801j78398p5090J11562K33276K78981J53937
19508A499933r8295k12567j16674J1224O2943P2083N6984M1889k5737k07625l17640
$$ y = [1459140, 1966951, 2440957, 2753704, 2887934, 2859746, 2640912, 2246060, 1775078, 1388551, 1164844, 1006756, 889715, 942567, 1089892, 1107261, 943318, 715290, 543838, 503490, 664086, 958383, 1135894, 1011471, 664063, 350072, 192242, 62486, -174323, -529441, -892457, -1135329, -1160297, -963681, -704603, -512494, -360024, -211518, -87242, 96632, 357083, 517333, 442565, 160478, -132388, -244445, -159106, 25596, 226477, 312515, 366673, 571816, 845959, 1034330, 1132241, 1259085, 1369710, 1294257, 1070850, 888474, 850892, 936593, 1037181, 1064466, 975665, 797267, 722177, 833739, 1067015, 1345996, 1499933, 1401638, 1189071, 1072397, 1083621, 1146564, 1218647, 1275631, 1317520, 1291783, 1084158, 766518]
19497G66518k16766j26776j47794p3729K0882l9489n1400R1296J89087Q5252j40233
19486C56848k60155j81044j16143j75644k02397j62309l988K22103L15108K81225
19476G3604K99440L81394L37964J42542l0554j55680l56639m71931m05914k79258
19466d65032k05047j76407j07759n346L5874J15293L10729M35053M03537L28466
19456F69361L08118L61158L29065J32456k0576o7674r6525j06754j63471j46718
19446A198440l7541l4099p6725r2074n3053j10917k53537k13592p834J04116N2506
19435D75690r528k2512j25896m11863n43031k61264J46127L25815K78206K46525
19425I8269L41304M53920L89392K22223R2748P0904J12862r397j96619l14487
$$ y = [766518, 549752, 422976, 275182, 201453, 222335, 182846, 131446, 222742, 411829, 497081, 356848, 96693, -84351, -200494, -376138, -578535, -740844, -744832, -522729, -207621, 73604, 373044, 754438, 1092402, 1234944, 1204390, 1048710, 692071, 220140, -185774, -465032, -670079, -846486, -954245, -959591, -923717, -808424, -497695, -62642, 340895, 669361, 977479, 1338637, 1667702, 1800158, 1779582, 1711908, 1615383, 1508629, 1345158, 1198440, 1160899, 1126800, 1050075, 958001, 904948, 794031, 540494, 326902, 319068, 423184, 475690, 466162, 443650, 317754, -94109, -637140, -898404, -752277, -426462, -148256, 98269, 439573, 893493, 1282885, 1505108, 1597856, 1668760, 1781622, 1772225, 1575606, 1261119]
19415A261119l65704l03106j90195o5276M3188J33745J90040K0993k24555k85210
19405B15039j52300k0405r6056j89660m2036J79942J64246j03217l53276l77512
19395g75235k29949L7924L14917M62353L61253J12358j2245p8687k13642k83516
19385c04469k81687k96071k00024p4224l6790O89R028o0073p6920N9967K79746
19374i80828L56444K27692J4290j29635j90602q6910P4363N2063o663N1648Q4988
19363e33150R3192J35626R8109J349K0023N8355J9252n2784j34194j37495j34677
19352e66394k46965l24554j93654J13928L71781M44925L85098K52266J29622O4026
19342D30079R9339K05788K85401J64199j68956l92633l02033j75451j93637k95420
$$ y = [1261119, 895415, 592309, 402114, 336838, 380026, 513771, 703811, 724804, 500249, 215039, 62739, 42334, -53722, -243382, -285418, -105476, 58770, -44447, -397723, -775235, -1005184, -967260, -652343, -189990, 171263, 283621, 271376, 192689, -20953, -304469, -586156, -882227, -1082251, -1156475, -1193265, -1192576, -1183548, -1243621, -1320541, -1260574, -980828, -624384, -396692, -382402, -512037, -702639, -789549, -715186, -663123, -669786, -618138, -533150, -439958, -304332, -206223, -204874, -184851, -126496, -107244, -160028, -294222, -431717, -566394, -813359, -1137913, -1331567, -1217639, -845858, -400933, -15835, 236431, 366053, 430079, 529418, 735206, 1020607, 1184806, 1015850, 623217, 321184, 145733, -47904, -343324]
19332c43324m25587n01208l91209j43760J0383J13044L62972N46311M25752K40917
19322a05709Q5458m5013j10083j94126k14957j40061r3888k33473l10072r2899
19312a454823J66133K23343J71641R2191K8910N8719J19512K18890L14711K94994
19302B34221K39381J88745M2965j14932k10151l49832m41799l38291k12765j73318
19292a135776j27435l435J87214L18767K95983J23883K5569M9716N0422m5175
19282b60267j14806j59451k26710j58591N4889J41907O5005K8084j4202j08234
19272g52376j16695o9045k9322K2437j1012j90602k27413L939J86901J74709J66586
19261h41893L21654M55712M42825L58197K52283Q1530j92972m60830n84888n07971
$$ y = [-343324, -768911, -1270119, -1661328, -1805088, -1794705, -1681661, -1318689, -772378, -346626, -105709, -20251, -65264, -175347, -369473, -584430, -724491, -818379, -1051852, -1361924, -1454823, -1288690, -1065347, -893706, -801515, -772605, -713886, -594374, -375484, -60773, 234221, 473602, 662347, 705312, 590380, 380229, 30397, -411402, -749693, -962458, -1135776, -1263211, -1266646, -1079432, -760665, -464682, -340799, -315230, -265514, -215092, -260267, -375073, -534524, -761234, -919825, -864936, -723029, -658024, -629940, -644142, -752376, -869071, -938116, -967438, -945001, -956013, -1146615, -1374028, -1370089, -1183188, -1008479, -841893, -520239, -64527, 378298, 736495, 988778, 1070308, 877336, 416506, -168382, -676353]
19251f76353k68070r5933j45424k63362k61077l5981K75401M96843N33599M54858
19241A4501L74195K41956R7669R5564R9915K9611j4865q1528j02375q7747j07604
19230E59292n5541N8169J68363K25208J18986j3193j23910k60834k90208k09351
19220A76981j36422L3077K29935J88861J1734j63041k84421k65748j34442m7820
19210c91306n2271r326J20194J72444R6452M2165O5435J15856K31926K24931K6786
19199F43286j29988j83276k16147k02446j03960k6336n6393j72058k08546j47773
19189h03637n5152J11827L58069N27079M67078K74202J38890R6946O4329J01418
19179A281049J82847J48764j5536j85455k52426k94045l17439k57586o1824J77081
$$ y = [-676353, -944423, -1040356, -1185780, -1449142, -1710219, -1746200, -1470799, -973956, -440357, 14501, 388696, 630652, 728321, 823885, 923800, 953411, 938546, 857018, 754643, 666896, 559292, 503751, 561920, 730283, 955491, 1074477, 1061284, 937374, 676540, 386332, 176981, 40559, 73636, 303571, 492432, 504166, 341125, 56704, -209044, -343486, -391306, -443577, -452903, -332709, -160265, -63813, -21648, 43787, 159643, 391569, 616500, 643286, 513298, 330022, 113875, -88571, -192531, -218867, -275260, -447318, -655864, -803637, -858789, -746962, -388893, 138186, 605264, 879466, 1018356, 1115302, 1179631, 1281049, 1463896, 1612660, 1597124, 1411669, 1159243, 865198, 547759, 290173, 228349, 405430]
19169D05430K77769K22056K11982K83129K88901K37482K6987l39755n43450m27119
19159F43412k47056k24890k97409l11404k08571o1862M8318J62348J98631J30906
19149a67577P1982P8329J24954J08843M230o2882J1546J15547J83975J84447J42326
19138G95720J32205J59401J80399J12971n4619k41570l03444k43886l01392m36241
19128b00456m63364l47872k00074k08260k73381j91524Q6217K89740K53556J56489
19118a098929m542j91805k51374k00058p0584R7842K72391L85240M21794L16469
19108c23556J15729J5099n929K8005J75310L35264L66023K36550n3525k84161
19098F04809m19400n49591n81077m23576j08855K91147N17033M62731K86210K8878
$$ y = [405430, 683199, 905255, 1117237, 1400366, 1689267, 1926749, 1953736, 1613981, 1070531, 643412, 396356, 171466, -125943, -437347, -645918, -707780, -659462, -497114, -298483, -167577, -95595, -17266, 107688, 216531, 220761, 157879, 169425, 284972, 468947, 653394, 795720, 927925, 1087326, 1267725, 1380696, 1326077, 1084507, 781063, 537177, 235785, -200456, -663820, -1011692, -1211766, -1420026, -1693407, -1884931, -1798714, -1508974, -1255418, -1098929, -1103471, -1295276, -1546650, -1746708, -1817292, -1719450, -1447059, -1061819, -640025, -323556, -207827, -192728, -198657, -170652, 4658, 339922, 705945, 942495, 888970, 604809, 185409, -364182, -945259, -1368835, -1477690, -1186543, -669510, -206779, 79431, 108309]
19088A08309j11986k5268O0409Q0680K1401o1618r3946j06306q1935k4513k647
19077b37420j4982K7929K00129L01953J52396j12199j76713n5006o2176k29006
19067b05095k43486j35614j33386j89704l04370m64263m65321l04099j71983j30491
19057b747812p2148R1340K45259K88575K55507K34230K89975L05761J88384J32542
19047g88387K66917L81077L78989L39390K83135J37450p6397k36846k16868j06627
19037C61833j31037k29500j85009j13911k00618k65624j48210P2725K89543M00149
19027a49659K89603Q9100m5572m0602J18385K10658R5445K899n1984j35296j85220
19016A97757k30203k22540j18614J15053L14965K85615R4930p7703r5122k1829
$$ y = [108309, -3677, -28945, 31464, 112144, 133545, 71927, -22019, -128325, -210260, -234773, -237420, -252402, -224473, -24344, 277609, 430005, 317806, 141093, 86087, 23911, -205095, -448581, -584195, -717581, -907285, -1211655, -1675918, -2141239, -2445338, -2617321, -2747812, -2819960, -2728620, -2483361, -2194786, -1939279, -1705049, -1415074, -1109313, -920929, -788387, -521470, -140393, 238596, 577986, 861121, 998571, 922174, 685328, 468460, 361833, 230796, 1296, -183713, -297624, -498242, -763866, -912076, -839351, -549808, -149659, 139944, 229044, 183472, 142870, 261255, 471913, 567358, 570257, 518273, 382977, 197757, -32446, -254986, -373600, -258547, 56418, 342033, 436963, 359260, 264138, 242309]
19006B42309N5189Q8232M6606n367M2435J54336K23206K04534K9762p0424J36813
18995A147631L78837L82356K50793N5746j94327l54184l38748k28934j93859k00664
18985G04647j79623j32659j33710k09167l08313l71007k55139J35325N58087O49167
18975D57608M14315J01430j15486j23558k3806j5562j26843k26382k58294l41906
18965b58484m70042m94371l56371j20621Q492J7208Q7197K01830K33621J77653
18955i73888O3801q1993j88629j96071j16645j4217N9177J03672J19289R3311
18945a132193J0357j21206j94088j18791N6102J56257J89713L11989M09502L18663
18935a13695M4733k33940l31571k58898j29841R018R5489J23392J83659K29330
$$ y = [242309, 297498, 385730, 432336, 426969, 469404, 623740, 846946, 1051480, 1081242, 1010818, 1147631, 1526468, 1908824, 2159617, 2215363, 2021036, 1666852, 1328104, 1099170, 905311, 704647, 525024, 392365, 258655, 49488, -258825, -629832, -884971, -749646, -191559, 457608, 871923, 973353, 857867, 734309, 710503, 694941, 568098, 341716, 83422, -258484, -728526, -1222897, -1579268, -1699889, -1691397, -1674189, -1586992, -1385162, -1151541, -973888, -910087, -992080, -1180709, -1376780, -1493425, -1507642, -1448465, -1344793, -1225504, -1132193, -1121836, -1243042, -1437130, -1555921, -1499819, -1343562, -1153849, -841860, -432358, -113695, -68962, -302902, -634473, -893371, -1023212, -1014194, -918705, -795313, -611654, -382324]
18925c82324P6975j37131j79049j69917k05562k04864k16677k66587k60998p7979
18915b024113K87612O32675P89181O29715K31323Q30J33659L27251K31157j36574
18905A102716m06244m11725k76024j06789p3427k00739k73368j33353R0219K01249
18895d87485K37591L10829L86580K72136O4678m9940j60747k12598r3397k0765
18885B46882L3619J61764K21766J52657l4664k68226m22274m06899j89287J33628
18875c71034K73856J71738N6264J9056p707o5506q0882l8656K6413j1191j67166
18864a94815k42498j39598M2678K04696K64014J83596R2071m354j25452j21611
18854d1273j7557L9016J27452K37677L10719L05601K44286M9595k48251m56118
$$ y = [-382324, -305349, -442480, -621529, -791446, -997008, -1201872, -1418549, -1685136, -1946134, -2024113, -1736501, -1103826, -314645, 315070, 546393, 547223, 680882, 1008133, 1239290, 1102716, 696472, 284747, 8723, -98066, -171493, -372232, -645600, -778953, -688734, -487485, -249894, 60935, 447515, 719651, 784329, 734389, 573642, 361044, 267647, 246882, 280501, 442265, 664031, 816688, 782024, 513798, 91524, -315375, -504662, -371034, -97178, 74560, 130824, 149880, 142173, 76667, -4215, -42871, -16458, -27649, -194815, -437313, -576911, -534233, -329537, -65523, 118073, 210144, 205790, 80338, -41273, -58830, -19814, 107638, 345315, 656034, 961635, 1205921, 1255516, 1007265, 551147]
18844E51147n49661n87446n43841l89618k02864K3145J39512J19833J20344J84615
18834a134834J75209O8434K290k1876q9014j16360o7908q1278j68187j72722r8774
18823a705020p2359l1735K3850O5874J10567J59632K48827L29165K86256J56701
18813d28242K8144n5167j22967j77918j62461r5947k0601Q4042J69804K08533
18803e72780J79420k5331k61028k01681J5719R3567K7965k4762j15088k23929
18793a107928q7567K38053M26796M61362M49679L38707J28982j93658m92178m85386
18783c23138j85312L8801L3634Q539M948l7586J2368K05538K69697J80028J51330
18772C58847J27313Q6208O6534O272L1048M6828j33585k91130k79247j82190j5037
$$ y = [551147, 1486, -585960, -1129801, -1519419, -1722283, -1699138, -1559626, -1439793, -1319449, -1134834, -959625, -891191, -888901, -910777, -999791, -1116151, -1184059, -1265337, -1433524, -1606246, -1705020, -1777379, -1809114, -1785264, -1719390, -1608823, -1449191, -1200364, -871199, -584943, -428242, -400098, -455265, -578232, -756150, -918611, -1014558, -1035159, -951117, -781313, -572780, -393360, -418691, -679719, -881400, -865681, -772114, -744149, -768911, -883999, -1107928, -1195495, -957442, -530646, -69284, 380395, 719102, 848084, 654426, 162248, -323138, -508450, -469649, -436015, -427476, -422528, -460114, -447746, -242208, 27489, 207517, 358847, 486160, 572368, 638902, 645174, 676222, 723050, 589465, 298335, 19088, -163102, -178139]
18761a78139K58347N17857N53422L35348J10219M0418n3248k30849l64192l77253
18751F11930k31848p1164J6812R5353O7010j51708k97100j81889M5472K13107
18741A15975K21280k5753l74708m63820k93569j44785p9294o8091j41106j92882
18731a446753j59963o1372P834M3655J63894L27502L89723K83135J66582M5354
18721b40409j36624j59632q2278j80753m25469n73176m57660j82961L2291O5293
18711b341378J0676L9998J95217L53524L87300L61753L82159M48206M47108L52742
18701F37305K10757P9335P190M541k4674o5415j11839j45584j95043k89777k97461
18690a90665j69460J3211J29282K36180L34699K29779l2505j86469j88647k53650
$$ y = [-178139, 80208, 598065, 1151487, 1486835, 1597054, 1637472, 1584224, 1353375, 989183, 611930, 380082, 308918, 325730, 421083, 488093, 336385, 39285, -142604, -97132, 115975, 337255, 311502, -63206, -527026, -820595, -965380, -1044674, -1112765, -1253871, -1446753, -1606716, -1668088, -1660254, -1616599, -1452705, -1125203, -735480, -452345, -285763, -240409, -377033, -536665, -618943, -799696, -1225165, -1798341, -2256001, -2438962, -2406671, -2341378, -2330702, -2290704, -2095487, -1741963, -1354663, -992910, -610751, -162545, 284563, 637305, 848062, 927397, 934587, 939128, 914454, 849039, 737200, 591616, 396573, 106796, -190665, -360125, -346914, -217632, 18548, 353247, 583026, 550521, 364052, 175405, -78245]
18680g8245m04794l57857j68400j14241j01770N1674K86175M75878N00953L78150
18670D67523K49986J77585N0255j06168j89907k53133k43246q5218O7982O1013
18660A96672J1320R3101K93151M16814L12268J66922P3914P5318J19218K5737
18650A784435j48222k80800l62554m48650n14585m66041k33272J41909L83814
18641a43966L57545L05564K65304J18944o1919j45491o0048K9122L9582Q5091
18631G89728J43794Q9540j8898j69916l97641n04083m14870l05950j93309J0330
18621i71275J96858K01966Q1053j2232q7284j49070j61143j39118j28151p3129
18611a241525O6929K97543M48151L38332J17601q4837k29687k72974j94665l3888
$$ y = [-78245, -483039, -840896, -1009296, -1123537, -1225307, -1173633, -887458, -411580, 89373, 467523, 717509, 895094, 945349, 839181, 649274, 396141, 152895, 67677, 135659, 196672, 207992, 301093, 594244, 1011058, 1323326, 1490248, 1564162, 1639480, 1758698, 1784435, 1636213, 1355413, 992859, 544209, 29624, -436417, -669689, -527780, -143966, 213579, 519143, 784447, 903391, 841472, 695981, 635933, 665055, 704637, 789728, 933522, 1023062, 1004164, 834248, 436607, -67476, -482346, -788296, -981605, -971275, -774417, -572451, -491398, -503630, -590914, -739984, -901127, -1040245, -1168396, -1241525, -1174596, -877053, -428902, -90570, 27031, -57806, -287493, -560467, -755132, -789020]
18601g89020J29432L34690M33749L37578L11739L51214K48787J74478K90967M08249
18591B231863K97101m6852l87303n24171m52883l84881m18353m48967l49206j97166
18581f80818l8183L0846n0178j06819j10468j50759j69617k9035K50305N84101
18571d70625P82043O85141L62106L216j38979p9318n6283j47125k10623j76726
18561E52827j57843j49591q9605p0580j59415k34078j80690o2757N3477O7974
18551d30281m0542j36828j45150o2833R5574K38560K51891J70588J27166O7397
18541A35542n0044j32612k08262j18897J67682L37268L44511K93110K65556J53766
18531A187620p812j2191J358j6983K8767N6006m7079j60662j69900j02400m7669
$$ y = [-789020, -659588, -324898, 108851, 446429, 758168, 1109382, 1358169, 1532647, 1823614, 2231863, 2528964, 2482112, 2094809, 1570638, 1117755, 732874, 314521, -134446, -483652, -680818, -719001, -688155, -738333, -845152, -955620, -1106379, -1275996, -1305031, -1054726, -470625, 311418, 996559, 1358665, 1361881, 1222902, 1143584, 1087301, 940176, 729553, 552827, 394984, 245393, 155788, 85208, -74207, -308285, -488975, -551732, -498255, -430281, -470823, -607651, -752801, -815634, -720060, -481500, -229609, -59021, 68145, 135542, 85498, -47114, -255376, -374273, -206591, 130677, 475188, 768298, 1033854, 1187620, 1179808, 1167617, 1168975, 1151992, 1180759, 1236765, 1189686, 1029024, 859124, 756724, 709055]
18520G09055m7005q4869j21925j66142k25416l15721m27156l94307k74017p2632
18510a420135K45539M38614M12482L26973K05015K8087j68443k18312j0389K74300
18500A13731M81593N18923L19692K4134j82551k45024j78194m5762P5328J57866
18490A039736J22724n1874j00449m5164k5919k6955n2244p7293r1168q9037j27205
18479D75152k25113k81784k10840n5953N3274J19682J81199J58541R3061M7403
18469C54622o0270j18417N660J11165J31426J67125K04834J85083O5330o1651
18459I84907r2682J8144K58630L63232K08987n3789k41751k91801k71186k26201
18449F56490j89732k59978k81719j27788j4958j09598j93858q1418J23448L03222
$$ y = [709055, 662050, 577181, 455256, 289114, 63698, -252023, -679179, -1073486, -1347503, -1420135, -1174596, -735982, -323500, 3473, 208488, 236575, 68132, -150180, -160569, 113731, 595324, 1114247, 1433939, 1458073, 1275522, 1030498, 852304, 806542, 881870, 1039736, 1162460, 1110586, 1010137, 964973, 939054, 912099, 859855, 782562, 691394, 602357, 475152, 250039, -31745, -242585, -298538, -245264, -125582, 55617, 214158, 307219, 354622, 294352, 175935, 181595, 292760, 424186, 591311, 796145, 981228, 1046558, 984907, 892225, 910369, 1168999, 1532231, 1741218, 1687429, 1445678, 1153877, 882691, 656490, 466758, 206780, -74939, -202727, -217685, -327283, -521141, -602559, -479111, -175889]
18439a75889M46203N10226L57371R9309j56530l69590m48596l88603k91203j10404
18429e27706J17774K85183L47516K56997N3688j20778k06643k49358l50421m55609
18419h49357m34592l43252k64615j06176J57319L33650L73012M54780N47545M87679
18409C55993K95888N0007j83621k69647j74700r3395r8593l6129P9013J50890
18399G5706J45174J22623K09534K75158J99471R0846n37n1772j19447k59946k10812
18388D75998J57820M96071M37387M3425k26578k32896j94131r2542J4463m3681
18378H35336o6212P1663P4085q4180k10718k39512j62455q8002o8473p2921K4905
18367A3516J97863L39724M77346M90972M09737L62655J04519l29602o31542o80419
$$ y = [-175889, 270314, 780540, 1137911, 1237220, 1080690, 711100, 262504, -126099, -417302, -527706, -409932, -124749, 222767, 479764, 533452, 412674, 206031, -43327, -393748, -849357, -1283949, -1627201, -1891816, -1997992, -1840673, -1507023, -1134011, -679231, -131686, 355993, 651881, 701888, 518267, 248620, 73920, -19475, -118068, -154197, -75184, 75706, 220880, 343503, 553037, 828195, 1027666, 1118512, 1117975, 1066203, 946756, 686810, 475998, 633818, 1129889, 1567276, 1610701, 1384123, 1151227, 957096, 864554, 879017, 835336, 769124, 840787, 914872, 830692, 619974, 380462, 218007, 130005, 61532, -11389, 13516, 211379, 551103, 1028449, 1519421, 1929158, 2291813, 2396332, 2066730, 1435188, 754769]
18357G54769m94543k15708l3264L6857N9493J04214J04512J505j08555j98979
18347A0301l05075m49653m66959l29941j39690J05914K95410L00875K20397M4459
18337g13962j90204l10353l35622k80895j14997R3815K06565K27893K14837J26498
18327a076425p027j9915J49723K38700J68472J46032J27818M6044q3811j53709
18317d64098r7244K8558K02630L14615K99767J03934k15404l69520k44135o3902
18307e04799L7742J48409J44165k1533j35408r7614l728J4745K9917J05715J05833
18296a76556K2877m2002j7531N8896L6867q7153q2056J07720K25982J22640K5113
18285A94797J11421J94270J05025j8356n7209J0285P0106l565q6795j98764k87478
$$ y = [754769, 260226, 44518, 11254, 48111, 107604, 211818, 316330, 317835, 209280, 10301, -294774, -744427, -1211386, -1541327, -1681017, -1575103, -1279693, -978818, -758421, -713962, -904166, -1214519, -1550141, -1831036, -1946033, -1852218, -1645653, -1417760, -1202923, -1076425, -1083452, -1103367, -953644, -714944, -546472, -400440, -272622, -226578, -310389, -464098, -561342, -532784, -330154, -15539, 284228, 388162, 172758, -196762, -440897, -504799, -467057, -318648, -174483, -196016, -331424, -429038, -432766, -418021, -388104, -282389, -176556, -153679, -195681, -213212, -154316, -117449, -204602, -286658, -178938, 47044, 169684, 194797, 306218, 500488, 605513, 587157, 529948, 540233, 610339, 606774, 519979, 321215, 33737]
18274C3737k04701k2922Q3866J18284K05479M12122N18813M03813J44612k05322
18264A487781m30492l61227j25308P4741K06965L09733L16303K59937L11487M27000
18254B476920L30664N0233j75020l00447l33158k60374k24334l17705n26775o29577
18244I0427m49060j33907O4810J48753K28329K52799K21300K20692J30682Q402
18234G83227L0617L1771l9925n9454o6026j82172l05527k80341j20982K696o2333
18223b68449k53847l99942l17705m5036J31522J18081J04015J92172K45229K16125
18213b77835J91709R8499N680N8108R6362P8426R3514J16482J34632O9075n7118
18202F07534p3588L748K8435Q790k012J887R3018J01175k1600o3806j7590K0575
$$ y = [33737, -170964, -193886, -110020, 8264, 213743, 625865, 1144678, 1548491, 1693103, 1487781, 1057289, 696062, 570754, 645495, 852460, 1162193, 1478496, 1738433, 2049920, 2476920, 2807584, 2857817, 2682797, 2382350, 2049192, 1788818, 1564484, 1246779, 720004, 90427, -358633, -492540, -427730, -278977, -50648, 202151, 423451, 644143, 774825, 783227, 813844, 845615, 805690, 746236, 680210, 498038, 192511, -87830, -208812, -206116, -268449, -522296, -922238, -1239943, -1284979, -1153457, -1035376, -931361, -739189, -493960, -277835, -86126, 12373, 18053, 76161, 172523, 250949, 344463, 460945, 595577, 664652, 607534, 533946, 537694, 566129, 574919, 572907, 574794, 667812, 768987, 747387, 683581, 665991, 686566]
18190F86566O9171M5477K4883J32574K19258K03992N7474j95598l55760l86106
18180E01931l59887k77727j93509n3797J39744K28039J93961N0944j83060k99083
18170b52444l19222l18448j93969N042J77567L38424L22750J54256J24799J43896
18160A82651j0556k81578m08607l02780k2812K09622K23235J71285J48635R4641
18150C736M4078Q1438J70263J92902P8142k0970Q403M2350j2692m6384n4628j7967
18138D68671M5005M9111n2487j97160l35786n36590o61529m94933j4303L40721
18128a389280L42128K90937K80948K24521J82645J39225K9947j08490j76315j85261
18118c68995k17212j42900J03491K62811K67293J73334p183j76367l10004l47019
$$ y = [686566, 755737, 801214, 826097, 958671, 1177929, 1381921, 1439395, 1243797, 888037, 501931, 142044, -135683, -329192, -382989, -243245, -15206, 178755, 229699, 46639, -252444, -571666, -890114, -1084083, -1079041, -901474, -563050, -240300, -86044, 38755, 182651, 172095, -109483, -518090, -820870, -843682, -634060, -410825, -239540, -90905, 3736, 47814, 129252, 299515, 492417, 570559, 549589, 557992, 600342, 587650, 541266, 486638, 468671, 513676, 562787, 510300, 313140, -22646, -559236, -1220765, -1715698, -1730001, -1389280, -1047152, -756215, -475267, -250746, -68101, 71124, 101071, -7419, -183734, -368995, -586207, -729107, -625616, -362805, -95512, 77822, 70639, -105728, -415732, -762751]
18108g62751j36068K15560L35898J77179L9389j0889k7226J6478K1908m2554j31444
18097c04520j48140p197K15006M39105O26880N19948M3264m31410n47187l83817
18087B1932k13024l4813J05920J03180R3341Q9358q955q4580n0873j3003j6869
18076h386J0728N3456O9674J57625K13514J48894R5318J4016j26042k78070l06728
18065D3999j63556J3214J09509Q0439M557n0423j09377j8254J70874K26103J61531
18054D68616J20783K08039K47662J46459L5637R344Q2177J22793l002j98386k54872
18043I85250j03778j9575j84945l33444l11901k42258l59594n57409o44394n73246
18033b345294l66544j16350R9281K32608M76050Q05685R38646Q67627O64973L48388
$$ y = [-762751, -898819, -683259, -347361, -170182, -130793, -141682, -168908, -152430, -130522, -173076, -304520, -452660, -459857, -244851, 194254, 821134, 1341082, 1384346, 952936, 405749, 21932, -191092, -225905, -119985, -16805, 76536, 165894, 156939, 72359, 21486, 8483, -8386, 2342, 55798, 125472, 283097, 496611, 645505, 740823, 754839, 628797, 350727, 43999, -119557, -106343, 3166, 83605, 88162, 37739, -71638, -89892, 80982, 307085, 468616, 589399, 797438, 1045100, 1191559, 1227196, 1236540, 1318717, 1441510, 1438508, 1240122, 985250, 881472, 861897, 676952, 343508, 31607, -210651, -570245, -1127654, -1772048, -2345294, -2711838, -2828188, -2728907, -2496299, -2020249, -1214564, -275918, 591709, 1256682, 1605070]
18023A605070R0666K2099P1329J08802q5088l59079m95323n43443o00826o11924
18013g97717n22128l77767k06158j3283J93200K77784J89172P5382n1548j42164
18003a375227p6076J05292K76288K82677J07676N438P1495J40751J75955K23555
17993f2176K38696J29697L3210j2548J5815J31070J57784J46838J51215K3688
17983I53289j15853j9493J19766Q7189m9127k11241k85092j86501j4984J8125
17973B96078j00220k14972k61379k09980J342K25049L58508M51333M01217J04089
17963A051065j80093j73608N1372L11235M16746K45204m4050k15882j87492r4318
17953A180179j15930k19020k77085k83881k31908j24784p7484j08176j44190j30940
$$ y = [1605070, 1695736, 1717835, 1789164, 1897966, 1812878, 1453799, 958476, 415033, -185793, -797717, -1319845, -1697612, -1903770, -1917053, -1723853, -1446069, -1256897, -1181515, -1233063, -1375227, -1451303, -1346011, -1069723, -787046, -679370, -673932, -602437, -461686, -285731, -62176, 176520, 306217, 339427, 326879, 342694, 473764, 631548, 778386, 929601, 953289, 837436, 817943, 937709, 1024898, 975771, 764530, 479438, 292937, 277953, 296078, 195858, -19114, -280493, -490473, -489131, -264082, 94426, 545759, 946976, 1051065, 870972, 697364, 748736, 1059971, 1476717, 1721921, 1677871, 1461989, 1274497, 1180179, 1064249, 845229, 568144, 284263, 52355, -72429, -149913, -258089, -402279, -533219]
17943e33219O1382L05966L35822J52193r7114k44472k29510j59431n1362P0544
17933c89201J06038J41843K37693K16324p937k97410l99164k55244r5527n8372
17923h00957n4837L3575J74632K63340K75305K33659J42565P9918P5218M2165
17913D64583r6222l28107m21044l02126j66812q7227k763P9139J97476K01084
17903d62019m3860k10744j55156j7619J73800K96446L20091L61445L01798J56695
17893G20877j7612k15763k50491n6321K21403L35049J69260j46760l85592m12012
17883c7962k47082O2512L51779M41183L97505K64161K6376k19120k96658j45850
17873E96844R0864K30309K96161L59942K80189M4380k93188n95987o44247m54227
$$ y = [-533219, -471837, -165871, 169951, 322144, 225030, -19442, -248952, -408383, -459745, -389201, -283163, -141320, 96373, 312697, 304760, 7350, -391814, -647058, -742585, -800957, -855794, -822219, -647587, -384247, -108942, 124717, 267282, 347200, 422418, 464583, 368361, 40254, -380790, -682916, -849728, -936955, -939718, -860579, -663103, -462019, -505879, -716623, -871779, -889398, -715598, -419152, -99061, 262384, 564182, 720877, 703265, 487502, 237011, 180690, 402093, 737142, 906402, 759642, 374050, -37962, -285044, -222532, 129247, 570430, 967935, 1232096, 1258472, 1039352, 742694, 596844, 687708, 918017, 1214178, 1574120, 1854309, 1898689, 1605501, 1009514, 365267, -88960]
17863h8960k20283q6736m0638J02436K02925R8443l117L9590J31527J09403J05339
17852C49929J63309J05577m2534j10020j04288p0913J11907L28596M18130L24183
17842A473876J892k14250n0920K27303L67596L65758L07273J47821j59615l86144
17832B080590m23981l77262k65599p2579K8889P7272J65054J63156O7385m3040
17822A399885j53750k07860k71494l36940k42874n7012j9681j16246k13032k72529
17812d91533k14124j38594j30795j09702j734J02536J24995R7925J03106J34114
17802e23806J01976J11533K72342M23138L81632K27793N1732j09611j63665j49774
17792F23290k28580l33520l07493j49575R7198L23133M01590K20243N357N3080
$$ y = [-88960, -309243, -395979, -436617, -334181, -131256, -32813, -35930, 3660, 135187, 244590, 349929, 513238, 618815, 576281, 466261, 361973, 291060, 402967, 731563, 1149693, 1473876, 1475768, 1261518, 1210598, 1437901, 1805497, 2171255, 2478528, 2626349, 2466734, 2080590, 1656609, 1279347, 1013748, 941169, 970058, 1047330, 1212384, 1375540, 1442925, 1399885, 1246135, 1038275, 766781, 429841, 186967, 129955, 110274, -5972, -219004, -491533, -705657, -844251, -975046, -1084748, -1086482, -983946, -858951, -761026, -657920, -523806, -421830, -310297, -37955, 385183, 766815, 994608, 1046340, 936729, 773064, 623290, 394710, 61190, -246303, -395878, -298680, 24453, 426043, 646286, 651643, 704723]
17782G04723K36899L18189K51813N8480j47192j82660o0344p9733k24719k49873
17772F25583j73583q3876k0998j22690l85261n03571l13132L8083K72073L87948
17762b79424M05759L20184K28046J48874O7992m415j15175k38852k03416n6891
17752B72682R765o618n5542j9784K22135M52329M31003K20015K0005j16885k80770
17741A148335m09553l65389j66482R4651J74506l3161j88947p7419P8827P6119
17731C31487n2000r8485m363J194j54290k17975j54131K2643K55826L01514J07374
17720C38794j38832k52938k38760j20828J18514L13301K67661J03837l1522o1624
17710B97603o4125j71962j89421o3093M7967J00253J00248J62822K73677K84041
$$ y = [704723, 941622, 1259811, 1511624, 1570104, 1422912, 1240252, 1179908, 1100175, 875456, 625583, 452000, 368124, 347126, 224436, -160825, -664396, -977528, -939445, -667372, -279424, 126335, 446519, 674565, 823439, 891431, 887016, 771841, 532989, 329573, 272682, 282447, 275829, 220287, 200503, 422638, 874967, 1305970, 1525985, 1545990, 1429105, 1148335, 738782, 373393, 206911, 301562, 476068, 442907, 253960, 176541, 255368, 331487, 279487, 181002, 176639, 177833, 23543, -194432, -348563, -325920, -70094, 231420, 338794, 199962, -52976, -291736, -412564, -294050, 19251, 286912, 390749, 359227, 297603, 233478, 61516, -127905, -190998, -143031, -42778, 57470, 220292, 493969, 778010]
17700G78010J85362J5597j39685k15601k82617k15798r290J00456K8014o1032
17690A83416l3468q9560l42127o08636o86946n73522l22961R8530M82219N83037
17680a310018N46972N24543M10144K07273K2459j6285L3614r286j98151l50289
17670a39024k89556j38765j9357Q1812O2754o2406j15109j77157l00090k53530
17660a350428P6873M75829O18447M70989L45106M37285M69026J80124j44432k20569
17650A358250j43796j17821j94641l21411l25122j45738l5028j39719k72812k82590
17640f20428j14430K39185N06419L41448o9008l18740l50028k41113j00011k0968
17630g47674K6882R5808J49715J15150L496r5070j27100o3481J1082k870p3546
$$ y = [778010, 963372, 978969, 839284, 623683, 341066, 125268, 115978, 216434, 244448, 183416, 149948, 60388, -281739, -890375, -1577321, -2150843, -2473804, -2375274, -1893055, -1310018, -763046, -238503, 171641, 378914, 401373, 385088, 418702, 409416, 211265, -139024, -428580, -567345, -586702, -504890, -442136, -504542, -619651, -796808, -1096898, -1350428, -1273555, -797726, -179279, 291710, 636816, 1074101, 1543127, 1723251, 1578819, 1358250, 1214454, 1096633, 901992, 580581, 255459, 109721, 74693, -65026, -337838, -620428, -734858, -495673, 10746, 352194, 283186, -35554, -385582, -626695, -726706, -747674, -720792, -624984, -475269, -360119, -356623, -451693, -578793, -642274, -631192, -634062, -707608]
17619g07608j60498k68425l06677j88650l8535K1602L7692J10092K54799L24459
17609i21749L17175K17327N2236j032J24598K62475J36119j73231l13864j93876
17599d93822o1128p8995j45597j84481j96912j55942j73146j56718l4068P5188
17589a605621P7309P331K5866J45831K60169L13010K63801J90220J72195K60344
17579A10455L96626N36305N66773K65305j21287k30378k05644l79119n94328n06860
17569a62152j97831P4557J73088J77968J64300J07513N570N848L5981J5389K6095
17558D26326R4114J96321K55038J41384m3555m2238J59713L88457M30699K01796
17548B208055j42308l68199m31956m59317m24876k69668j08440k5341N2828J18633
$$ y = [-707608, -868106, -1136531, -1443208, -1631858, -1670393, -1648791, -1611099, -1501007, -1246208, -921749, -604574, -387247, -335011, -336043, -211445, 51030, 187149, 13918, -299946, -493822, -554950, -633945, -779542, -964023, -1160935, -1316877, -1490023, -1646741, -1680809, -1605621, -1528312, -1520981, -1495115, -1349284, -1089115, -776105, -512304, -322084, -149889, 110455, 507081, 1043386, 1610159, 1875464, 1754177, 1523799, 1318155, 939036, 344708, -162152, -359983, -285426, -112338, 65630, 229930, 337443, 343013, 348861, 384842, 400231, 426326, 520440, 716761, 971799, 1113183, 1069628, 1027390, 1187103, 1575560, 2006259, 2208055, 2065747, 1697548, 1265592, 806275, 381399, 111731, 3291, -22050, 30778, 149411]
17538A49411P8312l1857j40251k16016k67831j44338Q9327K26962K26868J93962
17528A64549K25702J70910n4943j68441m2983L4538j28749k53741k04416j42008
17518c99582q7875k5826K8956Q0854J57575J16411m5497j92353k62988k76511
17508i06836l17837j92864J22596K12327k8314j87680k7436L44472O58899P49481
17498D26808O52015M25056j750m45874n67813m03594k59114j96896j99457j86017
17488g56636l1741J26764J66348J16557j9789k06035l07625k73542k06096j10340
17478a502135O974l0558q1912K2506J71383L69102N28319M10552J2211l74999
17468d68557l98223r0448J89693L09244K98842K28576J51590K13930L33628K29753
$$ y = [149411, 227723, 195866, 55615, -160401, -428232, -572570, -483243, -256281, -29413, 164549, 390251, 561161, 506218, 337777, 294794, 329332, 200583, -53158, -257574, -399582, -487457, -513283, -484327, -403473, -245898, -129487, -174984, -367337, -630325, -906836, -1224673, -1417537, -1294941, -1082614, -1110928, -1298608, -1326044, -981572, -322673, 426808, 1078823, 1503879, 1502129, 1056255, 488442, 84848, -174266, -371162, -570619, -756636, -788377, -661613, -495265, -378708, -398497, -604532, -912157, -1185699, -1391795, -1502135, -1495161, -1525719, -1607631, -1585125, -1413742, -1044640, -516321, -105769, -93558, -468557, -866780, -957228, -767535, -458291, -159449, 69127, 220717, 434647, 768275, 998028]
17458I98028m7142k80274l70036l17809j37453R2477K35325K37885Q0257q8956
17448D02302j65768k22847k14203j05838N1992K94543N12866L92826l5029l06249
17438F04595l02199k52414j19412J73528M45384M66525L10619J73915J43941R6836
17428A741318r2272k05451k17065k70524j26124J32498J27589n4043k45031l32518
17418D58377k83737k62246l38815l54198j84200k2084K0085N698j39200k68134
17408a368454j55332Q7041J67912J11352J30749J86161K33237K85343K45166M9148
17398b7677j84248k94587k77073j84230n5299M6429J48412K74456L33144L02845
17388H2172L29004L22186J11179j26616k52792k52638j24663l7876l5049r6866
$$ y = [998028, 950886, 670612, 300576, -17233, -154686, -62209, 173116, 411001, 491258, 402302, 236534, 13687, -200516, -306354, -254362, 40181, 553047, 945873, 910844, 604595, 302396, 49982, -69430, 104098, 549482, 1016007, 1326626, 1500541, 1644482, 1741318, 1649046, 1443595, 1226530, 956006, 829882, 962380, 1089969, 1035926, 790895, 458377, 174640, -87606, -426421, -780619, -964819, -986903, -966818, -961120, -1100320, -1368454, -1523786, -1436745, -1268833, -1157481, -1026732, -840571, -607334, -321991, -76825, -27677, -211925, -506512, -783585, -967815, -1023114, -976685, -828273, -553817, -220673, 82172, 411176, 733362, 844541, 717925, 465133, 212495, 87832, 49956, 14907, -81959]
17378h1959j80096j41041Q0944L44953N20055M70576K25111j12500l96209m08409
17368C21425k52589j16491Q2669K81922K55075P0265j17750k20210j40683J8290
17358A81923J17327J62164J97992J34279j9575j56264j88355j08771K5422J80081
17348E26223K70981J99076L4031j28823k27578j43856j4523M7898J35342K24114
17338I22885K46975K29558K75698L85521L53154R6778k00453l73946m20871l29347
17328A185952j85357k16244l44051k93605j12688L1469p1563m21150o27051m75607
17318a529895j61975J8480R7683J51417K33728L30671J89104p6563j56036M0943
17308h62443K82121L41638K65878Q0605k16156m11224l33298j29690L2328J67996
$$ y = [-81959, -262055, -403096, -322152, 22801, 542856, 1013432, 1238543, 1126043, 729834, 321425, 68836, -47655, 35014, 316936, 572011, 642276, 524526, 304316, 163633, 181923, 299250, 461414, 659406, 793685, 774110, 617846, 429491, 320720, 346142, 526223, 797204, 996280, 1030311, 901488, 673910, 530054, 515531, 563429, 698771, 922885, 1169860, 1399418, 1675116, 2060637, 2413791, 2510569, 2310116, 1936170, 1515299, 1185952, 1000595, 784351, 440300, 146695, 34007, 65476, -6087, -427237, -1054288, -1529895, -1691870, -1673390, -1575707, -1424290, -1190562, -859891, -670787, -747350, -903386, -862443, -580322, -238684, 27194, 107799, -108357, -519581, -852879, -982569, -950241, -782245]
17298g82245K56489K06308P5485j1566o3958j34156k12066l91862m43731j68203
17288a669505J59750K80301K46117K94365M37003M04276J15713j69997j76423
17279g8400p355O0705J8857O5645J06731q3614l31666m09106k71433j12125j8455
17268a060216J41433L35657M19040K84637L4676j10244j67974k27764j48552L1205
17258d68102J23439J96252K71306K36046J10752j51749m60893n10523k33810J28815
17248g58467K98256K98700K16061k4504k74801k54057n0232O5122L0634r260N4719
17237d07829J71912J79006J44047K75621M51345M92348M55163M06667K72987J52466
17227B593733J85456K13098R5674q2601k50284l26052l52083m84723n36319m16295
$$ y = [-782245, -525756, -319448, -243963, -255529, -319487, -453643, -665709, -1057571, -1501302, -1669505, -1509755, -1229454, -983337, -688972, -251969, 152307, 268020, 98023, -78400, -85755, -25050, -6193, 59452, 166183, 82569, -249097, -658203, -929636, -1041761, -1060216, -918783, -583126, -164086, 120551, 155227, 44983, -122991, -350755, -499307, -468102, -344663, -148411, 122895, 358941, 469693, 317944, -142949, -653472, -887282, -758467, -460211, -161511, 54550, 30046, -244755, -498812, -549044, -483922, -453288, -462548, -407829, -235917, -56911, 87136, 362757, 814102, 1306450, 1761613, 2168280, 2441267, 2593733, 2779189, 2992287, 3087961, 3005360, 2755076, 2429024, 2076941, 1592218, 1055899, 639604]
17217F39604k28514L4934K69265L07141K35942J64415J05805q557j13203p0377
17207A336455m1420j71966l01348l27626k91063k05056q0623q165j2758k9008
17197a32578n9410j20063j40685o4107J03609K43496K50404K36113J99251P8693
17187E94723K5402N4440M1008M5604J44656K03534P4545r0232j01544j34171k27210
17176F30755j55411N0609J32515N6364n3988j41424k08851l46730n27690n37739
17166a101590k15544J88207K86782J07642j46003l50963m08867k38799O2093K30410
17156a586632J70867J37103K29484L13442L49655L07043K03998P3641q3325k30308
17146a15032k54672j98295j18889J14824L32102L48481K30332m46j72050k44710
$$ y = [639604, 411090, 446024, 715289, 1022430, 1258372, 1422787, 1528592, 1520035, 1406832, 1336455, 1295035, 1123069, 821721, 494095, 203032, -2024, -82647, -90812, -103570, -132578, -191988, -312051, -452736, -516843, -413234, -169738, 80666, 316779, 516030, 594723, 620125, 674565, 715573, 761177, 905833, 1109367, 1183912, 1093680, 992136, 857965, 630755, 475344, 525953, 658468, 714832, 660844, 519420, 310569, -36161, -563851, -1101590, -1317134, -1128927, -842145, -734503, -880506, -1231469, -1640336, -1879135, -1817042, -1586632, -1415765, -1278662, -1049178, -735736, -386081, -79038, 124960, 198601, 115276, -115032, -369704, -567999, -686888, -572064, -239962, 108519, 338851, 338405, 166355, -78355]
17136g8355k17128r0729l3990q8708j44032j37287n5583J14785M04096O37780
17126C10849O17373L14080j17412l91346l26421j39193o2402r5951r0421L0657
17116D9813J07476J64924K21168J22257m0219k6554J40467K73068K39729R3037
17106A345166n3246j39326j50035j72471j33602K5253J77923K74115K02024k7418
17096A348383k09226j96733p4950J4507N7426L8531o2896j68686j55587p0270
17086E20499p9545q9292o7561m3922O7403J84267J13781r0448k57895k34850k8877
17075f440P9410L6388o1697j18766n4019M9401O7441P6153J37037J03402n7738
17064B50572j42922j17551m4143P8218K75039M15594L65804K76750J54202j32462
$$ y = [-78355, -295483, -386212, -420202, -508910, -652942, -790229, -845812, -731027, -326931, 310849, 928222, 1242302, 1124890, 733544, 407123, 267930, 205528, 109577, 19156, 49813, 157289, 322213, 543381, 665638, 625419, 598865, 739332, 1012400, 1252129, 1345166, 1291920, 1152594, 1002559, 830088, 696486, 721739, 899662, 1173777, 1375801, 1348383, 1139157, 942424, 867474, 881981, 939407, 977938, 915042, 746356, 590769, 520499, 440954, 351662, 284101, 240179, 307582, 491849, 605630, 515182, 257287, 22437, -6440, 72970, 109358, 47661, -71105, -125124, -75723, -8282, 67871, 204908, 308310, 250572, 107650, -9901, -54044, 24174, 299213, 714807, 1080611, 1357361, 1511563, 1379101]
$$ [...]
##END NTUPLES=NMR SPECTRUM
##END=
