##TITLE=C13_DE-75H
 D2O, 19500sc

 3.2.2025
##JCAMPDX= 6.0         $$ Bruker NMR JCAMP-DX V2.0
##DATA TYPE= NMR SPECTRUM
##DATA CLASS= NTUPLES
##ORIGIN= UXNMR, Bruker Analytische Messtechnik GmbH
##OWNER= root
$$ XWIN-NMR		Version 3.5
$$ Tue Feb  4 13:52:21 2025 Russian Standard Time (UT+4h)  she@DPX200
##.OBSERVE FREQUENCY= 50.327896
##.OBSERVE NUCLEUS= ^13C
##.ACQUISITION MODE= SIMULTANEOUS
##.ACQUISITION SCHEME= undefined
##.AVERAGES= 19501
##.DIGITISER RES= 17
##SPECTROMETER/DATA SYSTEM= spect
##.PULSE SEQUENCE= zgpg30
##.SOLVENT NAME= CDCl3
##.SHIFT REFERENCE= (INTERNAL, CDCl3, 0, 222.646)
##AUDIT TRAIL= $$ (NUMBER, WHEN, WHO, WHERE, WHAT)
$$ ##TITLE= Audit trail, XWIN-NMR		Version 3.5
$$ ##JCAMPDX= 5.01
$$ ##ORIGIN= Bruker BioSpin GmbH
$$ ##OWNER= she
$$ F:/spectra/data/she/nmr/c13/1/pdata/1/auditp.txt
$$ ##AUDIT TRAIL=  $$ (NUMBER, WHEN, WHO, WHERE, WHAT)
(   1,<2025-02-04 13:51:08.09 +0400>,<she>,<DPX200>,
      <created by zg, POWCHK disabled, PULCHK disabled
       terminated by command 'halt'
       configuration hash MD5:
       00 E9 B6 7A A2 85 ED C7 34 08 36 98 17 FE 4E 26
       data hash MD5: 32K
       DF C9 A2 6E F3 FF F0 FF D9 54 A6 AB C6 C2 64 2F>)
(   2,<2025-02-04 13:51:12.81 +0400>,<she>,<DPX200>,
      <Start of raw data processing
       efp BC_mod = 2 LB = 2 FT_mod = 6 PKNL = 1 PHC0 = -417.2021 PHC1 = 38.68833 SI = 32K 
       data hash MD5: 32K
       07 CB 08 BD 95 E1 15 86 76 16 F1 78 29 AD 51 BA>)
(   3,<2025-02-04 13:51:19.59 +0400>,<she>,<DPX200>,
      <abs ABSG = 5 
       data hash MD5: 32K
       68 88 CD 86 AA 1D 2E 80 77 F1 6A D8 A2 17 AD B3>)
(   4,<2025-02-04 13:51:43.68 +0400>,<she>,<DPX200>,
      <pk PHC0 = 2.491047 PHC1 = 4.400001 
       data hash MD5: 32K
       68 46 6F B5 40 04 E4 EC EF 97 95 90 58 AD B7 AA>)
(   5,<2025-02-04 13:51:47.00 +0400>,<she>,<DPX200>,
      <abs ABSG = 5 
       data hash MD5: 32K
       EF EC AF 54 58 79 72 93 89 80 72 20 A4 C3 00 FA>)
$$ ##END=
$$ 
$$ hash MD5
$$ 62 CE 58 A9 DA 49 4E BE 9D 8F 96 65 A3 92 28 9E
##$RELAX= 
##$RELAX= 
##$RELAX= 
##$RELAX= 
##$RELAX= 
##$RELAX= 
##$RELAX= 
##$RELAX= 
$$ Bruker specific parameters
$$ --------------------------
##$DU= <F:/spectra>
##$EXPNO= 1
##$NAME= <c13>
##$PROCNO= 1
##$TYPE= <nmr>
##$USER= <she>
##$AMP= (0..31)
100 100 100 100 100 100 100 100 100 100 100 100 100 100 100 100 100 100 
100 100 100 100 100 100 100 100 100 100 100 100 100 100 
##$AQSEQ= 0
##$AQ_mod= 1
##$AUNM= <au_zg>
##$AUTOPOS= <>
##$BF1= 50.322709
##$BF2= 200.13
##$BF3= 50.322709
##$BF4= 500.13
##$BF5= 500.13
##$BF6= 500.13
##$BF7= 500.13
##$BF8= 500.13
##$BYTORDA= 1
##$CFDGTYP= 0
##$CFRGTYP= 5
##$CHEMSTR= <none>
##$CNST= (0..31)
1 1 145 1 1 1 1 1 1 1 1 1 1 1 1 1 1 1 1 1 1 1 1 1 1 1 1 1 1 1 1 1 
##$CPDPRG= <waltz16>
##$CPDPRG1= <>
##$CPDPRG2= <waltz16>
##$CPDPRG3= <>
##$CPDPRG4= <mlev>
##$CPDPRG5= <mlev>
##$CPDPRG6= <mlev>
##$CPDPRG7= <mlev>
##$CPDPRG8= <mlev>
##$CPDPRGB= <>
##$CPDPRGT= <>
##$D= (0..31)
$$ [...]
##$SUBNAM4= <"">
##$SUBNAM5= <"">
##$SUBNAM6= <"">
##$SUBNAM7= <"">
##$SUBNAM8= <"">
##$SUBNAM9= <"">
##$SW= 239.972175391363
##$SWIBOX= (0..15)
0 1 3 0 0 0 0 0 0 0 0 0 0 0 0 0 
##$SW_h= 12077.2946859903
##$TD= 32768
##$TD0= 1
##$TE= 0
##$TE2= 300
##$TE3= 300
##$TEG= 300
##$TL= (0..7)
120 120 120 120 120 120 120 120 
##$TP= (0..7)
150 150 150 150 150 150 150 150 
##$TP07= 0
##$TPNAME0= <>
##$TPNAME1= <>
##$TPNAME2= <>
##$TPNAME3= <>
##$TPNAME4= <>
##$TPNAME5= <>
##$TPNAME6= <>
##$TPNAME7= <>
##$TPOAL= (0..7)
0.5 0.5 0.5 0.5 0.5 0.5 0.5 0.5 
##$TPOFFS= (0..7)
0 0 0 0 0 0 0 0 
##$TUNHIN= 0
##$TUNHOUT= 0
##$TUNXOUT= 0
##$USERA1= <user>
##$USERA2= <user>
##$USERA3= <user>
##$USERA4= <user>
##$USERA5= <user>
##$V9= 5
##$VALIST= <valist>
##$VCLIST= <CCCCCCCCCCCCCCC>
##$VD= 0
##$VDLIST= <DDDDDDDDDDDDDDD>
##$VPLIST= <PPPPPPPPPPPPPPP>
##$VTLIST= <TTTTTTTTTTTTTTT>
##$WBST= 1024
##$WBSW= 4
##$XGAIN= (0..3)
0 0 0 0 
##$XL= 0
##$YL= 0
##$YMAX_a= 116704142
##$YMIN_a= -32372829
##$ZGOPTNS= <>
##$ZL1= 120
##$ZL2= 120
##$ZL3= 120
##$ZL4= 120
##$ABSF1= 222.646
##$ABSF2= -17.35081
##$ABSG= 5
##$ABSL= 3
##$ALPHA= 0
##$AQORDER= 0
##$ASSFAC= 0
##$ASSFACI= 0
##$ASSFACX= 0
##$ASSWID= 0
##$AUNMP= <proc_1d>
##$AZFE= 0.1
##$AZFW= 0.5
##$BCFW= 0
##$BC_mod= 2
##$BYTORDP= 0
##$COROFFS= 0
##$CY= -3
##$DATMOD= 1
##$DC= 0
##$DFILT= <>
##$DTYPP= 0
##$F1P= 0
##$F2P= 0
##$FCOR= 0.5
##$FTSIZE= 32768
##$FT_mod= 6
##$GAMMA= 0
##$GB= 0
##$INTBC= 1
##$INTSCL= 4.134877e-10
##$ISEN= 128
##$LB= 2
##$LEV0= 0
##$LPBIN= 0
##$MAXI= 10000
##$MC2= 0
##$MEAN= 0
##$ME_mod= 0
##$MI= 0.1934396
##$NCOEF= 0
##$NC_proc= 1
##$NLEV= 6
##$NOISF1= 120.0001
##$NOISF2= 80.00006
##$NSP= 0
##$NTH_PI= 0
##$NZP= 0
##$OFFSET= 222.646
##$PC= 1.4
##$PHC0= -414.711
##$PHC1= 43.08833
##$PH_mod= 1
##$PKNL= yes
##$PPARMOD= 0
##$PSCAL= 0
##$PSIGN= 0
##$REVERSE= no
##$SF= 50.3227304950709
##$SI= 32768
##$SIGF1= 140
##$SIGF2= 120
##$SINO= 11.81781
##$SIOLD= 32768
##$SREGLST= <13C.CDCl3>
##$SSB= 0
##$STSI= 32768
##$STSR= 0
##$SW_p= 12077.2946859903
##$SYMM= 0
##$S_DEV= 0
##$TDeff= 32768
##$TDoff= 0
##$TI= <>
##$TILT= no
##$TM1= 0
##$TM2= 0
##$TOPLEV= 0
##$USERP1= <user>
##$USERP2= <user>
##$USERP3= <user>
##$USERP4= <user>
##$USERP5= <user>
##$WDW= 1
##$XDIM= 32768
##$YMAX_p= 352266554
##$YMIN_p= -3295171
$$ End of Bruker specific parameters
$$ ---------------------------------
##NTUPLES= NMR SPECTRUM
##VAR_NAME=  FREQUENCY,     SPECTRUM/REAL,   SPECTRUM/IMAG
##SYMBOL=    X,             R,               I
##VAR_TYPE=  INDEPENDENT,   DEPENDENT,       DEPENDENT
##VAR_FORM=  AFFN,          ASDF,            ASDF
##VAR_DIM=   32768,         32768,           32768
##UNITS=     HZ,            ARBITRARY UNITS, ARBITRARY UNITS
##FACTOR=    0.368581032318806, 1,           1
##FIRST=     11204.1544572324, 0,            0
##LAST=      -873.140228757911, 0,           0
##MIN=       -873.140228757911, -3295171,    0
##MAX=       11204.1544572324, 352266554,    0
$$ Real data points
##PAGE= N=1
##DATA TABLE= (X++(R..R)), XYDATA
$$ [...]
22940A69402k30982j36650l2534k9309o5305l9111p156K5821J7936k8422j0356
$$ 169402 -61580 -198230 -230764 -260073 -325378 -364489 -371645 -345824 -327888 -356310 -366666
22929c66666J16277K21678K09005O3139p7883l926J49806K10964O2056k08373
$$ -366666 -250389 -28711 180294 243433 165550 161624 311430 522394 584450 376077
22919C76077j76624J59614L27305J66217j4140q5312r0698l8782o2478j85527
$$ 376077 199453 359067 686372 852589 838449 753137 662439 623657 561179 375652
22909C75652k62622k15579j39416r3173J0223N3511o751n139r795l2264j9576
$$ 375652 113030 -102549 -241965 -335138 -324915 -271404 -278155 -283294 -293089 -325353 -344929
22898c44929l6795n6679P154J93675M00487M10157K39117Q0552m7319j44957j56949
$$ -344929 -381724 -438403 -431249 -237574 162913 573070 812187 892739 845420 700463 543514
22887E43514o4123K5560N9605N0602n7587j55226j30773o0876K134J1555j8248
$$ 543514 479391 504951 564556 615158 557571 402345 271572 210696 212830 224385 206137
22876B06137j0814p5115k09184l33711l98561l16504j26539J3725Q0812O6419
$$ 206137 195323 120208 -88976 -422687 -821248 -1137752 -1264291 -1250566 -1169754 -1103335
22866a103335m3653j09364n2538R033l5725l6662p539o4177j46344k54601l36651
$$ -1103335 -1146988 -1256352 -1308890 -1299857 -1335582 -1372244 -1379783 -1443960 -1590304 -1844905 -2181556
22855b181556l08093j74723l8624K3726Q8105J83091K88789L62203L81792L33745
$$ -2181556 -2489649 -2664372 -2702996 -2679270 -2591165 -2408074 -2119285 -1757082 -1375290 -1041545
22845a041545K03168O6860J1343O0362O2655P8927K31526M08172N72253O12407
$$ -1041545 -838377 -771517 -760174 -699812 -637157 -558230 -326704 81468 653721 1266128
22835A266128L52620m6373l15286l96681m10653l09068q2244N6810P7322p299
$$ 1266128 1618748 1572375 1257089 860408 449755 140687 58443 115253 192575 185276
22825A85276j39638k79725l01096j39616N9761J48329P0909j87629l79867l40947
$$ 185276 45638 -234087 -535183 -674799 -615038 -466709 -395800 -583429 -963296 -1304243
22815a304243k02321m0673O2159O6198J03703J78645K37001L30800K79150J7301
$$ -1304243 -1506564 -1547237 -1485078 -1418880 -1315177 -1136532 -899531 -568731 -289581 -272280
22805b72280k00900j82179L6970J65286Q5961Q9818J84615J31329n9728k19344
$$ -272280 -473180 -655359 -618389 -453103 -367142 -277324 -92709 38620 -21108 -240452
22795b40452k29892j97929j85553j00796J01910L87570N42361M17246J18386j78261
$$ -240452 -470344 -668273 -853826 -954622 -852712 -465142 77219 494465 612851 434590
22785D34590k90490j91350n7580n105O2734J67010J11870j31753l00756k71558
$$ 434590 144100 -47250 -104830 -109935 -47201 119809 231679 99926 -200830 -472388
22775d72388j25660R2863K71131J94100p0108k78745k59378j2140K29889K94661
$$ -472388 -598048 -505185 -234054 -39954 -110062 -388807 -648185 -660325 -430436 -135775
22765a35775K03034J08701K8440j33372k84110l20215j83832P0495K03319J95038
$$ -135775 67259 175960 204400 71028 -213082 -533297 -717129 -646634 -443315 -248277
22755b48277J49729J11159J41273K82462M31136M08116K42495M270k00960j63255
$$ -248277 -98548 12611 153884 436346 867482 1275598 1518093 1522363 1321403 1158148
22745A158148n6768p9381j63794k24318k40242k10465j83105k13444j91884l7135
$$ 1158148 1101380 1021999 858205 633887 393645 183180 75 -213369 -405253 -442388
22735d42388J31551K27757K91299K73705J54408j9001k33021m17306m78161m13791
$$ -442388 -310837 -83080 208219 481924 636332 617331 384310 -32996 -511157 -924948
22725i24948k61193p0888J39170L11701L22657K35715J48336l5325j87689j5235
$$ -924948 -1186141 -1257029 -1117859 -806158 -483501 -247786 -99450 -134775 -322464 -337699
22715c37699K27418J89341j6055j55454j70309j28749j21098j79687j46728N1705
$$ -337699 -110281 79060 63005 -92449 -262758 -391507 -512605 -692292 -839020 -787315
22705g87315K01411Q4224j65278k39330J1312L48313L91226J70881J9813l040
$$ -787315 -585904 -501680 -666958 -906288 -894976 -546663 -155437 15444 35257 32217
22695C2217l1401q7487j26606j60160k40592k82997j68873k5049j6297l4948k4956
$$ 32217 816 -86671 -213277 -373437 -614029 -897026 -1065899 -1090948 -1107245 -1142193 -1167149
22684a167149k5071k2504j0927J11732L70326N85073N27173J94040j22589k16470
$$ -1167149 -1192220 -1214724 -1225651 -1113919 -743593 -158520 368653 562693 440104 223634
22674B23634k51542k59857j49761L2853J67036J82710J46806J12839Q5507M0221
$$ 223634 -27908 -287765 -437526 -404673 -237637 -54927 91879 204718 290225 330446
22664C30446l4847j15701j84314j98893j17031m9448j01241j83679k09635j98760
$$ 330446 295599 179898 -4416 -203309 -320340 -369788 -471029 -654708 -864343 -1063103
22654a063103j38798n4863o1794n1364J37236K81400K20553J15441J53038K44751
$$ -1063103 -1201901 -1256764 -1318558 -1369922 -1232686 -951286 -730733 -615292 -462254 -217503
22644b17503K36715J84853J44253Q5293L0478L7835N1645M2083K5542q8851k01375
$$ -217503 19212 204065 348318 433611 464089 501924 553569 595652 621194 532343 330968
22633C30968j52194l3128O9569K07898K65945J63704M7485Q808J265l7671o9750
$$ 330968 178774 145646 215215 423113 689058 852762 900247 909055 910320 872649 802899
22622H02899r0166j58991k41429k85514k91854j81435J1458J77540K59136K15532
$$ 802899 712733 553742 312313 26799 -265055 -446490 -435032 -257492 1644 217176
22612B17176P5601p813p074q211j950l4811j66333k58774k08229j08398j9022
$$ 217176 292777 284964 277890 269679 267729 232918 66585 -192189 -400418 -508816 -527838
22601e27838O1879J29463R9320K1275r9825k94851l67147j86664J8281M7540L9870
$$ -527838 -465959 -336496 -237176 -215901 -315726 -610577 -977724 -1164388 -1146107 -1098567 -1058697
22590a058697R2998J07710K4012j5030J94932M82366N63732M30667K76330J59829
$$ -1058697 -965699 -857989 -833977 -849007 -654075 -171709 392023 822690 1099020 1258849
22580A258849m7680l74905n87082m49248r9749J58905L06298L53354J82685r2568
$$ 1258849 1211169 836264 249182 -200066 -299815 -140910 165388 518742 701427 608859
22570F08859k90895m25089m72265l66028j37436R4467K51590L59641M70015M35584
$$ 608859 317964 -107125 -579390 -945418 -1082854 -988387 -736797 -377156 92859 528443
22560E28443J26712j13912j57858j49838p8593O5201J83746K10401Q5070j57490
$$ 528443 655155 541243 383385 233547 154954 220155 403901 614302 699372 541882
22550E41882l93501n24886l44416J02384M89448O55434M97328J61890j50848l48733
$$ 541882 148381 -376505 -720921 -618537 -129089 526345 1023673 1185563 1034715 685982
22540F85982l96862l57720l58468l60664k25427j3251Q6976P3839M1479m5780
$$ 685982 289120 -68600 -427068 -787732 -1013159 -1026410 -939434 -865595 -824116 -869896
22530h69896q0191O2174K75281L32110J51116j35399l22251l43766k06486K5823
$$ -869896 -950087 -887913 -612632 -280522 -129406 -264805 -587056 -930822 -1137308 -1111485
22520a111485J03011K1608m6983n8930r264J03340K46933K25890P7481J0185J7049
$$ -1111485 -1008474 -986866 -1033849 -1092779 -1102043 -998703 -751770 -525880 -448399 -438214 -421165
22509d21165P4494J67018K80241M32712N12925L87887R8834j38389k34268k77431
$$ -421165 -346671 -179653 100588 533300 1046225 1434112 1532946 1394557 1160289 882858
22499H82858j97327k2368J40008K71971K27529j4126k54902l19032k60846j11627
$$ 882858 685531 663163 803171 1075142 1302671 1288545 1033643 714611 453765 342138
22489C42138L7092n729j24197j38782j84386k91528l58709l47623k81618j90234
$$ 342138 379230 373501 249304 110522 -73864 -365392 -724101 -1071724 -1353342 -1543576
22479a543576p0841N1347J51638K08135K93104L48987K93031J97852L9630j84238
$$ -1543576 -1614417 -1563070 -1411432 -1203297 -910193 -561206 -268175 -70323 -30693 -214931
22469b14931l17285l09012j24877J51975L24845L54798K47560R1328k9380m1099
$$ -214931 -532216 -841228 -966105 -814130 -489285 -134487 113073 204401 175021 133922
22459A33922m6618r9887q8877k9705k9475p8619j41191k22983k65176k10877j42688
$$ 133922 87304 -12583 -101460 -131165 -160640 -239259 -380450 -603433 -868609 -1079486 -1222174
22448a222174j40550j86927k20049j03121J67691L83139L32801N9854p8476J10647
$$ -1222174 -1362724 -1549651 -1769700 -1872821 -1705130 -1321991 -989190 -929336 -1007812 -897165
22438h97165L66161M73077M20715J36834j83933k75198k20551j36101k0392J33737
$$ -897165 -531004 -57927 362788 499622 315689 40491 -180060 -316161 -336553 -202816
22428b02816K69853L49508L23417J55283p0997k27766l14730k76789j12992J15514
$$ -202816 67037 416545 739962 895245 824248 596482 281752 4963 -108029 7485
22418G485K82359K75396J83195M5089q9919r6459k4606K0630R8437J58909Q5365
$$ 7485 289844 565240 748435 793524 703605 607146 582540 603170 701607 860516 945881
22407I45881K5746p667j78239l22146k81668j52327J8686J50862J45200l7428
$$ 945881 971627 963960 785721 463575 181907 29580 48266 199128 344328 306900
22397C06900k77144m12214l64497j95682p9325j32050j75262j28661r3638n4948
$$ 306900 29756 -382458 -746955 -942637 -1021962 -1154012 -1329274 -1457935 -1551573 -1606521
22387a606521q3620j31679k5149K29123M64507N67349M66333J55967k08867l77306
$$ -1606521 -1690141 -1821820 -1846969 -1617846 -1153339 -585990 -119657 36310 -172557 -549863
22377e49863k90883j33085j06688j03340M2696J17959l1200k00329k22328r9456
$$ -549863 -840746 -973831 -1080519 -1183859 -1141163 -1023204 -1054404 -1254733 -1477061 -1576517
22367a576517J51707M36242N29746L54156J39829n0087p4701J04149J79151J50427
$$ -1576517 -1424810 -988568 -458822 -104666 35163 -14924 -89625 14524 193675 344102
22357C44102J34395J10610Q0404J05360K01237L09680L14459J06295j26803k21094
$$ 344102 478497 589107 669511 774871 976108 1285788 1600247 1706542 1579739 1358645
22347A358645k61295l14434l10741k19675j79884j79092j18388k5388J1580P5131
$$ 1358645 1097350 782916 472175 252500 72616 -106476 -224864 -250252 -238672 -163541
22337a63541K70341L93789L75558L25317K62749J15414p1496p4388N0168m1394
$$ -163541 106800 500589 876147 1201464 1464213 1579627 1508131 1433743 1483911 1442517
22327A442517k50012l35658l26364k61358j55705k3179J03546J77725J36319n6133
$$ 1442517 1192505 856847 530483 269125 113420 90241 193787 371512 507831 451698
22317D51698l17294m35271k75571M6887K45241K47291J67864M2074o7491j09455
$$ 451698 134404 -300867 -576438 -529551 -284310 -37019 130845 172919 105428 -4027
22307d027j29400j00922j940K9353J337J8056J9159N0099J75524J56683m9918
$$ -4027 -133427 -234349 -236289 -206936 -205599 -187543 -168384 -118285 57239 213922 164004
22296A64004k59390l53350l36822k53962j02565L7058J50682K96250L21571J33450
$$ 164004 -95386 -448736 -785558 -1039520 -1142085 -1105027 -954345 -658095 -336524 -203074
22286b03074k3051j0919n0300j52569j27351J457J48613K23630J81188m9170l28483
$$ -203074 -226125 -237044 -287344 -439913 -567264 -565807 -417194 -193564 -12376 -61546 -390029
22275c90029m32194l35478j59299j812R7830K15169L35392L30033K30839J11263
$$ -390029 -822223 -1157701 -1317000 -1318812 -1220982 -1005813 -670421 -340388 -109549 1714
22265A714k6215r5298p4490L567Q6272J31896P3022q8498k15033k25209j59952
$$ 1714 -24501 -119799 -194289 -190722 -104450 27446 100468 11970 -203063 -428272 -588224
22254e88224o3254K861r724n2139k5680m8927j61750j88411j55679j83709k08427
$$ -588224 -651478 -648617 -658341 -710480 -736160 -785087 -946837 -1135248 -1290927 -1474636 -1683063
22243a683063j66571j16750l282J83123L71027M68084M10503K20010Q7865J60626
$$ -1683063 -1849634 -1966384 -1969666 -1786543 -1415516 -947432 -536929 -316919 -229054 -68428
22233f8428L06429L56139J61085j81001l48144l36214k83865k26742k40191j97426
$$ -68428 238001 594140 755225 574224 226080 -110134 -393999 -620741 -860932 -1058358
22223a058358j3897R1724R5390J55154K72335L03899K13874O9734k5839q8840
$$ -1058358 -1072255 -980531 -885141 -729987 -457652 -153753 60121 129855 104016 15176
22213A5176j80080j52827Q4435K46831J59125L8066j8796r0815j60084j54591
$$ 15176 -164904 -317731 -233296 13535 172660 210726 191930 101115 -58969 -213560
22203b13560m0724J23941J83452J53109J82149K33744J63611N744j41191k34139
$$ -213560 -254284 -130343 53109 206218 388367 622111 785722 791466 650275 416136
22193D16136k05577o0187J1734m1711m9777K0122J29114K17070J60843n186r9430
$$ 416136 210559 150372 162106 120395 70618 90740 219854 436924 597767 592581 493151
22182D93151k6098J02552J45733K8600j85102m02044n12334m20878k54760q0695
$$ 493151 467053 569605 715338 743938 558836 156792 -355542 -776420 -1031180 -1111875
22172a111875J94771M26581M39205L27190K56333K38888J91275N8753j09275k32456
$$ -1111875 -917104 -490523 -51318 275872 532205 771093 962368 1021121 911846 679390
22162F79390k59358j11931O9236J7357o0339L9620J36953R8322j01532k71913
$$ 679390 420032 308101 377337 394694 334355 373975 510928 609250 507718 235805
22152B35805k56068j94387j57012p0217N5823K04015K67682K02255M1224j47891
$$ 235805 -20263 -214650 -371662 -441879 -386056 -182041 85641 287896 329120 181229
22142A81229k41568j56354O4832L06225L98172L72115M09823M15449K35291m7425
$$ 181229 -60339 -216693 -151861 154364 552536 924651 1334474 1749923 1985214 1937789
22132A937789l29603m70503m03034k75429k07293k48251k80733k01602j13773
$$ 1937789 1608186 1137683 734649 459220 251927 3676 -277057 -478659 -592432
22123e92432j39186k33383k64741j42201J10592K77659K29749N3110r2840j26138
$$ -592432 -731618 -965001 -1229742 -1371943 -1261351 -983692 -753943 -700833 -793673 -919811
22113i19811j06960k0201O1697Q3087J50035J88120J53222J97080L27421L71844
$$ -919811 -1026771 -1046972 -985275 -902188 -752153 -564033 -410811 -213731 113690 485534
22103D85534K53606n758k62178l12668j31383N0162J91127K95966J96220M107
$$ 485534 739140 733382 471204 158536 27153 77315 268442 564408 760628 764735
22093G64735l7022L7885r756k14794l67083k80094M552J79131Q5841q1822j92965
$$ 764735 727713 765598 755842 541048 173965 -106129 -101577 77554 163395 81573 -111392
22082a11392k97753l51240k65724j0662K30159K67611J87674J51846J89048J61227
$$ -111392 -409145 -760385 -1026109 -1036771 -806612 -539001 -351327 -199481 -10433 150794
22072A50794N0308n1663j61145j92599j73557j49147j4003K45321N04835N21906
$$ 150794 201102 149439 -11706 -204305 -377862 -527009 -541012 -295691 209144 731050
22062G31050K77651l7822k48292l21720k65097m5787K24477L93838L44174J24279
$$ 731050 1008701 970879 722587 400867 135770 89983 314460 708298 1052472 1176751
22052A176751j5781j79207m50122n63221l35976Q8327M31314N63514M42187J65535
$$ 1176751 1160970 981763 531641 -31580 -367556 -279229 152085 715599 1157786 1323321
22042A323321k8397m4159m4216j12727j45514q0788K9724J17205J73267J57263
$$ 1323321 1294924 1250765 1206549 1093822 948308 867520 897244 1014449 1187716 1344979
22032A344979J2992m5374J00117J62066O9069N449K3583P9927O5251p577q3164
$$ 1344979 1357971 1312597 1412714 1574780 1643849 1649298 1672881 1752808 1818059 1810482 1727318
22021A727318j39546j96467k28391k63971l36719l18462j29929J41752K38545
$$ 1727318 1587772 1391305 1162914 898943 562224 243762 113833 255585 494130
22012D94130J21720K2424J2749l3887j06858j38274j63556k41935k71634j50210
$$ 494130 615850 638274 651023 617136 510278 372004 208448 -33487 -305121 -455331
22002d55331l0790M3853R3939L2474j61983l71544l93671k70799j03124N2222
$$ -455331 -486121 -442268 -348329 -315855 -477838 -849382 -1243053 -1513852 -1616976 -1564754
21992a564754J80336L20969L97328L42790J69987k3297n3489K6079O0095j1857
$$ -1564754 -1384418 -1063449 -666121 -323331 -153344 -176641 -230130 -204051 -143956 -155813
21982a55813o6909j343M8822M2634L1850N7304O8975n7474j59865p1766J8917
$$ -155813 -222722 -224065 -175243 -132609 -100759 -43455 25520 -31954 -191819 -263585 -244668
21971b44668K1707p3806j37126m8631R2837J30443M2491J392K1283n4400j81175
$$ -244668 -222961 -296767 -433893 -482524 -389687 -259244 -216753 -215361 -194078 -248478 -429653
21960d29653k49179k24806k0515J94824K22441J53454l7344l65133o20617n69627
$$ -429653 -678832 -903638 -924153 -729329 -506888 -353434 -390778 -755911 -1376528 -1946155
21950a946155l74071k07073n4915J24012K60180K77261K72345K50563K10137J52055
$$ -1946155 -2320226 -2527299 -2582214 -2458202 -2198022 -1920761 -1648416 -1397853 -1187716 -1035661
21940a035661R6886J09910K12836L19129L25603K35030J81325J99367K36806L05549
$$ -1035661 -938775 -828865 -616029 -296900 28703 263733 445058 644425 881231 1186780
21930A186780L19936J83285r9655l80840m66754l92051k99535k74614k22987j03293
$$ 1186780 1506716 1690001 1590346 1209506 742752 350701 51166 -223448 -446435 -549728
21920e49728n647J59841L84059L90373J79691J7836k3298n0963k7530n309l931
$$ -549728 -555375 -395534 -11475 378898 558589 576425 553127 502164 474634 469325 465394
21909D65394j2804p1754j89521k31952j32140n3483j67J03974K76430M11681M63467
$$ 465394 452590 380836 191315 -40637 -172777 -226260 -226427 -122453 153977 565658 1029125
21898A029125L79182R1747k02203l08637k56534p6562J47827K67947J30053j08289
$$ 1029125 1408307 1500054 1297851 989214 732680 656118 803945 1071892 1201945 1093656
21888A093656k22849k37262k30827k70573k93186j85716J1722J36485J83479K77127
$$ 1093656 870807 633545 402718 132145 -161041 -346757 -335035 -198550 -15071 262056
21878B62056M40147M88314K54377p8134j92895p4732M2925M9296j5106r4125j36201
$$ 262056 702203 1190517 1444894 1366760 1173865 1099133 1142058 1191354 1176248 1082123 945922
21867I45922j36333j14671j44775k40581m28979n44289l77628j24626m8907m4941
$$ 945922 809589 694918 550143 309562 -119417 -663706 -1041334 -1165960 -1214867 -1259808
21857a259808P5215K00684K99914M12139M68687M20890L09133J72982p0383k84437
$$ -1259808 -1184593 -983909 -683995 -271856 196831 617721 926854 1099836 1029453 745016
21847G45016k43940P357K39383K66289J13115j03824l02333l32357j83356m444
$$ 745016 501076 508433 747816 1014105 1127220 1023396 721063 388706 205350 200906
21837B00906J53072K41282J09899j70656l21675k34703n3884M9352J09493J25692
$$ 200906 353978 595260 705159 534503 212828 -21875 -75759 -26407 83086 208778
21827B08778j3635j29185o8488P3505K06041K81084L14337K42282O4855p9631
$$ 208778 195143 65958 -2530 70975 277016 558100 872437 1114719 1179574 1099943
21817A099943r2927J8072M2255p1569r9305m540O4046L8428m3957j79510k01248
$$ 1099943 1007016 1025088 1067343 995774 896469 891929 955975 994403 950446 770936 569688
21806E69688l1020J33797P8872q0788j82493j87226j33429j05467j18682q8261
$$ 569688 538668 672465 751337 670549 488056 300830 167401 61934 -56748 -145009
21796a45009O908Q6965J77971K55951K96851K69167Q8941l7852O3135J20862o7740
$$ -145009 -138101 -51136 126835 382786 679637 948804 1037745 999893 1063028 1183890 1116150
21785A116150l34287l77759j44921O0599P104j18546j58793k12113k93395k78958
$$ 1116150 781863 404104 259183 319782 326886 208340 49547 -162566 -455961 -734919
21775g34919p1664J49145K69367L28373K88904J80128J5869k27125l77585k93205
$$ -734919 -806583 -657438 -388071 -59698 229206 409334 425203 198078 -179507 -472712
21765d72712j45156p6921N1953J20334P2102P4291Q4416L4261p2311j76543k04837
$$ -472712 -617868 -694789 -642836 -522502 -450400 -376109 -291693 -257432 -329743 -506286 -711123
21754g11123j29894n3208Q78J20814K58351K58611J59790J35211K07312L17420
$$ -711123 -841017 -894225 -893347 -772533 -514182 -255571 -95781 39430 246742 564162
21744E64162L99393L18559J22231j44195m49860n77401m53649k37917k3900J09508
$$ 564162 963555 1282114 1404345 1260150 810290 232889 -220760 -458677 -482577 -373069
21734c73069J05206P1590J38749K12394P5014k17301l64224l05925k10622j97730
$$ -373069 -267863 -196273 -57524 154870 229884 12583 -351641 -657566 -868188 -1065918
21724a065918k10614r6138Q7159J67439K21765L28941M01308M36037M48967M22542
$$ -1065918 -1276532 -1372670 -1285511 -1118072 -896307 -567366 -166058 269979 718946 1141488
21714A141488K91979L8178j44027k16188l12828l86654l24224j25381Q0254J33241
$$ 1141488 1433467 1471645 1327618 1111430 798602 411948 87724 -37657 42597 175838
21704A75838O9950m2335j58004j97152j73179j30938j44138k54023l29775k18556
$$ 175838 245788 203453 45449 -151703 -324882 -455820 -599958 -853981 -1183756 -1402312
21694a402312K7525K27429L26440M21954M64413M07757L17036J70048j15367l76578
$$ -1402312 -1374787 -1147358 -820918 -398964 65449 473206 790242 960290 844923 468345
21684D68345l88726k53021j85235j69951l1883J37259J49742R4254O4911L4334
$$ 468345 79619 -173402 -358637 -528588 -560471 -423212 -273470 -179216 -114305 -79971
21674g9971K3034J21109K31197O6351l04279m98421l29178n6480P6719Q3343J1567
$$ -79971 -56937 64172 295369 361720 57441 -440980 -770158 -826638 -749919 -666576 -655009
21663f55009k9090P5139K65008L46316L02308J78243M9785p9934k11086l02216
$$ -655009 -684099 -608960 -343952 2364 304672 482915 532700 452766 241680 -60536
21653f0536l68871l66703j87437O7302J67023J04391M3930M2394Q8731J56717
$$ -60536 -429407 -796110 -983547 -916245 -749222 -644831 -600901 -558507 -469776 -313059
21643c13059J62069Q6597J0030L290K4486Q1278J73045K51986K13085Q6714Q7374
$$ -313059 -150990 -64393 -54363 -51073 -26587 54691 227736 479722 692807 779521 866895
21632H66895J86477J85098M174k03736j84420K2607J36110K4419j20238j54256
$$ 866895 1053372 1238470 1242644 1038908 854488 877095 1013205 1037624 917386 763130
21622G63130j08364k3390Q913k5484n9120j95870l43478k38575p780J63083L38153
$$ 763130 654766 631376 640289 614805 555685 359815 16337 -222238 -230018 -66935 271218
21611B71218M32831L85375J92566j46172m27428m78015l65334k91640k21499j28962
$$ 271218 704049 1089424 1281990 1135818 708390 230375 -134959 -426599 -648098 -777060
21601g77060k4729J55077K91041K16463N2497Q120J21828K37381K03067J12088
$$ -777060 -801789 -646712 -355671 -139208 -86711 -78591 43237 280618 483685 595773
21591E95773J33924J58898K2461m9909K8522J31284J13348m077j47563l33112
$$ 595773 729697 888595 911056 861147 889669 1020953 1134301 1130224 982661 649549
21581F49549m59249l54945m0777K47481L62008L10791K19604K31126J19673j09194
$$ 649549 190300 -164645 -205422 42059 404067 714858 934462 1165588 1285261 1176067
21571A176067j67295r5140j09809k20313l53006m70974m84221k76621L1989J66878
$$ 1176067 1008772 913632 803823 583510 230504 -240470 -724691 -1001312 -969323 -802445
21561h02445R5692O0344J77048J85066J5646p8429K0395N1401l1907q7544o1566
$$ -802445 -706753 -646409 -469361 -284295 -268649 -347078 -326683 -275282 -307189 -394733 -456299
21550d56299Q6841K13748R3416o9650L5627K33425L42688M49781M58264K27068
$$ -456299 -369458 -155710 -62294 -131944 -96317 137108 479796 929577 1387841 1614909
21540A614909%r8320j72282k20385k07584j82986j78171j46876q7821m4723j22745
$$ 1614909 1614909 1516589 1344307 1123922 916338 733352 555181 408305 320484 275761 153016
21529A53016k87255l47852j63261K622o5657j19844O0986K81102L49673K06534
$$ 153016 -134239 -482091 -645352 -642730 -708387 -828231 -767245 -486143 -136470 70064
21519G0064o9427k31316l26082m57018m41177j54439K57644M91576M95796M39779
$$ 70064 637 -230679 -556761 -1013779 -1454956 -1609395 -1351751 -860175 -364379 75400
21509G5400M09216K87203P3538q3689j22857l9035o9400k71105m02868l20900
$$ 75400 484616 771819 845357 761668 638811 599776 530376 259271 -143597 -464497
21499d64497l9421K45067L39070L16591L19960K53047P1814m4367o4512N740J75846
$$ -464497 -503918 -258851 80219 396810 716770 969817 1041631 997264 932752 938492 1114338
21488A114338J85198p5582l34282l54424k34752j74478j38237q7765m7585O2261
$$ 1114338 1299536 1223954 889672 535248 300496 126018 -12219 -99984 -147569 -85308
21478h5308K05768J43306j31409l41909l39908j21223J41094K44409J56772K1162
$$ -85308 120460 263766 132357 -209552 -549460 -670683 -529589 -285180 -128408 -107246
21468a07246P0960J75572J32964k6600j53691j24946j08516k05969j78274n4125
$$ -107246 -36286 139286 272250 245650 91959 -32987 -141503 -347472 -525746 -579871
21458e79871j25934l01775k71542n1283J88835L93375M74782L72072K43742K47071
$$ -579871 -705805 -1007580 -1279122 -1330405 -1141570 -748195 -273413 98659 342401 589472
21448E89472K33003J01115j00648k53371k98486k18995q4851k3353K3775R3517
$$ 589472 822475 923590 822942 569571 271085 52090 -32761 -56114 -32339 61178
21438F1178J40027K1552k21989l58614k34498J05635L43307L09010K57845L59300
$$ 61178 201205 222757 768 -357846 -592344 -486709 -143402 165608 423453 782753
21428G82753L48464J43266j10409l84658m85667k82946L9331L15596M18361K66342
$$ 782753 1131217 1274483 1164074 779416 293749 10803 50134 365730 784091 1050433
21418A050433J0464p5741L5691J05452O6898J07918K63782L71926L07179J71198
$$ 1050433 1060897 985156 1020847 1126299 1193197 1301115 1564897 1936823 2244002 2415200
21408B415200J16981P2155r578l8481N304K2335j9578p0528j86352l38616m08109
$$ 2415200 2532181 2604336 2594758 2556277 2561581 2583916 2564338 2493810 2307458 1968842 1560733
21397A560733n16914o90350p45408o00413l24362l818K47909L39238K93845K10967
$$ 1560733 1043819 353469 -391939 -992352 -1316714 -1320532 -1072623 -733385 -439540 -228573
21387b28573J76575J83866J36620j5475k02806l57742m10504l24755k32674j93754
$$ -228573 -51998 131868 268488 253013 50207 -307535 -718039 -1042794 -1275468 -1469222
21377a469222j71386j31672m7093P3363K36983M19677M14408J85061N1775J99008
$$ -1469222 -1640608 -1772280 -1819373 -1746010 -1509027 -1089350 -674942 -489881 -438106 -239098
21367b39098L14849K18209N3743P922M3247L2078n2046j45429j92377k67868k73188
$$ -239098 75751 293960 347703 355625 398872 430950 378904 233475 41098 -226770 -499958
21356d99958k03608j63253r9821M1889K75206N19306N69364L42911L4481j52351
$$ -499958 -703566 -866819 -966640 -924751 -649545 -130239 439125 782036 816517 664166
21346F64166k68117l31683l33785l25295m14226m79197k69607L0548J78427K53074
$$ 664166 396049 64366 -269419 -594714 -1008940 -1488137 -1757744 -1727196 -1548769 -1295695
21336a295695K63808J88672J13278M5611n4485n9276M7756J02857Q7537j1983
$$ -1295695 -1031887 -843215 -729937 -684326 -738811 -798087 -750331 -647474 -559937 -571920
21326e71920j27662j93395j84778k02695k83644j76075O8173L08080M82099M38657
$$ -571920 -699582 -892977 -1077755 -1280450 -1564094 -1740169 -1671996 -1363916 -881817 -443160
21316d43160L68354M26334M85858M51170K74144N8489j13380k26271k41472j52499
$$ -443160 -74806 351528 837386 1288556 1562700 1621189 1507809 1281538 1040066 887567
21306H87567j6737J07699J70285P2495j09278k36389k96349k36189k39952k42398
$$ 887567 870830 978529 1148814 1221309 1112031 875642 579293 343104 103152 -139246
21296a39246n8118R1918J48937J98578J78822N4734j12158j36478L0365J16671
$$ -139246 -197364 -105446 43491 242069 420891 475625 363467 226989 257354 374025
21286C74025j3612k32913l63965k77067k2069K12443L07350K20084J9604m8252
$$ 374025 360413 127500 -236465 -513532 -535601 -323158 -15808 204276 223880 175628
21276A75628J5356L9094k3521n8215J0348J22965K27912K39242O7913r2194j26107
$$ 175628 190984 230078 206557 148342 158690 281655 509567 748809 816722 724528 598421
21265E98421o6713P4772J99204K76200K70525J42774M8921L941o8751j63849k04192
$$ 598421 531708 606480 805684 1081884 1352409 1495183 1544104 1548045 1479294 1315445 1111253
21254A111253j36358j7506Q8262J72741K44426L30190L09191O9197j71316k33546
$$ 1111253 974895 957389 1045651 1218392 1462818 1793008 2102199 2171396 2000080 1766534
21244A766534j57913K1920J41847N998j78814k34738j45090l5828m3164j10751
$$ 1766534 1608621 1630541 1772388 1778386 1599572 1364834 1219744 1183916 1140752 1030001
21234A030001r4414Q6931L08713K91776l0560l53554l05757K6484K71165K84254
$$ 1030001 935587 1022518 1331231 1623007 1592447 1238893 933136 959620 1230785 1515039
21224A515039K33035J45954m3078j11315J09379L06054K39381N9691n8813r7182
$$ 1515039 1748074 1894028 1850950 1739635 1849014 2155068 2394449 2454140 2395327 2298145
21214B298145j68390k68776k66737k45098k27839j20197Q236p450j81005l27471
$$ 2298145 2129755 1860979 1594242 1349144 1121305 1001108 1009344 1001894 820889 493418
21204D93418k71855M582L28415M12551J79496K1607O1077J08666Q7146J7352J1014
$$ 493418 221563 226145 554560 967111 1146607 1168214 1229291 1337957 1425103 1442455 1453469
21193A453469R7294J12131j3430j20318j18441n1106Q2738K43165L28128L23223
$$ 1453469 1550763 1662894 1649464 1529146 1410705 1359599 1442337 1685502 2013630 2336853
21183B336853K11561O0389p2733k85397m32351l55245k71907l56864m87023n20880
$$ 2336853 2548414 2608803 2536070 2250673 1818322 1463077 1191170 834306 347283 -173597
21173a73597m20809k07800n757L5860j17935j78048L3869K76052L43669L18984
$$ -173597 -594406 -802206 -807963 -772103 -890038 -1068086 -1034217 -758165 -414496 -95512
21163i5512K58382J83605R3525n9754j92646j34209l0716m2955q5358j22495j20089
$$ -95512 162870 346475 440000 380246 187600 53391 22675 -20280 -105638 -228133 -348222
21152c48222j43530k42891j88040P2773K36082J19769j63806m06291l93566j63871
$$ -348222 -491752 -734643 -922683 -849910 -613828 -494059 -657865 -1064156 -1457722 -1621593
21142a621593r745L3478J26071K46225K45344P1722j18665j50697n6879R8580
$$ -1621593 -1631338 -1597860 -1471789 -1225564 -980220 -908498 -1027163 -1177860 -1234739 -1136159
21132a136159L03741L91323L28129K42823K36625K30944J30934L1596k4716J7095
$$ -1136159 -832418 -441095 -112966 129857 366482 597426 728360 759956 735240 752335
21122G52335J74404K43251J02596l7805l4482N1293J38351J81902J79866J17644
$$ 752335 926739 1169990 1272586 1234781 1200299 1251592 1389943 1571845 1751711 1869355
21112A869355J023j15638j52595j31729l8375N2875J9451r1493k24582k90875
$$ 1869355 1870378 1754740 1602145 1470416 1432041 1484916 1504367 1412874 1188292 897417
21102H97417k98726k97673k60414k27277j14518K0157q712j50792k51750k87021
$$ 897417 598691 301018 40604 -186673 -301191 -281034 -289746 -440538 -692288 -979309
21092i79309j94298N1622K28880K09143J88113K30015J28697l0062L260J55620
$$ -979309 -1173607 -1121985 -893105 -683962 -495849 -265834 -137137 -167199 -163939 -8319
21082h319K15307J83210J83316K03395J33559k6795j82196k82369l40583l43244
$$ -8319 206988 390198 573514 776909 910468 883673 701477 419108 78525 -264719
21072b64719k20902l9583J07915K28179K55546N1374k29294l99463l09274o647
$$ -264719 -485621 -525204 -417289 -189110 66436 117810 -111484 -510947 -820221 -826868
21062h26868J43672K3026r8116N4740L05875M16886L88301K59442L8730j60997
$$ -826868 -683196 -660170 -758286 -703546 -397671 19215 407516 666958 705688 544691
21052E44691l33371m91823n09627m20914l47204j64358J56771L88315L65122K19330
$$ 544691 211320 -280503 -790130 -1211044 -1558248 -1722606 -1565835 -1177520 -812398 -593068
21042e93068Q1906j05989k53373j68963O9785K18345J83205J40814K11380L44072
$$ -593068 -511162 -617151 -870524 -1039487 -969702 -751357 -568152 -427338 -215958 128114
21032A28114L89036K52712O3962m8448j4451L9264n8400j94425j41280K9787J22033
$$ 128114 517150 769862 833824 785376 770925 810189 751789 557364 416084 445871 567904
21021E67904J35877K00772K50222J42347R81j30552k74190m45712o16622n75312
$$ 567904 703781 904553 1154775 1297122 1298103 1167551 893361 447649 -168973 -744285
21011g44285k37688M9591J75556K02656J77735J73265K86610M48851L24408n4741
$$ -744285 -981973 -932382 -756826 -554170 -376435 -203170 83440 532291 856699 801958
21001H01958l49424l42577j05299M9692J69308L36937L47931J72839l7329k01451
$$ 801958 452534 109957 4658 54350 223658 560595 908526 1081365 1044036 842585
20991H42585k92253k84351j93937R487K23806K81586J75611K6990r8513j42151
$$ 842585 550332 265981 72044 81531 305337 586923 762534 789524 691011 548860
20981E48860l9029J20989K76085M16524N15878L97812J01254n1830l7127l1728
$$ 548860 509831 630820 906905 1323429 1839307 2237119 2338373 2286543 2249416 2217688
20971B217688q8892j78232k67984l70218l93745k62857j26249r4436p832R9034
$$ 2217688 2128796 1950564 1682580 1312362 918617 655760 529511 435075 427243 526277
20961E26277J37792J45266M5864j25779k13562k23280j64315n8108J76561L72985
$$ 526277 664069 809335 855199 729420 515858 292578 128263 70155 246716 619701
20951F19701K81412M9156r552J04991J61270j6955l55357n41577m64391k33193
$$ 619701 901113 950269 940717 1045708 1206978 1190023 834666 293089 -171302 -404495
20941d04495l2810K3345J8941Q5647J54416J26290J04651N2430l3028M9139K08827
$$ -404495 -437305 -413960 -395019 -309372 -154956 -28666 75985 128415 95387 144526 353353
20930C53353K76929K68074J89316J39125J82431J24992r597j49210k00182p7425
$$ 353353 630282 898356 1087672 1226797 1409228 1534220 1524623 1375413 1175231 1097806
20920A097806J05258J89761K11891K35237K05542K25732K81667K67428J95503
$$ 1097806 1203064 1392825 1604716 1839953 2045495 2271227 2552894 2820322 3015825
20911C015825L8401j47737j83165l1872J09757P1110j57126k48963k6503K08273
$$ 3015825 3054226 2906489 2723324 2691452 2801209 2872319 2715193 2466230 2439727 2648000
20901B648000K55919K26200K10422J47665k8907k15849k12655L3868L24515N35703
$$ 2648000 2903919 3130119 3340541 3488206 3459299 3243450 3030795 3064663 3389178 3924881
20891C924881O03942N75181N38685N29722N66033O52220P93572J011905J274514
$$ 3924881 4528823 5104004 5642689 6172411 6738444 7390664 8184236 9196141 10470655
20882A0470655J511232J802062K174521K412022K467162K366927K025425J320204
$$ 10470655 11981887 13783949 15958470 18370492 20837654 23204581 25230006 26550210
20874B6550210L05726o84925j353331j709548j836665j758011j638185j559526
$$ 26550210 26855936 26171011 24817680 23108132 21271467 19513456 17875271 16315745
20866A6315745j468125j248318r32352o70943n11997l58737r4015K51161N43724
$$ 16315745 14847620 13599302 12666950 11996007 11484010 11125273 11031258 11282419 11826143
20857A1826143P39404Q51280Q92808J012181J211785J349445J383373J402367
$$ 11826143 12565547 13416827 14309635 15321816 16533601 17883046 19266419 20668786
20849B0668786J466092J469454J285953P01535j81674j040373j710058k070310
$$ 20668786 22134878 23604332 24890285 25591820 25410146 24369773 22659715 20589405
20841B0589405k137585k090972k063920k027358j979072j856121j483813r09582
$$ 20589405 18451820 16360848 14296928 12269570 10290498 8434377 6950564 6040982
20833F040982m40577j64814o3909j79167l45981m47061n42856o03690n08017l33231
$$ 6040982 5600405 5435591 5371682 5192515 4846534 4399473 3856617 3252927 2744910 2411679
20823B411679j63939R3045L33890M76529M80731K84726M3254j51122k74802k94830
$$ 2411679 2247740 2340785 2674675 3151204 3631935 3916661 3959915 3808793 3533991 3239161
20813C239161k34887k24965k57569k65181j25871J42694K15667M5704l3200M4044
$$ 3239161 3004274 2779309 2521740 2256559 2130688 2273382 2489049 2534753 2501553 2545597
20803B545597M8384j16133l89890n99550n24814k34118Q9292L73978M57294L45181
$$ 2545597 2593981 2477848 2087958 1488408 963594 729476 818768 1192746 1650040 1995221
20793A995221K05596J67653J68105J64015J74968O3591j13730j31649n9626J1598
$$ 1995221 2200817 2368470 2536575 2700590 2875558 2939149 2825419 2693770 2634144 2645742
20783B645742k14j19314j39847r799M8461n1579j71236k64128m38052n71878m67465
$$ 2645742 2645528 2526214 2386367 2376568 2425029 2373450 2202214 1938086 1500034 928156 460691
20772D60691k26291j25567j34384n8523J49823L50454L79816K93485K02248R3572
$$ 460691 234400 108833 -25551 -84074 65749 416203 796019 1089504 1291752 1385324
20762A385324p0552k15122j23425N1203J9064o6104p8203j8474J20995J73623
$$ 1385324 1314772 1099650 976225 1027428 1046492 980388 902185 883711 1004706 1178329
20752A178329J84071K53111K49301J94644J47145R9081N7851J5924l716l2767
$$ 1178329 1362400 1615511 1864812 2059456 2206601 2305682 2363533 2379457 2375741 2342974
20742B342974r7293j00617o4436j39566j65513m3761J4084Q1551K04575J53146
$$ 2342974 2245681 2145064 2080628 1941062 1775549 1731788 1745872 1827423 2031998 2185144
20732B185144k2261j47053k87195l90905l52155j98545r9633j00781j20572k06338
$$ 2185144 2162883 2015830 1728635 1337730 985575 787030 687397 586616 466044 259706
20722B59706k32818j68718j06746n7977j45735l22505l41830j24472J19745K37784
$$ 259706 26888 -141830 -248576 -306553 -452288 -774793 -1116623 -1241095 -1121350 -883566
20712h83566K39612J11860k821q6768k30701k50157o0594J20326J82009J48117
$$ -883566 -643954 -532094 -534915 -621683 -852384 -1102541 -1163135 -1042809 -860800 -712683
20702g12683O4051P932m6418j90289l44068l52235k46278j48246O133K68615L98021
$$ -712683 -648632 -640700 -687118 -877407 -1221475 -1573710 -1819988 -1968234 -1962101 -1693486 -1295465
20691a295465L70247L14437J92382M3539n521l2916j24798j40326o3123j06249
$$ -1295465 -925218 -610781 -418399 -374860 -380381 -413297 -538095 -678421 -741544 -847793
20681h47793j08939P0194L45858N06441L99747J57376r7880k42940k87017k58641
$$ -847793 -956732 -886538 -540680 -34239 365508 522884 425004 182064 -104953 -363594
20671c63594j17943m7952q3373j13453p1772l349n625q2085k12992k78160j43964
$$ -363594 -481537 -529489 -612862 -726315 -798087 -801436 -807061 -889146 -1102138 -1380298 -1524262
20660a524262R9661K58126K60955J39747O1134J53566L15829L50648J88082r1611
$$ -1524262 -1424601 -1166475 -905520 -765773 -704639 -551073 -235244 115404 303486 211875
20650B11875l80954n18522m46559k64169J6432K78816L92888L16598J39248J2967
$$ 211875 -169079 -687601 -1134160 -1398329 -1381897 -1103081 -710193 -393595 -254347 -241380
20640b41380j03656j92494j13285N5361J36107J56287R6563o1467j71638p9407
$$ -241380 -345036 -537530 -650815 -595454 -459347 -303060 -206497 -267964 -439602 -519009
20630e19009J33535K43138K86413L34387L15907J97078O7193J5851L6045j9167
$$ -519009 -385474 -142336 144077 478464 794371 991449 1058642 1074493 1110538 1091371
20620A091371k03999l30531k52804j93324k74774k30895K5278K31822K13032L6762
$$ 1091371 887372 556841 304037 110713 -164061 -394956 -369678 -137856 75176 111938
20610A11938j34911j08145l7263q6247o0658L801k9701r8179j07285l1795M8658
$$ 111938 -22973 -131118 -168381 -254628 -315286 -311485 -341186 -439365 -546650 -578445 -529787
20599e29787J33724K33801L38893L79355K74042J10691J8055N2950Q1169N8302
$$ -529787 -396063 -162262 176631 555986 830028 940719 958774 1011724 1092893 1151195
20589A151195N4713P9699Q7176Q2278Q0479j5425p8591m3448J7911J33199J89875
$$ 1151195 1205908 1285607 1372783 1455061 1535540 1520115 1441524 1398076 1415987 1549186 1739061
20578A739061J02717m3978j03184n7868J8901Q5823J25703J25987J23036P6931
$$ 1739061 1841778 1797800 1694616 1636748 1655649 1741472 1867175 1993162 2116198 2193129
20568B193129J9748n785m3128n2632n3217j08934j93088k24205j75325k11314
$$ 2193129 2212877 2207092 2163964 2111332 2058115 1949181 1756093 1531888 1356563 1145249
20558A145249l23351l26253k69409k73197k52010o7330J51135J76542M8096q1805
$$ 1145249 821898 495645 226236 -46961 -298971 -366301 -215166 -38624 9472 -72333
20548g2333j39261k9052J96579L79611L19928O9434p1416M9361K57780L01493
$$ -72333 -211594 -240646 -44067 335544 655472 724906 653490 702851 960631 1262124
20538A262124J62180j3505j14547j41964k01848k97715l99249m16137k65078o1166
$$ 1262124 1424304 1410799 1296252 1154288 952440 654725 255476 -160661 -425739 -486905
20528d86905P0068O5683J3721M4384J54550K60093L37520L69780J85213j39883
$$ -486905 -416837 -351154 -337433 -293049 -138499 121594 459114 828894 1014107 874224
20518H74224l48129l81887k67866o2897J02889J56527J13901O5625P2986L4904
$$ 874224 526095 144208 -123658 -186555 -83666 72861 186762 252387 325373 360277
20508C60277j72698m92483o74954n81436l24880o7017R4718K65708M90669O33902
$$ 360277 187579 -304904 -979858 -1561294 -1886174 -1953191 -1858473 -1592765 -1102096 -468194
20498d68194N67781L35456J74337J21686Q4038J24330O7519k14897l85507l41265
$$ -468194 99587 435043 609380 731066 815104 939434 1006953 792056 406549 65284
20488F5284l20094k91307j69238q4434r7665j38106r1056N2458J77108K10819
$$ 65284 -254810 -546117 -715355 -799789 -897454 -1035560 -1126616 -1074158 -897050 -686231
20478f86231Q7002m4868j8631j0895m3438Q7292L91621N10757K74429l2441j20383
$$ -686231 -599229 -644097 -662728 -673623 -717061 -629769 -238148 272609 547038 514597 394214
20467C94214p3598j21026j86809p8428J03445J91074J90636J32192P3084J03432
$$ 394214 320616 199590 12781 -65647 37798 228872 419508 551700 624784 728216
20457G28216J35790L882j76985j42034L5691J62048K39846K43056K11150J11209
$$ 728216 864006 867888 690903 548869 584560 746608 986454 1229510 1440660 1551869
20447A551869o5796q7987R2329J27279j07012l97467m71464l18772j11453K2512
$$ 1551869 1486073 1398086 1490415 1617694 1510682 1113215 641751 322979 211526 234038
20437B34038J33955K51730K68439K13125J32550M8361k1305l4179M0005J00794
$$ 234038 367993 619723 888162 1101287 1233837 1282198 1260893 1226714 1266719 1367513
20427A367513J35610J14267j6372j52137j81743j30124r4903j68422k22061j22480
$$ 1367513 1503123 1617390 1601018 1448881 1267138 1137014 1042111 873689 651628 529148
20417E29148J6386O8515P6350O4671O086o2702j43686j63131j37925n9638N5143
$$ 529148 545534 614049 690399 755070 761156 698454 554768 391637 253712 194074 249217
20406B49217K09656M23412N51464N10397K45581o0295k17151k20996k37178k93080
$$ 249217 458873 882285 1433749 1944146 2189727 2129432 1912281 1691285 1454107 1161027
20396A161027l19121l61386l37182r1387K51254M49762M52827L40317K34644J01609
$$ 1161027 841906 480520 143338 51951 303205 752967 1205794 1546111 1780755 1882364
20386A882364o9825k20752l19316l41142k43607p8125Q4228K05215K33808J06493
$$ 1882364 1812539 1591787 1272471 931329 687722 609597 693825 899040 1132848 1239341
20376A239341j54929m41220n87410n21328k24192J05382K60145K34249K18556
$$ 1239341 1084412 643192 55782 -465546 -689738 -584356 -324211 -89962 128594
20367A28594L39905M34563L39882J83439J0631j49446j42808j27366k32749k28064
$$ 128594 468499 903062 1242944 1426383 1437014 1287568 1144760 1017394 784645 556581
20357E56581q6128M0939P3555J2262J0964J04300K8283j35072j27547K1639R6913
$$ 556581 470453 511392 584947 597209 608173 712473 740756 605684 478137 499776 596689
20346E96689M9418O6978R9494k1124k34323l83270l24733n6806K59564M58832
$$ 596689 646107 713085 812579 791455 557132 173862 -150871 -207677 51887 510719
20336E10719M54675L78746K32210Q3547R2503J19395P0134r4734l20953n60593
$$ 510719 965394 1344140 1576350 1659897 1752400 1871795 1941929 1847195 1526242 965649
20326I65649o69189n27354k23296P7245K40578K54073J53247J14962J38453R2037
$$ 965649 296460 -230894 -454190 -376945 -136367 117706 270953 385915 524368 616405
20316F16405M7009N5154Q7294J01719L2427l0662L1806R0151J32323K17939J92805
$$ 616405 663414 718568 805862 907581 940008 909346 941152 1031303 1163626 1381565 1574370
20305A574370L3674j94377l57894m17823m30554m19142l78036k69631l0799K26102
$$ 1574370 1608044 1413667 1055773 637950 207396 -211746 -589782 -859413 -890212 -664110
20295f64110K82216K26632J81672J15545m6285j35793o369J49180J47859J12066
$$ -664110 -381894 -155262 26410 141955 95670 -40123 -46492 102688 250547 362613
20285C62613J31387J39764J43995P1062j68323l72694k86965n8521K12019M29804
$$ 362613 494000 633764 777759 848821 680498 307804 20839 -37682 174337 604141
20275F04141M33300K54500J37294J86826K01638J40559K4947j40884k24040k09677
$$ 604141 1037441 1291941 1429235 1616061 1817699 1958258 1983205 1842321 1618281 1408604
20265A408604j78334j37951q8257o4871r4195k26257l64559l55239k26500o1734
$$ 1408604 1230270 1092319 1004062 939191 844996 618739 254180 -101059 -327559 -389293
20255c89293R1143K45160K97887L15968M04924M50811L87411K06336j367j30735
$$ -389293 -298150 -52990 244897 560865 965789 1416600 1804011 2010347 2008980 1878245
20245A878245k76547m25417m06964l05920j98878n6266J16938L18231M45333M52661
$$ 1878245 1601698 1176281 769317 463397 264519 208253 325191 643422 1088755 1541416
20235A541416M97758N30620L96184J33071j45885l46733m14633k64745M6426K29333
$$ 1541416 2039174 2569794 2965978 3099049 2953164 2606431 2191798 1927053 1973479 2202812
20225B202812K19662K30044K79783J83150J8668Q718R5257K03758L81759N17342
$$ 2202812 2422474 2652518 2932301 3115451 3134119 3142837 3238094 3441852 3823611 4340953
20215D340953M48978K07393n9729k44440k90314j60493l6968l2984j4O0925L915
$$ 4340953 4789931 4997324 4937595 4693155 4402841 4242348 4205380 4172396 4172382 4233307 4237222
20204D237222j65493k87393k87034k19306j41346o1034R2502K59154L10011L05813
$$ 4237222 4071729 3784336 3497302 3277996 3136650 3075616 3168118 3427272 3737283 4043096
20194D043096L74488L77374J84800j09519l25539l38611k34840j81601k31729
$$ 4043096 4417584 4794958 4979758 4870239 4544700 4206089 3971249 3789648 3557919
20185C557919k18277q9424J1156Q4201N0058j22501j52915L3693J32324K1996
$$ 3557919 3339642 3250218 3261374 3345575 3395633 3273132 3120217 3153910 3286234 3308230
20175C308230l4540P8616K20116K32810J42840L4327n3309j14203k16846l11889
$$ 3308230 3273690 3352306 3572422 3805232 3948072 3982399 3929090 3814887 3598041 3286152
20165C286152l18681l12374k54662j43825j32826j75275j7882L27296M90332L02626
$$ 3286152 2967471 2655097 2400435 2256610 2123784 1948509 1930627 2257923 2748255 3050881
20155C050881L6470p1339q707O0975J23233K35635K65552K15111M8680j25361
$$ 3050881 3087351 3016012 3007305 3068280 3191513 3427148 3692700 3907811 3956491 3831130
20145C831130k23087l11611k49877N0854L87846M56621J62263k44018m02158k95441
$$ 3831130 3608043 3296432 3046555 3097409 3485255 3941876 4104139 3860121 3457963 3162522
20135C162522j92362j45971j17065j51397j46775r4235n7921m5210q1427j71768
$$ 3162522 2970160 2824189 2707124 2555727 2408952 2314717 2256796 2211586 2130159 1958391
20125A958391k42731k13263k339K36289L01348J80394m5331j81687n0824J21574
$$ 1958391 1715660 1502397 1500058 1736347 2037695 2218089 2172758 1991071 1940247 2061821
20115B061821J97845L79715N60587N25154L64182K36182J60453J94156K80133
$$ 2061821 2259666 2639381 3199968 3725122 4089304 4325486 4485939 4680095 4960228
20106D960228K07542M252j06934j22095p3586L0544J81964L44991L87278L80828
$$ 4960228 5167770 5172022 5065088 4942993 4869407 4899951 5081915 5426906 5814184 6195012
20096F195012L33540J42123m1081k10841m21555m50463l37055k64617k39421r6400
$$ 6195012 6528552 6670675 6629594 6418753 5997198 5546735 5209680 4945063 4705642 4609242
20086D609242J22299K54990M19891O12436P43232Q21936Q14925Q22900Q32506
$$ 4609242 4731541 4986531 5406422 6018858 6762090 7584026 8398951 9221851 10054357
20077A0054357P37503N08444J81026r2348k96206m30300m37177k67159P4299L69257
$$ 10054357 10791860 11300304 11481330 11388982 11092776 10662476 10225299 9958140 10032439 10401696
20067A0401696M08734L76432M52676O09848O37963L98757J11160o96N6642J2891
$$ 10401696 10810430 11186862 11639538 12249386 12887349 13286106 13397266 13396570 13453212 13466103
20057A3466103j22857j0342K55084L18672J97633Q1471L1127J16623L73997O95841
$$ 13466103 13343246 13332904 13587988 13906660 14104293 14185764 14216891 14333514 14707511 15403352
20047A5403352J016392J282758J391841J389838J395551J440288J448690J443793
$$ 15403352 16419744 17702502 19094343 20484181 21879732 23320020 24768710 26212503
20039B6212503J374622J084641P03703M98801M86363N68961Q19617J378754K126442
$$ 26212503 27587125 28671766 29375469 29874270 30360633 30929594 31749211 33127965 35254407
20030C5254407K795002L199123L412095L694954M171476M804125N555001O388080
$$ 35254407 38049409 41248532 44660627 48355581 52527057 57331182 62886183 69274263
20022F9274263P291496Q227167R139525J0186739J1865598J4535907J7881261
$$ 69274263 76565759 84792926 93932451 104119190 115984788 130520695 148401956
20015A48401956K1242492K3694328K4013117K1354516J6878252J3908503J4548003
$$ 148401956 169644448 193338776 217351893 238706409 255584661 269493164 284041167
20008B84041167J7003011J7901941J5590465J1256058O473912l07619j1161613
$$ 284041167 301044178 318946119 334536584 345792642 352266554 351958935 340797322
20001C40797322k3857059l3093947l6126107l4272895l0014385k5122272k0660054
$$ 340797322 316940263 283846316 247720209 213447314 183432929 158310657 137650603
19994A37650603j7166481j4627410j2678809j1143319r716002q134240o600698
$$ 137650603 120484122 105856712 93177903 82034584 72318582 64184342 57583644
19987E7583644n416119m567132l861976l213942k626630k173431j824074j626351
$$ 57583644 52167525 47600393 43738417 40524475 37897845 35724414 33900340 32273989
19979C2273989j507855j374024j237750j143106j210201j398772j538048j502827
$$ 32273989 30766134 29392110 28154360 27011254 25801053 24402281 22864233 21361406
19971B1361406j353677j255324j093467r00411q53851q66924p47036n83191n25081
$$ 21361406 20007729 18752405 17658938 16758527 15904676 15037752 14290716 13707525 13182444
19962A3182444m46836l10095k07501j19914l9578J3268L1370j8041n0059j1824
$$ 13182444 12735608 12425513 12218012 12098098 12058520 12071788 12103158 12085117 12035058 12023234
19952A2023234P4201J96999K44514K47472L09696L70913K94377J50485k359n4661
$$ 12023234 12097435 12294434 12538948 12786420 13096116 13467029 13761406 13911891 13909532 13854871
19942A3854871q5408k77009l86279k50307m7666P9993Q2125r1271j95242m354
$$ 13854871 13769463 13492454 13106175 12855868 12808202 12888195 12970320 12879049 12683807 12679453
19932A2679453L14599N00639N36914N59671O40320Q03466J046686J283643J369248
$$ 12679453 12994052 13494691 14031605 14591276 15231596 16035062 17081748 18365391 19734639
19923A9734639J146628P37034L17322j29784n36170q54468j017731q59471m47241
$$ 19734639 20881267 21618301 21935623 21805839 21269669 20415201 19397470 18537999 18090758
19914A8090758K3256L74186O23306R27196J224603J291637J084288O01366j89282
$$ 18090758 18114014 18488200 19111506 20038702 21263305 22554942 23639230 24240596 24051314
19905B4051314j023732j587274j812319j642726j307984j072175r63625r23631
$$ 24051314 23027582 21440308 19627989 17985263 16677279 15605104 14641479 13717848
19897A3717848r19173j022260j083033r93664r27442q45829n03081j4919L72047
$$ 13717848 12798675 11776415 10693382 9699718 8772276 7926447 7423366 7408447 7780494
19888G780494O15708O32343M28240J78431p4227l44953m61660m62842n60577o83319
$$ 7780494 8396202 9028545 9456785 9635216 9560989 9216036 8754376 8291534 7730957 7047638
19878G047638o76219n67029l46113o7157M627j63250k64613j95685j21039r1174
$$ 7047638 6371419 5804390 5458277 5391120 5395747 5232497 4967884 4772199 4651160 4559986
19868D559986m5029j20903k52567k80093k26324j33429m5968M9643J35169J77946
$$ 4559986 4514957 4394054 4141487 3861394 3635070 3501641 3455673 3505316 3640485 3818431
19858C818431J37937r590j86501j86310j02538l9976J39171L51612L46997J99350
$$ 3818431 3956368 3946778 3760277 3573967 3471429 3431453 3570624 3922236 4269233 4468583
19848D468583M7762j353N6930J03088J25736J81677J97342J26311P9556P9581
$$ 4468583 4516345 4514992 4571922 4675010 4800746 4982423 5179765 5306076 5385632 5465213
19838E465213O1881L9412L4401K1670R8946K07543K59888K54772K71019K84205
$$ 5465213 5527094 5566506 5600907 5622577 5721523 5929066 6188954 6443726 6714745 6998950
19828F998950K42036K39141K80528L66879N10396O06600O80828P82371Q92187
$$ 6998950 7240986 7480127 7760655 8127534 8637930 9244530 9925358 10707729 11599916
19819A1599916R42534R64655J015181J112490J297357J320285J014572O27623
$$ 11599916 12542450 13507105 14522286 15634776 16932133 18252418 19266990 19894613
19811A9894613M76600N89009R14885J412299J878952K257063K734080L593600
$$ 19894613 20371213 20960222 21875107 23287406 25166358 27423421 30157501 33751101
19803C3751101M787186O169636P629298Q919733J0036315J0722687R838510O510204
$$ 33751101 38538287 44707923 52337221 61256954 71293269 82015956 91854466 98364670
19795I8364670J080832m861202r228046j0937811j0572514r326418p902457o435142
$$ 98364670 99445502 94584300 85356254 74418443 63845929 54519511 46617054 40181912
19787D0181912m948448l611948k612516k070902j904719j936427k011351k016704
$$ 40181912 35233464 31621516 29009000 26938098 25033379 23096952 21085601 19068897
19779A9068897j837375j595469j478810j433915j301901j131510r52938p07407
$$ 19068897 17231522 15636053 14157243 12723328 11421427 10289917 9336979 8629572
19771H629572m76799l50667l02652l40045m26900m27304l45039k73676k26374
$$ 8629572 8152773 7802106 7499454 7159409 6732509 6305205 5960166 5686490 5460116
19762E460116k32868l18698k92391P1735N00066O05954L54015K6456k53169m80415
$$ 5460116 5227248 4908550 4616159 4687894 5187960 5793914 6147929 6174385 5921216 5440801
19752E440801n12920l96548k59402j54381j93872l17725l60709k46506m2368O8520
$$ 5440801 4927881 4531333 4271931 4117550 3923678 3605953 3245244 2998738 2956370 3024890
19742C024890l0444k24695k57247j47056q7196q3469m5649J0970L1629J7827r4708
$$ 3024890 2994446 2769751 2512504 2365448 2278252 2194783 2149134 2160104 2191733 2209560 2114852
19731B114852l06695l85634j99989Q7375K30809K26133J00195p2123j40976j54789
$$ 2114852 1808157 1422523 1222534 1309909 1540718 1766851 1867046 1794923 1653947 1499158
19721A499158k13129k69553j92061L8717L56738N74698N11310K47129n2645j65125
$$ 1499158 1286029 1016476 824415 863132 1219870 1794568 2305878 2553007 2500362 2335237
19711B335237j48854k39587l76582l52683j78924q02J08576J53169J71093J59932
$$ 2335237 2186383 1946796 1570214 1217531 1038607 1037805 1146381 1299550 1470643 1630575
19701A630575J74182J62092J33987K22974L69476L50154J62282O8657J49002J81435
$$ 1630575 1804757 1966849 2100836 2323810 2693286 3043440 3205722 3274379 3423381 3604816
19691C604816P0015r9269k02903j81769j08246j52312l06159n23852n70101l08295
$$ 3604816 3674831 3575562 3372659 3190890 3082644 2930332 2624173 2100321 1530220 1221925
19681A221925K2705K29434K86483K36991J82170J90356J74198L5231j34995k11902
$$ 1221925 1244630 1474064 1760547 1997538 2179708 2370064 2544262 2579493 2444498 2232596
19671B232596j46035L810N9088J5595l691Q3121K21423K19082R1376J06138L02146
$$ 2232596 2086561 2090371 2149459 2165054 2161363 2244484 2465907 2684989 2776365 2882503 3184649
19660C184649M30284M91664O02901O95973P29782P61967Q91418J030395J089985
$$ 3184649 3614933 4106597 4709498 5405471 6135253 6897220 7788638 8819033 9909018
19651I909018J053309R01685O20520K19073j90089n40970p88970r54577j051386
$$ 9909018 10962327 11864012 12484532 12703605 12513516 11972546 11183576 10228999 9177613
19642I177613r51972o81053l95675k05697j48921j89517k19390j68384j68214
$$ 9177613 8225641 7544588 7148913 6943216 6794295 6604778 6385388 6217004 6048790
19633F048790l25574m89503n19131l72518j30596j3105j14539k95310l90651l88091
$$ 6048790 5723216 5233713 4714582 4342064 4211468 4198363 4083824 3788514 3397863 3009772
19623C009772j83094J58602K71699O403l32989l43109q0724L9510r1127k83217
$$ 3009772 2826678 2985280 3256979 3263382 2930393 2587284 2506560 2546070 2454943 2171726
19613B171726l58007k40397j16337p3008j08503j52220j83792k35645k71967k46849
$$ 2171726 1813719 1573322 1456985 1383977 1275474 1123254 939462 703817 431850 185001
19603A85001j24416J3700J04642J93988L55623L19096l6215k45480j49822m4035
$$ 185001 60585 74285 178927 372915 728538 1047634 1011419 765939 616117 572082
19593E72082j3772O9274J66051J80071J63535J64199J17864m3089k26739l04674
$$ 572082 558310 627584 793635 973706 1137241 1301440 1419304 1376215 1149476 844802
19583H44802k42513j36974r9279n6341R6233K38085J86575L036k2450Q3392O1068
$$ 844802 602289 465315 366036 309695 405928 644013 830588 833624 811174 894566 955634
19572I55634J22712K79770L04121K65346J36152r3454k73243l57724l95258l98934
$$ 955634 1078346 1358116 1662237 1927583 2063735 1970281 1697038 1339314 944056 545122
19562E45122l08406j70795j15376k20801l32601k49979k5403R7333M1022m772
$$ 545122 236716 65921 -49455 -270256 -602857 -852836 -878239 -780906 -739884 -744656
19552g44656R9678L12750L46303Q0486j19229l8219K11180L99203L63759J35922
$$ -744656 -644978 -332228 14075 94561 -24668 -62887 148293 547496 911255 1047177
19542A047177j09671l81691n53889l86741m1062J89153K78725L28372L17476K13478
$$ 1047177 937506 555815 1926 -384815 -425877 -236724 42001 370373 687849 901327
19532I01327R4721K3291L420l1628k02795l70335l09444j47956o0649q7632k26323
$$ 901327 996048 1019339 1022759 991131 788336 418001 108557 -39399 -100048 -187680 -414003
19521d14003k75961j33860M8797J90023K49115K03771K00202L34801M12634J79364
$$ -414003 -689964 -823824 -775027 -585004 -335889 -132118 68084 402885 815519 994883
19511I94883k49111m97998k67561J58450K97827J59600k133L0400K38651L86707
$$ 994883 745772 247774 -19787 138663 436490 596090 593957 624357 863008 1249715
19501A249715L76624J85519m9777j20307r9852j56096k61020k85165k22422k35675
$$ 1249715 1626339 1811858 1762081 1641774 1541922 1385826 1124806 839641 617219 381544
19491C81544l38395l09855j33672m4861r8923j77773j23218P2948J90991J91530
$$ 381544 43149 -266706 -400378 -445239 -544162 -721935 -845153 -772205 -581214 -389684
19481c89684J14043K9331j4698k9333k9072n8554j03326p7816J03240L40913M19742
$$ -389684 -275641 -246310 -261008 -290341 -319413 -377967 -481293 -559109 -455869 -114956 304786
19470C04786L21951J21010k3376n6732m6473O1451K09458K62985K98912L17069
$$ 304786 626737 747747 724371 667639 621166 682617 892075 1155060 1453972 1771041
19460A771041K20134k0716l32570n40864n07894k68448n4092R5311J78646J20846
$$ 1771041 1991175 1970459 1637889 1097025 589131 320683 266591 361902 540548 661394
19450F61394N3322P5494Q9031K4350q3610j32768r9411j1204L9316J6999J21020
$$ 661394 714716 790210 879241 903591 819981 687213 587802 576598 615914 632913 753933
19439G53933L31283L56959J57379n6007l03448n97249p31865o20092l56768n8395
$$ 753933 1085216 1442175 1599554 1543547 1240099 642850 -89015 -709107 -1065875 -1124270
19429a124270Q0441j939r2110p393J98693K49931J12564K0019L5359J26870K68786
$$ -1124270 -1043829 -1045768 -1137878 -1145271 -946578 -696647 -584083 -564064 -528705 -401835 -133049
19418a33049L69925L73036L11138L17581M11226M01746K03397o7600k66515l65339
$$ -133049 236876 609912 921050 1238631 1649857 2051603 2255000 2187400 1920885 1555546
19408A555546l36736j96492o6809M0903J27935J14649k6877j87198k39479k59418
$$ 1555546 1218810 1022318 955509 996412 1124347 1238996 1212119 1024921 785442 526024
19398E26024l68919m82925m20174k29870n8137J06234K65037L19379K49786K07321
$$ 526024 157105 -325820 -745994 -975864 -1034001 -927767 -662730 -343351 -93565 113756
19388A13756K64842K96179J99284R3504Q0434O6087K9022N7354N7886r4712j39221
$$ 113756 378598 674777 874061 967565 1047999 1114086 1143108 1200462 1258348 1163636 1024415
19377A024415P097M4909n7796j09035j22004k32640k70777j11665J46271M00400
$$ 1024415 1031512 1076421 1018625 909590 787586 554946 284169 172504 318775 719175
19367G19175N75870N35183K71590o1232k48610k73529j98628l2561Q5061R701
$$ 719175 1295045 1830228 2101818 2040586 1791976 1518447 1319819 1287258 1372319 1382020
19357A382020j65335k69889k25884j36933p5833q5811m3662N0435N1259N1915
$$ 1382020 1216685 946796 720912 583979 508146 422335 378673 429108 480367 532282
19347E32282J48388K26340J19716o5075n8393J22748K69968K62186J00313j01763
$$ 532282 680670 907010 1026726 961651 903258 1026006 1295974 1558160 1658473 1556710
19337A556710k20853j50751p7880j52691k57033k83858k06610N7130M60830O52412
$$ 1556710 1335857 1185106 1107226 954535 697502 413644 207034 264164 724994 1377406
19327A377406M82385J66809j10281k51744j61575J7480m8170m41055p28659o67926
$$ 1377406 1859791 2026600 1916319 1664575 1503000 1520480 1472310 1031255 302596 -365330
19317c65330m85224l30626j78630j01534n2640J53712M70157P38394P16462L77975
$$ -365330 -850554 -1181180 -1359810 -1461344 -1513984 -1360272 -890115 -151721 564741 942716
19307I42716J18296Q7890R2424M3593j78487m82769n50355k78007J51574M03155
$$ 942716 1061012 1148902 1241326 1284919 1106432 623663 73308 -204699 -53125 350030
19297C50030L38066J33267J1500j711l2273j31468j79383j93224j97168j47920
$$ 350030 688096 821363 832863 831152 798879 667411 488028 294804 97636 -50284
19287e0284p8835j04637j42383n7909N0933J10020J77967K27510R6423j8081J6450
$$ -50284 -129119 -233756 -376139 -434048 -383115 -273095 -95128 132382 228805 210724 227174
19276B27174l7594j65754j32493m745M6022L3830k3470q6149j17027j01190J5738
$$ 227174 189580 23826 -108667 -113412 -67390 -33560 -57030 -143179 -260206 -361396 -345658
19265c45658K33131M91737N23184K45326o3145k43300l22939m03442m99716n17561
$$ -345658 -112527 379210 902394 1147720 1084575 841275 518336 114894 -384822 -902383
19255i02383m16406j46651R1356Q9183P2392K63384M40822L91028K03719Q0999
$$ -902383 -1318789 -1465440 -1374084 -1284901 -1212509 -949125 -508303 -117275 86444 167443
19245A67443R8769J43678R1137j9506k42409m41896m94069l28942O6778M73119
$$ 167443 266212 409890 501027 481521 239112 -202784 -696853 -1025795 -959017 -485898
19235d85898P62001P94552N41182J65697q8885j97615k13631j32037q7789j88882
$$ -485898 276103 1070655 1611837 1777534 1688649 1491034 1277403 1145366 1057577 868695
19225H68695l47560l57875j92704m4389l6705q3394r0338j18410j65038j37842
$$ 868695 521135 163260 -29444 -73833 -110538 -193932 -284270 -402680 -567718 -705560
19215g05560J5963J63350J07136M4415K12277M72599N26317L35973P6788j58825
$$ -705560 -689597 -526247 -419111 -374696 -162419 310180 836497 1172470 1249258 1090433
19205A090433k45570k55253k56954k06266j77747k00008k24898j29089J69734
$$ 1090433 844863 589610 332656 126390 -51357 -251365 -476263 -605352 -435618
19196d35618M36864L91986K07435J19882q934j50852j33287K0593J53366P6065
$$ -435618 1246 393232 600667 720549 711615 560763 427476 448069 601435 677500
19186F77500j33971k35595k24470k24598j68389o2894L5157J31070J97209K29053
$$ 677500 543529 307934 83464 -141134 -309523 -372417 -337260 -206190 -8981 220072
19176B20072K63870L04944J96171n3900j77800n1459J62422K21395O2470j58847
$$ 220072 483942 788886 985057 931157 753357 701898 864320 1085715 1148185 989338
19166I89338k74452l08857l75501l62527k04143p3583J8459K21745L62124K82691
$$ 989338 714886 406029 30528 -331999 -536142 -609725 -591266 -369521 -7397 275294
19156B75294J71170N4492j35736k90523l50610l56642l09482k34438j43643m2809
$$ 275294 446464 500956 365220 74697 -275913 -632555 -942037 -1176475 -1320118 -1362927
19146a362927N4098J79777L85924N59568M81213K45683K9529j48663k58222k79130
$$ -1362927 -1308829 -1129052 -743128 -183560 297653 543336 572865 424202 165980 -113150
19136a13150k63796j62533J238J30523J70325J13985O6652P4561R7406J03493
$$ -113150 -376946 -539479 -538241 -407718 -237393 -123408 -56756 17805 115211 218704
19126B18704R8555l814l06154o84744q09232n60107j83547J08783L44347M69757
$$ 218704 317259 313445 7291 -677453 -1486685 -2046792 -2230339 -2121556 -1777209 -1307452
19116a307452L82643J65629j0683j14749r5302J32869K90299J89149J04r6497
$$ -1307452 -924809 -759180 -769863 -884612 -979914 -847045 -556746 -367597 -367493 -463990
19106d63990o5744N5912K02947L05360L11629K50071K01418J81308J92670K94699
$$ -463990 -529734 -473822 -270875 34485 346114 596185 797603 978911 1171581 1466280
19096A466280L61143K51448J5018k22197k61187j33603P9022J94029R7094l3467
$$ 1466280 1827423 2078871 2093889 1871692 1610505 1476902 1555924 1749953 1847047 1813580
19086A813580j83303m22814o35252o63771m92448k58187l5640J28352K99705M37768
$$ 1813580 1630277 1207463 572211 -91560 -584008 -842195 -877835 -749483 -449778 -12010
19076a2010M02372K88573K46518K16344J22350M2104R5783J82569J03388j07168
$$ -12010 390362 678935 925453 1141797 1264147 1306251 1402034 1584603 1687991 1580823
19066A580823k59814j76219M6766K24501K78365Q4744k43921m77329n94693n95888
$$ 1580823 1321009 1144790 1191556 1416057 1694422 1779166 1535245 1057916 463223 -132665
19056a32665m46638k38762j05536k4802J16343K74223L15383K17514J50500J12124
$$ -132665 -579303 -818065 -923601 -948403 -832060 -557837 -242454 -24940 125560 237684
19046B37684l6314j99859k38900k12528j61111j06658l6238M5009J05370J88121
$$ 237684 201370 1511 -237389 -449917 -611028 -717686 -753924 -708915 -603545 -415424
19036d15424K64214K85061K77947K26761J25202M6355n0879k16436l53831k22553
$$ -415424 -151210 133851 411798 638559 763761 810116 759237 542801 188970 -33583
19026c3583J09326K97911K48059J35003J17663J72531J12347P336j9882j1133
$$ -33583 75743 373654 621713 756716 874379 1046910 1159257 1166593 1146711 1135578
19016A135578J1126P0344J06016L8899n4913j26114j15303K3600J68567K58320
$$ 1135578 1146704 1217048 1323064 1361963 1307050 1180936 1065633 1089233 1257800 1516120
19006A516120K47916J32301N0870J00586J24601k3138k40183l28347k01015K1031
$$ 1516120 1764036 1896337 1947207 2047793 2172394 2149256 1909073 1580726 1379711 1400742
18996A400742L1285j77801l20919k77388k2398K70846L05602J20379l7769j21352
$$ 1400742 1432027 1254226 933307 655919 633521 904367 1209969 1330348 1292579 1171227
18986A171227j43786r1583m0751n3869r6524m6296J02531K11933J14003j47014
$$ 1171227 1027441 935858 895107 841238 744714 698418 800949 1012882 1126885 979871
18976I79871k41787j32370O209R106j2210K1660j3543m9860R769K683p8835r5787
$$ 979871 738084 605714 611923 621029 608819 630479 616936 567076 576845 579528 500693 404906
18964D04906k8056J09370J66001R7966J04472K19588L14898L49042L24796L32285
$$ 404906 376850 486220 652221 750187 854659 1074247 1389145 1738187 2062983 2395268
18954B395268L45162K65113J10739j57675m60501n86889m96693l32540k25334
$$ 2395268 2740430 3005543 3116282 2958607 2498106 1911217 1414524 1081984 856650
18945H56650j93635k27484j98648m7727M5627m233m9107j8079p3252k76943l67564
$$ 856650 663015 435531 236883 189156 234783 230550 181443 163364 90112 -186831 -554395
18934e54395k04332O1344L12125L36161P9519p1555P6180L04232L15729J88013
$$ -554395 -758727 -697383 -385258 -49097 30422 -41133 35047 339279 655008 843021
18924H43021L9035j41311l59988m95705m51782k50966j3782J35931K01064L30062
$$ 843021 882056 740745 380757 -114948 -566730 -817696 -831478 -695547 -494483 -164421
18914a64421N41928O46709M86640K60077J09612j13903l08318k63320n9267P7810
$$ -164421 377507 1024216 1510856 1770933 1880545 1766642 1458324 1195004 1135737 1213547
18904A213547J65347K08693R6371j09804l19891n42804o74355o72813n31512k56263
$$ 1213547 1378894 1587587 1683958 1574154 1254263 711459 37104 -635709 -1167221 -1423484
18894a423484M2286J57237M9418l0411j6070J1702J19687L04613L96370L29501
$$ -1423484 -1381198 -1223961 -1174543 -1204954 -1221024 -1209322 -1089635 -785022 -388652 -59151
18884e9151J39564o2288j32622j30137j08650m2587K4679O5044J60943K55679
$$ -59151 80413 18125 -114497 -244634 -353284 -395871 -371192 -306148 -145205 110474
18874A10474J31660m5226l2938O0486J00368J42997J47282L9225j37326l70034
$$ 110474 242134 196908 163970 224456 324824 467821 615103 654328 517002 146968
18864A46968m92732l68325q2332J92820L89832M82726M48937L71713K82490J92433
$$ 146968 -345764 -714089 -796421 -603601 -213769 268957 717894 1089607 1372097 1564530
18854A564530J89683J86084L3957j48170l10804l97092l28018j38468L3757J40468
$$ 1564530 1754213 1940297 1974254 1826084 1515280 1118188 790170 651702 685459 825927
18844H25927J97767J10748j51517m49574n63148m37139k14383m6628N7435J56022
$$ 825927 1023694 1134442 982925 533351 -29797 -466936 -681319 -727947 -670512 -514490
18834e14490K41305K13459M0336j73273k85172k33404j31818m0009J18082K28160
$$ -514490 -273185 -59726 -19390 -192663 -477835 -711239 -843057 -883066 -764984 -536824
18824e36824K16957J76462R9440J0848k2806o2267j27411j44060j09722L562K12711
$$ -536824 -319867 -143405 -43965 -33117 -55923 -118190 -245601 -389661 -499383 -495821 -283110
18813b83110L65513L41128J49244j396j6904o3614q5115j4279m8269j33688o0796
$$ -283110 82403 423531 572775 571379 554475 490861 405746 391467 343198 209510 148714
18802A48714J10482J72953J45146Q5497Q8949R8620K0402j20851k27621k25509
$$ 148714 259196 432149 577295 662792 751741 850361 870763 749912 522291 296782
18792B96782j36224K236J76883L17389L08567K28629J78909J97814K33570J93149
$$ 296782 160558 162794 339677 657066 965633 1194262 1373171 1570985 1804555 1997704
18782A997704J23355N6624m6727j01652j17166j39259j08471o6673p1765m0412
$$ 1997704 2121059 2177683 2130956 2029304 1912138 1772879 1664408 1597735 1525970 1485558
18772A485558o1021j47915j73321j98884j97788m1738O9042p5338l05502m77538
$$ 1485558 1424537 1276622 1103301 904417 706629 664891 733933 658595 353093 -124445
18762a24445n63333l68667L8979K43677J52768L2761L769m437m4977n0453N6730
$$ -124445 -687778 -1056445 -1017466 -773789 -621021 -588260 -584491 -588928 -633905 -684358 -627628
18751f27628K80858M59846M41138K65565k6147l66006n13846l21704k6530J33143
$$ -627628 -346770 113076 554214 819779 793632 427626 -86220 -407924 -434454 -301311
18741c01311J82916J67968J40329R8675l7722k10755k27146j16253j2193Q0849
$$ -301311 -118395 49573 189902 288577 250855 40100 -187046 -303299 -315492 -234643
18731b34643K23744L05955K56636J68636M396k44327l81917l39040k76845k53026
$$ -234643 -10899 295056 551692 720328 724724 480397 98480 -240560 -517405 -770431
18721g70431j67475O1117K22143J74233M1229L7517J57536K44001K62518L02756
$$ -770431 -937906 -876789 -654646 -480413 -439184 -401667 -244131 -130 262388 565144
18711E65144L51207M08036L75468J64108p4255j95538j94004k05967k16338j50552
$$ 565144 916351 1324387 1699855 1863963 1789708 1594170 1400166 1194199 977861 827309
18701H27309n4100o584p9938k41450l86143m87779m27572j31542J57012K16016
$$ 827309 773209 766625 686687 445237 59094 -428685 -856257 -987799 -830787 -614771
18691f14771J21597Q0517J46685J90082J11688O6681J36220J73425J44380R3584
$$ -614771 -493174 -412657 -265972 -75890 35798 102479 238699 412124 556504 650088
18681F50088J7358o8942j51575j37048l7060J2319J3379L4144Q6404J53092J99822
$$ 650088 667446 598504 446929 309881 272821 285140 298519 332663 419067 572159 771981
18670G71981J72374J51642J96880J95878P5937j28307k42888j83813j21315j57400
$$ 771981 944355 1095997 1292877 1488755 1564692 1436385 1193497 1009684 888369 730969
18660G30969j70140r2819k6720K7297J44293K09156J21386L285j17308k43651
$$ 730969 560829 468010 441290 468587 612880 822036 943422 946707 829399 585748
18650E85748k30090j58910j93163l07037l99288k75796R0261K68172M2456j83337
$$ 585748 355658 196748 3585 -303452 -702740 -978536 -888275 -620103 -577647 -760984
18640g60984p4130K34509M53831M92785L88820K53095O7528j11570j05368N8267
$$ -760984 -835114 -600605 -146774 346011 734831 987926 1055454 943884 838516 896783
18630H96783J64907N3320j28155j93235j34107K7586J65622J91299J21790m8590
$$ 896783 1061690 1115010 986855 793620 659513 687099 852721 1044020 1165810 1117220
18620A117220k50061k91588j23516Q1840J63503N2747j12047j16844K2778J31089
$$ 1117220 867159 575571 452055 533895 697398 750145 638098 521254 544032 675121
18610F75121J45499Q5471m6656j74589j87945p6960K2522n4581j76496k38141
$$ 675121 820620 906091 859435 684846 496901 419941 442463 387882 211386 -26755
18600b6755k71975k96583k82418k44574n9540L38246O40925O55214M36197J35868
$$ -26755 -298730 -595313 -877731 -1122305 -1181845 -843599 -202674 452540 888737 1024605
18590A024605q1551j73208j74800j11460q3721r8417p1875j37970k98909l64407
$$ 1024605 943054 769846 595046 483586 399865 301448 229573 91603 -207306 -571713
18580e71713k54968J2326K01978J21549p4457k14620l09914k21516P3303K74971
$$ -571713 -826681 -814355 -612377 -490828 -565285 -779905 -1089819 -1311335 -1238032 -963061
18570i63061J76167Q845L532L4535n608l9454P0324J83051J61694J19394L6982
$$ -963061 -786894 -778049 -774517 -739982 -745590 -785044 -714720 -531669 -369975 -250581 -213599
18559b13599o9557j35090j14834N962J01399J27413J33400J76756K11826L9366
$$ -213599 -283156 -418246 -533080 -527118 -425719 -298306 -164906 11850 223676 263042
18549B63042j61935j50309m3645k0363m4870j3010k2647j62327k49868j49764
$$ 263042 101107 -49202 -92847 -113210 -158080 -171090 -193737 -356064 -605932 -755696
18539g55696L9160J79443L02298M92532N81893M14484J86023O0723l438l8588
$$ -755696 -716536 -537093 -234795 257737 839630 1254114 1440137 1500860 1497422 1458834
18529A458834j80615l06541j63230M9719R1838j5691r5711J2995K34740K70856
$$ 1458834 1278219 971678 808448 858167 950005 934314 838603 851598 1086338 1357194
18519A357194k5650l90966n22394m39521k64864q4522j2763r098K6927j157j77801
$$ 1357194 1331544 940578 418184 -21337 -286201 -370723 -383486 -392584 -365657 -366814 -544615
18508e44615l05515k40163j17534m7947J2328J32141K56024L07858J91802K9936
$$ -544615 -850130 -1090293 -1207827 -1255774 -1243446 -1111305 -855281 -547423 -355621 -325685
18498c25685P2863J77594J57982J57292K66540K58523Q5043j06304k22901k83938
$$ -325685 -252822 -75228 82754 240046 506586 765109 850152 743848 520947 237009
18488B37009l76200l59570j71363n4238m9048m8994Q1701K42003L02113L39725
$$ 237009 -139191 -498761 -670124 -724362 -773410 -822404 -740703 -498700 -196587 143138
18478A43138K92771J16753p3407k36590l79029l96448k92686j73131k8315J26427
$$ 143138 435909 552662 479255 242665 -136364 -532812 -825498 -998629 -1026944 -900517
18468i00517J95809J35242N543k6656Q1927K55310L73174L29719J95481R1737
$$ -900517 -704708 -569466 -563923 -590579 -508652 -253342 119832 449551 645032 736769
18458G36769N5563O1931N3664n6710k29143k63893k08555k03430j78727o4859
$$ 736769 792332 854263 907927 851217 622074 358181 149626 -53804 -232531 -297390
18448b97390O7285J71833L26252M85389M68816K64227M9915r9547k13279k40342
$$ -297390 -230105 -58272 267980 753369 1222185 1486412 1536327 1436780 1223501 983159
18438I83159k23723j96499j57870j91204k97142l69751l17904j00974J50739J68313
$$ 983159 759436 562937 405067 213863 -83279 -453030 -770934 -871908 -721169 -552856
18428e52856J8631M836J46042K99595L26140J45821q2609k84661m58753n29386
$$ -552856 -534225 -529389 -383347 -83752 242388 388209 305600 20939 -437814 -967200
18418i67200l11881O6020K96174K81456L2738k31040k53006j13664m3683M2154
$$ -967200 -1279081 -1213061 -916887 -635431 -602693 -833733 -1086739 -1200403 -1244086 -1201932
18408a201932J79905L52735N60888O33770L86711j6618l57575n36844m69807j99304
$$ -1201932 -1022027 -669292 -108404 525366 912077 895459 537884 1040 -468767 -668071
18398f68071Q1448J46482Q3065J04696J57418J73399Q8085j28046k60059k39200
$$ -668071 -586623 -440141 -357076 -252380 -94962 78437 166522 38476 -221583 -460783
18388d60783j25419R6174L03012L62868K15110n1945k42625k87270q1445K54803
$$ -460783 -586202 -490028 -187016 175852 390962 339017 96392 -190878 -272323 -17520
18378a7520K61096J1160j15715o0898Q0575K76220M14012L07508J65287J93869
$$ -17520 243576 254736 139021 78123 158698 434918 848930 1156438 1321725 1515594
18368A515594J86346J02798J10226J19190m0986k54170l04969k37358j85975k08519
$$ 1515594 1701940 1804738 1914964 2034154 1993168 1738998 1434029 1196671 1010696 802177
18358H02177k98494l28304j65271K479J108K8420J10649J57858J72411J11523
$$ 802177 503683 175379 10108 12587 13695 42115 152764 310622 483033 594556
18348E94556j0724j08536j77903j64153j73327k49717k54673j95751q9600J4373
$$ 594556 583832 475296 297393 133240 -40087 -289804 -544477 -740228 -829828 -815455
18338h15455J19178J14801k5521j01190k5786J04630J46181L4044j72528l66392
$$ -815455 -696277 -581476 -606997 -708187 -733973 -629343 -483162 -449118 -621646 -988038
18328i88038m42485l70780j36275K33921N59975O60799N60908L02326p7829l52057
$$ -988038 -1430523 -1801303 -1937578 -1703657 -1143682 -482883 78025 380351 302522 -49535
18318d9535l24750q5668O5182L5940k0471j02035k09765j98574N821L26581N67326
$$ -49535 -374285 -459953 -394771 -358831 -379302 -481337 -691102 -889676 -883855 -557274 10052
18307A0052N92806M80955K23627j96306n50424o28409m36954j56862P8549K20518
$$ 10052 602858 1083813 1307440 1111134 560710 -67699 -504653 -661515 -582966 -362448
18297c62448K92245L01315K21116N5883q1539q2041j39266k39321k39503k30482
$$ -362448 -70203 231112 452228 508111 426572 344531 205265 -34056 -273559 -504041
18287e04041k29236j43049J7828J27013J73648J21634Q633K0355J63733K05135
$$ -504041 -733277 -876326 -858498 -731485 -557837 -436203 -427570 -407215 -243482 -38347
18277c8347J08722k9770j86985k66067j87398j16041j84053k19399k21399k12319
$$ -38347 70375 40605 -146380 -412447 -599845 -715886 -899939 -1119338 -1340737 -1553056
18267a553056j99212k23620j49800p5702j28022o7083J06898K20750K48029J78514
$$ -1553056 -1752268 -1975888 -2125688 -2201390 -2329412 -2396495 -2289597 -2068847 -1820818 -1642304
18257a642304J27635J27421R7652N8536J57857M02262N71781N86107N53856M52328
$$ -1642304 -1514669 -1387248 -1289596 -1231060 -1073203 -670941 -99160 486947 1040803 1493131
18247A493131K64301k5137l49784n35200n61115m84183l08046p2620J35251K57389
$$ 1493131 1757432 1732295 1382511 847311 286196 -197987 -506033 -578653 -443402 -186013
18237a86013K82864K91508L37717K91107J93628K45038L10236J99135K2790m4166
$$ -186013 96851 388359 726076 1017183 1210811 1455849 1766085 1965220 1988010 1943844
18227A943844m2030q9260j66125k56669l33173k30390k4138j2860j45680j89618
$$ 1943844 1901814 1812554 1646429 1389760 1056587 826197 802059 789199 643519 453901
18217D53901j38223j17522p2479M2658R2870O0062r589m0398j6004K1384N8758
$$ 453901 315678 198156 125677 168335 261205 321267 311678 271280 255276 276660 335418
18206C35418J32664J77621P4938j22188j63963O5452K44779J48096R220j2318
$$ 335418 468082 645703 720641 598453 434490 499942 744721 892817 902037 889719
18196H89719l84j43811l82224m20957k46973m0545M1996n5847k09960j87491K4570
$$ 889719 889335 745524 363300 -57657 -304630 -345175 -303179 -359026 -568986 -756477 -731907
18185g31907J71777J13116n3164j63903k13285j62978q9394p6291q6160j19909
$$ -731907 -560130 -447014 -500178 -664081 -877366 -1040344 -1129738 -1206029 -1292189 -1412098
18175a412098j92911j91098P36K77067M31546M26534M15374M21496L37690J11580
$$ -1412098 -1605009 -1796107 -1795371 -1518304 -1086758 -660224 -244850 176646 514336 625916
18165F25916j75694l60498l89384l46256l23899k58361q4586J27700K82565L76954
$$ 625916 450222 89724 -299660 -645916 -969815 -1228176 -1312762 -1185062 -902497 -525543
18155e25543L77871K37706J8727p5093j9050R8883J49577L5901r2354j12145k0347
$$ -525543 -147672 90034 108761 33668 14618 113501 263078 298979 206625 94480 74133
18144G4133N5284M8835R4236J08003Q425j03418k71151m28994m17567k90797k27777
$$ 74133 129417 178252 272488 380491 388916 285498 14347 -414647 -832214 -1123011 -1350788
18133a350788k59976k60195q0530J54446K08240J85396J99930O0776j31947j22320
$$ -1350788 -1610764 -1870959 -1951489 -1797043 -1588803 -1403407 -1203477 -1142701 -1274648 -1396968
18123a396968k3004m510Q960R1096J56391J19311L4340k5765p0116p9963P2029
$$ -1396968 -1419972 -1424482 -1415522 -1324426 -1168035 -1048724 -1014384 -1040149 -1110265 -1190228 -1118199
18112a118199K72483L46853L16919K31838J70549K24954L36471K83241J00611
$$ -1118199 -845716 -498863 -181944 49894 220443 445397 781868 1065109 1165720
18103A165720J2644o7922k74081m26001l73487k26355j15355p5678k3321J5361
$$ 1165720 1178364 1110442 836361 410360 36873 -189482 -304837 -380515 -403836 -388475
18093c88475j28583l14291k86431j07575J652p902L8733K06970K78948J56708
$$ -388475 -517058 -831349 -1117780 -1225355 -1223703 -1231605 -1192872 -985902 -706954 -550246
18083e50246R302p6574o9340j189J45126L89439N04735L11024K6826o5037K857
$$ -550246 -540944 -617518 -686858 -688047 -542921 -153482 351253 662277 689103 624066 626923
18072F26923J2380K632L4294J6958m3655j31075j28238K329R7305J29769J25932
$$ 626923 639303 641935 676229 693187 649532 518457 390219 392548 489853 619622 745554
18061G45554P3901J6544j0165l8353n3114j332k451j30042k41431k12715j11208
$$ 745554 819455 835999 825834 787481 734367 733035 730584 600542 359111 146396 35188
18050C5188n328N7800N1236N5656R3858P7604O2888J30998J94448R0625j63672
$$ 35188 29860 87660 138896 194552 288410 366014 428902 559900 754348 844973 681301
18039F81301k49697j18914R847Q2233J11825J07713N5918N6730J35619L1903k19403
$$ 681301 431604 312690 322537 404770 516595 624308 680226 736956 872575 904478 685075
18028F85075k50531o0648J23521J91805J25171K4547p0610j49442k25394m06233
$$ 685075 434544 373896 497417 689222 814393 838940 768330 618888 393494 -12739
18018a2739n69442n15403l37825j59446J21848L40676J87255j16225j60165Q9917
$$ -12739 -582181 -1097584 -1435409 -1594855 -1473007 -1132331 -945076 -1061301 -1221466 -1131549
18008a131549L18823K99042J68416j4858j71195j27380J25655M16381N57203N42838
$$ -1131549 -812726 -513684 -345268 -360126 -531321 -658701 -533046 -116665 440538 983376
17998I83376M71792L62403J66464j80137n08860m46100j45562r8124k97515m03806
$$ 983376 1455168 1817571 1984035 1803898 1295038 848938 703376 605252 307737 -96069
17988i6069l05923j31835o8005q5265o4820k1102N4535Q4665N1913J2410m4219
$$ -96069 -401992 -533827 -601832 -687097 -751917 -773019 -718484 -633819 -581906 -569496 -613715
17977f13715j10635j14042m7389N800L7922J9828m2151p1802l1191K706J08844
$$ -613715 -724350 -838392 -885781 -879981 -842059 -822231 -864382 -936184 -967375 -964669 -855825
17966h55825L11997L55076J58179l9593m0672O8021O8719j15712k05065l3159
$$ -855825 -543828 -188752 -30573 -70166 -110838 -42817 25902 -89810 -294875 -328034
17956c28034J46244J04954q1878k27128k36931j12349k1282l2151j2032J33415
$$ -328034 -181790 -76836 -158714 -385842 -622773 -735122 -756404 -788555 -800587 -667172
17946f67172L27914L89167K56207O9327l8687n309J81525L79210L84751J89158
$$ -667172 -339258 49909 306116 375443 336756 331447 512972 892182 1276933 1466091
17936A466091l5888j63949j24425P5635K96012M04949M01517L43527K09442j8580
$$ 1466091 1430203 1266254 1141829 1217464 1513476 1918425 2319942 2663469 2872911 2854331
17926B854331k76079m25719l57175j36001j1186o8347j72236k38191j53484p724
$$ 2854331 2578252 2152533 1795358 1659357 1648171 1579824 1407588 1169397 1015913 1008189
17916A008189J25733K01045J75061J27688J23995R9219q3248l36997l82117j64619
$$ 1008189 1133922 1334967 1510028 1637716 1761711 1860930 1777682 1440685 1058568 893949
17906H93949L2466K4625j8917L8595P0603k7598k04554l06870k01830P349N3340
$$ 893949 926415 951040 932123 970718 1041321 1013723 809169 502299 300469 307818 361158
17895C61158j4766m1050p5004j20540n4642J02753J99505J05202r7604l29904
$$ 361158 346392 305342 230338 109798 55156 157909 357414 462616 365012 35108
17885C5108m54460l40711p0557J45877J80187J64816J85544J73170J37782J46947
$$ 35108 -419352 -760063 -830620 -684743 -504556 -339740 -154196 18974 156756 303703
17875C03703J01937q3792k48885k07835k01698k98515k32969k7026J69268K29954
$$ 303703 405640 321848 72963 -134872 -336570 -635085 -868054 -895080 -725812 -495858
17865d95858J43504p3981k85085k52711l8791J47551J84902J19890J46799K42818
$$ -495858 -352354 -426335 -711420 -964131 -1002922 -855371 -670469 -550579 -403780 -160962
17855a60962K38625J38320n2717k79678m09810l71702k04778P5462M31654O45285
$$ -160962 77663 215983 163266 -116412 -526222 -897924 -1102702 -1027240 -595586 49699
17845D9699O00512M38278K76017J97587K32091J52808k04873n90004o74625n27978
$$ 49699 650211 1088489 1364506 1562093 1794184 1946992 1742119 1152115 477490 -50488
17835e0488l57730j51377J52645K81546P4135k30601m70903m51702j00402K60874
$$ -50488 -408218 -559595 -406950 -125404 -51269 -281870 -752773 -1204475 -1304877 -1044003
17825a044003L35403K38247J21313q1864k26532k80474l61692l58775j89326Q3863
$$ -1044003 -708600 -470353 -349040 -430904 -657436 -937910 -1299602 -1658377 -1847703 -1763840
17815a763840L82859O22734O81835N94809M96538L98181K80174Q2055j07530k63716
$$ -1763840 -1380981 -758247 -76412 518397 1014935 1413116 1693290 1775345 1667815 1404099
17805A404099m40194n65307n09158l03058n3209K02305L26790K31780M5979r3990
$$ 1404099 963905 398598 -110560 -413618 -466827 -264522 62268 294048 340027 246037
17795B46037j22793j27949j37621j50411k18518j99199K3906K59398K97342J33583
$$ 246037 123244 -4705 -142326 -292737 -511255 -710454 -686548 -427150 -129808 3775
17785C775k7247l2014n1466j54331o8667J20560j5566l42769l77818n0377L72666
$$ 3775 -23472 -55486 -106952 -261283 -329950 -209390 -224956 -567725 -945543 -995920 -623254
17774f23254O26121O30674M29784O1238k51164l59487l60977l84421l32764j00766
$$ -623254 2867 633541 1063325 1124563 873399 513912 152935 -231486 -564250 -665016
17764f65016J53363K39853J15601n1712n9713Q4892J98221J45148K9220k8039
$$ -665016 -511653 -271800 -156199 -207911 -267624 -182732 15489 160637 189857 161818
17754A61818M9153J47178J35444J58573K13511Q8905p2602k9059L1790m6100j83540
$$ 161818 210971 358149 493593 652166 865677 954582 881980 852921 884711 838611 655071
17743F55071k76325k70620k70546l14835l12580j14830J45927J50680n3077j59316
$$ 655071 378746 108126 -162420 -477255 -789835 -904665 -758738 -608058 -661135 -820451
17733h20451n0465J86073L52406K50482L8287j5544K9986l1777j40601j47494
$$ -820451 -870916 -684843 -332437 -81955 -43668 -59212 -29226 -61003 -201604 -349098
17723c49098n1581O3321L3616r1388j04193p8146m3622J11971L34632M18802J83574
$$ -349098 -400679 -337358 -303742 -395130 -499323 -577469 -621091 -509120 -174488 244314 427888
17712D27888k33716m40388k61170p536Q9685J38686K39995L02171K09321L7655
$$ 427888 194172 -246216 -507386 -514922 -425237 -286551 -46556 255615 464936 502591
17702E02591Q552J00250R6701j04459k72744k17209p1247j5879n7226n8888J0318
$$ 502591 511143 611393 708094 603635 330891 113682 42435 26556 -30670 -89558 -79240
17691g9240O0471R9175J43205J16126k7004k07633k23564m3671P6505o044j71308
$$ -79240 -18769 80406 223611 339737 312733 105100 -118464 -162135 -85630 -91674 -262982
17680b62982j60648n2435q575L5151M1191j2038j08000j76467k21081k82002l08689
$$ -262982 -423630 -476065 -484640 -449489 -408298 -420336 -528336 -704803 -925884 -1207886 -1516575
17669a516575k03882K3083K37657L41313L31237K49562J52016K3945j02464p3678
$$ -1516575 -1720457 -1697374 -1459717 -1118404 -787167 -537605 -385589 -361644 -464108 -537786
17659e37786K1517J05919K13116J86783N6495n3764j98476k72273j48937J8489
$$ -537786 -516269 -410350 -197234 -10451 46044 -7720 -206196 -478469 -627406 -608917
17649f08917J45102K29897K26676J93633J21704J8254j4215J73409L26505K27629
$$ -608917 -463815 -233918 -7242 186391 308095 326349 312134 485543 812048 1039677
17639A039677P6161k3610r4946q2425N187N1746K4004q2038j76393j65154m5605
$$ 1039677 1115838 1092228 997282 914857 920044 971790 995794 913756 737363 572209 526604
17628E26604l314j75978m01845m13171k20080r198J72710L03903L78915M13042
$$ 526604 523290 347312 -54533 -467704 -687784 -696982 -524272 -220369 158546 571588
17618E71588L26721L1278k74869l60225l68417k76278p7579K0023N9060J25722
$$ 571588 898309 929587 654718 294493 -73924 -350202 -427781 -407758 -348698 -222976
17608b22976J94814K99303L73403K90483J09455k7625j41680k22275k69144k32257
$$ -222976 -28162 271141 644544 935027 1044482 1016857 875177 652902 383758 151501
17598A51501l4711J48835K07589J77808J24549O8166q1247l36357m03161l00932
$$ 151501 116790 265625 473214 651022 775571 843737 762490 426133 22972 -277960
17588b77960k55011j53614L8243J19556P5429k0978j16567j37170m4124O7800
$$ -277960 -532971 -686585 -648342 -528786 -453357 -474335 -590902 -728072 -772196 -704396
17578g04396J52921K28743J95073O0740p4615p1250j3271n1201p2923k5527k077
$$ -704396 -551475 -322732 -127659 -66919 -141534 -212784 -226055 -277256 -350179 -375706 -377783
17567c77783K3835J5378L52Q5505J34533N3219K4871O5691J21j11296m3524J25114
$$ -377783 -353948 -338570 -338218 -252713 -118180 -64961 -40090 25601 25722 -85574 -129098 -3984
17555c984K54953L28832K61837J25685J1241m9063j24770k65966l63290l14395
$$ -3984 250969 579801 841638 967323 978564 929501 804731 538765 175475 -138920
17545a38920k49426k46932k25581r1285P9639J57392K01629K45210K93088J79519
$$ -138920 -388346 -635278 -860859 -952144 -872505 -715113 -513484 -268274 24814 204333
17535B04333O795k0514p0495j95392k60176l03710l05457j11129K03058L61204
$$ 204333 211128 190614 120119 -75273 -335449 -639159 -944616 -1055745 -852687 -491483
17525d91483L09651R8881j05884j58546o3584J20694K92664L58575L33894K65042
$$ -491483 -181832 -82951 -188835 -347381 -410965 -290271 2393 360968 694862 959904
17515I59904J54495k4887j40425q2924J4326O0621J02985N9599r2996k72703m97547
$$ 959904 1114399 1089512 949087 866163 880489 941110 1044095 1103694 1010698 737995 240448
17504B40448n89282m89761l02941r6677j2281l1929m0125O650J00565K39705M27239
$$ 240448 -348834 -838595 -1141536 -1238213 -1250494 -1282423 -1322548 -1315898 -1215333 -975628 -548389
17493e48389M98632M42651L44355K17189N1690j13794j33975j11627j07290K765
$$ -548389 -49757 392894 737249 954438 1006128 892334 758359 646732 539442 542207
17483E42207Q7937j8600j65174k16175k70525l71152n26675n96316m38174j93772
$$ 542207 630144 611544 446370 230195 -40330 -411482 -938157 -1534473 -1972647 -2166419
17473b166419K7165K06477L26653L20670J24537j11589j84933j24681p4234N3666
$$ -2166419 -2139254 -1932777 -1606124 -1285454 -1160917 -1272506 -1457439 -1582120 -1656354 -1602688
17463a602688K36116L30831L40678L10180K61838J89898K9344k39045m20977l22143
$$ -1602688 -1366572 -1035741 -695063 -384883 -123045 66853 96197 -142848 -563825 -885968
17453h85968p8076K8252L7055J62124K37337K30072K84188L10419K25940Q6191
$$ -885968 -964044 -935792 -898737 -736613 -499276 -269204 14984 325403 551343 637534
17443F37534l1570q2393n998P4935M6400J3732K5018K6532L3488l2332k04476
$$ 637534 605964 523571 517573 592508 638908 652640 677658 704190 737678 705346 500870
17432E00870j86905j1891J0192j77032m84140o38727n24656l80827k99541j90086
$$ 500870 313965 302074 312266 135234 -348906 -987633 -1512289 -1893116 -2192657 -2382743
17422b382743j27968j12855K2956L20270O88393Q79016P21235M05015J66580O9915
$$ -2382743 -2510711 -2623566 -2600610 -2280340 -1591947 -712931 8304 413319 579899 649814
17412F49814O0707J10590J56564R6459l4583j98572l91268m67304l09588q8466
$$ 649814 710521 821111 977675 1074134 1039551 840979 449711 -17593 -327181 -415647
17402d15647n651p961P94J2577M5211Q0708P9559Q3095J39783K65047L27935K39663
$$ -415647 -421298 -429259 -428465 -415888 -370677 -289969 -210410 -127315 12468 277515 605450 845113
17390H45113J05413m4923j63141j72699j82067l26053m36340l80922k15234j8411
$$ 845113 950526 905603 742462 569763 387696 61643 -374697 -755619 -970853 -989264
17380i89264M566j25888j66932j30701j34939p9571L7337P6544K517q2209q6255
$$ -989264 -984698 -1110586 -1277518 -1408219 -1543158 -1622729 -1585392 -1508848 -1506331 -1588540 -1674795
17369a674795K2271K10711K43545j0175k91542k78961l229K16348K69595K74897
$$ -1674795 -1652524 -1441813 -1198268 -1208443 -1499985 -1778946 -1782175 -1565827 -1296232 -1021335
17359a021335K76510K24176J90715L02719M28325L37804J18274p951K5913Q087
$$ -1021335 -744825 -520649 -329934 -27215 401110 738914 857188 849237 875150 883237
17349H83237j14873j55951p4989R6883K13999O7839k05431l02261l39304m35529
$$ 883237 768364 612413 537424 634307 848306 916145 710714 408453 69149 -366380
17339c66380m22396k43265n9906L8491N1602p5731k12875j74255N3665L17627
$$ -366380 -788776 -1032041 -1091947 -1053456 -1001854 -1077585 -1290460 -1464715 -1411050 -1093423
17329a093423L98302J75399j04376j63264l8009J84020L97742M10235K11614Q9869
$$ -1093423 -695121 -519722 -624098 -787362 -825371 -641351 -243609 166626 378240 468109
17319D68109R5997O23k16288m02543n17060n14761l58370j24515N8294J64796
$$ 468109 564106 564729 348441 -54102 -571162 -1085923 -1444293 -1568808 -1510514 -1345718
17309a345718L01243M05123L42385J63516m3756j45357p7760l3139m9457l4481
$$ -1345718 -1044475 -639352 -296967 -133451 -177207 -322564 -400324 -433463 -482920 -517401
17299e17401j8173m5338j11196j68371j51398q0856j7006J2627N8485J08364Q6729
$$ -517401 -535574 -580912 -692108 -860479 -1011877 -1092733 -1109739 -1097112 -1038627 -930263 -843534
17288h43534l7560j66414l7966K16752L59973L53264K48810J10642m4056j60445
$$ -843534 -881094 -1047508 -1085474 -868722 -508749 -155485 93325 203967 159911 -534
17278e34q0679K75453M75018K46515q8161k68192k99515k01369o7739k5278o4910
$$ -534 -81213 194240 669258 915773 827612 559420 259905 58536 -9203 -34481 -99391
17267i9391j42239k25129k56227j26634J05376J73272J40996J73131L17028M48079
$$ -99391 -241630 -466759 -722986 -849620 -744244 -570972 -429976 -256845 60183 508262
17257E08262M07156L01826K35824J87535L1165k06165k97623j68230k53L1409
$$ 508262 915418 1217244 1453068 1640603 1671768 1465603 1167980 999750 999497 1030906
17247A030906n4003r2710n4434j9452j4187l0522O431J37109L58863N58839N31680
$$ 1030906 976903 884193 829759 810307 796120 765598 772029 909138 1268001 1826840 2358520
17236B358520K72309j5189k04799l25061m20335l77870j51666q9323k07653k71584
$$ 2358520 2630829 2615640 2410841 2085780 1665445 1287575 1135909 1046586 838933 567349
17226E67349l13908l07845j80284K8640R8420j30717l67238m00735l15765j47716
$$ 567349 253441 -54404 -234688 -206048 -107628 -238345 -605583 -1006318 -1322083 -1469799
17216a469799R2231K51948K47229K07710K45003L62075M55244L82212J66779k3279
$$ -1469799 -1377568 -1125620 -878391 -670681 -425678 -63603 391641 773853 940632 917353
17206I17353j34124j93246j33364K5716J54828K00580J01215j08353k84249l41475
$$ 917353 783229 589983 456619 482335 637163 837743 938958 830605 546356 204881
17196B04881k19602K156J23695K09850L89350M95366L94509J63490j02182l33922
$$ 204881 -14721 -12565 111130 320980 710330 1205696 1600205 1763695 1661513 1327591
17186A327591l78627k60229j96307k40460k13190J4672L08205L77551K03855N660
$$ 1327591 948964 688735 492428 251968 38778 53450 361655 739206 943061 948721
17176I48721j54539k74572k97993k40864j56345j08861j04279r3131q8813m6218
$$ 948721 794182 519610 221617 -19247 -175592 -284453 -388732 -481863 -570676 -616894
17166f16894J4193j5511j13751j46578r5406r5762k17393k33676J26436N16184
$$ -616894 -602701 -618212 -731963 -878541 -973947 -1069709 -1287102 -1520778 -1394342 -878158
17156h78158N52130L34081J49457Q8816j3165k11339k89404k30046k51516k62899
$$ -878158 -326028 8053 157510 246326 233161 21822 -267582 -497628 -749144 -1012043
17146a012043j79520j03792O227J68838J63871P7314Q7096Q5578n2710j61859
$$ -1012043 -1191563 -1295355 -1289128 -1120290 -956419 -879105 -792009 -706431 -759141 -921000
17136i21000j19820k8202O3705J59932K41917K21201J57033J71269J94778J94784
$$ -921000 -1040820 -1069022 -1005317 -845385 -603468 -382267 -225234 -53965 140813 335597
17126C35597K87992L91968L00736O0212p9879j17261j99307k87850l30761l64944
$$ 335597 623589 1015557 1316293 1376505 1296626 1179365 980058 692208 361447 -3497
17116c497k77464o7251J38422K52953K39405J42881P344j21518k46468m11084
$$ -3497 -280961 -348212 -209790 43163 282568 425449 432793 311275 64807 -346277
17106c46277n48932n20041l05589q4596J39037M21738O12140O42094N92021M62217
$$ -346277 -895209 -1415250 -1720839 -1805435 -1666398 -1244660 -632520 9574 601595 1063812
17096A063812J79650j50523k90619k28181j69840k06650k42219k12703j97766
$$ 1063812 1243462 1092939 802320 574139 404299 197649 -44570 -257273 -455039
17087d55039j77062r5399j5787j0223r4994j62677j63474q5984J50359L91323
$$ -455039 -632101 -727500 -743287 -753510 -848504 -1011181 -1174655 -1260639 -1110280 -718957
17077g18957M38008K87747J70431K35914L26878L42719J91841n0417k12199k68883
$$ -718957 -280949 6798 177229 413143 740021 1082740 1274581 1224164 1011965 743082
17067G43082k86480l63624k93677j00325k0817m5209n3833j08345j66968j06832
$$ 743082 456602 92978 -200699 -301024 -321841 -367050 -420883 -529228 -696196 -803028
$$ [...]
##END NTUPLES=NMR SPECTRUM
##END=
