##TITLE=C13_DE-54_NaOH
 D2O, 22000 sc

 27.6.2024
##JCAMPDX= 6.0         $$ Bruker NMR JCAMP-DX V2.0
##DATA TYPE= NMR SPECTRUM
##DATA CLASS= NTUPLES
##ORIGIN= UXNMR, Bruker Analytische Messtechnik GmbH
##OWNER= root
$$ XWIN-NMR		Version 3.5
$$ Fri Jun 28 13:39:27 2024 Russian Standard Time (UT+4h)  she@DPX200
##.OBSERVE FREQUENCY= 50.327896
##.OBSERVE NUCLEUS= ^13C
##.ACQUISITION MODE= SIMULTANEOUS
##.ACQUISITION SCHEME= undefined
##.AVERAGES= 22002
##.DIGITISER RES= 17
##SPECTROMETER/DATA SYSTEM= spect
##.PULSE SEQUENCE= zgpg30
##.SOLVENT NAME= CDCl3
##.SHIFT REFERENCE= (INTERNAL, CDCl3, 0, 222.565)
##AUDIT TRAIL= $$ (NUMBER, WHEN, WHO, WHERE, WHAT)
$$ ##TITLE= Audit trail, XWIN-NMR		Version 3.5
$$ ##JCAMPDX= 5.01
$$ ##ORIGIN= Bruker BioSpin GmbH
$$ ##OWNER= she
$$ F:/spectra/data/she/nmr/c13/1/pdata/1/auditp.txt
$$ ##AUDIT TRAIL=  $$ (NUMBER, WHEN, WHO, WHERE, WHAT)
(   1,<2024-06-28 13:37:54.59 +0400>,<she>,<DPX200>,
      <created by zg, POWCHK disabled, PULCHK disabled
       terminated by command 'halt'
       configuration hash MD5:
       00 E9 B6 7A A2 85 ED C7 34 08 36 98 17 FE 4E 26
       data hash MD5: 32K
       64 0E C3 DB D3 B5 DE 0E 62 0D 79 1C C0 00 27 FB>)
(   2,<2024-06-28 13:38:00.45 +0400>,<she>,<DPX200>,
      <Start of raw data processing
       efp BC_mod = 2 LB = 2 FT_mod = 6 PKNL = 1 PHC0 = -397.6245 PHC1 = 22.7862 SI = 32K 
       data hash MD5: 32K
       17 80 B0 A4 45 B5 0D 3A DA A8 A7 8C 76 70 2D 78>)
(   3,<2024-06-28 13:38:06.42 +0400>,<she>,<DPX200>,
      <abs ABSG = 5 
       data hash MD5: 32K
       29 F4 A7 F6 AA A0 3D 25 30 F9 E3 C1 A0 7F C6 A8>)
(   4,<2024-06-28 13:38:27.85 +0400>,<she>,<DPX200>,
      <pk PHC0 = -5.905827 PHC1 = 0.6000005 
       data hash MD5: 32K
       15 66 8B E8 C9 4D F8 61 FC 21 90 49 5F 44 AC 85>)
(   5,<2024-06-28 13:38:30.92 +0400>,<she>,<DPX200>,
      <abs ABSG = 5 
       data hash MD5: 32K
       CE BD FB 77 68 2C 13 0B 8C 46 E6 6A 52 F2 15 01>)
$$ ##END=
$$ 
$$ hash MD5
$$ 59 3A CD 2B CF F5 9E E3 4A 86 9A 5D 6F 25 9D 48
##$RELAX= 
##$RELAX= 
##$RELAX= 
##$RELAX= 
##$RELAX= 
##$RELAX= 
##$RELAX= 
##$RELAX= 
$$ Bruker specific parameters
$$ --------------------------
##$DU= <F:/spectra>
##$EXPNO= 1
##$NAME= <c13>
##$PROCNO= 1
##$TYPE= <nmr>
##$USER= <she>
##$AMP= (0..31)
100 100 100 100 100 100 100 100 100 100 100 100 100 100 100 100 100 100 
100 100 100 100 100 100 100 100 100 100 100 100 100 100 
##$AQSEQ= 0
##$AQ_mod= 1
##$AUNM= <au_zg>
##$AUTOPOS= <>
##$BF1= 50.322709
##$BF2= 200.13
##$BF3= 50.322709
##$BF4= 500.13
##$BF5= 500.13
##$BF6= 500.13
##$BF7= 500.13
##$BF8= 500.13
##$BYTORDA= 1
##$CFDGTYP= 0
##$CFRGTYP= 5
##$CHEMSTR= <none>
##$CNST= (0..31)
1 1 145 1 1 1 1 1 1 1 1 1 1 1 1 1 1 1 1 1 1 1 1 1 1 1 1 1 1 1 1 1 
##$CPDPRG= <waltz16>
##$CPDPRG1= <>
##$CPDPRG2= <waltz16>
##$CPDPRG3= <>
##$CPDPRG4= <mlev>
##$CPDPRG5= <mlev>
##$CPDPRG6= <mlev>
##$CPDPRG7= <mlev>
##$CPDPRG8= <mlev>
##$CPDPRGB= <>
##$CPDPRGT= <>
##$D= (0..31)
$$ [...]
##$SUBNAM4= <"">
##$SUBNAM5= <"">
##$SUBNAM6= <"">
##$SUBNAM7= <"">
##$SUBNAM8= <"">
##$SUBNAM9= <"">
##$SW= 239.972175391363
##$SWIBOX= (0..15)
0 1 3 0 0 0 0 0 0 0 0 0 0 0 0 0 
##$SW_h= 12077.2946859903
##$TD= 32768
##$TD0= 1
##$TE= 0
##$TE2= 300
##$TE3= 300
##$TEG= 300
##$TL= (0..7)
120 120 120 120 120 120 120 120 
##$TP= (0..7)
150 150 150 150 150 150 150 150 
##$TP07= 0
##$TPNAME0= <>
##$TPNAME1= <>
##$TPNAME2= <>
##$TPNAME3= <>
##$TPNAME4= <>
##$TPNAME5= <>
##$TPNAME6= <>
##$TPNAME7= <>
##$TPOAL= (0..7)
0.5 0.5 0.5 0.5 0.5 0.5 0.5 0.5 
##$TPOFFS= (0..7)
0 0 0 0 0 0 0 0 
##$TUNHIN= 0
##$TUNHOUT= 0
##$TUNXOUT= 0
##$USERA1= <user>
##$USERA2= <user>
##$USERA3= <user>
##$USERA4= <user>
##$USERA5= <user>
##$V9= 5
##$VALIST= <valist>
##$VCLIST= <CCCCCCCCCCCCCCC>
##$VD= 0
##$VDLIST= <DDDDDDDDDDDDDDD>
##$VPLIST= <PPPPPPPPPPPPPPP>
##$VTLIST= <TTTTTTTTTTTTTTT>
##$WBST= 1024
##$WBSW= 4
##$XGAIN= (0..3)
0 0 0 0 
##$XL= 0
##$YL= 0
##$YMAX_a= 141861421
##$YMIN_a= -61403781
##$ZGOPTNS= <>
##$ZL1= 120
##$ZL2= 120
##$ZL3= 120
##$ZL4= 120
##$ABSF1= 222.5654
##$ABSF2= -17.4314
##$ABSG= 5
##$ABSL= 3
##$ALPHA= 0
##$AQORDER= 0
##$ASSFAC= 0
##$ASSFACI= 0
##$ASSFACX= 0
##$ASSWID= 0
##$AUNMP= <proc_1d>
##$AZFE= 0.1
##$AZFW= 0.5
##$BCFW= 0
##$BC_mod= 2
##$BYTORDP= 0
##$COROFFS= 0
##$CY= -3
##$DATMOD= 1
##$DC= 0
##$DFILT= <>
##$DTYPP= 0
##$F1P= 0
##$F2P= 0
##$FCOR= 0.5
##$FTSIZE= 32768
##$FT_mod= 6
##$GAMMA= 0
##$GB= 0
##$INTBC= 1
##$INTSCL= 4.134877e-10
##$ISEN= 128
##$LB= 2
##$LEV0= 0
##$LPBIN= 0
##$MAXI= 10000
##$MC2= 0
##$MEAN= 0
##$ME_mod= 0
##$MI= 0.1934396
##$NCOEF= 0
##$NC_proc= 0
##$NLEV= 6
##$NOISF1= 120.0001
##$NOISF2= 80.00006
##$NSP= 0
##$NTH_PI= 0
##$NZP= 0
##$OFFSET= 222.5654
##$PC= 1.4
##$PHC0= -403.5303
##$PHC1= 23.3862
##$PH_mod= 1
##$PKNL= yes
##$PPARMOD= 0
##$PSCAL= 0
##$PSIGN= 0
##$REVERSE= no
##$SF= 50.3227345484362
##$SI= 32768
##$SIGF1= 140
##$SIGF2= 120
##$SINO= 11.81781
##$SIOLD= 32768
##$SREGLST= <13C.CDCl3>
##$SSB= 0
##$STSI= 32768
##$STSR= 0
##$SW_p= 12077.2946859903
##$SYMM= 0
##$S_DEV= 0
##$TDeff= 32768
##$TDoff= 0
##$TI= <>
##$TILT= no
##$TM1= 0
##$TM2= 0
##$TOPLEV= 0
##$USERP1= <user>
##$USERP2= <user>
##$USERP3= <user>
##$USERP4= <user>
##$USERP5= <user>
##$WDW= 1
##$XDIM= 32768
##$YMAX_p= 302410589
##$YMIN_p= -7333268
$$ End of Bruker specific parameters
$$ ---------------------------------
##NTUPLES= NMR SPECTRUM
##VAR_NAME=  FREQUENCY,     SPECTRUM/REAL,   SPECTRUM/IMAG
##SYMBOL=    X,             R,               I
##VAR_TYPE=  INDEPENDENT,   DEPENDENT,       DEPENDENT
##VAR_FORM=  AFFN,          ASDF,            ASDF
##VAR_DIM=   32768,         32768,           32768
##UNITS=     HZ,            ARBITRARY UNITS, ARBITRARY UNITS
##FACTOR=    0.368581032318806, 1,           1
##FIRST=     11200.0995020947, 0,            0
##LAST=      -877.195183895579, 0,           0
##MIN=       -877.195183895579, -7333268,    0
##MAX=       11200.0995020947, 302410589,    0
$$ Real data points
##PAGE= N=1
##DATA TABLE= (X++(R..R)), XYDATA
$$ [...]
##PAGE= N=2
##DATA TABLE= (X++(I..I)), XYDATA
22453A03510491J4178K62098O31099N82216M21885M19115N28364M49143j49732
22444A06668857r03238j167922j029514p67805n37615l95320k5316M99919O70175
22435A03012221M47863J07994n3697Q7782K03260N5554J98687O02660O47614N14013
22425A05823951N98169N25125J77902M6168K81185N58559M11521k05859p88610
22416A07428111p82357l02244J31885J99680K3259p112J55163L51380L47477J7575
22406A07562817l83350m89987n75920o61552n63487l90222k63774l86131n99287
22397A03249107o72945n76910l47642L5946M68378O38833O08753O86715J001714
22388A05091949J081899P81277L66877J10590J23697L32790M72475K23947j00063
$$ plain form
22453 103510491 103524669 103786767 104417866 105000082 105421967 105841082 106369446 106818589 106668857
22444 106668857 105765619 104597697 103568183 102800378 102262763 101867443 101842127 102342046 103012221
22435 103012221 103460084 103568078 103514381 103602163 103805423 103860977 104059664 104662324 105309938 105823951
22425 105823951 106422120 106947245 107125147 107171315 107452500 108011059 108422580 108216721 107428111
22416 107428111 106645754 106343510 106475395 106675075 106698334 106691222 106846385 107197765 107545242 107562817
22406 107562817 107179467 106689480 106113560 105452008 104888521 104498299 104234525 103848394 103249107
22397 103249107 102576162 101999252 101651610 101687556 102155934 102794767 103403520 104090235 105091949
22388 105091949 106173848 106955125 107322002 107432592 107556289 107889079 108361554 108585501 108485438
22379A08485438J06886M25593K74601j10085l84175m81758m54608l07149l13753
22370A07240990o45299p21605l43964p0832k24384n82392p15289m86586j26288
22361A03324351J17178J74840J30537J25214J17957J63324L37683K76308l6985
22352A04730407m39110n51042r1713L98788O42984Q48805Q56638M91942r9740
22343A06787959o79287q28346n19379l29463l24338J8203N03374O24903M68615
22334A05722241K57686l1645l73130p32200q08554m93088r6194L14346M94643
22325A04254105J91460j01496O5398L37220L00144J61916J79361R5147j28459
22316A05354796n9947K53129K55227o2698j57325j90896m61043p42555r10370
$$ plain form
22379 108485438 108592324 109017917 109292518 109182433 108798258 108316500 107861892 107554743 107240990
22370 107240990 106595691 105874086 105530122 105459290 105234906 104652514 103937225 103450639 103324351
22361 103324351 103441529 103616369 103746906 103872120 103990077 104153401 104491084 104767392 104730407
22352 104730407 104291297 103740255 103648542 104047330 104690314 105539119 106395757 106887699 106787959
22343 106787959 106108672 105280326 104760947 104431484 104107146 104125349 104628723 105253626 105722241
22334 105722241 105979927 105948282 105575152 104842952 104034398 103541310 103445116 103759462 104254105
22325 104254105 104445565 104344069 104409467 104746687 105046831 105208747 105388108 105483255 105354796
22316 105354796 105294849 105547978 105803205 105740507 105583182 105392286 104931243 104188688 103278318
22307A03278318r11507p49308l86906k5438J54859L30060N91662O29004K41648
22298A03152392p7669L1373J93716J00430j3506m6467J34439K38264j64461o20766
22288A02927745n35201j20152J08761J12765J23229L29744N27622L91637R4957
22279A03961107j72762l62386j92024L79960P68671O00332J5896n72190p66622
22270A03659982n02068J2119N98140Q72447P12674L12954j08543l12844j02190
22261A05142671L00045L59068P257k18177q5789J65070L57393L57552J03792k13335
22251A06275547m37565n07880n14608o11761n92503l10403M4890J78807K37422
22242A03761946L16711L79626N44614O42657M62509J53622N29K0554K33754O07200
$$ plain form
22307 103278318 102366811 101617503 101230597 101205159 101360018 101690078 102281740 102910744 103152392
22298 103152392 103074723 103106096 103299812 103400242 103386736 103340269 103474708 103712972 103548511 102927745
22288 102927745 102392544 102272392 102381153 102493918 102617147 102946891 103474513 103866150 103961107
22279 103961107 103788345 103425959 103233935 103613895 104382566 104982898 104998794 104426604 103659982
22270 103659982 103157914 103170033 103768173 104640620 105353294 105666248 105557705 105244861 105142671
22261 105142671 105442716 105801784 105809041 105590864 105505075 105670145 106027538 106385090 106488882 106275547
22251 106275547 105837982 105330102 104815494 104203733 103611230 103300827 103345717 103524524 103761946
22242 103761946 104078657 104458283 105002897 105645554 106108063 106261685 106262214 106282768 106516522 107123722
22232A07123722R97406J167758R05474K43272m12040o20888m20095K238K24220
22223A09211067J19511j73115n57537q73232j083365j158045r20298n37595l31536
22214A03695855k56291m9815K96317M74662N33474P93752R07740O09613N2155
22205A07057462k04833o8522J63375K66132K01129M2450k90045o43592q82119
22196A05641437r59817r54361p78274l87175j29344r1700j55791k64225j64278
22187A01756472J61903M56448O63193O88470L57383L9443J47208M25482M81668
22178A05177670K43340j2634j58356l56263o40642o58237l10877r1719K5234K07639
22168A03425155L26933L09805J16731k3124j44849k52763m5367L67101M80984
$$ plain form
22232 107123722 108121128 109288886 110194360 110437632 110025592 109404704 108984609 108986847 109211067
22223 109211067 109330578 109157463 108599926 107726694 106643329 105485284 104564986 104027391 103695855
22214 103695855 103439564 103389749 103686066 104160728 104694202 105487954 106395694 107005307 107057462
22205 107057462 106852629 106784107 106947482 107213614 107414743 107457193 107167148 106523556 105641437
22196 105641437 104681620 103727259 102948985 102561810 102432466 102340766 102184975 101920750 101756472
22187 101756472 101918375 102374823 103038016 103726486 104083869 104123312 104270520 104696002 105177670
22178 105177670 105421010 105408376 105250020 104893757 104253115 103594878 103284001 103192282 103217516 103425155
22168 103425155 103752088 104061893 104178624 104155500 104010651 103757888 103712521 104079622 104560606
22159A04560606J63823l15787m67098j94807M9373M1455N6829K35233L92473J98312
22149A04720412l35624o78931n55790k73357m1243K03114K84367J27673N3610
22140A03504231K26118K58751j13209n47516o61890o01257m48744k81577l35733
22131A00999174m80750k05887L93470Q61225J004440O81106l879l55117j30139
22122A02763643N2006J09372L36765N24143L87780j0431n13044q88340q58104
22113A01903790n11381o3610L84097P32004P10301L10762Q3514J02958k7276j42642
22103A03482517L1928K53057J18549k89719n84171l07880L29825O81535N20153
22094A04235794R0260k86756n18249o22353m71353p6865L11042L66536L0953k23478
$$ plain form
22159 104560606 104724429 104408642 103941544 103746737 103796110 103837565 103894394 104129627 104522100 104720412
22149 104720412 104384788 103705857 103150067 102876710 102835467 103038581 103322948 103450621 103504231
22140 103504231 103730349 103989100 103875891 103328375 102666485 102065228 101616484 101334907 100999174
22131 100999174 100518424 100312537 100706007 101567232 102571672 103252778 103248899 102893782 102763643
22122 102763643 102815649 102925021 103261786 103785929 104173709 104163278 103650234 102761894 101903790
22113 101903790 101392409 101328799 101712896 102444900 103155201 103465963 103549477 103652435 103625159 103482517
22103 103482517 103514445 103767502 103886051 103596332 103012161 102704281 103034106 103715641 104235794
22094 104235794 104326054 104039298 103521049 102898696 102427343 102350478 102661520 103028056 103059009 102835531
22084A02835531J15625Q30984J333765J337599P53481k0314l44556l40533m38452
22075A06063130o33258n22896l6673M89296Q31218Q92879O99172L35007q7558
22066A08030317m14303m89593l93348k05528p7049k17474m38333l53715j25986
22057A05314988O0324M84210Q85249P58219M18828K32678L3766k79980q22605
22048A07085677j099941p70331k97231k03374l54121k70127k412J39708J33985
22039A04361833K0828j20394k40076m08448m18240q3603L09873L63491R6532j18914
22029A03762882j10888r3171j26559N5385J81867r3773l90021k98437P5941L69234
22019A03332460M74905N25233O09103N71403L36281k2553k90065k68866j20076
$$ plain form
22084 102835531 102951156 103782140 105115905 106453504 107206985 107186671 106842115 106501582 106063130
22075 106063130 105429872 104906976 104870303 105359599 106190817 107083696 107782868 108117875 108030317
22066 108030317 107616014 107126421 106733073 106527545 106450496 106233022 105794689 105440974 105314988
22057 105314988 105375312 105859522 106744771 107502990 107921818 108154496 108188262 107908282 107085677
22048 107085677 105985736 105215405 104918174 104714800 104360679 104090552 104088140 104227848 104361833
22039 104361833 104382661 104262267 104022191 103613743 103195503 103111900 103421773 103785264 103881796 103762882
22029 103762882 103651994 103558823 103432264 103487649 103669516 103575743 103185722 102887285 102963226 103332460
22019 103332460 103807365 104332598 104941701 105513104 105849385 105826832 105536767 105267901 105147825
22010A05147825L3816M3189O5952J94581K20100J75647o7074m15856p54953j092224
22000A03551003j032929n48126k10551j96508k55584o4603J46881J17878P8450
21991A01585911J58607K07492K03189J04421p1146Q9919P24109J437900J809156
21982A06249558J730677J240350N24582j22477o79410j025799q90232o05591n27102
21973A05894556l54159q712L29093M65157L55048L27386M06285L28863M633m61248
21963A07286902p96108n70471L5337L63452K66920p2365k74289j42779L7243L8656
21953A06172498m6982k4818J18354J9949j14896J261J65473J62618o8158k04565
21943A06180734M7800K72589N7014l19924n19156o07699q09779j089999j111711
$$ plain form
22010 105147825 105181641 105224830 105290782 105485363 105705463 105881110 105814036 105398180 104643227 103551003
22000 103551003 102518074 101969948 101759397 101562889 101307305 101242702 101389583 101507461 101585911
21991 101585911 101744518 101952010 102155199 102259620 102188474 102278393 103002502 104440402 106249558
21982 106249558 107980235 109220585 109745167 109622690 108943280 107917481 107027249 106421658 105894556
21973 105894556 105540397 105531685 105860778 106325935 106680983 107008369 107414654 107743517 107748150 107286902
21963 107286902 106490794 105920323 105955660 106319112 106586032 106513667 106239378 106096599 106133842 106172498
21953 106172498 106125516 106100698 106219052 106239001 106124105 106125366 106290839 106453457 106385299 106180734
21943 106180734 106228534 106501123 106558137 106238213 105719057 105111358 104301579 103211580 102099869
21934A02099869o10255K91872J141127J455759J188479P14382K91517q5020l42745
21925A06144985m33450j99036O3573J17955K24053M13375N36084M13211J06110
21916A07386860l8753N6889N4659j87606m12828l79082j69382P002Q7689J06108
21906A06511556J63525K28323M8931k85131m67921k40108K78270M09309m3916
21897A06602838m81619n85657n51944n60532n52602m68668j97658L50710N05430
21888A04060298J20413j74677k40975j21644K45087O53794P76957M72373J40673
21879A05932299J21775K69446K81050P9548j01313l23762n23845n09702n73923
21870A04651573p52354o40687l58716j06136J56603L96896M60971R8718n07179
$$ plain form
21934 102099869 101489614 101781486 102922613 104378372 105566851 106281233 106572750 106487730 106144985
21925 106144985 105711535 105512499 105576072 105694027 105918080 106331455 106867539 107280750 107386860
21916 107386860 107348107 107404996 107459655 107272049 106859221 106480139 106310757 106317759 106405448 106511556
21906 106511556 106675081 106903404 106952335 106667204 106199283 105959175 106237445 106646754 106602838
21897 106602838 106121219 105535562 104983618 104423086 103870484 103401816 103204158 103554868 104060298
21888 104060298 104180711 104006034 103765059 103643415 103888502 104542296 105319253 105791626 105932299
21879 105932299 106054074 106323520 106604570 106684118 106582805 106259043 105735198 105225496 104651573
21870 104651573 103899219 103258532 102899816 102793680 102950283 103347179 103808150 103906868 103399689
21861A03399689p68311n43377k31065q9396N1670J76872L33874M07548J98834
21852A02936338J65862L65293L32699K73897M24570M24985N8532k85717l01164
21843A04395295R3660M93740M41647J39302n2503J65503M20340K93388r4821m33879
21833A05861672n03693m38451l96297k30071N2539J38866n39K5141K79973M65321
21823A05254461N42879N45131L35890j55645o67180p15783l17829l0506J394J69938
21813A04962750N64418Q46499O63779J99213k31371l52523k57002j20349P6283
21804A06351697q099l93145n82225n94406n90907l76354K8774M65928P46074N92103
21794A05639440J17507k60480n29830n74043m70524m53644m14486N0467O63105
$$ plain form
21861 103399689 102631378 102088001 101856936 101767540 101819210 101996082 102329956 102737504 102936338
21852 102936338 103102200 103467493 103800192 104074089 104498659 104923644 104982176 104696459 104395295
21843 104395295 104488955 104982695 105424342 105563644 105511141 105676644 106096984 106390372 106295551 105861672
21833 105861672 105357979 104919528 104523231 104293160 104345699 104484565 104484026 104509167 104789140 105254461
21823 105254461 105797340 106342471 106678361 106522716 105855536 105139753 104821924 104791418 104792812 104962750
21813 104962750 105527168 106373667 107037446 107236659 107005288 106652765 106395763 106275414 106351697
21804 106351697 106343598 105950453 105368228 104773822 104182915 103806561 103835335 104301263 105047337 105639440
21794 105639440 105756947 105496467 104966637 104392594 103922070 103468426 103053940 103104407 103767512
21785A03767512P87326N35016M91285N33343M52119M11490L25269J1872n02292
21776A06812940r06766j215732j460513j109496k33926M36456N84097L99611J61131
21767A03467802J3623j9057K45115Q31791J337317J420216J090373N77976O4641
21758A09029797l56703p04752q49225o98556m64303m73261l79662K10573O09138
21749A05923046L72996Q1617N8966J69762J57761J7197J6483K0298k85497o01776
21739A05930853o01585m18785r9503K98573N59487N60870M33444K47616K3130
21730A06934100p5058n8776q9469j91735k78635m00435p20458j067243q93148
21721A03159143j25908P46792J166188R80963M98369K11416M34965Q66136R82416
$$ plain form
21785 103767512 104554838 105089854 105581139 106114482 106566601 106978091 107303360 107315232 106812940
21776 106812940 105906174 104690442 103229929 102120433 101886507 102322963 102907060 103306671 103467802
21767 103467802 103481425 103462368 103707483 104539274 105876591 107296807 108387180 108965156 109029797
21758 109029797 108673094 107968342 107119117 106420561 105956258 105482997 105103335 105313908 105923046
21749 105923046 106296042 106377659 106436625 106606387 106764148 106781345 106797828 106818126 106532629 105930853
21739 105930853 105329268 104910483 104810980 105109553 105669040 106229910 106663354 106910970 106934100
21730 106934100 106859042 106800266 106710797 106519062 106240427 105839992 105119534 104052291 103159143
21721 103159143 103033235 103780027 104946215 105927178 106425547 106636963 107071928 107938064 108920480
21712A08920480O72351K45565o808J20516O11343J115101J009952K77328m23148
21703A12542680p20583p80607o74411n74569o98904q41578p34253l49682Q0840
21694A07248933L84284O18524N08553p632k72984j51546m1174l0895J40638K76442
21684A08673143j039l29222k84306n7220J00702J46147L3052j25623p0404J06016
21674A08191246P4162j3797j66821m58873m75601j78867K5882R3084l82j63060
21664A06926973j25705J02801K94959J35919l21299m97035p2648L87446M87232
21655A07318643K85461P4196O0985J19252R0813j15995l53223n60465n32235k76983
21645A06110449m2218J77492K53340K8519k12496j15322Q9332K73198M34580N50855
$$ plain form
21712 108920480 109592831 109838396 109831588 109952104 110563447 111678548 112688500 112965828 112542680
21703 112542680 111822097 111041490 110367079 109792510 109093606 108252028 107517775 107168093 107248933
21694 107248933 107633217 108251741 108760294 108752662 108479678 108328132 108286958 108256063 108396701 108673143
21684 108673143 108672104 108342882 108058576 108001356 108102058 108248205 108281257 108155634 108085230 108191246
21674 108191246 108265408 108251611 108084790 107625917 107150316 106971449 106997331 107090415 107090033 106926973
21664 106926973 106801268 106904069 107199028 107334947 107013648 106516613 106443965 106831411 107318643
21655 107318643 107604104 107678300 107739285 107858537 107949350 107833355 107480132 106919667 106387432 106110449
21645 106110449 106068231 106245723 106499063 106527582 106315086 106199764 106289096 106562294 106996874 107547729
21635A07547729M57297K65405J59805j21277n80778p52466m56046j35497j18971
21626A06265201l70145o41258o45364j96363L79136M27597J5433l61362l15739
21617A04557136P1022M67636N56785M18714K91124J26824j6244O6534M08295N76307
21607A07524133L25778j60079p19974j128523j034730o28276m21654l02122O7613
21598A03522166M12888K39136L2833K16421N24744O10595M69023K89820J51619
21589A06469245O0239Q0288K7245j85399l11161j95262m8792j23295k08928k08940
21579A05355240K7616L61268N19740M46626k7416n95091p71187p28044o65966
21570A03922786n48774l07476j40058j37221q2128J32329K90741M16916O32813
$$ plain form
21635 107547729 108005026 108270431 108430236 108308959 107728181 106975715 106519669 106384172 106265201
21626 106265201 105895056 105253798 104608434 104412071 104791207 105218804 105234237 104872875 104557136
21617 104557136 104628158 105095794 105652579 106071293 106362417 106489241 106472997 106539531 106947826 107524133
21607 107524133 107849911 107689832 106969858 105841335 104806605 104178329 103756675 103454553 103522166
21598 103522166 103935054 104174190 104207023 104423444 104948188 105558783 106027806 106317626 106469245
21589 106469245 106529484 106609772 106637017 106451618 106140457 105945195 105896403 105773108 105564180 105355240
21579 105355240 105382856 105744124 106263864 106710490 106683074 106087983 105316796 104588752 103922786
21570 103922786 103374012 103066536 102926478 102789257 102707129 102839458 103130199 103547115 104179928
21561A04179928P73069P52786N30157J67448M6031J84049K25114J49813m2384
21552A06966011m04089n73060m42515l34403l17089k08908j56326k36320l40266
21543A03953035l27752L3906N77944R15160R31383P58386M69173J41810q6435
21534A07366610j96658l18652k14408J36068M29450O44344O51453L59376M1860
21525A08899443J11738M22809L94009l2589l86167l44852k1846K04616Q0695k45891
21515A09081965n06212n70785m26126j14088L18909N02652K54347J39591K87309
21506A08967562K22412j9675l17055o24277p92328p71486p68782q71663q17271
21497A04207437m86209M3044N45444P26872O68190N59697L34067J27303K35553
$$ plain form
21561 104179928 104952997 105705783 106235940 106403388 106449419 106633468 106858582 107008395 106966011
21552 106966011 106561922 105988862 105546347 105211944 104894855 104685947 104529621 104293301 103953035
21543 103953035 103625283 103659189 104237133 105152293 106083676 106842062 107311235 107453045 107366610
21534 107366610 107169952 106851300 106636892 106772960 107202410 107846754 108498207 108857583 108899443
21525 108899443 109011181 109433990 109827999 109795410 109409243 109064391 109042545 109247161 109327856 109081965
21515 109081965 108575753 108004968 107578842 107464754 107783663 108286315 108540662 108680253 108967562
21506 108967562 109189974 109170299 108853244 108228967 107436639 106665153 105896371 105024708 104207437
21497 104207437 103721228 103764272 104309716 105036588 105704778 106264475 106598542 106725845 106961398
21488A06961398M13808L22408k1604n82587j124444j319702r44583l59631J01125
21479A03446188M48576P56489Q96561P85769M50419J67339J80276K06089Q5175
21470A07422881l3126j82040k79358j57993J38799L63853K30686Q615K9017J25600
21460A07666934r269m18533m91082k30211N8513L41300L52960J75122J64099K45962
21450A07855795J49270j71469o01936r38882q88922m53510J01175N49366P40390
21441A06341277N56399K31575J17277L78960P36457P13599M10184J23747j24731
21432A09484744j63440l4770k1700k03384n38236n26340J2279N15960N33844J40405
21422A09199362j36045r9047n8370q1941N2516L35700N58433N90901K81078r4380
$$ plain form
21488 106961398 107375206 107697614 107676010 107093423 105968979 104649277 103704694 103345063 103446188
21479 103446188 103894764 104651253 105547814 106333583 106784002 106951341 107131617 107337706 107422881
21470 107422881 107389755 107207715 106928357 106770364 106909163 107273016 107503702 107512317 107541334 107666934
21460 107666934 107657665 107239132 106748050 106517839 106576352 106917652 107270612 107445734 107609833 107855795
21450 107855795 108005065 107833596 107231660 106292778 105403856 104950346 105051521 105600887 106341277
21441 106341277 106897676 107129251 107246528 107625488 108361945 109075544 109485728 109609475 109484744
21432 109484744 109321304 109286534 109264834 109061450 108523214 107996874 108009153 108525113 109058957 109199362
21422 109199362 109063317 108964270 108905900 108823959 108876475 109212175 109770608 110361509 110642587 110548207
21412A10548207k05128k31547k29123j051L62865L14324l73601r76836j042615
21403A08165495r32732o67368k45601m219j47286l71478l14120m1311R4711J91030
21393A05727121J62178q7056k07073j84545k93384l38938L2712N29622Q82280
21384A06222917J075860Q58759M28807K00484n9237m98276q98687j036468q67974
21375A05426185n71847l88006q6523L01632N01162M62093K62102K39912M68018
21366A06614728M23281J51077k2503p168L7967m5397k43553l70527k65687M5322
21356A06317540M54241O55596M63877Q9159j67686l15650l94456l8914M69112
21347A07532819O04090O01064O65298O01174K24472k07383l68700k28877K9922
$$ plain form
21412 110548207 110343079 110111532 109882409 109881358 110244223 110558547 110184946 109208110 108165495
21403 108165495 107232763 106565395 106319794 106315575 106168289 105796811 105482691 105441380 105536091 105727121
21393 105727121 105889299 105802243 105595170 105410625 105117241 104778303 104811015 105340637 106222917
21384 106222917 107298777 108157536 108586343 108786827 108727590 108229314 107330627 106294159 105426185
21375 105426185 104854338 104466332 104379809 104681441 105182603 105644696 105906798 106146710 106614728
21366 106614728 107038009 107189086 107166583 107159415 107197382 107151985 106908432 106537905 106272218 106317540
21356 106317540 106771781 107427377 107891254 107980413 107812727 107497077 107102621 107063707 107532819
21347 107532819 108136909 108737973 109403271 110004445 110228917 110021534 109652834 109423957 109453879
21338A09453879J88291Q9063k58241m99245m68592k11310L2183Q315o1825J31508
21328A08404026L28430K10726k13425p37879r08749m77215L38146J044090J418073
21319A09406223J370637J000943O33422K07682m35698j044059j125889o17369
21311A09395892J02121M07148P5625n82408r13136o41345k08986J32468M19436
21302A08186815M46017J66968j92975n43459q58336q24234l62338J33128M29476
21293A06581062P51704J019702R28907N75119K31101j62030n88164o49834m60699
21284A08226868m84198p07051o10072n745N38117M92889K43081L08147M80454
21275A08482490M50689J50636j37225k51632l41396n23526p48497p51619k34125
$$ plain form
21338 109453879 109642170 109731233 109472992 108973747 108505155 108293845 108326028 108334343 108272518 108404026
21328 108404026 108732456 108943182 108729757 107991878 107083129 106605914 106944060 107988150 109406223
21319 109406223 110776860 111777803 112411225 112618907 112183209 111139150 110013261 109395892
21311 109395892 109498013 109905161 109980786 109398378 108485242 107843897 107634911 107767379 108186815
21302 108186815 108632832 108799800 108606825 108063366 107205030 106380796 106018458 106151586 106581062
21293 106581062 107332766 108352468 109281375 109856494 110087595 109925565 109337401 108687567 108226868
21284 108226868 107742670 107035619 106425547 106419802 106957919 107450808 107693889 108002036 108482490
21275 108482490 108933179 109083815 108946590 108694958 108353562 107830036 107081539 106329920 106095795
21266A06095795M88620P84010P18264O73161O46671O45507O18337N27302K82015
21257A11479682q8419m12872m98952l39392k75106m08906n53156o40291o03916
21248A07658672n02018k15867Q9715L2332N6875M32997P76131Q06849O02111L33816
21238A10071613J07171l6170j30021j96637k63994k92818l71701p21518j039920
21229A07126005q01126l37117l70518o29104o04523m11390k89313j83305O7662
21220A03567271J52526Q6774K74355M76304M08758L78300N09420M76125K07180
21211A06537013L016M9409K33496M17760M30725J94774o8225j25710j71676j15239
21201A07385343K6518K8658n6201R826K30103K83307K29222N38614J018677J144462
$$ plain form
21266 106095795 106584415 107368425 108086689 108759850 109406521 110052028 110670365 111197667 111479682
21257 111479682 111391263 110978391 110479439 110140047 109864941 109456035 108902879 108262588 107658672
21248 107658672 107156654 106940787 107030502 107062834 107119709 107552706 108328837 109135686 109737797 110071613
21238 110071613 110178784 110142614 110012593 109815956 109551962 109259144 108887443 108165925 107126005
21229 107126005 106324879 105987762 105617244 104988140 104383617 103972227 103682914 103499609 103567271
21220 103567271 103719797 103806571 104080926 104557230 104965988 105344288 105853708 106329833 106537013
21211 106537013 106540029 106589438 106822934 107240694 107671419 107866193 107797968 107672258 107500582 107385343
21201 107385343 107411861 107440519 107384318 107394144 107624247 107907554 108136776 108675390 109694067 110838529
21191A10838529R53590O56903K80726k32975o87295q51573p43202l85162j02071
21182A09727470l14876p58039q22835l90574J4684J6377q3367L2928K79030M99096
21172A08199894O83448P49855O84087L75558n7363k07855M0599L57663L40955
21163A11166841Q8402k52609m09138k79318k57708l29851l59731l26290k09893
21154A08830705m3265L5637J14568L22339M17315K74252K11794L33086L79442
21145A10875873K77383J41460Q6207Q0541q598k03169k08179p8435K185K85388
21135A11250656N77856P39341O98472N39001L89532L4420n71976r46976r04999
21126A11805327p05344o38295p57161n43897J72619O64240O20320M62284M03165
$$ plain form
21191 110838529 111792119 112449022 112729748 112496773 111809478 110957905 110214703 109829541 109727470
21182 109727470 109412594 108654555 107831720 107441146 107455830 107472207 107388840 107421768 107700798 108199894
21172 108199894 108883342 109633197 110317284 110692842 110635479 110427624 110468223 110825886 111166841
21163 111166841 111255243 111002634 110593496 110314178 110056470 109726619 109366888 109040598 108830705
21154 108830705 108787440 108823077 108937645 109259984 109677299 109951551 110163345 110496431 110875873
21145 110875873 111153256 111294716 111380923 111461464 111452866 111249697 111041518 110963083 110965268 111250656
21135 111250656 111828512 112567853 113266325 113805326 114194858 114229278 113657302 112710326 111805327
21126 111805327 111099983 110461688 109704527 109160630 109333249 109997489 110617809 111080093 111483258
21117A11483258N58585Q78888R27305M81751j34916k92800m2489k6954j51929
21108A13680699L3210K53974K11690K29591L15137J67525o6434j70178n4195R9567
21098A14700586j7711l09646o07832m55529J83514P05180O99281J83206n33885
21089A14547164r35185p60352l06099l5724p3559j20043P8016L68966N48692N67995
21079A13879871N39545N31221L21915L8697J57824M86389N59929L49629P3297
21070A16938317j09374q4168o620L58M5995Q0647N4438m6308j12027N1887J97761
21059A17010906K52998L57623L89234K90504M968k05979N5744N25079P21672M33950
21049A19836699k0525j08069m3153j50701k16902k69008l12978j04524K00781
$$ plain form
21117 111483258 112041843 112920731 113848036 114329787 114194871 113902071 113859582 113832628 113680699
21108 113680699 113713909 113967883 114179573 114409164 114724301 114891826 114825392 114655214 114601019 114700586
21098 114700586 114682875 114373229 113765397 113309868 113493382 114198562 114897843 115081049 114547164
21089 114547164 113611979 112851627 112545528 112509804 112436245 112316202 112394218 112763184 113311876 113879871
21079 113879871 114419416 114950637 115272552 115311249 115469073 115955462 116515391 116865020 116938317
21070 116938317 116828943 116744775 116738155 116738513 116784508 116865155 116919593 116873285 116761258 116813145 117010906
21059 117010906 117263904 117621527 118010761 118301265 118306233 118100254 118155998 118681077 119402749 119836699
21049 119836699 119816174 119708105 119664952 119514251 119297349 119028341 118715363 118610839 118811620
21040A18811620L61067M72478Q91288J323399J331279R83573L26059o2218J86427
21031A24624972M93105N44297O61183Q57094Q78031P26662N52517O07437R17944
21022A30863242J092964R83215P82398N53005M96608O99862R91873J352995J457584
21013A39273746Q54402l96357j719223k590368l349311m343753n441637o314539
21005A15972960o510560n513539l530216j433169Q8363Q16545J104763J389144
20997A02384291J698031J770866J422520O27071p67599k705267m775512o289552
20989I3364849o246896m643072k532686p01274M35250Q78414R87776R69636P31142
20980H3243139K76703J0638K10057Q10024J328763J530034J762500J860039J237554
$$ plain form
21040 118811620 119172687 119645165 120536453 121859852 123191131 124174704 124500763 124438545 124624972
21031 124624972 125118077 125662374 126323557 127180651 128058682 128785344 129337861 129945298 130863242
21022 130863242 131956206 132939421 133721819 134274824 134771432 135471294 136463167 137816162 139273746
21013 139273746 140128148 139731791 138012568 135422200 132072889 127729136 122287499 115972960
21005 115972960 109462400 103948861 100418645 98985476 99073839 99890384 100995147 102384291
20997 102384291 104082322 105853188 107275708 107902779 107135180 104429913 99654401 93364849
20989 93364849 87117953 82474881 79942195 79240921 79676171 80554585 81542361 82511997 83243139
20980 83243139 83519842 83530480 83740537 84550561 85879324 87409358 89171858 91031897 92269451
20971I2269451M72887M25283M37397J54104P6996J61155L37324N51777L77549
20962I5263923J37641N15765J084709J231134J000817N23143Q1029p3399m2963
20953I9721799K31702O72568P98648M63162o9828m29356l11127J85251M94115
20944A01756934N18149L74828K45308N4444j39534j56178j08872m1269p8623o6699
20934A02358488J81976L60594J23084m28652q65477j034062j064704r28100q06360
20925I7896787r26147j039776q60054m63857O4105O85884J025643P05653N0676
20916I7138914l09191m10464n25242m39672j10185K90539O38850P65130N74525
20907I7613204J05696k65107l42553k62702k07996j10871m1628q4108j53925j19761
$$ plain form
20971 92269451 92742338 93167621 93605018 93759122 93836118 93997273 94334597 94886374 95263923
20962 95263923 95401564 95917329 97002038 98233172 99233989 99757132 99838161 99764762 99721799
20953 99721799 99953501 100626069 101424717 101887879 101818051 101388695 101077568 101262819 101756934
20944 101756934 102275083 102649911 102895219 102949663 102810129 102653951 102545079 102503810 102425187 102358488
20934 102358488 102540464 102901058 103024142 102595490 101730013 100695951 99631247 98703147 97896787
20925 97896787 96970640 95930864 95070810 94606953 94671058 95356942 96382585 97088238 97138914
20916 97138914 96829723 96419259 95894017 95454345 95344160 95634699 96273549 97038679 97613204
20907 97613204 97718900 97453793 97111240 96848538 96640542 96529671 96488043 96403935 96250010 96130249
20897I6130249N5220M10603Q00379R37181Q32074M94131R4628k16728m53936n51472
20887I8532329m48071j4105L72368K82822O2195j8153K08528N03495N57043K48407
20877A00286858j81160k87345j17067M0244Q9977J77056M14253N54384M58169
20868A01435369J85988k4508q8604j09613l6182L3281J2352M5493Q2670Q3027
20858A01619273J02176O9156j13452l50364o55365o60113k65752L7356K89110
20849A00072025N32074O29289O36612M98408L14504L62075M42248L16143J08663
20840A03912041j40659k80155m27839m49224j34172Q6642j4515k69760l34608
20831A01947751j87125j58808j13265L20819Q55566Q27878K32898k28591l03678
$$ plain form
20897 96130249 96185469 96596072 97396451 98333632 99165706 99659837 99754465 99537737 99083801 98532329
20887 98532329 98084258 98070153 98442521 98725343 98787538 98769385 98977913 99481408 100038451 100286858
20877 100286858 100105698 99818353 99701286 99741530 99831507 100008563 100422816 100977200 101435369
20868 101435369 101621357 101596849 101508245 101398632 101362450 101395731 101408083 101453576 101536246 101619273
20858 101619273 101721449 101790605 101677153 101326789 100671424 100011311 99745559 99782915 100072025
20849 100072025 100604099 101233388 101870000 102368408 102682912 103044987 103487235 103803378 103912041
20840 103912041 103771382 103491227 103063388 102614164 102479992 102566634 102552119 102282359 101947751
20831 101947751 101760626 101601818 101488553 101809372 102664938 103492816 103725714 103497123 103193445
20822A03193445l17758l53546m59313o32411o23759m32892k32063K3807K23347
20813A00388857K66031J13713j45868j42069L69669R13613R77677O02214J41655
20804A03485492k56465o55345q69548o76338k02200J54659L39805M85473L96890
20795A02202423R7803o4824O9525K67925L85284N27598O04262M73073K64972J26663
20785A04954704K8717j58305l33576l57196m22534n66082n11258j61101K99277
20776A02772646M78228L00087J86944J15298l1399k2555J60690K68092O8982l25548
20766A03971465m60878q7683L24063L59504L9256k23642j39241K5661Q8435J34406
20756A04031346K24519L46041N42163P83166R45725P55871J12999q01775j545740
$$ plain form
20822 103193445 102875687 102522141 102062828 101430417 100806658 100373766 100141703 100165510 100388857
20813 100388857 100654888 100768601 100622733 100480664 100850333 101763946 102741623 103343837 103485492
20804 103485492 103229027 102573682 101704134 101027796 100825596 100980255 101320060 101805533 102202423
20795 102202423 102300226 102235402 102304927 102572852 102958136 103485734 104089996 104563069 104828041 104954704
20785 104954704 104983421 104825116 104491540 104134344 103711810 103145728 102634470 102473369 102772646
20776 102772646 103250874 103550961 103737905 103853203 103821804 103799249 103959939 104228031 104297013 103971465
20766 103971465 103510587 103422904 103746967 104106471 104145727 103922085 103782844 103808505 103896940 104031346
20756 104031346 104255865 104601906 105144069 105927235 106872960 107628831 107741830 106940055 105394315
20747A05394315j625009j098822n51979k67621k73541m46657l17463J62191O88680
20738A01664094J136711J176714Q09930L16477k17097n68745n14663k63931j20287
20729A03419203q8590O6563K14331K68675M63009P60089P96517M54390j9275k42848
20719A06092064j17286O1622N4716q5287j44244o9888j76241l04446k86928k67185
20709A04756897j01170M01842R43804J067232O80170Q5115l47336k99012r593
20700A07177949q2641l83722m29652q3429L18835N77120N53052K06366j0976J1951
20690A07854853j36186o27412j008819r19065n89721m11249m74541m89994l37577
20681A02860289j32254J12034L67210N38474Q34791J157287J043375N80193K54029
$$ plain form
20747 105394315 103769306 102670484 102118505 101850884 101577343 101130686 100813223 100975414 101664094
20738 101664094 102800805 103977519 104787449 105103926 104886829 104318084 103803421 103539490 103419203
20729 103419203 103330613 103397176 103611507 103880182 104343191 105103280 105899797 106354187 106334912 106092064
20719 106092064 105974778 106036400 106091116 106005829 105861585 105791697 105615456 105311010 105024082 104756897
20709 104756897 104655727 105057569 106001373 107068605 107748775 107833890 107486554 107187542 107177949
20700 107177949 107095308 106711586 106281934 106198505 106517340 107094460 107647512 107853878 107842902 107854853
20690 107854853 107718667 107091255 106082436 105163371 104573650 104162401 103687860 103197866 102860289
20681 102860289 102728035 102840069 103207279 103745753 104580544 105737831 106781206 107361399 107615428
20672A07615428K23887K47850J29988J5695j24561l77736m50209l40493l75682
20663A06564167o04621n65267j47442L14529O64459P58555N13535k2028p31083
20654A06744804j002359m06749M53288R03849P42972K41250r4865K5846J15967
20645A07724003j26094k36111j30079j29031j48293n661O2333M4955P2055L550
20635A07131627l00440n59218o42660l63918J05867K43393K06525K03393L20159
20626A06344728M89870M54937L46996M10813L06236l4881l13671m00641l36130
20617A07268257m29347o84136o91392k47787L55455O15454N02354L91173L36558
20608A07416589N1855j99298j24586L0145Q230q7946j64503q4168K12953K94375
$$ plain form
20672 107615428 107839315 108087165 108217153 108232848 108108287 107730551 107280342 106939849 106564167
20663 106564167 105959546 105394279 105246837 105561366 106225825 106984380 107497915 107475887 106744804
20654 106744804 105742445 105335696 105788984 106692833 107435805 107677055 107582190 107608036 107724003
20645 107724003 107597909 107361798 107231719 107102688 106954395 106948734 107011067 107056022 107128077 107131627
20635 107131627 106831187 106271969 105629309 105265391 105371258 105614651 105821176 106024569 106344728
20626 106344728 106834598 107289535 107636531 108047344 108353580 108318699 108005028 107604387 107268257
20617 107268257 106838910 106154774 105463382 105215595 105571050 106186504 106688858 107080031 107416589
20608 107416589 107468444 107269146 107144560 107174705 107182935 107094989 106930486 106846318 107059271 107353646
20598A07353646m4074l96797n33507l52273k07593m71030p51073o65663j67908
20589A03763728L36698O14595N47527L07680K28413J40300j7218q3631J00144
20580A05938236M65653P71539P01097K36804j60450l52747m50803m30852j86758
20571A06531719K06298M74473O01451P07784N09892k10398j026114j213817r06883
20562A05674405m83297J0774M59157N95372L36336p2367m78186p22844o37091
20553A04682259l36186O0997M21836N54773M95909K64402l8580j20583J87388
20544A06172215O48941P67043M63686J20778j84622l59201j42983J38599J38983
20535A07763439r9097l66765n50895m96549j86314Q0872K63527M94761P58565
$$ plain form
20598 107353646 107309572 106912775 106379268 106026995 105819402 105348372 104597299 103931636 103763728
20589 103763728 104100426 104715021 105262548 105570228 105798641 105938941 105921723 105838092 105938236
20580 105938236 106403889 107175428 107876525 108113329 107952879 107600132 107149329 106718477 106531719
20571 106531719 106738017 107212490 107813941 108521725 109031617 108821219 107795105 106581288 105674405
20562 105674405 105191108 105201882 105661039 106256411 106592747 106520380 106042194 105319350 104682259
20553 104682259 104346073 104407070 104828906 105383679 105879588 106143990 106105410 105984827 106172215
20544 106172215 106821156 107588199 108051885 108172663 107988041 107628840 107485857 107624456 107763439
20535 107763439 107664342 107297577 106746682 106250133 106063819 106144691 106408218 106902979 107661544
20526A07661544Q67575O88938J69787l29095l71052k3548K21725k11595o60281
20517A08013998l88100O4081K04818L16753N96460P24301M08734r3995m59080
20508A09387970l95293J30699P57642J056154O91733O7932k58395k45266j09435
20499A11083741l0722l00523p32601q73495o05041k01067k16500n73233n84026
20490A06966533j71784K27199L60644K54597J32089J52707K19291K7889l39666
20481A07829499m58978l38896j88283j64320k1398L35453N81245N74257K31567
20472A08380146k18998k76718p0258M804j72156o38263r97452r19570n80775j42024
20462A04368736J30124R680j59572N6943N58837P54264O17754M33759K24553J00178
$$ plain form
20526 107661544 108529119 109218057 109387844 109058749 108687697 108664149 108885874 108674279 108013998
20517 108013998 107625898 107689979 107894797 108211550 108808010 109532311 109941045 109847050 109387970
20508 109387970 108992677 109123376 109881018 110937172 111628905 111696837 111438442 111193176 111083741
20499 111083741 111053019 110752496 110019895 109146400 108541359 108340292 108123792 107550559 106966533
20490 106966533 106794749 107021948 107382592 107637189 107769278 107921985 108141276 108169165 107829499
20481 107829499 107370521 107031625 106843342 106679022 106657624 106993077 107574322 108148579 108380146
20472 108380146 108161148 107884430 107814172 107818976 107646820 107008557 106011105 105091535 104510760 104368736
20462 104368736 104498860 104508540 104348968 104405911 104964748 105719012 106336766 106770525 106995078 107095256
20452A07095256K12350K89284K12851K14986L99753O18205N73064M95276N39556
20443A10650581M36453J74212Q8248J16888K28293L00536O9689j16261m5265J05015
20433A12008389K37107K17505J99793K68741L11234J58939l64295p68152p32540
20424A11536721m57713j34816J00652J82572K49346M38747N76405L59596m4828
20415A12806682k15645k18060j86653m5868q3826l37904n32227n54728l62942
20406A10268829k49928l10033l21848j61486J27901K88503K95842J61161j10640
20397A09988301j39639K46669N19380K24105k57492k46720Q0872Q7288k65337
20388A10237427n74730o13052k94371N833K0591K89565O52095N64457K96337K51849
$$ plain form
20452 107095256 107307606 107596890 107809741 108024727 108424480 109042685 109615749 110111025 110650581
20443 110650581 111087034 111261246 111349494 111466382 111694675 111995211 112064900 111948639 111903374 112008389
20433 112008389 112245496 112463001 112662794 112931535 113242769 113401708 113037413 112269261 111536721
20424 111536721 111079008 110944192 111044844 111227416 111476762 111915509 112491914 112851510 112806682
20415 112806682 112591037 112372977 112186324 112140456 112056630 111718726 111186499 110631771 110268829
20406 110268829 110018901 109708868 109387020 109225534 109353435 109641938 109937780 110098941 109988301
20397 109988301 109848662 110095331 110614711 110838816 110581324 110334604 110415476 110502764 110237427
20388 110237427 109662697 109049645 108755274 108761107 108781698 109071263 109723358 110287815 110584152 110836001
20378A10836001L15192K29654J66250J33146L5969j27045k56995k81727k32407
20369A10818038r0650q2303l43995n10255m00087k10104k01483k43746Q176M77215
20359A09220806J034472J497704J501509J021219L99023k14647o27236n32605
20351A13300245j13259J21807O8295k32466p03530j054187q92987m27380j37724
20342A09928814r9893j34303k11649k49236k42030k34086j63446j04263p1998
20333A08417910n962J03413J03329O3257J68045L13679N12545P87987R04076O57760
20323A12026039J98548l55106o24500l24955J99080N83791N69404J93562k09646
20314A12256217k91249j69946k78221o07081q33503o43687j51907J47079K05130
$$ plain form
20378 110836001 111151193 111380847 111547097 111680243 111716212 111589167 111332172 111050445 110818038
20369 110818038 110727388 110645085 110301090 109790835 109390748 109180644 108979161 108735415 108743591 109220806
20359 109220806 110255278 111752982 113254491 114275710 114674733 114460086 113832850 113300245
20351 113300245 113186986 113308793 113377088 113144622 112441092 111386905 110493918 110066538 109928814
20342 109928814 109828921 109694618 109482969 109233733 108991703 108757617 108594171 108489908 108417910
20333 108417910 108411948 108515361 108618690 108681947 108849992 109163671 109676216 110464203 111368279 112026039
20323 112026039 112224587 111869481 111244981 110920026 111119106 111702897 112272301 112465863 112256217
20314 112256217 111964968 111795022 111516801 110909720 110076217 109432530 109280623 109427702 109632832
20305A09632832K09186K09807P3026j36906r8445J64253L49853J31156k71164
20296A10263598l20826m1478J00447q2888l53013l54350q8486K40410N44570N25947
20286A10433931K64174R1067j34657m19747m92728m7966P98007J346689J204610
20277A13043380Q44613O61509N05739K69548n474k40777l86043l54962l05421
20268A14032112m50943n25557l88960k59405l00089l67057k14175J66408M57251
20259A12149585L56517K8330k10643l66741l15870l4246L36003O06086M39469
20250A12988490J13420l7300j49709j81702J2738L48087N63712L42615j00956
20241A13899395j49791K34046M38581J36758l60786m63219J10173P21158Q51026
$$ plain form
20305 109632832 109842018 110051825 110124851 109987945 109889500 110053753 110403606 110534762 110263598
20296 110263598 109942772 109901294 110001741 109918853 109565840 109211490 109123004 109363414 109907984 110433931
20286 110433931 110698105 110789172 110654515 110234768 109742040 109694074 110492081 111838770 113043380
20277 113043380 113887993 114549502 115055241 115324789 115319315 115078538 114692495 114337533 114032112
20268 114032112 113581169 113055612 112666652 112407247 112107158 111740101 111525926 111692334 112149585
20259 112149585 112506102 112534432 112323789 111957048 111641178 111606932 111942935 112549021 112988490
20250 112988490 113101910 113064610 112914901 112733199 112745937 113094024 113657736 114000351 113899395
20241 113899395 113749604 113983650 114422231 114558989 114198203 113734984 113845157 114566315 115417341
20232A15417341O13923K06556q1970l3827K20126L59582K50812K52833M86633
20223A17692009M87009L02948K67832L73733K65299k86129p83225p12233m89180
20214A17118063m07731l53292k16717q4666J898k6718k03297l17457j63402K02558
20204A15549239M16768K99230J28678k0521j70479j57525J22180N54640P18629
20195A17440839M77176J24705j82637l19213k17000j41926q9023q5106k03764
20186A16804051k12697r2607J47005M05248M47258K68996L157k32637j84197j6972
20176A17336605j14296k32611q7275J52333L14470L03023J65457j3469j47384
20167A17676853o6155L1325q5105l04183o24091j014601j066837o29858J69187
$$ plain form
20232 115417341 116031264 116237820 116155850 116122023 116342149 116701731 116952543 117205376 117692009
20223 117692009 118179018 118481966 118749798 119123531 119388830 119102701 118319476 117607243 117118063
20214 117118063 116710332 116357040 116140323 116055657 116057555 116030837 115827540 115510083 115346681 115549239
20204 115549239 115966007 116265237 116393915 116373394 116202915 116045390 116167570 116722210 117440839
20195 117440839 117918015 118042720 117860083 117540870 117323870 117181944 117092921 117007815 116804051
20186 116804051 116591354 116498747 116645752 117051000 117498258 117767254 117770411 117537774 117353577 117336605
20176 117336605 117222309 116989698 116902423 117054756 117369226 117672249 117837706 117824237 117676853
20167 117676853 117610698 117642023 117556918 117252735 116628644 115614043 114547206 113917348 114086535
20158A14086535Q84734J172280J050442P82030O16614M74782L79825L27041R2322
20149A19866605k42502l12270k919J59091J2407n1987l9197k68687l94125k6098
20139A18700318L55692L01609p6080k12888k3695R1408Q4870J38172K69222K93234
20129A19921862K02751K51406L01310J42327J10177N2288l31555q23739j004734
20120A18822093o06504N5058N06005P85974R14895P74489N91348O07579N96839
20111A23047776K43053j70224k73823j64491j66037k73172k50542j10959O6452
20102A21948033L14017O14212N74042L48063K92871J69390j41181m43328m80257
20093A23195862l67857k89917k89841j48270K09845M64839N28337O32681Q09419
$$ plain form
20158 114086535 114971269 116143549 117193991 117976021 118592635 119067417 119447242 119774283 119866605
20149 119866605 119624103 119311833 119308914 119468005 119480412 119428425 119389228 119120541 118726416 118700318
20139 118700318 119056010 119357619 119281539 119068651 119044956 119136364 119221234 119359406 119628628 119921862
20129 119921862 120124613 120376019 120677329 120819656 120929833 120982121 120650566 119826827 118822093
20120 118822093 118215589 118270647 118776652 119562626 120477521 121252010 121843358 122450937 123047776
20111 123047776 123290829 123120605 122846782 122682291 122516254 122243082 121992540 121881581 121948033
20102 121948033 122262050 122876262 123450304 123798367 124091238 124260628 124119447 123676119 123195862
20093 123195862 122828005 122538088 122248247 122099977 122309822 122774661 123302998 123935679 124745098
20084A24745098P72901N94271M85585L12297l2406m31127m51178m0226L84149
20075A26339364N31634K97279j06991k78426j27505Lm9654j91812j93369M3023
20065A26263546J41759L1661J33541N06251P04293O42692N60376L83806O9423
20056A29437348L1780M05434Q71324R51765N24858J19571N1856J43395M26878
20047A32964209Q22136Q65427M23353k58754p80563r01201m75991J95955M48358
20038A33302929K75152J01630J69887M11762O25905Q62837R64087P50307K86581
20029A37751077l31312p24913n94636r5762M91874J030630J182953R91091O74834
20020A40375836K83487o0328m6414L85959Q50176J041749J059708R54887P45165
$$ plain form
20084 124745098 125517999 126112270 126597855 126910152 126877746 126446619 125995441 125955215 126339364
20075 126339364 126870998 127168277 127061286 126782860 126655355 126655358 126605704 126413892 126220523 126263546
20065 126263546 126405305 126436966 126570507 127076758 127781051 128423743 128984119 129367925 129437348
20056 129437348 129469128 129874562 130745886 131697651 132222509 132342080 132393936 132537331 132964209
20047 132964209 133786345 134651772 135075125 134816371 134035808 133134607 132658616 132854571 133302929
20038 133302929 133578081 133679711 133849598 134261360 134887265 135750102 136714189 137464496 137751077
20029 137751077 137419765 136694852 136100216 136004454 136496328 137526958 138709911 139701002 140375836
20020 140375836 140659323 140598995 140552581 140938540 141788716 142830465 143890173 144845060 145590225
20011A45590225O64172P45827O06410K70779J15333N6549j33327k90990p3746
20002A47551232L95938O81995O92376O64853P01790O20279O56167J058765J418613
19993A54442008J660650J874153J571921Q79576N25932N10585N65671N94326M85112
19984A63109934L88342O53517R82423J215287J434832J520689J477185J542318
19976A72324527J639050J765697K124301K369986K257438J887084J464798J510329
19968A87343210K084075K457523K372296K202020K280516K467352K677404K949575
19960B06833971L246271L746642M420965M827777M949059N213093N619012O027091
19952B44883881O546555P041997P193231O993818O564290N927702M462440J272940
$$ plain form
20011 145590225 146254397 147000224 147606634 147877413 147992746 148049295 147915968 147624978 147551232
20002 147551232 147947170 148629165 149321541 149986394 150688184 151308463 151964630 153023395 154442008
19993 154442008 156102658 157976811 159548732 160428308 160954240 161464825 162030496 162624822 163109934
19984 163109934 163498276 164151793 165134216 166349503 167784335 169305024 170782209 172324527
19976 172324527 173963577 175729274 177853575 180223561 182480999 184368083 185832881 187343210
19968 187343210 189427285 191884808 194257104 196459124 198739640 201206992 203884396 206833971
19960 206833971 210080242 213826884 218247849 223075626 228024685 233237778 238856790 244883881
19952 244883881 251430436 258472433 265665664 272659482 279223772 285151474 289613914 290886854
19944B90886854m293488j1940463j9646615k4585650k6246730k7575596l1456179
19937A45142133l7021151l9716051l6031602k7519665j8005980r778284l473556
19930b6404156J044739L944926N541468O505439P169331P343215O997898O560036
19922A8702896O236714N930367N637440N297059M791526M302718M001104L912427
19914E8812251L926067L962879M069215L863535L115080K430651K127164J936026
19906H4242868J925041K080846K378135K863633L350750L346774K850326K191591
19898A05229964J534775J264877J554696K118350K738798L193796L326981L208882
19890A24171119L103489L126470K919573K190636J040780r1143j099871k436567
$$ plain form
19944 290886854 286593366 274652903 255006288 230420638 204173908 176598312 145142133
19937 145142133 108120982 68404931 32373329 4853664 -13152316 -22930600 -26404156
19930 -26404156 -25359417 -21414491 -15873023 -9367584 -2198253 5144962 12142860 18702896
19922 18702896 24939610 30869977 36507417 41804476 46596002 50898720 54899824 58812251
19914 58812251 62738318 66701197 70770412 74633947 77749027 80179678 82306842 84242868
19906 84242868 86167909 88248755 90626890 93490523 96841273 100188047 103038373 105229964
19898 105229964 106764739 108029616 109584312 111702662 114441460 117635256 120962237 124171119
19890 124171119 127274608 130401078 133320651 135511287 136552067 136460924 135361053 132924486
19882A32924486m361122o736148q749294r110246p803170o091098m899872m589839
19874H0583697n126659o444267q758942j1446384j2772388j1397452q030379m615729
19866A1991497k002306j00812J170580K041448K635561K989931L042131K871357
19858B4639387K870907L014822K910015K476413K062779J857494J939062K287536
19850D4058415K803301L096015K890690K410681J868461J539604J562902J444175
19842F1674244J103110J125346J584246J861222J672819J426212J540280J772293
19834G3759772J875220J701202J355158J276323J439131J568161J503868J118087
19826H5596922O00275L56046N55161Q27326P91636Q59251J089220J102983R18945
$$ plain form
19882 132924486 128563364 121827216 113077922 103967676 96164506 90073408 85173536 80583697
19874 80583697 75457038 69012771 60253829 48807445 36035057 24637605 16607226 11991497
19866 11991497 9989191 9888379 11058959 13100407 15735968 18725899 21768030 24639387
19858 24639387 27510294 30525116 33435131 35911544 37974323 39831817 41770879 44058415
19850 44058415 46861716 49957731 52848421 55259102 57127563 58667167 60230069 61674244
19842 61674244 62777354 63902700 65486946 67348168 69020987 70447199 71987479 73759772
19834 73759772 75634992 77336194 78691352 79967675 81406806 82974967 84478835 85596922
19826 85596922 86197197 86553243 87108404 87935730 88727366 89586617 90675837 91778820 92697765
19817I2697765O98899O16573R79940J608765J751388J166286M08608J09932L04207
19808A00342363O09835R52881J289802J531358J734113J702109J311400Q49294
19800A10323155Q78733J452266J828169J590510J188723P44274K78122K3043k96467
19791A18010528q51507j100402o67247J64629J086403J852246K173765K208032
19783A22876447K205391K277480K336249K175147K111232K405413K914395L353919
19775A42655673L497104L371163L424748L731501L709754L253172K938320K975988
19767A69557423K899938K511830J871247Q90175m9778p45691k206120n534817
19759A69194207j1617013k0857030l1257184l8326074l8347409l1735752k2735148
$$ plain form
19817 92697765 93396664 94013237 94993177 96601942 98353330 99519616 99928224 100038156 100342363
19808 100342363 100952198 101905079 103194881 104726239 106460352 108162461 109473861 110323155
19800 110323155 111201888 112654154 114482323 116072833 117261556 118005830 118283952 118306995 118010528
19791 118010528 117159021 116058619 115391372 115556001 116642404 118494650 120668415 122876447
19783 122876447 125081838 127359318 129695567 131870714 133981946 136387359 139301754 142655673
19775 142655673 146152777 149523940 152948688 156680189 160389943 163643115 166581435 169557423
19767 169557423 172457361 174969191 176840438 177730613 177680835 176935144 174729024 169194207
19759 169194207 157577194 136720164 105462980 67136906 28789497 -2946255 -25681403
19752b5681403j4903433q536125l031090J194759L605130M470423M584655M518247
19744c3778837M396921M346544M346964M246274M023193M034592M286996M339700
19736B42347M148000L799478L289356K793870K275493J930957J921081K147653
19728B2548235K361262K199531J684722J293894J405669J799774J945824J745596
19720C6984507J213499Q71092R77628R90602Q38824P98422P67231P40940P13712
19711D4896457Q46341J209093J408086J312891J162760J061075Q57117N98889
19703E3352709O56302Q93242R65337P98374O31776Q25770Q61691N90286N23259
19694F0098746N82467N09144L73100M16567O36706Q55835Q52710O13083K98536
$$ plain form
19752 -25681403 -40584836 -49120961 -52152051 -50957292 -47352162 -42881739 -38297084 -33778837
19744 -33778837 -29381916 -25035372 -20688408 -16442134 -12418941 -8384349 -4097353 242347
19736 242347 4390347 8189825 11479181 14273051 16548544 18479501 20400582 22548235
19728 22548235 24909497 27109028 28793750 30087644 31493313 33293087 35238911 36984507
19720 36984507 38198006 39069098 40046726 41037328 41876152 42674574 43441805 44182745 44896457
19711 44896457 45742798 46951891 48359977 49672868 50835628 51896703 52753820 53352709
19703 53352709 54009011 54902253 55867590 56665964 57297740 58123510 58985201 59575487 60098746
19694 60098746 60681213 61190357 61563457 61980024 62616730 63472565 64325275 64938358 65236894
19685F5236894K10185M53939O51501N43305K72793K12348J90014k83494r00397
19676F6587088r43118m16776j3999q355q4492k03364k80552j615O22583J121834
19666F6379234J320151J154163O60292K89812Q5145k0523k8013j2475K97148Q77204
19656G1002138J355791J446645J059012N13907J21297o9976j22097r3452j3536
19647G5199729J54286J53295l29180p00123m45420Q3205L61476L47747L33379
19638G5158394L48432L78877M54958M30823K37752O2611k6641j55734l19774k11578
19628G6358120K84238O83663O22629K14313k00233l09693j26916P9000J21485
19619G7726606J51792J37380m4482l40463o52740q25543q06267o24022j79596
$$ plain form
19685 65236894 65447079 65901018 66552519 67095824 67368617 67580965 67770979 67487485 66587088
19676 66587088 65643970 65227194 65213195 65204840 65120348 64916984 64636432 64634817 65257400 66379234
19666 66379234 67699385 68853548 69513840 69803652 69888797 69868274 69840261 69827786 70124934 71002138
19656 71002138 72357929 73804574 74863586 75377493 75498790 75428814 75306717 75213265 75199729
19647 75199729 75354015 75507310 75178130 74478007 74032587 74115792 74477268 74825015 75158394
19638 75158394 75506826 75885703 76340661 76771484 77009236 77071847 77045206 76889472 76569698 76358120
19628 76358120 76642358 77326021 77948650 78162963 77962730 77653037 77526121 77605121 77726606
19619 77726606 77878398 78015778 77971296 77630833 76978093 76152550 75346283 74722261 74542665
19610G4542665L75076O95312O36369K93043r8157k44664k10586r5393K65843O50665
19600G6810173P04028L58058p9374k28037j16904Q5543K92867J61059m07272r15557
19590G6664584q96957o04055l41568P2616O73551R61206P62410N19070M07914
19581G8218771L50675L81502M36451K81882n2300m51103p20561n38307k4150M74043
19571G8356903O22756L97118L10910M82441M72558K20737o6442p9635J74567M18566
19561H1310479N31569N01302L61526J90479K13511L87935N75242P77399O87339
19552H5536781K28307k72761n50060n54217l42414k01529k48833k48213j01376
19543H3245685Q5457K17945K70246J63680o165o7953j39280l14393l12905o6096
$$ plain form
19610 74542665 74917741 75613053 76249422 76542465 76444308 76199644 75989058 75893665 76159508 76810173
19600 76810173 77514201 77872259 77792885 77564848 77447944 77533487 77826354 77987413 77580141 76664584
19590 76664584 75767627 75163572 74822004 74894620 75568171 76529377 77291787 77810857 78218771
19581 78218771 78569446 78950948 79387399 79669281 79616981 79165878 78445317 77907010 77882860 78356903
19571 78356903 78979659 79376777 79687687 80170128 80642686 80863423 80796981 80717346 80891913 81310479
19561 81310479 81842048 82343350 82704876 82895355 83108866 83496801 84072043 84849442 85536781
19552 85536781 85765088 85492327 84942267 84388050 84045636 83844107 83595274 83347061 83245685
19543 83245685 83331142 83549087 83819333 83983013 83976848 83908895 83769615 83455222 83142317 83076221
19533H3076221K19690K17076k59387q25330r01911n40660l14178m73031p31429
19524G9467061n36985q4437J99828L49661M04274M23905M15413M27917N44233
19515H1610870O89047O91045N02103J20141l32486m46247j43816K10930L37278
19506H3238865K78521J04329j44386k74743l54436m05290l27697k30397N9286
19497H1944052M58195O23046N30540L49946K89363L64623L87980K63300J75503
19488H5386548J91531L37374L81931K96035K04583j7607l86099o71943p08010
19479H5014343n36594p9847K55484J52967p5345j26089j1704O5202k202k6901
19469H4629314Q2987L99416O65232L45997l82168r06100r96756p99656m37945
$$ plain form
19533 83076221 83295911 83512987 83253600 82428270 81526359 80985699 80671521 80198490 79467061
19524 79467061 78930076 78845639 79045467 79395128 79799402 80223307 80638720 81066637 81610870
19515 81610870 82299917 82990962 83493065 83613206 83280720 82834473 82690657 82901587 83238865
19506 83238865 83517386 83621715 83477329 83202586 82848150 82442860 82115163 81884766 81944052
19497 81944052 82402247 83025293 83555833 83905779 84195142 84559765 84947745 85211045 85386548
19488 85386548 85578079 85915453 86297384 86593419 86798002 86780395 86394296 85722353 85014343
19479 85014343 84477749 84397902 84653386 84806353 84731008 84604919 84593215 84658417 84656215 84629314
19469 84629314 84712301 85111717 85776949 86122946 85740778 84834678 83837922 83038266 82600321
19460H2600321J01141O05322R57978R02497M55526J04333q7751k38253k44869
19451H5156245r4985N5275K73945M01668K82821J60538K28076L13547Q1031k56426
19441H6601735m02257k79052O089J41118K89373M77604N04085L20103q1630m52862
19431H7124306m19588J49057P12105P62017L78873m4931k61780k30990k10764
19422H7958305l93823m52454k07598J32308M06547N02673L88630n2196m56564
19413H7825828n00954m32568l73532l10378j33578N954P4591K73035M19860K80609
19403H7128867N0470j18823k70263l07852l73594o39803q08586m31501K6L419
19393H4232360O4992L00290L15387M0534j62463k05515r6207J75931M42909N57612
$$ plain form
19460 82600321 82701462 83306784 84264762 85167259 85622785 85727118 85639367 85401114 85156245
19451 85156245 85061260 85116535 85390480 85792148 86074969 86235507 86463583 86777130 86858161 86601735
19441 86601735 86199478 85920426 85926515 86067633 86357006 86834610 87338695 87658798 87577168 87124306
19431 87124306 86704718 86853775 87565880 88327897 88706770 88661839 88400059 88169069 87958305
19422 87958305 87564482 87112028 86904430 87036738 87443285 87945958 88334588 88282392 87825828
19413 87825828 87324874 86892306 86518774 86208396 86074818 86080772 86155363 86428398 86848258 87128867
19403 87128867 87179337 87060514 86790251 86482399 86108805 85469002 84660416 84228915 84228941 84232360
19393 84232360 84297352 84597642 84913029 84953563 84791100 84585585 84489378 84665309 85108218 85665830
19383H5665830O43799P27750P29608O79003N04507M2180n11570m83805N6723M91576
19373H8545601Q30273J199614J469855J270947N96238n0108l87222l32342k02802
19364I2940054l51213n44434l84422j96524j31654J99299O06392N83801K72699
19355I2993998o4135k83723r1484L27222L17992j9282j82907m85292r84148j212535
19345I0315706j036303o89609o59237r43176p44905L00631J242899J290067Q64756
19336H9940829M57772K27075L21180O00448N42980J20053k78659n12659n71380
19327I0847639m83911l68057j64098L6664Q8715J41060M46738O94663M37540j74271
19317I1502682n55833n82647l22730J50417N17432N59214L33694O1394j93234
$$ plain form
19383 85665830 86309629 87037379 87766987 88445990 88950497 88992677 88481107 87997302 88054025 88545601
19373 88545601 89375874 90575488 92045343 93316290 93912528 93862420 93475198 93142856 92940054
19364 92940054 92588841 92044407 91659985 91463461 91331807 91531106 92137498 92721299 92993998
19355 92993998 92929863 92646140 92554656 92881878 93199870 93180588 92997681 92512389 91528241 90315706
19345 90315706 89279403 88589794 87930557 86987381 86242476 86543107 87786006 89076073 89940829
19336 89940829 90398601 90625676 90946856 91547304 92090284 92210337 91931678 91419019 90847639
19327 90847639 90363728 89995671 89831573 89868237 89956952 90098012 90544750 91239413 91676953 91502682
19317 91502682 90946849 90364202 90041472 90191889 90709321 91268535 91602229 91663623 91470389
19308I1470389m65187n28457l01304j04791L4925L16622N75237M01361j74191
19299I1224604n27436n13821l14383m3427q7287k26169J3607L73534M75338K26947
19289I0601507o2870k13374j36703J84037N02711M96160K02891j30710l26647
19280I1117002j71987P1164J27272J64963J79330k4873m01043n04864k59662J5679
19270I0312981K56193O16250J171746J476437J211654O76302J95348n2722j36007
19261I5728182j73006k47087m60781o21917m21843l3844K2257l19786o78250n72658
19251I2221267r1061K89825L95607K47849J53462J79229P7839J558K3428K9342
19241I3528345q2212k59505j32571J41539J68430L4290j47077k93997j96541k0690
$$ plain form
19308 91470389 91005202 90476745 90175441 90070650 90105575 90422197 90997434 91398795 91224604
19299 91224604 90697168 90183347 89868964 89825537 89738250 89512081 89525688 89899222 90374560 90601507
19289 90601507 90538637 90325263 90188560 90372597 90875308 91371468 91574359 91443649 91117002
19280 91117002 90945015 91016179 91143451 91308414 91487744 91462871 91061828 90556964 90297302 90312981
19270 90312981 90569174 91185424 92357170 93833607 95045261 95721563 95916911 95864189 95728182
19261 95728182 95555176 95308089 94847308 94225391 93803548 93769704 93791961 93472175 92793925 92221267
19251 92221267 92130206 92420031 92815638 93063487 93216949 93396178 93474017 93475575 93499003 93528345
19241 93528345 93446133 93186628 93054057 93195596 93364026 93398316 93251239 92957242 92760701 92740011
19231I2740011o4706k35593l39665j77189K12717K83337R6312Q550j65193l12384
19221I2046197k16586M2575L35392M48921J71627k31492k63016j5374J87957L34396
19211I2840597L52433J60625p1812m81527q85328o36774J16728O37591N46055
19202I2578588J2017l24518j51848K51695N37326O06966L53601k88483r19963
19193I2655381j121448q91642m79936m6524M05173P03762O83806O80069P41876
19184I3330517N20494Q9718k72334n32774p21253o40006l71915j76360M2076K40148
19174I1508311K51609J65722K30831K29716J84007K19144r659m38165o37030m05132
19164I1299354K46559O57566J92578o66969j033512p48677j32398J72006N1818
$$ plain form
19231 92740011 92675305 92439712 92100047 91922858 92135575 92418912 92515224 92523774 92358581 92046197
19221 92046197 91829611 91872186 92207578 92656499 92828126 92596634 92333618 92318244 92506201 92840597
19211 92840597 93193030 93353655 93281843 92800316 91914988 91278214 91394942 92032533 92578588
19202 92578588 92590605 92266087 92114239 92365934 92903260 93510226 93863827 93575344 92655381
19193 92655381 91533933 90642291 90162355 90115831 90521004 91224766 91908572 92588641 93330517
19184 93330517 93851011 93940729 93668395 93135621 92414368 91774362 91402447 91226087 91268163 91508311
19174 91508311 91759920 91925642 92156473 92386189 92570196 92789340 92779681 92341516 91704486 91299354
19164 91299354 91545913 92203479 92396057 91729088 90695576 89946899 89814501 89986507 90038325
19155I0038325M1300K32489K04313j16082l07370l55364k65977O0895L40169K86905
19145I0159603J08145P1020K18241L27790K50022J73515J16440l0776j98073l08323
19135I0887604k68753j22981N8759K10292K60458K28077J33737K4131o1743j23225
19125I1226356j30477j21828j30589j1828R9038q5497k77930k17084O6413L09568
19115I0726142K77601J85635L16490P88379J185706J049446M24464j87201m90665
19106I4275997o64699q33633p49571l06808J7796J01872J1900j70529l33224l18725
19096I1030376j30653k46558p82761j091806n51356K93167Q13256J001972R99633
19087I1335270R96056J036345Q53334L25172q3706j26740p7339j72537l19142
$$ plain form
19155 90038325 90079625 90312114 90516427 90400345 90092975 89737611 89471634 89532529 89872698 90159603
19145 90159603 90267748 90338768 90557009 90884799 91134821 91308336 91424776 91394000 91195927 90887604
19135 90887604 90618851 90495870 90554629 90764921 91025379 91253456 91387193 91411324 91349581 91226356
19125 91226356 91095879 90974051 90843462 90831634 90930672 90845175 90567245 90350161 90416574 90726142
19115 90726142 91003743 91189378 91505868 92294247 93479953 94529399 94953863 94766662 94275997
19106 94275997 93611298 92777665 92028094 91721286 91739082 91840954 91852854 91682325 91349101 91030376
19096 91030376 90899723 90653165 89870404 88778598 88227242 88520409 89333665 90335637 91335270
19087 91335270 92331326 93367671 94221005 94546177 94462471 94335731 94258392 94085855 93766713
19078I3766713l05311p9371N5961k65116p83137p35285p8788M71747O78103O71560
19068I3397076O28325O33617P25249P83024M27885r8325l81780n29779o10240
19059I4975052m57270j02202J78616K85483Q3948l87839p21742o39132k17152
19050I2997762K29697K74650j63746n68466n73872m81668l79922l67484m00818
19041I0566133l17226j92548K5672L69233P16641Q73801O59597L84397L53511
19032I3439211L53019K87638L92429P33581J019446Q64337L20816j60295m04094
19023I6846088m68366l82764k80706k00931k02449l65978o17570o95363m54282
19014I3177679O024N02411O33342L99238r346m58457n22410j35145L40984N53064
$$ plain form
19078 93766713 93461402 93382031 93437992 93172876 92389739 91654454 91575666 92047413 92725516 93397076
19068 93397076 94025401 94659018 95384267 96167291 96595176 96496851 96115071 95585292 94975052
19059 94975052 94517782 94415580 94594196 94879679 94963627 94575788 93854046 93214914 92997762
19050 92997762 93227459 93502109 93338363 92769897 92196025 91714357 91334435 90966951 90566133
19041 90566133 90248907 90056359 90082031 90451264 91167905 92041706 92701303 93085700 93439211
19032 93439211 93792230 94079868 94472297 95205878 96225324 97089661 97410477 97250182 96846088
19023 96846088 96377722 95994958 95714252 95513321 95310872 94944894 94327324 93631961 93177679
19014 93177679 93183703 93686114 94319456 94718694 94709348 94250891 93728481 93593336 93934320 94487384
19004I4487384N73755N86463M44949K6079m04376n79587m76403l13550k80544
18995I4064170j30288J82771L66718M05034M52334M10384L01060J43755m5419
18986I6150519n2509J26796K31464K71291M56219M40126K34401K36697J89392
18977I8284396K7639j84295m84566m87925m42873q08183j079012q36234l42958
18968I3645989q2853j70591j85169N2477L73740O78572O73088L02310k87050p74513
18958I4226000p76936n46709m96449o33772p48278n15797K7156M97524Q46724
18949I1879463J038073Q84126O93419N43011K35656l79888j023087j054274m59891
18940I2356608K77808O08285L37598l1382j38437q5937P3311K66475N08976M97789
$$ plain form
19004 94487384 95061139 95647602 96092551 96118630 95714254 95134667 94658264 94344714 94064170
18995 94064170 93933882 94116653 94483371 94888405 95340739 95751123 96052183 96195938 96150519
18986 96150519 96098010 96224806 96456270 96727561 97183780 97623906 97858307 98095004 98284396
18977 98284396 98312035 98127740 97643174 97155249 96712376 95904193 94825181 93988947 93645989
18968 93645989 93563136 93392545 93207376 93259853 93633593 94312165 94985253 95287563 95000513 94226000
18958 94226000 93449064 92902355 92405906 91772134 91023856 90508059 90535215 91032739 91879463
18949 91879463 92917536 93801662 94495081 95038092 95273748 94893860 93870773 92816499 92356608
18940 92356608 92634416 93242701 93580299 93548917 93410480 93324543 93397854 93664329 94173305 94671094
18930I4671094j13011p53237p56594l01067K49463L45828n2628k17539L825K13134
18920I3289268K94464L66381M76280N68701N60954L66552n4465m26779n51379
18911I4889977m52547k15875J3725K7048j35083j30096K4015J27250n486m67898
18901I3675030o37920l11097p6068l9993R2160M59929R59426J081863P58906M68996
18891I6431232K23090p2777k86875m42945n40207l46755k32205o23591j035688
18882I3073279j085808p52779j26856L74052L71757J05589q384l465j75629l51103
18872I1420653k34054k6532K24262N27087M71933J9251k82082r6270L65834O61683
18862I3051765N58814K83622N9155q4650j24829M2093L83881N67387N70943M84927
$$ plain form
18930 94671094 94558083 93804846 93048252 92747185 92996648 93342476 93289848 93072309 93076134 93289268
18920 93289268 93583732 93950113 94426393 94995094 95556048 95922600 95868135 95441356 94889977
18911 94889977 94437430 94221555 94235280 94262328 94127245 93997149 94021164 94148414 94142928 93675030
18901 93675030 93037110 92726013 92649945 92609952 92702112 93162041 94121467 95203330 95962236 96431232
18891 96431232 96654322 96581545 96294670 95851725 95311518 94964763 94732558 94108967 93073279
18882 93073279 91987471 91234692 91107836 91481888 91853645 91959234 91950850 91947385 91771756 91420653
18872 91420653 91186599 91160067 91384329 91911416 92383349 92402600 92120518 92024248 92390082 93051765
18862 93051765 93610579 93894201 93953356 93868706 93743877 93785970 94169851 94737238 95308181 95793108
18852I5793108K23625j03073l31841l28963n7863M60496Q11015O42160K68481
18843I7377145O8412J54948J78380k38364p03412q34637o72572j84971K08111
18834I5353040K01751O8966J08729L12000J99943j68226k88356k32821l31189
18825I5223837n56216p32822p66220o69449l50648J51531N89577P59820O55488
18816I4304898M74415N11475O69943O37064N43676K88684j79633n59707o74387
18807I6016428n08812j72018l1532j07650j26071O3318K86078L66754J12729k20861
18797I5678363k22930p9708k46220o87998q26896m95521k05205L6928J84462l3635
18787I3101640n07983p39823m56903j4424K71245L15468L05308M63028N31040
$$ plain form
18852 95793108 96016733 95913660 95581819 95252856 95194993 95655489 96466504 97108664 97377145
18843 97377145 97445557 97600505 97778885 97540521 96837109 96002472 95329900 95144929 95353040
18834 95353040 95554791 95623757 95732486 96044486 96244429 96076203 95787847 95555026 95223837
18825 95223837 94667621 93934799 93168579 92499130 92148482 92300013 92889590 93649410 94304898
18816 94304898 94779313 95290788 95960731 96597795 97141471 97430155 97250522 96690815 96016428
18807 96016428 95507616 95335598 95304066 95196416 95070345 95133663 95419741 95786495 95899224 95678363
18797 95678363 95455433 95375725 95129505 94441507 93614611 93119090 92913885 92950813 93135275 93101640
18787 93101640 92593657 91853834 91396931 91382507 91653752 91969220 92274528 92737556 93268596
18778I3268596L29387j2311k25020k31841J5207K24315K42475M00663N35919N51727
18768I5099117L53128o9290j68999J76869L57643K21741K0627r6870l6669J65837
18758I6023134K72074M9788l54176l47018j462Q2405j89233l12169m51269p24399
18748I4047675p46397l46784K46724O50773P01942N52164N75393O39547L70806
18739I6691843o1655l94444n10940m50958l58971m06652n49083m84583j15449
18730I3359108K23766L03266L07064L59394K56481L1177o7604j81292l42644k18544
18720I4030172K54365P65280J033606Q39663K90574j75110n48822o79142l89806
18711I5420780J0110K04725K10025J45216L4147j10075k51993l09343k68487j59987
$$ plain form
18778 93268596 93597983 93585672 93360652 93128811 93144018 93368333 93610808 94011471 94547390 95099117
18768 95099117 95452245 95382955 95213956 95390825 95748468 95970209 95990836 95893966 95857297 96023134
18758 96023134 96295208 96344996 95990820 95643802 95642340 95724745 95535512 95223343 94772074 94047675
18748 94047675 93301278 92954494 93201218 93851991 94553933 95106097 95681490 96321037 96691843
18739 96691843 96630188 96235744 95724804 95273846 94914875 94508223 93959140 93474557 93359108
18730 93359108 93582874 93886140 94193204 94552598 94809079 94840256 94772652 94591360 94248716 94030172
18720 94030172 94284537 95049817 96083423 96923086 97213660 97038550 96489728 95810586 95420780
18711 95420780 95430890 95635615 95845640 95990856 96025003 95914928 95662935 95353592 95085105 94925118
18701I4925118j73076l10300j27929L50230N28280J34092n13103r76289j047396
18692I2789627p68227j83459L90164P40130Q26733N90770L83316M88615O80069
18683I5937738O48412L33794K7779J5849J46471Q7782j52127m17726n97891o63408
18673I5366673o18642m68297j50381K90152O55985P73559M04248k14746l35285
18664I5703266J63235N91424O63859N87788N30838N27420M39022J93364K6594
18655I9426810J24875K91158K17128j68336o89965r98396q83706n04399l11308
18646I6503861n19687o34516l57431m4941J08870J67608J67217L60928P66975
18637I6518884O93169n8700q10598r27394n14769l4886J29720j26049n55943p57646
$$ plain form
18701 94925118 94752042 94441742 94313813 94664043 95192323 95326415 94813312 93837023 92789627
18692 92789627 92021400 91837941 92228105 92968235 93794968 94385738 94769054 95257669 95937738
18683 95937738 96586150 96919944 96947723 96963572 97110043 97197825 97045698 96627972 96030081 95366673
18673 95366673 94748031 94279734 94129353 94419505 95075490 95849049 96253297 96038551 95703266
18664 95703266 95866501 96457925 97121784 97709572 98240410 98767830 99206852 99400216 99426810
18655 99426810 99551685 99842843 100059971 99891635 99201670 98203274 97319568 96815169 96503861
18646 96503861 95984174 95349658 94992227 94947286 95056156 95223764 95390981 95751909 96518884
18637 96518884 97212053 97153353 96342755 95415361 94900592 94865706 94995426 94869377 94313434 93555788
18627I3555788n87371o4894N48327P37298M33240R3172j64807k6375L45112L07456
18617I5176946J09279K31793M81523N47923N00518L03157j42921o31840p52702
18608I5823676n64647k81770O3557L68117N55866N02371K63460m84k61082n17250
18598I5951814n68188k58054k4491p7959m40J60469L88002O12358O20013M82439
18588I7285963K54056m9759k25640l7168M07575O16625K11335n38401j084586
18579I6840000j348788j272640p56129q9063L60609M50726M93773P10701P58001
18570I6147190M32736L6789j7787K55628M05651L38515K01030p0686l25394l08408
18560I7095264k14276k04340j08829J82182M84573N56726K35904l56615q41531
$$ plain form
18627 93555788 92968417 92903523 93451850 94189148 94622388 94715560 94550753 94524378 94869490 95176946
18617 95176946 95286225 95518018 95999541 96547464 97047982 97351139 97208218 96576378 95823676
18608 95823676 95259029 94977259 95040816 95408933 95964799 96467170 96730630 96730146 96469064 95951814
18598 95951814 95383626 95125572 95101081 95023122 95022682 95183151 95571153 96183511 96803524 97285963
18588 97285963 97540019 97490260 97264620 97227452 97635027 98251652 98462987 97924586 96840000
18579 96840000 95491212 94218572 93462443 93373380 93733989 94184715 94678488 95389189 96147190
18570 96147190 96579926 96616715 96598928 96854556 97260207 97598722 97799752 97729066 97403672 97095264
18560 97095264 96880988 96676648 96567819 96750001 97234574 97791300 98027204 97670589 96829058
18551I6829058r10346o45866m17787l39236q4538K33985K69033J42680M151k18077
18541I4863057l87515j68994L86984Q94166J081090Q43900K44695m85684j012258
18532I6259441j143678r63814n40182n5018K91926N28018Q41790R46934O79025
18523I6844442M62233L90309L05877p9937n74906p54771n86376l59178m10985
18514I5236708l96150m6300K70285K44528n6389l62288m71555n68432p09182n99385
18504I2541840j31410M07770P31194R53985Q92816M38780k7382m93027q63549
18495I4451017q91668p00245n58699m91754l15674R3418N33439Q21308Q65396
18486I3806538O33578K75074P601k9823J19181K17722P3190L0107K34080K85403
$$ plain form
18551 96829058 95918712 95272846 94855059 94515823 94431285 94665270 94934303 95076983 95081134 94863057
18541 94863057 94475542 94306548 94693532 95587698 96668788 97512688 97757383 97271699 96259441
18532 96259441 95115763 94151949 93611767 93556749 93848675 94376693 95218483 96165417 96844442
18523 96844442 97306675 97696984 98002861 97922924 97348018 96593247 96006871 95647693 95236708
18514 95236708 94840558 94794258 95064543 95309071 95252682 94890394 94418839 93850407 93141225 92541840
18504 92541840 92410430 92818200 93549394 94503379 95396195 95834975 95807593 95314566 94451017
18495 94451017 93559349 92859104 92300405 91808651 91492977 91586395 92119834 92941142 93806538
18486 93806538 94440116 94715190 94722791 94692968 94812149 95029871 95103061 95133168 95367248 95652651
18476I5652651J00129q4780k48615q5650L02488M29988M27163N53107P19926P17381
18466I8483788L72319j94365o67912r08801j049637j013261n36976M3021L72416
18457I4900592N50922O24071M63777J96884O3163j20729m35429o31776o07858
18448I5003617l83047j727M11733O01532N29206L12204K9343l05281m23209l47179
18438I5427192l40065k95442j80612M327L32960O34983Q27834Q38811O86268N51353
18428I8487609K37773p4577r4379j69521m89781o83880p10231o25748m89184m10996
18418I4977085l35419k65131l74006p03167q11471l23479M25007Q46170P27326
18409I4162915L97059L46504M31059M56618M87032K94435J4104o87M088l4078
$$ plain form
18476 95652651 95752780 95668000 95419385 95333735 95636223 96066211 96493374 97046481 97766407 98483788
18466 98483788 98856107 98661742 97993830 97085029 96035392 95022131 94485155 94528176 94900592
18457 94900592 95451514 96075585 96539362 96736246 96799409 96678680 96243251 95611475 95003617
18448 95003617 94620570 94618843 95030576 95632108 96161314 96473518 96502861 96197580 95774371 95427192
18438 95427192 95087127 94791685 94611073 94615400 94948360 95583343 96411177 97249988 97936256 98487609
18428 98487609 98725382 98650805 98556426 98386905 97897124 97213244 96503013 95877265 95388081 94977085
18418 94977085 94641666 94376535 94002529 93299362 92487891 92164412 92589419 93435589 94162915
18409 94162915 94559974 94906478 95337537 95794155 96281187 96575622 96589726 96589039 96593127 96559049
18399I6559049r6390j93426k57484m8998M60261Q67537P67415L76121K00139K06282
18389I8840506L2181k35224k19846k28353l09559k49952m15212q14764j015013
18380I5384764o89975L3461O92250J059905Q07873J6756o58516p41380m25147
18371I5479991j29917k30857n25528m40253K9587M14096L70992K68989K74787
18362I5511887J8752l95923m28977j1069M27991M81741J14304m63322q33446p12142
18352I3709796l17947m1248J86873O49869R09125O34811n314o45303p78000m03277
18342I3899385P5608M15800L97889k4379m64786o61469n00197j74072k9438N5913
18332I2990254N02282R27261P55680K33691l4754L7072J70534M02572N24570N11511
$$ plain form
18399 96559049 96462659 96269233 96011749 95962751 96423012 97290549 98057964 98434085 98634224 98840506
18389 98840506 98872687 98637463 98417617 98189264 97879705 97629753 97214541 96399777 95384764
18380 95384764 94694789 94728250 95420500 96480405 97288278 97305034 96646518 95905138 95479991
18371 95479991 95350074 95119217 94593689 94153436 94183023 94597119 94968111 95237100 95511887
18362 95511887 95530639 95134716 94705739 94694670 95122661 95604402 95718706 95255384 94421938 93709796
18352 93709796 93391849 93350601 93537474 94187343 95096468 95731279 95725965 95080662 94302662 93899385
18342 93899385 93974993 94390793 94788682 94764303 94299517 93638048 93137851 92963779 92934341 92990254
18332 92990254 93492536 94419797 95175477 95409168 95374414 95411486 95582020 95984592 96509162 97020673
18322I7020673M64209L05653n5137m04242k87229K46122O13968N99282L66947
18313I8870246R3712k8950J02094K48163L34016K69256j40297o69413r05274p67668
18303I7405885n70811m97391m13440j13137M19717O93811M28068k851j69817k9902
18293I7150132L4786l35478p54790p39132l61269K75337Q61064J021309Q36507
18284I7988466M37830N1789p7694n0062n025M9716K01450K06667r4106m06055
18274I8302976l90777j89034n7515p7916l25960o42359n63231j70512K06369J65418
18264I6257459l42056o46934m58639j91526r7061m9534J44159K86098J40359N0577
18254I5092902L38443O69818O55603L85347p7943n97329p52754m73980j45180
$$ plain form
18322 97020673 97484882 97790535 97735398 97331156 97043927 97290049 97904017 98503299 98870246
18313 98870246 98963958 98935008 99037102 99285265 99619281 99888537 99748240 99078827 98173553 97405885
18303 97405885 96835074 96337683 95924243 95811106 96230823 96924634 97352702 97349851 97180034 97150132
18293 97150132 97184918 96849440 96094650 95355518 94994249 95269586 96130650 97151959 97988466
18284 97988466 98426296 98478085 98400391 98350329 98345304 98395020 98596470 98803137 98709031 98302976
18274 98302976 97912199 97723165 97665650 97587734 97261774 96619415 96056184 95885672 96092041 96257459
18264 96257459 95915403 95268469 94809830 94618304 94521243 94471709 94615868 94901966 95042325 95092902
18254 95092902 95431345 96101163 96756766 97142113 97064170 96466841 95714087 95240107 95094927
18245I5094927N2184O9846j33806l42839k62120l1495J54235J75505J294k16236
18235I4561495o5089K97862N54373P88562R83287J148755J227981R06258J90469
18226A00593953n21799r33758q46949l54094J3282P0238J90276K59222n1812n64267
18216I7854292r22274j001662o81560j59028K5354j07601n2002K19441L67307
18207I5542267K29959R552k65495j82610L38120N90354M11820K80364L49969L68628
18197I7672928K31333o3832l50444n01239o01921r04428j198233j110658n71177
18188I2602329J47470O58721P07370O33147O99102P75237O69766K99385o1370
18179I7131157k13868o6943K47178L60817J10348k76684m79932n49420n01772
$$ plain form
18245 95094927 95147111 95216957 95083151 94740312 94478192 94446697 94600932 94776437 94777731 94561495
18235 94561495 94496406 94794268 95348641 96137203 97120490 98269245 99497226 100403484 100593953
18226 100593953 100072154 99138396 98291447 97937353 97950635 98020873 98211149 98470371 98418559 97854292
18216 97854292 96932018 95930356 95248796 95089768 95115122 95007521 94955519 95174960 95542267
18207 95542267 95772226 95781778 95516283 95333673 95671793 96262147 96673967 96954331 97304300 97672928
18197 97672928 97904261 97840429 97489985 96988746 96386825 95482397 94284164 93173506 92602329
18188 92602329 92749799 93408520 94115890 94749037 95448139 96223376 96893142 97192527 97131157
18179 97131157 96917289 96850346 97097524 97458341 97568689 97292005 96812073 96262653 95760881
18170I5760881l82630m58291o15009o10613m01400o2117R6136J75857L65566N08359
18160I4376739N65037N44474O29126Q04835P82492N78468K58085l71046r46791
18151I7221419q81319l91043O402J8125l27675o69804n18687K9638L06132K42252
18141I5035440O8870k62277o49431r15852p85912k08641O50407J208389J084489
18132I5225482O06329J55562j01587k88923m78546n13215k55006R5702K51105
18123I4696903J22578j69887l51715l38342k65126j78520K9308K18655K16449
18114I3980303K08933L06414M54662M03102K69376J40505j19198n71514r17435
18105I4155148q67924n32557n6006M81442R43313R87376M44955k40785o18252
$$ plain form
18170 95760881 95378251 94919960 94304951 93694338 93292938 93230821 93326957 93502814 93868380 94376739
18160 94376739 94941776 95486250 96115376 96920211 97702703 98281171 98539256 98168210 97221419
18151 97221419 96340100 95949057 95955459 95973584 95645909 94976105 94457418 94487056 94793188 95035440
18141 95035440 95104310 94842033 94192602 93276750 92490838 92282197 92932604 94140993 95225482
18132 95225482 95831811 95987373 95885786 95596863 95118317 94605102 94350096 94445798 94696903
18123 94696903 94819481 94649594 94297879 93959537 93694411 93515891 93545199 93763854 93980303
18114 93980303 94189236 94495650 94950312 95353414 95622790 95763295 95644097 95072583 94155148
18105 94155148 93287224 92754667 92698661 93180103 94123416 95110792 95555747 95314962 94696710
18096I4696710q44727o32415R4349O33576P14157P73943R02904O67906J23002
18087I7129405l20805n07153n69975m62399j8763O49068J130863J102648M62023
18078I8594912j66487m08346n93936p31607o00532k88531j83912l89744m61685
18069I4770132o4993L15129K18914J92983M92178O32479M91478N3974m31597n37476
18059I6133201m21498l66109m33735n73672n42369k67221j40990l42861n23675
18050I2521071l10105J50003N66917O57514J75781n81543j029506q35132j86147
18041I1128853M36209Q36552J053701J031170Q49018O89431M42517P0169k30383
18032I6307237l76597l81615l10632j77190N3989L28946M13154R4463k99590k94609
$$ plain form
18096 94696710 93851983 93219568 93313917 93947493 94661650 95435593 96338497 97006403 97129405
18087 97129405 96808600 96301447 95731472 95269073 95250310 95899378 97030241 98132889 98594912
18078 98594912 98428425 98020079 97426143 96694536 96094004 95805473 95621561 95231817 94770132
18069 94770132 94705139 95020268 95239182 95432165 95924343 96556822 97048300 97102274 96670677 96133201
18059 96133201 95711703 95345594 94911859 94338187 93795818 93528597 93387607 93044746 92521071
18050 92521071 92210966 92360969 92927886 93585400 93761181 93179638 92150132 91315000 91128853
18041 91128853 91565062 92401614 93455315 94486485 95335503 96024934 96467451 96537620 96307237
18032 96307237 95930640 95549025 95238393 95061203 95115192 95444138 95857292 95951755 95652165 95357556
18022I5357556m351J30651J60711J10461N6976J40292J62821K24853L08608L54050
18012I7002628M15989M83789L95493J35776j04347l06384m50774o39362p87434
18003I6145374m16815K47252N76077O26849N22938K15667j52518l24923k43085
17994I7196816j4949K01942P2264j25882m7390J82543L04506K02493j26778n51646
17984I7293919r76291j374935j315960l63238P66163J075126O80536J58309j88473
17975I5755156k66923k37963l32194m70138l77697o5905J91622K60244L43593
17966I4799795M55950L29199P5517k15333l85311k61576J9100K69296N23951P25374
17956I6335962N76173K904n64319n87721k96063p1694K75474Q00388R79159O55563
$$ plain form
18022 95357556 95353205 95483856 95644567 95755028 95812004 95952296 96115117 96339970 96648578 97002628
18012 97002628 97418617 97902406 98297899 98433675 98329328 98022944 97572170 96932808 96145374
18003 96145374 95728559 95975811 96551888 97178737 97701675 97917342 97764824 97439901 97196816
17994 97196816 97181867 97383809 97456073 97330191 97282801 97465344 97769850 97972343 97845565 97293919
17984 97293919 96317628 94942693 93626733 93263495 94029658 95104784 95785320 95943629 95755156
17975 95755156 95488233 95250270 94918076 94447938 94070241 94004336 94195958 94456202 94799795
17966 94799795 95255745 95584944 95660461 95445128 95059817 94798241 94817341 95086637 95610588 96335962
17956 96335962 96912135 96915039 96350720 95762999 95466936 95395242 95670716 96471104 97450263 98105826
17946I8105826L64913K45644J14403j04044k38252k79387m63730n89911j05095
17937I7050367N44069P90493O23013J71707k39905m64865p82593j095764r84439
17928I5612083n21589o2423L41370P53361Q65539O12752J48537j42350m8455K35238
17918I7794063N52465M75466J343m10332p24265r33718j008681q79124n08723
17909I4358494L886M06370M20502j1759m20923l62033l692K25833J06455p0531
17899I4652602l6829n2521l0059J95191L68497M57189N54077N96044N49905M67308
17889I7721404M30102L70678J79061n624j31864k04971j74981k37069m17107n20907
17879I7008722m35735j15725K33535L36297J69441K5139P1209J12238Q8095J83861
$$ plain form
17946 98105826 98470739 98716383 98830786 98726742 98488490 98209103 97745373 97155462 97050367
17937 97050367 97594436 98384929 99007942 99179649 98939744 98474879 97692286 96596522 95612083
17928 95612083 95090494 95028071 95369441 96122802 96988341 97601093 97749630 97607280 97558825 97794063
17918 97794063 98346528 98821994 98823337 98413005 97688740 96755022 95746341 94867217 94358494
17909 94358494 94362380 94768750 95189252 95177493 94756570 94394537 94390845 94616678 94723133 94652602
17899 94652602 94615773 94563252 94533193 94728384 95096881 95554070 96108147 96704191 97254096 97721404
17889 97721404 98151506 98522184 98701245 98695621 98563757 98358786 98183805 97946736 97529629 97008722
17879 97008722 96572987 96457262 96690797 97027094 97196535 97221674 97292883 97405121 97493216 97677077
17869I7677077M03857N42920L87334R0260l8877l0935j67833m45210m72996j76638
17859I7768959K15075M88116L83071j53437p37040q94317p28189m83786k26207
17850I5632245l104K05563M39576P91674J094105R33419J96036o52726j173645
17841I7463143j266036q56426m51164l59422k84632j38217o3282j10047j33499
17832I3800418J23432N55896Q40495Q77919N57186Q5405l13599n76997o34667
17823I5315488l06965J57727M57981O76692P90460O58487J69935l93485n61528
17814I6964792m62109l81013j12654L76838P96211Q56005O09440K07476j63900
17805I8691086j58766J31146M18707N13196N91739N66928K23177l82213r56201
$$ plain form
17869 97677077 98080934 98623854 99011188 99101448 99062571 99031636 98863803 98418593 97945597 97768959
17859 97768959 97984034 98472150 98855221 98701784 97964744 97070427 96342238 95858452 95632245
17850 95632245 95629141 95834704 96274280 97065954 98160059 99093478 99289514 98636788 97463143
17841 97463143 96197107 95340681 94889517 94530095 94245463 94107246 94043964 93933917 93800418
17832 93800418 93923850 94479746 95320241 96198160 96755346 96840751 96527152 95950155 95315488
17823 95315488 95008523 95166250 95624231 96300923 97091383 97749870 97919805 97526320 96964792
17814 96964792 96502683 96121670 96009016 96385854 97182065 98038070 98647510 98854986 98691086
17805 98691086 98532320 98663466 99082173 99595369 100187108 100754036 100977213 100595000 99638799
17796I9638799j052740q84009q85264j248376j734303j657001q25270J16537O22722
17787I2091095N90617M39140N57952O97905N89807L92151J53539P6045J51444
17778I5739695Q3681r6653l62156m74752k63974J20748M26197M34768L44899L04096
17768I6256549L03108L55776M28102L09118O5869j301L086m3923n1216j2690K67480
17757I7879958N97271M20338j06731m00693k46608r51J04243J35901O9534j14437
17747I8337825k16091k15423k72274k38532j44885r2193j44523l37290n40763
17738I6135851o12895n96625n20890l12204k3546K41633M27434L81300P0904j29504
17728I5061458L66J15409j16535k98714l2274L61945M91807L94674J00880j70284
$$ plain form
17796 99638799 98586059 97702050 96816786 95568410 93834107 92177106 91351836 91468373 92091095
17787 92091095 92681712 93120852 93678804 94376709 94966516 95358667 95512206 95588251 95739695
17778 95739695 95823376 95726723 95364567 94889815 94625841 94746589 95172786 95607554 95952453 96256549
17768 96256549 96559657 96915433 97343535 97652653 97718522 97717221 97720307 97676384 97625168 97612478 97879958
17757 97879958 98477229 98897567 98790836 98390143 98143535 98142584 98246827 98382728 98452262 98337825
17747 98337825 98121734 97906311 97634037 97395505 97250620 97158427 97013904 96676614 96135851
17738 96135851 95522956 94926331 94405441 94093237 94069691 94311324 94738758 95120058 95190962 95061458
17728 95061458 95061824 95177233 95060698 94761984 94729710 95091655 95583462 95978136 96079016 95908732
17718I5908732k81771j82526J19662M16382M18550J31767q1059O5462K52725P8282
17708I6846206l25457n65483l44378R8426K24116K39483L17927L22224M44500
17699I7257564O09296M76091J4274n94735r61076r69705q91882p32236l56803
17690I3850788K91802R62926J127425P49621K48021k23511m11481k77090q8022
17681I6230479Q3681K41462L85150L75641K00315J78693L01373K54563r0769p83170
17671I7377418j334996j224693o26748P3352N31590M40160J11737l1079j08902
17662I5207839m5155J02445K62566N31993P10600O18492N63474N22137K67708
17653I8742099K6448J4015L6953j00763j37687J37826M28944K88204j25785m70516
$$ plain form
17718 95908732 95626961 95444435 95564097 95980479 96399029 96530796 96449737 96515199 96767924 96846206
17708 96846206 96520749 95955266 95610888 95709314 95933430 96172913 96490840 96813064 97257564
17699 97257564 97866860 98342951 98357225 97762490 96801414 95831709 94939827 94207591 93850788
17690 93850788 94142590 95105516 96232941 96982562 97230583 97007072 96595591 96318501 96230479
17681 96230479 96314160 96555622 96940772 97316413 97516728 97695421 97996794 98251357 98160588 97377418
17671 97377418 96042422 94817729 94190981 94264333 94795923 95236083 95347820 95316741 95207839
17662 95207839 95162684 95265129 95527695 96059688 96770288 97388780 97952254 98474391 98742099
17653 98742099 98768547 98782562 98819515 98718752 98581065 98718891 99147835 99436039 99310254 98839738
17643I8839738p05313p02710k67230J49768m4854n39999m94743O3051M58372N16629
17633I7272709K72440J0763R2647M53311P04466O14059L76626o8604m47755k07451
17623I9073211L12051N50828L95004l8693l42365l70228l79149o40227j001659
17614I7558773j020605p14500m13911k70238m21333m86111m190O36509P86137
17605I5650531L58551M2638L2123O2968Q1525o1349m85745r78268j209379j127823
17595I2365772p79951l85521k27551k07928o1516K41464M37188L74463l1280n15045
17585I1210095n38006P575O07784Q28345O97494O32123P19946O27015L89790P7956
17575I5260117j94062k22623p413L30435N46689M38728J82652k7586k53552m62190
$$ plain form
17643 98839738 98134425 97431715 97164485 97314253 97269399 96729400 96234657 96297708 96756080 97272709
17633 97272709 97545149 97555912 97648559 98101870 98806336 99420395 99797021 99728417 99280662 99073211
17623 99073211 99385262 99936090 100331094 100292401 99950036 99579808 99200659 98560432 97558773
17614 97558773 96538168 95823668 95409757 95139519 94718186 94232075 94227885 94864394 95650531
17605 95650531 96009082 96051720 96083843 96146811 96228336 96166987 95681242 94702974 93493595 92365772
17595 92365772 91585821 91200300 90972749 90764821 90703305 90944769 91381957 91756420 91725140 91210095
17585 91210095 90672089 90679664 91287448 92115793 92813287 93445410 94165356 94792371 95182161 95260117
17575 95260117 95066055 94843432 94836019 95166454 95713143 96151871 96334523 96306937 96053385 95591195
17565I5591195l38215k1969K10914M78621O20959L47750L7669j36833k40728j32999
17555I6416364K3205J76832K98487L25016K53353Q0854k21765p61256j234084
17546I5357006j130973n02455J70652N98382P40557M60776R7556L0390K19064
17537I6040955M36305L74706p2932m69006m88749k50528p3360j48561j14347K60163
17527I5494646M24512N5762k51186r7885K65793M42510M50278M50895L37319K29675
17517I7802319K30505L17400M01709J93747k62442o19128o72763n94357n41305
17508I6255685m52618j96462p3574k2261K01106K60073N0241j54226k47056l19855
17498I5301053l34207k35511j78367k71855m10890k92719O4346L13026L43696
$$ plain form
17565 95591195 95252980 95231011 95441925 95920546 96541505 96889255 96926924 96790091 96549363 96416364
17555 96416364 96439569 96616401 96914888 97239904 97493257 97574111 97352346 96591090 95357006
17546 95357006 94226033 93723578 93894230 94492612 95233169 95693945 95791501 95821891 96040955
17537 96040955 96477260 96851966 96779034 96310028 95821279 95570751 95497391 95348830 95234483 95494646
17527 95494646 95919158 95974920 95723734 95625849 95891642 96334152 96784430 97235325 97572644 97802319
17517 97802319 98032824 98350224 98751933 98945680 98683238 98064110 97391347 96796990 96255685
17508 96255685 95803067 95606605 95533031 95510770 95711876 95971949 96022190 95867964 95620908 95301053
17498 95301053 94966846 94731335 94552968 94281113 93870223 93577504 93641850 93954876 94298572
17489I4298572M08917N62061N38817M72561L31898P3938j55596m45809o06204
17480I5479155l69603p6075J33678K01907J27427J29839J48541K12651N61222
17471I6548742Q83887M29271m47229q22005n52374o1362J81304J59472J29668
17462I6449374J56612L8541l33947p59080r55060p99499k10256M08735P85888
17453I4781308R65628Q46403L39756j76072m53354m89246k79582j79282j82108
17444I5173451q8451J97871L82470K35844J82037L61786M18446L40250L17359
17435I7521063K38817q8325l90727m53432l11320J69648O64163Q10150P07542
17426I8867579N24561J97422l53646q68100r74597q06906n91636m9758M57781
$$ plain form
17489 94298572 94707489 95269550 95808367 96280928 96612826 96686764 96531168 96085359 95479155
17480 95479155 95109552 95033477 95167155 95369062 95496489 95626328 95774869 95987520 96548742
17471 96548742 97432629 97861900 97414671 96592666 96040292 95978930 96160234 96319706 96449374
17462 96449374 96605986 96644527 96310580 95551500 94596440 93796941 93586685 93995420 94781308
17453 94781308 95746936 96593339 96933095 96757023 96303669 95814423 95534841 95355559 95173451
17444 95173451 95085000 95282871 95665341 95901185 96083222 96445008 96863454 97203704 97521063
17435 97521063 97759880 97671555 97280828 96827396 96516076 96685724 97349887 98160037 98867579
17426 98867579 99392140 99589562 99235916 98367816 97393219 96586313 95994677 95944919 96402700
17417I6402700L49441j76596m90568k68715K52584P14911Q57256Q02471N96291
$$ plain form
17417 96402700 96752141 96575545 96084977 95816262 96068846 96783757 97641013 98443484 99039775
$$ [...]
##END NTUPLES=NMR SPECTRUM
##END=
