##TITLE=C13_DE-54H_2
 D2O, 22100sc

 27.12.2024
##JCAMPDX= 6.0         $$ Bruker NMR JCAMP-DX V2.0
##DATA TYPE= NMR SPECTRUM
##DATA CLASS= NTUPLES
##ORIGIN= UXNMR, Bruker Analytische Messtechnik GmbH
##OWNER= root
$$ XWIN-NMR		Version 3.5
$$ Sat Dec 28 13:38:12 2024 Russian Standard Time (UT+4h)  she@DPX200
##.OBSERVE FREQUENCY= 50.327896
##.OBSERVE NUCLEUS= ^13C
##.ACQUISITION MODE= SIMULTANEOUS
##.ACQUISITION SCHEME= undefined
##.AVERAGES= 19160
##.DIGITISER RES= 17
##SPECTROMETER/DATA SYSTEM= spect
##.PULSE SEQUENCE= zgpg30
##.SOLVENT NAME= DMSO
##.SHIFT REFERENCE= (INTERNAL, DMSO, 0, 222.565)
##AUDIT TRAIL= $$ (NUMBER, WHEN, WHO, WHERE, WHAT)
$$ ##TITLE= Audit trail, XWIN-NMR		Version 3.5
$$ ##JCAMPDX= 5.01
$$ ##ORIGIN= Bruker BioSpin GmbH
$$ ##OWNER= she
$$ F:/spectra/data/she/nmr/c13/1/pdata/1/auditp.txt
$$ ##AUDIT TRAIL=  $$ (NUMBER, WHEN, WHO, WHERE, WHAT)
(   1,<2024-12-28 10:56:54.18 +0400>,<she>,<DPX200>,
      <created by zg, POWCHK disabled, PULCHK disabled
       terminated by command 'halt'
       configuration hash MD5:
       00 E9 B6 7A A2 85 ED C7 34 08 36 98 17 FE 4E 26
       data hash MD5: 32K
       5C DC E4 54 7A 22 29 94 7D B2 1E 99 86 89 F9 A8>)
(   2,<2024-12-28 13:36:42.01 +0400>,<she>,<DPX200>,
      <Start of raw data processing
       efp BC_mod = 2 LB = 2 FT_mod = 6 PKNL = 1 PHC0 = -406.5862 PHC1 = 23.28833 SI = 32K 
       data hash MD5: 32K
       53 31 8C 51 7B C5 4F 77 B3 BD 8B 58 C7 C3 9E F0>)
(   3,<2024-12-28 13:36:44.89 +0400>,<she>,<DPX200>,
      <abs ABSG = 5 
       data hash MD5: 32K
       14 A6 6E 78 30 5A 8D 49 31 98 53 27 F2 D3 0D F2>)
(   4,<2024-12-28 13:37:22.09 +0400>,<she>,<DPX200>,
      <pk PHC0 = -17.40783 PHC1 = 22 
       data hash MD5: 32K
       DD 94 20 A5 F5 9C C7 2A 13 E4 DD 4B 54 A0 FC 07>)
(   5,<2024-12-28 13:37:25.37 +0400>,<she>,<DPX200>,
      <abs ABSG = 5 
       data hash MD5: 32K
       29 F5 01 4F 89 AA D0 8F F4 93 4C 9D C8 38 D1 E3>)
$$ ##END=
$$ 
$$ hash MD5
$$ 3F 58 35 30 37 78 B1 F6 2B F3 C3 F5 A6 D0 04 AC
##$RELAX= 
##$RELAX= 
##$RELAX= 
##$RELAX= 
##$RELAX= 
##$RELAX= 
##$RELAX= 
##$RELAX= 
$$ Bruker specific parameters
$$ --------------------------
##$DU= <F:/spectra>
##$EXPNO= 1
##$NAME= <c13>
##$PROCNO= 1
##$TYPE= <nmr>
##$USER= <she>
##$AMP= (0..31)
100 100 100 100 100 100 100 100 100 100 100 100 100 100 100 100 100 100 
100 100 100 100 100 100 100 100 100 100 100 100 100 100 
##$AQSEQ= 0
##$AQ_mod= 1
##$AUNM= <au_zg>
##$AUTOPOS= <>
##$BF1= 50.322709
##$BF2= 200.13
##$BF3= 50.322709
##$BF4= 500.13
##$BF5= 500.13
##$BF6= 500.13
##$BF7= 500.13
##$BF8= 500.13
##$BYTORDA= 1
##$CFDGTYP= 0
##$CFRGTYP= 5
##$CHEMSTR= <none>
##$CNST= (0..31)
1 1 145 1 1 1 1 1 1 1 1 1 1 1 1 1 1 1 1 1 1 1 1 1 1 1 1 1 1 1 1 1 
##$CPDPRG= <waltz16>
##$CPDPRG1= <>
##$CPDPRG2= <waltz16>
##$CPDPRG3= <>
##$CPDPRG4= <mlev>
##$CPDPRG5= <mlev>
##$CPDPRG6= <mlev>
##$CPDPRG7= <mlev>
##$CPDPRG8= <mlev>
##$CPDPRGB= <>
##$CPDPRGT= <>
##$D= (0..31)
$$ [...]
##$SUBNAM4= <"">
##$SUBNAM5= <"">
##$SUBNAM6= <"">
##$SUBNAM7= <"">
##$SUBNAM8= <"">
##$SUBNAM9= <"">
##$SW= 239.972175391363
##$SWIBOX= (0..15)
0 1 3 0 0 0 0 0 0 0 0 0 0 0 0 0 
##$SW_h= 12077.2946859903
##$TD= 32768
##$TD0= 1
##$TE= 0
##$TE2= 300
##$TE3= 300
##$TEG= 300
##$TL= (0..7)
120 120 120 120 120 120 120 120 
##$TP= (0..7)
150 150 150 150 150 150 150 150 
##$TP07= 0
##$TPNAME0= <>
##$TPNAME1= <>
##$TPNAME2= <>
##$TPNAME3= <>
##$TPNAME4= <>
##$TPNAME5= <>
##$TPNAME6= <>
##$TPNAME7= <>
##$TPOAL= (0..7)
0.5 0.5 0.5 0.5 0.5 0.5 0.5 0.5 
##$TPOFFS= (0..7)
0 0 0 0 0 0 0 0 
##$TUNHIN= 0
##$TUNHOUT= 0
##$TUNXOUT= 0
##$USERA1= <user>
##$USERA2= <user>
##$USERA3= <user>
##$USERA4= <user>
##$USERA5= <user>
##$V9= 5
##$VALIST= <valist>
##$VCLIST= <CCCCCCCCCCCCCCC>
##$VD= 0
##$VDLIST= <DDDDDDDDDDDDDDD>
##$VPLIST= <PPPPPPPPPPPPPPP>
##$VTLIST= <TTTTTTTTTTTTTTT>
##$WBST= 1024
##$WBSW= 4
##$XGAIN= (0..3)
0 0 0 0 
##$XL= 0
##$YL= 0
##$YMAX_a= 101559898
##$YMIN_a= -30540279
##$ZGOPTNS= <>
##$ZL1= 120
##$ZL2= 120
##$ZL3= 120
##$ZL4= 120
##$ABSF1= 222.5654
##$ABSF2= -17.4314
##$ABSG= 5
##$ABSL= 3
##$ALPHA= 0
##$AQORDER= 0
##$ASSFAC= 0
##$ASSFACI= 0
##$ASSFACX= 0
##$ASSWID= 0
##$AUNMP= <proc_1d>
##$AZFE= 0.1
##$AZFW= 0.5
##$BCFW= 0
##$BC_mod= 2
##$BYTORDP= 0
##$COROFFS= 0
##$CY= -3
##$DATMOD= 1
##$DC= 0
##$DFILT= <>
##$DTYPP= 0
##$F1P= 0
##$F2P= 0
##$FCOR= 0.5
##$FTSIZE= 32768
##$FT_mod= 6
##$GAMMA= 0
##$GB= 0
##$INTBC= 1
##$INTSCL= 4.134877e-10
##$ISEN= 128
##$LB= 2
##$LEV0= 0
##$LPBIN= 0
##$MAXI= 10000
##$MC2= 0
##$MEAN= 0
##$ME_mod= 0
##$MI= 0.1934396
##$NCOEF= 0
##$NC_proc= -1
##$NLEV= 6
##$NOISF1= 120.0001
##$NOISF2= 80.00006
##$NSP= 0
##$NTH_PI= 0
##$NZP= 0
##$OFFSET= 222.5654
##$PC= 1.4
##$PHC0= -423.994
##$PHC1= 45.28833
##$PH_mod= 1
##$PKNL= yes
##$PPARMOD= 0
##$PSCAL= 0
##$PSIGN= 0
##$REVERSE= no
##$SF= 50.3227345484362
##$SI= 32768
##$SIGF1= 140
##$SIGF2= 120
##$SINO= 11.81781
##$SIOLD= 32768
##$SREGLST= <13C.CDCl3>
##$SSB= 0
##$STSI= 32768
##$STSR= 0
##$SW_p= 12077.2946859903
##$SYMM= 0
##$S_DEV= 0
##$TDeff= 32768
##$TDoff= 0
##$TI= <>
##$TILT= no
##$TM1= 0
##$TM2= 0
##$TOPLEV= 0
##$USERP1= <user>
##$USERP2= <user>
##$USERP3= <user>
##$USERP4= <user>
##$USERP5= <user>
##$WDW= 1
##$XDIM= 32768
##$YMAX_p= 188627498
##$YMIN_p= -13082770
$$ End of Bruker specific parameters
$$ ---------------------------------
##NTUPLES= NMR SPECTRUM
##VAR_NAME=  FREQUENCY,     SPECTRUM/REAL,   SPECTRUM/IMAG
##SYMBOL=    X,             R,               I
##VAR_TYPE=  INDEPENDENT,   DEPENDENT,       DEPENDENT
##VAR_FORM=  AFFN,          ASDF,            ASDF
##VAR_DIM=   32768,         32768,           32768
##UNITS=     HZ,            ARBITRARY UNITS, ARBITRARY UNITS
##FACTOR=    0.368581032318806, 1,           1
##FIRST=     11200.0995020947, 0,            0
##LAST=      -877.195183895579, 0,           0
##MIN=       -877.195183895579, -13082770,   0
##MAX=       11200.0995020947, 188627498,    0
$$ Real data points
##PAGE= N=1
##DATA TABLE= (X++(R..R)), XYDATA
$$ [...]
$$ plain form
8119 4294628 4585444 4340283 3262347 1622652 139886 -734634 -1582387 -2639622 -3331844
8110 -3331844 -3359079 -2953428 -2566046 -2422809 -2588561 -2770268 -2469400 -1693819 -1003723 -917792
8100 -917792 -1431864 -2362694 -3483102 -4933815 -6838747 -8437099 -8882562 -8597736 -8117146
8091 -8117146 -7388779 -6686483 -6220451 -5741153 -5372720 -5093159 -4648460 -4011812 -3487795 -3327058
8081 -3327058 -3145679 -2654892 -2325099 -2707492 -3429800 -3892919 -3988597 -4123768 -4413460 -4894538
8071 -4894538 -5731095 -6954524 -8521830 -9864110 -9970600 -8314750 -5418061 -2358262 -76844
8062 -76844 1571261 3208058 4434397 4744830 4571040 4415231 4066181 3216261 2157267
8053 2157267 1551409 1276558 659867 -319295 -1256535 -1800291 -2218115 -2795293 -3088131 -2781815
$$ packed form
8119D294628K90816k45161j077936j639695j482766q74520q47753j057235o92222
8110c331844k7235M05651L87382J43237j65752j81707L00868P75581O90096Q5931
8100i17792n14072r30830j120408j450713j904932j598352m45463K84826M80590
8091h117146P28367P02296M66032M79298L68433K79561M44699O36648N24017J60737
8081c327058J81379M90787L29793l82393p22308m63119r5678j35171k89692m81078
8071d894538q36557j223429j567306j342280j06490J655850K896689L059799K281418
8062g6844J648105J636797J226339L10433j73790j55809l49050q49920j058994
8053B157267o05858k74851o16691r79162r37240n43756m17824n77178k92838L06316
$$ plain form
8043 -2781815 -2153131 -1595022 -1062997 -150089 1257868 2634580 3482043 3893427 3962200
8034 3962200 3605700 3781122 5221005 6838098 7497339 7542566 7312003 6470193 5112602
8025 5112602 3324398 1564250 652920 742977 1337610 1586136 918321 -650161 -2558333
8016 -2558333 -4435367 -6024846 -7196101 -8278339 -9089256 -9090979 -8186290 -6467624 -4327999
8007 -4327999 -2495028 -978069 292623 1003765 1278813 1309006 805348 -438105 -1843275
7998 -1843275 -2828226 -3149300 -2988590 -2528875 -1920795 -1452941 -1180867 -1284626 -2216274 -3534271
7988 -3534271 -4506286 -5250349 -5824059 -5961269 -5796155 -5272146 -4506538 -4298889 -4806456 -5285998
7978 -5285998 -5342092 -5192010 -4892733 -4436286 -3967303 -3640844 -3650091 -4138531 -5360120 -7105932
$$ packed form
8043b781815O28684N58109N32025R12908J407957J376712Q47463M11384O8773
8034C962200l56500J75422J439883J617093O59241M5227k30563q41810j357591
8025E112602j788204j760148r11330R0057N94633K48526o67815j568482j908172
8016b558333j877034j589479j171255j082238q10917j723R04689J718666K139625
8007d327999J832971J516959J270692P11142K75048L0193n03658j243453j405170
7998a843275r84951l21074J60710M59715O08080M67854K72074j03759r31648j317997
7988c534271r72015p44063n73710j37210J65114N24009P65608K07649n07567m79542
7978e285998n6094J50082K99277M56447M68983L26459r247m88440j221589j745812
$$ plain form
7968 -7105932 -8046842 -7307745 -5525074 -3761385 -2473915 -1503541 -565844 206365 488984
7959 488984 147362 -724260 -1697238 -1859940 -1051099 135784 1039247 1338868 856101 -314188
7949 -314188 -1887283 -3691400 -5084735 -5644335 -5307669 -4105258 -2435729 -673067 445534
7940 445534 93955 -1471580 -3511632 -5326161 -6376053 -6748521 -6975481 -7519091 -7899661
7931 -7899661 -7404774 -6467210 -5713896 -5172879 -4575311 -3925053 -3686637 -4244045 -5316567
7922 -5316567 -6149605 -6380214 -6053810 -5370392 -4853149 -4849876 -4696596 -3637135 -2165162 -1083857
7912 -1083857 -478941 -115327 -141145 -612549 -1220315 -1628700 -1720005 -1555579 -1207481 -731866
7902 -731866 -171592 -42132 -802289 -2263592 -3996989 -5345152 -5230375 -3268584 -691942
$$ packed form
7968g105932r40910P39097J782671J763689J287470R70374R37697P72209K82619
7959D88984l41622q71622r72978j62702Q08841J186883R03463K99621m82767j170289
7949c14188j573095j804117j393335n59600L36666J202411J669529J762662J118601
7940D45534l51579j565535k040052j814529j049892l72468k26960n43610l80570
7931g899661M94887R37564P53314N41017N97568O50258K38416n57408j072522
7922e316567q33038k30609L26404O83418N17243L273J53280J059461J471973J081305
7912a083857O04916L63614k5818m71404o07766m08385r1305J64426L48098M75615
7902g31866N60274J29460p60157j461303j733397j348163J14777J961791K576642
$$ plain form
7893 -691942 1306050 2398854 2633505 2084610 1088813 -62804 -1536792 -2775630 -3155919
7884 -3155919 -2995514 -2951272 -3263792 -3919004 -4856855 -5667007 -5894820 -5652224 -5103289 -4245614
7874 -4245614 -3707005 -3770212 -3947666 -3816889 -3373181 -3093568 -3017496 -2945748 -2864362 -2649114
7864 -2649114 -2215373 -1222563 512700 2175138 2962800 3264319 3797579 4463794 4776412
7855 4776412 4446132 3307014 1683952 77026 -1074806 -1378011 -1039951 -719829 -1120423
7846 -1120423 -2527245 -4508479 -6190562 -6655056 -5673116 -4291754 -3444715 -3109613 -3086457
7837 -3086457 -3206379 -3082417 -2752368 -2591130 -2478944 -2333742 -2392462 -2637933 -2804519 -3003784
7827 -3003784 -3251736 -3346566 -3787468 -4700968 -5695733 -6611979 -7335650 -7711910 -7520069 -6949936
$$ packed form
7893f91942J997992J092804K34651n48895r95797j151617j473988j238838l80289
7884c155919J60405M4242l12520o55212r37851q10152k27813K42596N48935Q57675
7874d245614N38609o3207j77454J30777M43708K79613P6072P1748Q1386K15248
7864b649114M33741R92810J735263J662438P87662L01519N33260O66215L12618
7855D776412l30280j139118j623062j606926j151832l03205L38060L20122m00594
7846a120423j406822j981234j682083m64494R81940J381362Q47039L35102K3156
7837c086457j19922J23962L30049J61238J12186J45202n8720k45471j66586j99265
7827c003784k47952r4830m40902r13500r94765r16246p23671l76260J91841N70133
$$ plain form
7817 -6949936 -6248322 -5142332 -3839547 -2737844 -1728495 -1150652 -1450739 -2125746 -2572014
7808 -2572014 -2876177 -3084149 -3263852 -3589842 -4124669 -4552401 -4200854 -3095019 -1795554
7799 -1795554 -683852 146927 953719 2052808 3262975 3828824 3603956 2981694 2157671
7790 2157671 1010084 -384837 -1586389 -2358561 -2940561 -3338168 -3447489 -3265788 -2733321
7781 -2733321 -1967228 -1394779 -1061781 -577879 279788 1447646 2369793 2339244 1491972 622083
7771 622083 -366556 -1490547 -2246911 -2757508 -3542141 -4518964 -4998526 -4815005 -4246765 -3165839
7761 -3165839 -1217910 1270203 2951980 3087867 2385182 1917434 2372066 3499637 4434675
7752 4434675 4858660 5438268 6212853 6247197 5396309 4636314 4602418 4577908 3984254 2947134
$$ packed form
7817f949936P01614J105990J302785J101703J009349N77843l00087o75007m46268
7808b572014l04163k07972j79703l25990n34827m27732L51547J105835J299465
7799a795554J111702Q30779Q06792J099089J210167N65849k24868o22262q24023
7790B157671j147587j394921j201552p72172n82000l97607j09321J81701N32467
7781b733321P66093N72449L32998M83902Q57667J167858R22147l0549q47272q69889
7771F22083r88639j123991p56364n10597p84633r76823m79562J83521N68240J080926
7761c165839J947929K488113J681777J35887p02685m67748M54632J127571R35038
7752D434675M23985N79608P74585L4344q50888p59995l3896k4510n93654j037120
$$ plain form
7742 2947134 2322919 3095574 4781706 6092537 6331808 5737081 5120385 4918624 4926243 5459324
7732 5459324 6920415 8319506 8312692 7119086 5579905 3899760 2411711 1366049 745669
7723 745669 178291 -449856 -735959 -865629 -1291569 -1753031 -1643265 -774038 533016 1531194
7713 1531194 1808601 1249941 -175418 -1871302 -3070060 -3781175 -3981220 -3426862 -2362167
7704 -2362167 -763371 1224269 2947597 4099349 4359109 3496012 1956441 716376 561541
7695 561541 1289572 2260301 3019820 3321339 3237449 2993882 2760127 2707652 2810429 2842160
7685 2842160 2561494 1595476 -453847 -3171115 -5110896 -5256710 -4031281 -2560463 -1675327
7676 -1675327 -1626728 -1979206 -2288962 -2497609 -2431597 -2046658 -1421101 -841041 -376182 320946
$$ packed form
7742B947134o24215P72655J686132J310831K39271n94727o16696k01761P619N33081
7732E459324J461091J399091o814j193606j539181j680145j488049j045662o20380
7723G45669n67378o28147k86103j29670m25940m61462J09766Q69227J307054R98178
7713A531194K77407n58660j425359j695884j198758p11115k00045N54358J064695
7704b362167J598796J987640J723328J151752K59760q63097j539571j240065j54835
7695E61541P28031R70729P59519L01519q3890k43567k33755n2475J02777L1731
7685B842160k80666r66018k049323k717268j939781j45814J225429J470818Q85136
7676a675327M8599l52478l09756k08647O6012L84939O25557N80060M64859O97128
$$ plain form
7666 320946 1254084 1868105 1964102 1666904 957932 272905 -46544 -107222 103048 889068
7656 889068 2491591 4602343 6712404 8293648 9113589 9488702 9410610 8474128 6635573
7647 6635573 4899978 4430960 5257092 6451744 7531483 8685063 9491535 9122966 7608406
7638 7608406 5720642 4357662 3680102 3005092 1908750 838524 382190 731467 1645700
7629 1645700 2700541 3385429 3633195 3738922 3410713 2345968 751560 -786692 -1380351
7620 -1380351 -817948 51846 406596 187084 -166037 -661091 -1243070 -1531272 -1428502 -1058313
7610 -1058313 -785220 -1032375 -1521208 -1941946 -2212400 -1964378 -1068421 223816 1400862
7601 1400862 1902466 1568372 782667 -57818 -643197 -711557 -380399 -169894 -241009 113761
$$ packed form
7666C20946R33138O14021R5997k97198p08972o85027l19449o0678K10270P86020
7656H89068J602523K110752K110061J581244Q19941L75113p8092r36482j838555
7647F635573j735595m69018Q26132J194652J079739J153580Q06472l68569j514560
7638G608406j887764j362980o77560o75010j096342j070226m56334L49277R14233
7629A645700J054841O84888K47766J05727l28209j064745j594408j538252n93659
7620a380351N62403Q69794L54750k19512l53121m95054n81979k88202J02770L70189
7610a058313K73093k47155m88833m20738k70454K48022Q95957J292237J177046
7601A400862N01604l34094p85705q40485n85379o8360L31158K10505p1115L54770
$$ plain form
7591 113761 1384188 3100967 4554598 5111353 4740707 4022226 3438898 2694356 1693418
7582 1693418 773001 -388391 -1999273 -3224833 -3044919 -1708039 -577219 -26538 664862
7573 664862 1539553 1964599 1943256 2213376 2799717 2794048 1572123 -354869 -1898276 -2522366
7563 -2522366 -2037621 -595096 988757 1816692 1990046 2389020 3231865 4221614 4761418
7554 4761418 4394387 3406593 2637491 2291377 1993267 1714970 1610012 1628300 2061596 3378184
7544 3378184 5174990 6358802 6726888 6813281 6652882 6067483 5434960 5150781 5054427 4740940
7534 4740940 4405385 4599816 5321339 6197896 6757455 6825770 6242426 5032265 3252232
7525 3252232 981159 -841435 -1326791 -591293 764066 2277060 3512337 4179329 4361114
$$ packed form
7591A13761J270427J716779J453631N56755l70646p18481n83328p44542j000938
7582A693418r20417j161392j610882j225560J79914J336880J130820N50681O91400
7573F64862Q74691M25046k1343K70120N86341n669j221925j926992j543407o24090
7563b522366M84745J442525J583853Q27935J73354L98974Q42845R89749N39804
7554D761418l67031r87794p69102l46114k98110k78297j04958J8288M33296J316588
7544C378184J796806J183812L68086Q6393j60399n85399o32523k84179r6354l13487
7534D740940l35555J94431P21523Q76557N59559O8315n83344j210161j780033
7525C252232k271073j822594m85356P35498J355359J512994J235277O66992J81785
$$ plain form
7516 4361114 3914869 2783069 1361586 -18466 -989369 -965578 59018 1561478 3026787
7507 3026787 3972959 4676318 5549381 6275732 6202233 5460717 4412487 3129351 1941283
7498 1941283 977860 248571 280287 1247999 2496058 3441223 3840818 3796880 3600625 3601591
7488 3601591 3825967 3695428 3058993 2614704 2771863 2977511 2577517 1735795 1617621 2622219
7478 2622219 3390192 3148958 2534200 2424469 3055385 3524276 2850846 1359080 7662
7469 7662 -518920 36785 1371438 2721734 3718926 4499756 5196204 5687985 5993354 6384889
7459 6384889 6365148 5305266 3658059 2703912 2813481 2985833 2534946 1862230 1537713
7450 1537713 1811931 2862481 4574052 6429218 8005194 8857225 8387210 7015883 5942270
$$ packed form
7516D361114m46245j131800j421483j380052r70903K3791J024596J502460J465309
7507C026787R46172P03359Q73063P26351p3499p41516j048230j283136j188068
7498A941283r63423p29289L1716R67712J248059R45165L99595m3938j96255R66
7488C601591K24376j30539o36435m44289J57159K05648l99994q41722j18174J004598
7478B622219P67973k41234o14758j09731O30916M68891o73430j491766j351418
7469G662n26582N55705J334653J350296R97192P80830O96448M91781L05369L91535
7459F384889j9741j059882j647207r54147J09569J72352m50887o72716l24517
7450A537713K74218J050550J711571J855166J575976Q52031m70015j371327j073613
$$ plain form
7441 5942270 5987812 6767179 7874779 9988862 13261262 16868640 20343713 23535546 26302447
7432 26302447 28345047 29343679 29548561 29393606 28591520 26415007 23040995 19184818 15472090
7423 15472090 12398347 9927499 7899353 6575112 5785305 4879310 3700827 2581023
7415 2581023 1590638 854698 887970 1867122 3036467 3608666 3609186 3468741 3655611 4138485
7405 4138485 4538006 4546988 4054947 3270876 2568932 1986908 1902369 2963257 4961279 6908108
7395 6908108 7725449 7030524 5616742 4428561 3578262 2734578 1725858 807788 317689
7386 317689 219921 154747 -221040 -548840 -386161 135293 741701 1177938 772505 -397534
7376 -397534 -1591382 -2807559 -3958731 -4805652 -5251333 -5210567 -4865682 -4307258 -3310840
$$ packed form
7441E942270M5542P79367J107600K114083L272400L607378L475073L191833K766901
7432B6302447K042600R98632K04882j54955q02086k176513l374012l856177l712728
7423A5472090l073743k470848k028146j324241p89807r05995j178483j119804
7415B581023r90385p35940L3272R79152J169345N72199N20j40445J86870M82874
7405D138485L99521Q982m92041p84071p01944n82024q4539J060888J998022J946829
7395F908108Q17341o94925j413782j188181q50299q43684j008720r18070m90099
7386C17689r7768o5174l75787l27800J62679N21454O06408M36237m05433j170039
7376c97534j193848j216177j151172q46921m45681M0766L44885N58424R96418
$$ plain form
7367 -3310840 -2009674 -853825 -24747 389761 569921 930732 1114062 586741 -284353
7358 -284353 -1056437 -1997081 -3243264 -4067119 -4054331 -3545959 -3135084 -2892520 -2399584 -1427469
7348 -1427469 -267577 656510 1066102 1395715 2436542 3995626 5071248 5153420 4572557
7339 4572557 3792437 3149093 2845912 3239828 4172452 5055103 5865616 6613188 7096887 7289394
7329 7289394 7089145 6346316 4942862 2952642 852465 -868002 -2203977 -2962417 -2661268
7320 -2661268 -1208549 789291 2772025 4577642 6131387 7708801 9579939 11326403
7312 11326403 12408437 12756966 12431149 11597064 10869027 10476023 10394156 10606666 11026742
7303 11026742 11674456 12357222 13001300 13931077 15143304 16322137 17650077 19212707 20634279
$$ packed form
7367c310840J301166J155849Q29078M14508J80160L60811J83330n27321q71094
7358b84353p72084r40644j246183q23855J2788N08372M10875K42564M92936R72115
7348a427469J159892R24087M09592L29613J040827J559084J075622Q2172n80863
7339D572557p80120o43344l03181L93916R32624Q82651Q10513P47572M83699J92507
7329G289394k00249p42829j403454j990220k100177j720467j335975p58440L01149
7320b661268J452719J997840J982734J805617J553745J577414J871138J746464
7312A1326403J082034L48529l25817q34085p28037l93004q1867K12510M20076
7303A1026742O47714O82766O44078R29777J212227J178833J327940J562630J421572
$$ plain form
7294 20634279 22160499 24623035 28223725 32395022 36867554 42101352 48665332 56979539
7286 56979539 66498341 75789545 83768892 89517773 92429904 92318105 89130534 83599275
7278 83599275 77456896 72439666 69111875 67284574 67252809 69244531 73114056 78732953
7270 78732953 85388105 91639773 95616641 96127288 93310777 87534464 79087121 68842286
7262 68842286 57966031 48015136 40198449 34212648 29138681 24711641 21207880 18758566
7254 18758566 17290085 16330010 15322385 14378545 13844796 13141071 11685840 9868182 8301838
7245 8301838 7222546 6399752 5631412 4933867 4233887 3703460 3567887 3615960 3394785 2975000
7235 2975000 2908510 3268796 3548051 3399940 2860543 1789685 324024 -1040926 -2108276
$$ packed form
7294B0634279J526220K462536L600690M171297M472532N233798O563980Q314207
7286E6979539R518802R291204P979347N748881K912131j11799l187571n531259
7278H3599275o142379n017230l327791j827301l1765J991722L869525N618897
7270G8732953O655152O251668L976868N10647k816511n776313q447343j0244835
7262F8842286j0876255r950895p816687n985801n073967m427040l503761k449314
7254A8758566j468481r60075j007625r43840n33749p03725j455231j817658j566344
7245H301838j079292q22794p68340o97545o99980n30427j35573M8073k21175m19785
7235B975000o6490L60286K79255j48111n39397j070858j465661j364950j067350
$$ plain form
7226 -2108276 -2765147 -2763137 -2078628 -1117314 -190119 733994 1504791 1948173 2228892 2285670
7216 2285670 1898164 1333307 1379973 2454245 3975769 4935948 4886905 4197585 3559601 3011362
7206 3011362 2084962 1008723 199048 -409325 -1073958 -1334214 -604904 664224 1735894
7197 1735894 2457076 2909080 2918358 2554585 2001512 1213458 376916 135549 725966 1574077
7187 1574077 1819192 1179451 271568 -523620 -1351326 -2178438 -2941309 -3626590 -3813520 -3485970
7177 -3485970 -3092334 -2835914 -2779967 -2850202 -2597932 -1531843 -66825 1037433 1658549
7168 1658549 2001316 2261413 2151979 1515093 728789 -103187 -749061 -1007097 -912499 -512016
7158 -512016 111889 657144 933437 1147751 1858395 3234434 4817896 6264898 7274050
$$ packed form
7226b108276o56871K010O84509R61314R27195R24113P70797M43382K80719N6778
7216B285670l87506n64857M6666J074272J521524R60179m9043o89320o37984n48239
7206C011362r26400j076239q09675o08373o64633k60256P29310J269128J071670
7197A735894P21182M52004R278l63773n53073p88054q36542k41367N90417Q48111
7187A574077K45115o39741r07883p95188q27706q27112p62871o85281j86930L27550
7177c485970L93636K56420N5947p0235K52270J066089J465018J104258O21116
7168A658549L42767K60097j09434o36886p86304q31976o45874k58036R4598M00483
7158e12016O23905N45255K76293K14314P10644J376039J583462J447002J009152
$$ plain form
7149 7274050 7694976 7724786 6981947 5320898 3572519 2142496 1229464 1038231 1337862
7140 1337862 1415358 1035033 579340 258711 -88334 -442485 -731884 -1364238 -2667561 -4182086
7130 -4182086 -5002072 -4471617 -2948381 -1515904 -677229 -304763 -122859 186100 775179
7121 775179 1418065 1633462 1346624 569318 -721839 -2066046 -2902521 -3041808 -2778899
7112 -2778899 -2228493 -1255915 -177253 711704 1452591 2045171 2186299 1875549 1955407 2821829
7102 2821829 3728187 4076950 4347219 5025595 6013975 6702029 6581527 5924401 4992436 3872867
7092 3872867 2838210 2312285 2626161 3800939 5244111 6146878 6116798 5527178 4804969
7083 4804969 3636984 1708296 -822683 -3292044 -5273240 -6632862 -7052498 -6005785
$$ packed form
7149G274050M20926K9810p42839j661049j748379j430023r13032j91233K99631
7140A337862P7496l80325m55693l20629l47045l54151k89399o32354j303323j514525
7130d182086q19986N30455J523236J432477Q38675L72466J81904L08959N89079
7121G75179O42886K15397k86838p77306j291157j344207q36475j39287K62909
7112b778899N50406R72578J078662Q88957P40887N92580J41128l10750P9858Q66422
7102B821829R06358L48763K70269O78376R88380O88054j20502o57126r31965j119569
7092C872867j034657n25925L13876J174778J443172R02767l0080n89620p22209
7083D804969j167985j928688k530979k469361j981196j359622m19636J046713
$$ plain form
7075 -6005785 -3767825 -1255756 1219719 3316019 4508386 4827369 4603653 3771988 2362527
7066 2362527 1041306 275588 -87505 -284050 -450856 -930302 -1554711 -1685300 -1400001
7057 -1400001 -1146747 -749018 17889 406050 85094 -222972 123798 624769 433797 -427371
7047 -427371 -1432330 -2053123 -2497288 -3080963 -3413814 -3114418 -2261391 -1334604 -810215 -746546
7037 -746546 -983347 -1228199 -1187287 -1059841 -1025847 -1007012 -982432 -649607 29585 506148
7027 506148 639542 689979 613411 339428 286465 748863 1413160 1897466 2142788 2184825
7017 2184825 1934529 1603834 1612907 1873169 1933552 1852759 1893692 1884433 1351721 -36492 -1545314
7006 -1545314 -2012093 -1448122 -814410 -467761 -119096 520221 1362101 1992371 2346703 2481005
$$ packed form
7075f005785K237960K512069K475475K096300J192367L18983k23716q31665j409461
7066B362527j321221p65718l63093j96545j66806m79446o24409j30589K85299
7057a400001K53254L97729P66907L88161l20956l08066L46770N00971j90972q61168
7047d27371j004959o20793m44165n83675l32851K99396Q53027R26787N24389O3669
7037g46546k36801k44852M0912J27446L3994J8835K4580L32825O79192M76563
7027E06148J33394N0437p6568k73983n2963M62398O64297M84306K45322M2037
7017B184825k50296l30695R073K60262O0383q0793M0933r259n32712j388213j508822
7006a545314m66779N63971O33712L46649L48665O39317Q41880O30270L54332J34302
$$ plain form
6996 2481005 2545365 2498609 1924449 782781 -515528 -1920905 -3548874 -4933082 -5576666
6987 -5576666 -5744813 -5600749 -4576486 -2450324 123517 2400636 4015894 4882021 4707245
6978 4707245 3090952 612022 -1490678 -2672611 -3306962 -3774638 -4093417 -4082879 -3333803
6969 -3333803 -2314663 -2135887 -2913467 -3698264 -3893800 -3590541 -2902903 -1865023 -548660
6960 -548660 354570 525458 613901 711693 464385 -255493 -1576498 -3129370 -4288768 -4805936
6950 -4805936 -4523828 -3646797 -2822215 -2363622 -2026109 -1556987 -841221 282305 1509252
6941 1509252 2412107 2836907 2685044 2121299 1773079 2001478 2176358 1805215 1407087 1101710
6931 1101710 268305 -1032677 -1866290 -1896843 -1866164 -2082922 -2357508 -2626146 -2712498 -2372615
$$ packed form
6996B481005O4360m6756n74160j141668j298309j405377j627969j384208o43584
6987e576666j68147J44064J024263K126162K573841K277119J615258Q66127j74776
6978D707245j616293k478930k102700j181933o34351m67676l18779J0538P49076
6969c333803J019140J78776p77580p84797j95536L03259O87638J037880J316363
6960e48660R03230J70888Q8443R7792k47308p19878j321005j552872j159398n17168
6950d805936K82108Q77031Q24582M58593L37513M69122P15766J123526J226947
6941A509252R02855M24800j51863n63745l48220K28399J74880l71143l98128l05377
6931A101710q33405j300982q33613l0553L0679k16758k74586k68638q6352L39883
$$ plain form
6921 -2372615 -1762391 -1358530 -1195241 -1207147 -1890308 -3437701 -5220682 -6472998 -6892251
6912 -6892251 -6724444 -6459099 -6383373 -6246438 -5552495 -4527662 -3834990 -3506016 -3304734 -3527568
6902 -3527568 -4567600 -5926657 -6721983 -6940128 -7093568 -7496311 -7833865 -7619904 -7140524
6893 -7140524 -6920972 -6915903 -6814792 -6430658 -5749193 -5199850 -5265325 -5585654 -5653165 -5362735
6883 -5362735 -4794443 -3964908 -3040959 -2036932 -869442 -107199 -162252 -581402 -970031
6874 -970031 -1401364 -1881177 -2379188 -2909830 -3417348 -3889362 -4333269 -4457180 -4058206 -3349335
6864 -3349335 -2495252 -1758135 -1153936 -323268 842680 1568881 1655791 1946568 2973785
6855 2973785 4376117 5423717 6124834 6520202 6432941 6306823 6797876 7806273 8750912
$$ packed form
6921b372615O10224M03861J63289j1906o83161j547393j782981j252316m19253
6912f892251J67807K65345P5726J36935O93943J024833O92672L28974K01282k22834
6902c527568j040032j359057p95326k18145j53440m02743l37554K13961M79380
6893g140524K19552N069J01111L84134O81465N49343o5475l20329o7511K90430
6883e362735N68292Q29535R23949J004027J167490P62243n5053m19150l88629
6874i70031m31333m79813m98011n30642n07518m72014m43907j23911L98974P08871
6864c349335Q54083P37117O04199Q30668J165948P26201Q6910K90777J027217
6855B973785J402332J047600P01117L95368q7261j26118M91053J008397R44639
$$ plain form
6846 8750912 8893406 7654897 5651991 4081598 3576796 4286992 5501193 6065974 5374452
6837 5374452 3991097 2832456 1887191 584473 -1204288 -3256246 -4953827 -5631595 -5686889
6828 -5686889 -5869279 -6752469 -8299293 -9464401 -9373301 -8219501 -6641443 -4923548 -3709419
6819 -3709419 -3127111 -2558843 -1652808 -794456 -453587 -437506 -536825 -914193 -1657000 -2464243
6809 -2464243 -2886806 -3053125 -3433421 -3910067 -4331910 -4934839 -5539981 -5629257 -5235786 -4992259
6799 -4992259 -4894057 -4456191 -3689947 -2641396 -1483454 -780342 -518811 -345344 -139133
6790 -139133 88797 271819 155725 -423922 -981262 -949239 -602164 -502741 -581583 -564299
6780 -564299 -541014 -579166 -445868 -79473 572222 1684845 3262043 4832279 5743241 5796200
$$ packed form
6846H750912J42494j238509k002906j570393n04802P10196J214201N64781o91522
6837E374452j383355j158641r45265j302718j788761k051958j697581o77768n5294
6828e686889j82390q83190j546824j165108R1100J153800J578058J717895J214129
6819c709419N82308N68268R06035Q58352L40869J6081r9319l77368p42807q07243
6809b464243m22563j66319l80296m76646m21843o02929o05142q9276L93471K43527
6799d992259R8202M37866P66244J048551J157942P03112K61531J73467K06211
6790a39133K27930J83022j16094n79647n57340L2023L47075R9423p8842J7284
6780e64299K3285l8152J33298L66395O51695J112623J577198J570236R10962N2959
$$ plain form
6770 5796200 5233514 4409764 3752442 3572912 3806461 4263762 4928938 5489861 5489576 4584466
6760 4584466 3178419 2423212 2712441 3318194 3248846 2207609 902398 416972 874113
6751 874113 796131 -742306 -2582470 -3478188 -3882880 -4913723 -6471997 -7526813 -7583884
6742 -7583884 -6841927 -5494385 -4106307 -3290647 -3185411 -3813094 -4966216 -5938286 -6366349
6733 -6366349 -6244741 -5422534 -4103671 -2810775 -1550477 -13278 1235883 1440411 574482
6724 574482 -730084 -1883839 -2746563 -3287261 -3704961 -4228757 -5063598 -6122726 -6959686
6715 -6959686 -7178619 -6753498 -6292593 -6041328 -5261609 -3476954 -1470777 41015 911271
6706 911271 858549 48653 -797396 -1069170 -583452 819841 2859396 4661194 5951511
$$ packed form
6770E796200n62686q23750o57322j79530K33549M57301O65176N60923k85r05110
6760D584466j406047p55207K89229O05753o9348j041237j305211m85426M57141
6751H74113p7982j538437j840164q95718m04692j030843j558274j054816n7071
6742g583884P41957J347542J388078Q15660J05236o27683j153122r72070m28063
6733f366349J21608Q22207J318863J292896J260298J537199J249161K04528q65929
6724E74482j304566j153755q62724n40698m17700n23796q34841j059128q36960
6715f959686k18933M25121M60905K51265P79719J784655K006177J511792Q70256
6706I11271n2722q09896q46049k71774M85718J403293K039555J801798J290317
$$ plain form
6697 5951511 6744583 6859531 6515065 5622789 4073060 2492539 876031 -1024562 -2887037
6688 -2887037 -4228253 -4605885 -4048542 -2935959 -1632896 -15499 1923861 3648379 4868117
6679 4868117 5585846 6115555 6835213 7319720 6865534 5342190 3452924 2103665 1547871
6670 1547871 1404961 1251943 1263064 1821295 2936071 4263958 4957513 4485703 3844557
6661 3844557 3926838 4260526 4328749 4293324 4138922 3523213 2616058 1700832 441011 -1213364
6651 -1213364 -2593957 -3262215 -2889503 -1477832 546169 2611956 4085569 4759439 4857284
6642 4857284 4890197 5241321 5658491 5534978 4672149 3545117 2684481 2146954 1702020 1239543
6632 1239543 876283 736698 753113 697612 635517 364282 -478495 -1344688 -1699754 -1428617
$$ packed form
6697E951511P93072J14948l44466q92276j549729j580521j616508j900593j862475
6688b887037j341216l77632N57343J112583J303063J617397J939360J724518J219738
6679D868117P17729N29709P19658M84507m54186j523344j889266j349259n55794
6670A547871j42910j53018J1121N58231J114776J327887O93555m71810o41146
6661C844557Q2281L33688O8223l5425j54402o15709r07155r15226j259821j654375
6651a213364j380593o68258L72712J411671K024001K065787J473613O73870R7845
6642D857284L2913L51124M17170j23513q62829j127032q60636n37527m44934m62477
6632A239543l63260j39585J6415n5501o2095k71235q42777q66193l55066K71137
$$ plain form
6622 -1428617 -324202 1180390 2188249 2403802 2079165 1411500 572236 -77318 -119772
6613 -119772 508861 1517014 2645566 3296803 2881406 1887365 1294260 1308523 1735519 2382072
6603 2382072 3232071 4388722 5210654 4819486 3463905 2376804 2253612 2553704 2536537
6594 2536537 2047291 1023824 134097 -3542 547954 1470801 2254627 2480636 2229408
6585 2229408 1842313 1553922 1245921 543639 -454075 -828446 -323082 168234 181302 -265315
6575 -265315 -1183898 -2458575 -3397631 -3395423 -2748077 -1899384 -1178491 -905234 -991989 -1291616
6565 -1291616 -2009607 -3198930 -4337023 -4550127 -3712368 -2364487 -1304127 -965808 -1251504
6556 -1251504 -2127402 -3214138 -3669395 -3017267 -1542145 -183873 163517 -522955 -1729875
$$ packed form
6622a428617J104415J504592J007859K15553l24637o67665q39264o49554m2454
6613a19772O28633J008153J128552O51237m15397r94041n93105J4263M26996O46553
6603B382072Q49999J156651Q21932l91168j355581j087101j23192L00092j7167
6594B536537m89246j023467q89727j37639N51496R22847P83826K26009k51228
6585B229408l87095k88391l08001p02282r97714l74371N05364M91316J3068m46617
6575b65315r18583j274677r39056K208O47346Q48693P20893K73257q6755k99627
6565a291616p17991j189323j138093k13104Q37759J347881J060360L38319k85696
6556a251504q75898j086736m55257O52128J475122J358272L47390o86472j206920
$$ plain form
6547 -1729875 -2784645 -3030933 -2582478 -2200511 -2353218 -2883138 -3281203 -3393767 -3619447
6538 -3619447 -4171810 -4642461 -4776264 -4889176 -5116233 -5218329 -5050011 -4725520 -4450549 -3918356
6528 -3918356 -3038409 -2256845 -1752072 -1726283 -2444061 -3389710 -3900469 -4068537 -4334420 -4804126
6518 -4804126 -5442241 -6329095 -6879622 -6447413 -5370136 -4049656 -2934774 -2732347 -3358681
6509 -3358681 -4021332 -4092314 -3291681 -1784826 -134366 1256658 2510017 3419616 3644984
6500 3644984 3859360 4666325 5628741 6418741 6674686 5926269 4538766 3388135 2747446
6491 2747446 2424079 2189439 1958751 1974154 2354400 3079361 3899891 4534134 4692168 4077622
6481 4077622 2997674 2058432 1395080 706492 242596 534367 1069800 1319997 1538501
$$ packed form
6547a729875j054770k46288M48455L81967j52707n29920l98065j12564k25680
6538c619447n52363m70651j33803j12912k27057j02096J68318L24491K74971N32193
6528c918356Q79947P81564N04773K5789p17778r45649n10759j68068k65883m69706
6518d804126o38115q86854n50527M32209J077277J320480J114882K02427o26334
6509c358681o62651p0982Q00633J506855J650460J391024J253359R09599K25368
6500C644984K14376Q06965R62416P90000K55945p48417j387503j150631o40689
6491B747446l23367k34640k30688J5403L80246P24961Q20530O34243J58034o14546
6481D077622j079948r39242o63352o88588m63896K91771N35433K50197K18504
$$ plain form
6472 1538501 1739512 1946263 2577222 3706625 4762982 4980886 4427526 3974731 3856849
6463 3856849 3919967 4154252 4058878 3584913 3164272 2717169 2155791 1772449 1662260 1492480
6453 1492480 1289188 1553262 2058593 2097070 1520602 870720 728038 1080412 1489315 1543768
6443 1543768 1121237 415326 -247640 -506393 -238420 124698 909 -940823 -2013410
6434 -2013410 -2407663 -2421201 -2346250 -2147586 -1635613 -351044 1549697 3104572 3741125
6425 3741125 3612874 3125489 2567501 2174406 1750634 1153126 457353 -349136 -1063824 -1446936
6415 -1446936 -1923281 -2736652 -2855070 -1535968 474963 1962087 2615680 2849019 2932956
6406 2932956 3270376 4378589 6013385 7447485 8097481 7778392 6842902 5781102 4602447
$$ packed form
6472A538501K01011K06751O30959J129403J056357K17904n53360m52795j17882
6463C856849O3118K34285r5374m73965m20641m47103n61378l83342j10189j69780
6453A492480k03292K64074N05331L8477n76468o49882j42682L52374M08903N4453
6443A543768m22531p05911o62966k58753K67973L63118j23789r41732j072587
6434b013410l94253j3538P4951J98664N11973J284569J900741J554875O36553
6425C741125j28251m87385n57988l93095m23772n97508o95773q06489p14688l83112
6415a446936m76345q13371j18418J319102K010931J487124O53593K33339Q3937
6406B932956L37420J108213J634796J434100O49996l19089r35490j061800j178655
$$ plain form
6397 4602447 3277157 2218131 1918428 2361393 2788489 2631704 1968119 1133146 414870
6388 414870 -238073 -842223 -1275684 -1500959 -1517444 -1625781 -1870411 -1363249 160480 1851283
6378 1851283 2874966 2965539 2223466 1014107 -46726 -634877 -476395 485750 1532832
6369 1532832 2275265 2962054 3816390 4773213 5618886 6007132 5896491 5385466 4547656 3851925
6359 3851925 3734262 3804676 3275775 2052413 616823 -641253 -1494857 -1616029 -868224
6350 -868224 -76742 -70775 -727887 -1707838 -2818295 -3815850 -4255128 -3618402 -1646424 1030102
6340 1030102 3220772 4655886 5824152 6716008 7014227 6734357 5918867 5116911 5091556
6331 5091556 5705036 6947642 8632579 9838583 9956083 9418917 9138967 9351777 9506166
$$ packed form
6397D602447j325290j059026k99703M42965M27096j56785o63585q34973p18276
6388D14870o52943o04150m33461k25275j6485j08337k44630N07162J523729J690803
6378A851283J023683R0573p42073j209359j060833n88151J58482R62145J047082
6369A532832P42433O86789Q54336R56823Q45673L88246j10641n11025q37810o95731
6359C851925j17663P0414n28901j223362j435590j258076q53604j21172P47805
6350h68224P91482N967o57112r79951j110457r97555m39278O36726J971978K676526
6340A030102K190670J435114J168266Q91856K98219k79870q15490q01956k5355
6331E091556O13480J242606J684937J206004J17500n37166k79950K12810J54389
$$ plain form
6322 9506166 9362786 9161683 8946919 8766214 8929989 9527120 10014055 10129007 10266979 10646616
6312 10646616 10762761 10362818 9808297 9653692 10435855 12473874 15240979 17689551 19468328
6303 19468328 20984859 22991747 25969065 29301554 32328357 35144034 37690528 39611993
6295 39611993 40734373 41281684 41640333 42173545 42553850 42385710 41714243 40477280 39022935
6286 39022935 37799693 36433654 34336799 31247677 27344180 23571205 21057801 19826067
6278 19826067 19038475 18033715 16800710 15598975 14545306 13888614 13563284 13215980 12947091
6269 12947091 13006947 13182025 13075551 12513354 11638317 10412138 9139182 8244505 7655137
6260 7655137 7495313 7789993 8159964 8727739 9795554 10983609 11653898 11394422 9952809
$$ packed form
6322I506166j43380k01103k14764j80705J63775N97131M86935J14952J37972L79637
6312A0646616J16145l99943n54521j54605P82163K038019K767105K448572J778777
6303A9468328J516531K006888K977318L332489L026803K815677K546494J921465
6295C9611993J122380N47311L58649N33212L80305j68140o71467j236963j454345
6286C9022935j223242j366039k096855l089122l903497l772975k513404j231734
6278A9826067p87592j004760j233005j201735j053669o56692l25330l47304k68889
6269A2947091N9856J75078j06474n62197q75037j226179j272956q94677n89368
6260G655137j59824K94680L69971N67775J067815J188055O70289k59476j441613
$$ plain form
6251 9952809 7874315 6258017 5496554 5151248 4882316 4585676 4318293 4126792 3933271
6242 3933271 3888858 3943671 3837869 3560712 3765142 4899312 6288890 7179391 7792484 8714990
6232 8714990 9623045 9280687 7580576 6137074 5994094 6352197 6268439 5676479 4800207
6223 4800207 4011136 3599530 3416599 2964710 2070409 1666320 2638787 4482716 5941027
6214 5941027 6386332 6127515 5633631 5385408 5553594 5857208 5861721 5497624 4876580 3842944
6204 3842944 2294149 555208 -772612 -1406034 -1391493 -887950 -55711 749014 892180
6195 892180 119074 -1162567 -2464804 -3673742 -4614450 -4971954 -4695181 -3638205 -2626649
6186 -2626649 -2523186 -2868193 -3112582 -3061532 -2706536 -1990786 -787260 681471 1916738
$$ packed form
6251I952809k078494j616298p61463l45306k68932k96640k67383j91501j93521
6242C933271m4413N4813j05802k77157K04430J134170J389578Q90501O13093R22506
6232H714990R08055l42358j700111j443502j42980L58103q3758n91960q76272
6223D800207p89071m11606j82931m51889q94301m04089R72467J843929J458311
6214E941027M45305k58817m93884k48223J68186L03614M513l64097o21044j033636
6204C842944j548795j738941j327820o33422J4541N03543Q32239Q04725J43166
6195H92180p73106j281641j302237j208938r40708l57504K76773J056976J011556
6186b626649J03463l45007k44389N1050L54996P15750J203526J468731J235267
$$ plain form
6177 1916738 2499126 2847100 3604030 4539771 4723821 3708970 2004120 426231 -479956
6168 -479956 -629491 -158015 228644 31192 -335288 -253387 307634 855583 735120 -204460
6158 -204460 -1504955 -2930829 -4318288 -5281404 -5354697 -4240196 -2006098 650720 2479167
6149 2479167 2893643 2372816 1251881 -51650 -830642 -1091075 -782762 292860 1527569
6140 1527569 2384967 3130389 4159037 5077944 5395183 5463440 5800415 6285514 6861315 7682588
6130 7682588 8666583 9351705 9264670 8608950 7674190 6420007 5297137 4963225 5042891 4701042
6120 4701042 3910722 2897062 1968471 1686103 1924072 1718456 698594 -248077 -275463
6111 -275463 804974 2299595 2906156 2542269 2406964 2936403 3266700 2577907 1654296
$$ packed form
6177A916738N82388L47974P56930R35741J84050j014851j704850j577889r06187
6168d79956j49535M71476L86659j97452l66480Q1901N61021N47949j20463r39580
6158b04460j300495j425874j387459r63116p3293J114501K234098K656818J828447
6149B479167M14476n20827j120935j303531p78992k60433L08313J075622J234709
6140A527569Q57398P45422J028648R18907L17239O8257L36975M85099N75801Q21273
6130G682588R83995O85122q7035o55720r34760j254183j122870l33912P9666l41849
6120D701042p90320j013660r28591k82368K37969k05616j019862r46671k7386
6111b75463J080437J494621O06561l63887j35305N29439L30297o88793r23611
$$ plain form
6102 1654296 1520690 2057436 2889658 3648616 3794596 3329471 2843204 2834461 3340847 3872787
6092 3872787 3965544 3536831 2926789 2545316 2301859 2132961 2196249 2676659 3683464 4436209
6082 4436209 4220003 3435047 2643641 2244017 2333104 2548404 2898195 3788609 5012429 5864237
6072 5864237 6028345 6042461 6436163 7341791 8959886 11048142 13454405 16172097 18613416
6063 18613416 20138332 20620239 20782343 21509130 23162378 25657986 28634301 31735378 34766565
6054 34766565 38009307 41120212 43467096 45180382 46556786 47925764 49294040 49823369
6046 49823369 48894669 47080284 45012521 42712129 40067614 36985691 33669045 30254085
6038 30254085 26734983 23486273 20786804 18597425 16748270 15143681 13632710 12208966
$$ packed form
6102A654296j33606N36746Q32222P58958J45980m65125m86267q743N06386N31940
6092C872787R2757m28713o10042l81473k43457j68898O3288M80410J006805P52745
6082D436209k16206p84956p91406l99624Q9087K15300L49791Q90414J223820Q51808
6072E864237J64108J4116L93702R05628J618095K088256K406263K717692K441319
6063A8613416J524916M81907J62104P26787J653248K495608K976315L101077L031187
6054C4766565L242742L110905K346884J713286J376404J368978J368276N29329
6046D9823369r28700j814385k067763k300392k644515l081923l316646l414960
6038C0254085l519102l248710k699469k189379j849155j604589j510971j423744
$$ plain form
6030 12208966 10931988 10026111 9736258 9461924 8595355 7135572 5851873 5623576 6242356
6021 6242356 6823291 6891716 6577026 6472099 6957679 7836695 8600304 8938888 9034463 9312317
6011 9312317 9737593 9786045 9113118 7835832 6438749 5116414 4091543 3653061 3545378
6002 3545378 3670350 4146734 4615204 5014998 5788341 6779209 7309565 7226405 6839744 6457375
5992 6457375 6437139 7054989 7889437 8361158 8877259 9733414 10550382 10948846 10922441 10991468
5982 10991468 11314227 11555755 11299513 10412899 9107756 7840674 7070077 6757956 6706526
5973 6706526 7035632 7532422 7216041 5965535 4406518 2908983 1732071 901762 129216
5964 129216 -907593 -2009291 -2621235 -2413079 -1515236 -585750 -119310 -66702 282385 1127448
$$ packed form
6030A2208966j276978r05877k89853k74334q66569j459783j283699k28297O18780
6021F242356N80935O8425l14690j04927M85580Q79016P63609L38584R5575K77854
6011I312317M25276M8452o72927j277286j397083j322335j024871m38482j07683
6002C545378J24972M76384M68470L99794P73343R90868N30356q3160l86661l82369
5992F457375k0236O17850Q34448M71721N16101Q56155Q16968L98464k6405O9027
5982A0991468L22759K41528k56242q86614j305143j267082p70597l12121n1430
5973F706526L29106M96790l16381j250506j559017j497535j176912q30309p72546
5964A29216j036809j101698o11944K08156Q97843R29486M66440N2608L49087Q45063
$$ plain form
5954 1127448 1840226 2357195 3099009 4367023 5977336 7197074 7604075 7458081 7171491
5945 7171491 7066638 7540370 8519005 9310542 9588774 9418545 8682489 7467980 6179533
5936 6179533 4993472 3946665 2777539 1335595 -101296 -1207423 -1588236 -1196326 -712846
5927 -712846 -427205 -178989 -23511 289173 915958 1410638 1422188 1210848 1104935 1313560
5917 1313560 2078558 2737265 2520113 1826413 1702704 2552762 4114956 5777935 6970539
5908 6970539 7678086 8056462 7946157 7481438 6640574 5061057 2834359 253721 -1956984
5899 -1956984 -3313214 -3679041 -2911982 -1348654 71454 556505 135134 -815311 -2036961
5890 -2036961 -3331680 -4481903 -5196601 -5360233 -5121006 -4691351 -4419128 -4591264 -4921160
$$ packed form
5954A127448P12778N16969P41814J268014J610313J219738M07001j45994k86590
5945G171491j04853M73732R78635P91537K78232j70229p36056j214509j288447
5936F179533j186061j046807j169126j441944j436891j106127l80813L91910M83480
5927g12846K85641K48216J55478L12684O26785M94680J1550k11340j05913K08625
5917A313560P64998O58707k17152o93700j23709Q50058J562194J662979J192604
5908F970539P07547L78376j10305m64719q40864j579517k226698k580638k210705
5899a956984j356230l65827P67059J563328J420108M85051m21371r50445j221650
5890b036961j294719j150223p14698j63632K39227M29655K72223j72136l29896
$$ plain form
5881 -4921160 -4981311 -4732455 -4328016 -3984323 -4021983 -4425403 -4805736 -4837684 -4427940 -3861724
5871 -3861724 -3402311 -3145319 -3003847 -2648565 -1878284 -734835 478143 1450605 1995224
5862 1995224 2150508 1813304 708420 -303929 -284406 720093 2050933 3036741 3522578
5853 3522578 3534789 3092670 2592950 2459831 2997745 3937366 4666309 5194772 5790718 6371715
5843 6371715 6712377 6622706 5879042 4670661 3414450 2500672 2417966 3185764 3748578 3180236
5833 3180236 2067919 1171113 559185 294025 557476 1287399 2437449 3721779 4544406
5824 4544406 4814927 4777090 4733708 4713833 4451941 3886043 3075662 2406199 2450937 3141556
5814 3141556 4301021 5649089 6648993 6902749 6513227 5959964 5478461 4898391 4158372
$$ packed form
5881d921160o0151K48856M04439L43693l7660m03420l80333l1948M09744N66216
5871c861724M59413K56992J41472L55282P70281J143449J212978R72462N44619
5862A995224J55284l37204j104884j012349J9523J004499J330840R85808M85837
5853C522578J2211m42119m99720j33119N37914R39621P28943N28463N95946N80997
5843F371715L40662q9671p43664j208381j256211r13778q2706P67798N62814n68342
5833C180236j112317q96806o11928k65160K63451P29923J150050J284330Q22627
5824D544406K70521l7837m3382j9875k61892n65898q10381o69463M4738O90619
5814C141556J159465J348068R99904K53756l89522n53263m81503n80070p40019
$$ plain form
5805 4158372 3764022 3754217 3737836 3666313 3448425 3023073 2657094 2415420 2214335 1996379
5795 1996379 1581783 1074661 632173 245954 147221 470869 1063604 1419666 1207811 495774
5785 495774 -214407 -710995 -1131679 -1530686 -1822099 -1586271 -952178 -229564 424486 1044373
5775 1044373 1673883 2306777 3298852 4781352 6008637 6038551 5256534 4631169 4430408
5766 4430408 4503459 4906450 5943761 7378304 8408587 8433000 7240660 5393027 3824039
5757 3824039 3252564 3805050 4832658 5545944 5905076 6027803 5662006 4955792 4249575
5748 4249575 3451440 2468448 1730251 1346781 965701 655339 661210 1085686 1470409 1038676
5738 1038676 -56196 -944675 -1087011 -383843 644607 1431229 1678332 1337762 817549
$$ packed form
5805D158372l94350r805j6381p1523k17888m25352l65979k41674k01085k17956
5795A996379m14596n07122m42488l86219r8733L23648N92735L56062k11855p12037
5785D95774p10181m96588m20684l99007k91413K35828O34093P22614O54050O19887
5775A044373O29510O32894R92075J482500J227285K9914p82017o25365k00761
5766D430408P3051M02991J037311J434543J030283K4413j192340j847633j568988
5757C824039n71475N52486J027608P13286L59132J22727l65797p06214p06217
5748D249575p98135r82992p38197l83470l81080l10362N871M24476L84723m31733
5738A038676j094872q88479j42336P03168J028450P86622K47103l40570n20213
$$ plain form
5729 817549 419838 539708 1597869 3106955 3876218 3618260 2936182 2635525 3199146
5720 3199146 4403518 5754357 6885006 7288248 6669656 5718782 5312542 5414391 5935929
5711 5935929 6894644 7866539 8509187 8976332 9086875 8741286 8311415 8218401 8337542 8172392
5701 8172392 7375620 6021906 4511265 3483197 3409757 4266294 5323786 5826835 6024544
5692 6024544 6453209 7028279 7333766 7759919 8524771 8901591 8577044 8054006 8075758 8639348
5682 8639348 9217941 9697829 10426220 11579733 12877684 14107378 15229378 16171716 16779782
5673 16779782 17360804 17896120 17792133 17345541 17739971 19780657 23118207 27260664 32156784
5664 32156784 37680497 43748233 50773239 59524522 69773081 79735933 87213625 91033239
$$ packed form
5729H17549l97711J19870J058161J509086P69263k57958o82078l00657N63621
5720C199146J204372J350839J130649M03242o18592r50874m06240J01849N21538
5711E935929R58715R71895O42648M67145J10543l45589m29871r3014J19141j65150
5701H172392p96772j353714j510641j028068p3440Q56537J057492N03049J97709
5692F024544M28665N75070L05487M26153P64852L76820l24547n23038K1752N63590
5682H639348N78593M79888P28391J153513J297951J229694J122000R42338O08066
5673A6779782N81022N35316j03987m46592L94430K040686L337550M142457M896120
5664C2156784N523713O067736P025006Q751283J0248559R962852P477692L819614
$$ plain form
5656 91033239 91485080 89734112 86287767 80600176 72644613 63702567 55623063 49336944
5648 49336944 44581337 41280787 39699698 39530438 40185324 41270433 42733459 44528959
5640 44528959 46745886 49767338 53774432 58547933 63637024 68910418 73878562 77752642
5632 77752642 80219088 81367119 80928818 78134355 72505638 64686348 56127959 47823286
5624 47823286 40424224 34191449 28980440 24319644 19608130 14947802 11133726 8735427
5616 8735427 7521913 7198751 7346072 6952561 5672598 4524695 4265426 4370414 4181705
5607 4181705 3798228 3628265 3580386 3358069 2914395 2427343 2281653 2351430 2379310 2734204
5597 2734204 3431850 3908460 3891669 3765333 3782442 3730716 3534761 3506137 4100283 5054906
$$ packed form
5656I1033239M51841j750968l446345n687591p955563q942046q079504o286119
5648D9336944m755607l300550j581089j69260O54886J085109J463026J795500
5640D4528959K216927L021452M007094M773501N089091N273394M968144L874080
5632G7752642K466446J148031m38301k794463n628717p819290q558389q304673
5624D7823286p399062o232775n211009m660796m711514m660328l814076k398299
5616H735427j213514l23162J47321l93511j279963j147903k59269J04988j88709
5607D181705l83477j69963m7879k22317m43674m87052j45690O9777K7880L54894
5597B734204O97646M76610j6791j26336J7109n1726j95955k8624N94146R54623
$$ plain form
5587 5054906 5724029 6145938 6605062 6979657 7276465 8013148 8971619 9551680 9616156 9051084
5577 9051084 7867238 6489508 5492599 4950639 4778094 5027451 5611823 6003592 5768069
5568 5768069 5032263 4285455 3767577 3367792 2804663 1884272 1092969 1067819 1623689 2093549
5558 2093549 2503118 3103356 3583966 3563204 3164451 3042343 3469373 3905513 3868858 3656837
5548 3656837 3365019 2558857 1676443 1302916 1510977 2037490 2106585 1333706 515315 368069
5538 368069 328252 -425604 -1375687 -1992672 -2657713 -3772657 -5178355 -6304708 -6831095
5529 -6831095 -6478595 -5650064 -5280801 -5790911 -7066890 -8395788 -9209288 -9382705 -8870440
5520 -8870440 -7851386 -6807833 -6158089 -5917449 -5720722 -5413525 -4986844 -4339425 -3369472
$$ packed form
5587E054906O69123M21909M59124L74595K96808P36683R58471N80061O4476n65072
5577I051084j183846j377730r96909n41960j72545K49357N84372L91769k35523
5568E768069p35806p46808n17878l99785n63129r20391p91303k5150N55870M69860
5558B093549M09569O00238M80610k0762l98753j22108M27030M36140l6655k12021
5548C656837k91818q06162q82414l73527K08061N26513O9095p72879q18391j47246
5538C68069l9817p53856r50083o16985o65041j114944j405698j126353n26387
5529f831095L52500Q28531L69263n10110j275979j328898q13500j73417N12265
5520h870440J019054J043553O49744K40640J96727L07197M26681O47419R69953
$$ plain form
5511 -3369472 -2308931 -1742416 -1933300 -2639796 -3410963 -3965806 -4414380 -4932537 -5536968
5502 -5536968 -6206908 -6514795 -5739690 -3795672 -1547442 53249 583296 348475 -273302
5493 -273302 -1115369 -1780511 -1899824 -1513283 -1133127 -545426 530362 1506302 2040943 2495513
5483 2495513 2951625 3152499 2899446 2657701 3044341 4049472 5506912 7067138 8261076
5474 8261076 8480540 7619245 6183136 4864075 4169048 4089756 4152553 4372677 4920535 5527795
5464 5527795 5694068 4873241 3422302 2282266 1869395 1737958 1458519 1243178 991482
5455 991482 707681 584000 759810 1569068 2914850 4288272 5433301 6207973 6573440
5446 6573440 6553553 6410525 6333609 6395870 6324248 6035717 5865135 5921530 6192047 6486732
$$ packed form
5511c369472J060541N66515j90884p06496p71167n54843m48574n18157o04431
5502e536968o69940l07887P75105J944018K248230J600691N30047k34821o21777
5493b73302q42067o65142j19313L86541L80156N87701J075788R75940N34641M54570
5483B495513M56112K00874k53053k41745L86640J005131J457440J560226J193938
5474H261076K19464q61295j436109j319061o95027p9292O2797K20124N47858O07260
5464E527795J66273q20827j450939j140036m12871j31437k79439k15341k51696
5455I91482k83801j23681J75810Q09258J345782J373422J145029P74672L65467
5446F573440j9887j43028p6916O2261p1622k88531j70582N6395K70517K94685
$$ plain form
5436 6486732 6609640 6544279 6490218 6635639 6919936 7320379 8116797 9813042 12077840 14018926
5426 14018926 15454511 16643441 17454207 18027644 18927431 20375848 22089959 23661961 25143205
5417 25143205 26943454 29234549 31737337 34615022 38524733 43947112 50980135 59547177
5409 59547177 69874201 82170967 96805129 114430706 134382080 153398216 167061440
5402 167061440 173626619 174655488 171210022 161960529 146295036 126943636 107888672 91448911
5394 91448911 77777032 66435601 57268110 49859149 44269672 40591286 38473701 37698162
5386 37698162 38046376 39466629 41304818 42075509 40751419 37346016 32614807 27559706
5378 27559706 22573160 17757339 13354680 9407922 6180704 4300579 3954477 4496841
$$ packed form
5436F486732J22908o5361n4061J45421K84297M00443P96418J696245K264798J941086
5426A4018926J435585J188930Q10766N73437Q99787J448417J714111J572002J481244
5417B5143205J800249K291095K502788K877685L909711N422379P033023Q567042
5409E9547177J0327024J2296766J4634162J7625577J9951374J9016136J3663224
5402A67061440O565179J028869l445466r249493j5665493j9351400j9054964j6439761
5394I1448911j3671879j1341431r167491p408961n589477l678386k117585p75539
5386C7698162L48214J420253J838189P70691j324090l405403m731209n055101
5378B7559706m986546m815821m402659l946758l227218j880125l46102N42364
$$ plain form
5370 4496841 5099814 5224633 4759952 3944660 3732124 4782269 6544965 8369201 9807886
5361 9807886 10133083 9123671 7396493 5674979 4031187 2576145 1980554 2344698 2966229
5352 2966229 3386832 3876907 4643404 5693381 6960506 8196795 9096586 9446941 9450220
5343 9450220 9131567 8316435 7392847 6534516 5458387 4086619 2261880 -139246 -2395625
5334 -2395625 -3432602 -2899990 -1291312 528859 1789625 2071718 1478324 1019493 1477364
5325 1477364 2438044 3033264 3071476 2654708 1864878 1039634 750391 1291325 2453851 3838713
5315 3838713 4537928 3895605 2653272 1782668 1345218 787526 -25428 -763473 -991476
5306 -991476 -588254 38517 330092 -27734 -956726 -1880405 -2300552 -2101340 -1220365 -6307
$$ packed form
5370D496841O02973J24819m64681q15292k12536J050145J762696J824236J438685
5361I807886L25197j009412j727178j721514j643792j455042n95591L64144O21531
5352B966229M20603M90075P66497J049977J267125J236289Q99791L50355L279
5343I450220l18653q15132r23588q58331j076129j371768j824739k401126k256379
5334b395625j036977N32612J608678J820171J260766K82093n93394m58831M57871
5325A477364R60680N95220L8212m16768p89830q25244k89243N40934J162526J384862
5315C838713O99215o42323j242333q70604m37450n57692q12954p38045k28003
5306i91476M03222O26771K91575l57826r28992r23679m20147J99212Q80975J214058
$$ plain form
5296 -6307 1033518 1853957 2227447 2205699 2024241 1602059 1531255 2420629 3911375 5585410
5286 5585410 7052067 7678217 7335546 6157114 4970330 4449528 4555950 5177075 5860816
5277 5860816 6308830 6353100 6229831 6226183 6136608 5761105 5052589 4323014 3671096 3374353
5267 3374353 3878258 4819686 5811202 6676369 6688093 5824897 4800084 3903700 2934209 1711975
5257 1711975 486160 -387928 -796677 -670070 47253 1021234 1515515 1581636 2043013 3487860
5247 3487860 5537254 6967108 7211964 6566643 5026242 2524419 42977 -1388810 -1615229
5238 -1615229 -1114806 -237260 927090 2191725 3560830 4924944 5963614 6094122 5222702
5229 5222702 3898872 2665996 1936873 1539235 1179868 1055184 1316918 1687647 1969468
$$ packed form
5296f307J039825Q20439L73490k1748j81458m22182p0804Q89374J490746J674035
5286E585410J466657O26150l42671j178432j186784n20802J06422O21125O83741
5277E860816M48014M4270j23269l648q9575l75503p08516p29575o51918k96743
5267C374353N03905R41428R91516Q65167J1724q63196j024813q96384r69491j222234
5257A711975j225815q74088m08749J26607P17323R73981M94281O6121M61377J444847
5247C487860K049394J429854K44856o45321j540401k501823k481442j431787k26419
5238a615229N00423Q77546J164350J264635J369105J364114J038670J30508q71420
5229E222702j323830j232876p29123l97638l59367j24684K61734L70729K81821
$$ plain form
5220 1969468 2445199 3241560 3800977 3421188 2151116 573626 -665732 -1473321 -1437416
5211 -1437416 -217263 1515331 2849585 3544792 3711876 3560528 3256867 2426368 1301441
5202 1301441 686040 824451 1380718 2171375 2903435 2956232 2242176 1402014 843370 324775
5192 324775 -24944 389539 1685762 3018602 3533306 3402130 3171716 2904381 2686794
5183 2686794 2754766 2667350 2289478 2174170 2496828 3072714 3653010 3954870 3915431 3799728
5173 3799728 3838278 3944616 3667819 2985034 2369351 1743710 1002168 517748 981665 2456319
5163 2456319 4378838 6329513 8058391 9564727 11096613 12436515 13139286 13050801 12575722
5154 12575722 12579443 13465321 14938320 16583839 18287092 20240065 22676153 25607908 28292172
$$ packed form
5220A969468M75731P96361N59417l79789j270072j577490j239358q07589L5905
5211a437416J220153J732594J334254O95207J67084j51348l03661q30499j124927
5202A301441o15401J38411N56267P90657P32060N2797p14056q40162n58644n18595
5192C24775l49719M14483J296223J332840N14704j31176k30414k67335k17587
5183B686794O7972q7416l77872j15308L22658N75886N80296L01860l9439j15703
5173C799728L8550J06338k76797o82785o15683o25641p41542m84420M63917J474654
5163B456319J922519J950675J728878J506336J531886J339902P02771q8485m75079
5154A2575722L721Q85878J472999J645519J703253J952973K436088K931755K684264
$$ plain form
5145 28292172 29395996 28229784 25159221 21087239 17148920 14337465 12541053 10972744
5137 10972744 9636321 8568023 7652705 7156720 6950993 6840657 6608875 6519738 6877778
5128 6877778 7313642 7313839 6493006 5334338 4789052 4803032 4671254 4350048 4510641 5793933
5118 5793933 8182659 10789443 13059390 15440414 18320450 21724524 25771727 30720161
5110 30720161 36884264 44514205 53725804 64735178 78183860 95006376 115420278 138303808
5102 138303808 160864345 178688308 188304713 188627498 180036141 163704933 142794501 121727320
5094 121727320 103021459 87208977 74205132 63501714 55097345 49036860 44124213
5087 44124213 39214594 34112568 28882899 23786002 19554445 16956673 15586040 14486297
$$ packed form
5145B8292172J103824j166212l070563m071982l938319k811455j796412j568309
5137A0972744j336423j068298r15318m95985k05727j10336k31782q9137L58040
5128F877778M35864J97q20833j158668n45286J3980j31778l21206J60593J283292
5118E793933K388726K606784K269947K381024K880036L404074M047203M948434
5110C0720161O164103P629941R211599J1009374J3448682J6822516K0413902K2883530
5102A38303808K2560537J7823963R616405L22785q591357j6331208k0910432k1067181
5094A21727320j8705861j5812482j3003845j0703418q404369o060485m912647
5087D4124213m909619n102026n229669n096897m231557k597772j370633j099743
$$ plain form
5079 14486297 13741848 13960513 14816852 15378896 15312168 14872320 14279098 13544403 12705855 12131511
5069 12131511 12082685 12383077 12552433 12128826 10990131 9880027 9868748 10834522 11848676
5060 11848676 12348011 12482075 12489728 12267237 11535745 10738605 10317044 10018208 9637407 9019885
5050 9019885 7753657 5927915 4145201 2802054 1864123 1449505 1753125 2413424 2936451
5041 2936451 3042390 2634675 1825901 1170485 1169854 1679400 2424449 3487237 4587993 5184065
5031 5184065 5260660 5165550 4878570 4269418 3607400 3293735 3434797 3774240 3783548 2914018
5021 2914018 1433900 161715 -828585 -1753686 -2542073 -3322792 -4062796 -4353803 -4262529
5012 -4262529 -3924121 -2925828 -1196857 557184 2006302 3355759 4350869 4337478 3463609
$$ packed form
5079A4486297p44449K18665Q56339N62044o6728m39848n93222p34695q38548n74344
5069A2131511m8826L00392J69356m23607j138695j110104j1279R65774J014154
5060A1848676M99335J34064P653k22491p31492p97140m21561k98836l80801o17522
5050I019885j266228j825742j782714j343147r37931m14618L03620O60299N23027
5041B936451J05939m07715q08774o55416o31N09546P45049J062788J100756N96072
5031E184065P6595r5110k86980o09152o62018l13665J41062L39443R308q69530
5021B914018j480118j272185r90300r25101p88387p80719p40004k91007R1274
5012d262529L38408R98293J728971J754041J449118J349457R95110j3391q73869
$$ plain form
5003 3463609 2586375 1749253 732779 33023 -186485 -816689 -2283862 -3657382 -4252909
4994 -4252909 -3942244 -3217027 -2912044 -2743044 -1978958 -497120 928291 1795814 2259158
4985 2259158 2414701 2405582 2568808 3071996 3713911 4127420 4072732 3502776 2755145 2101742
4975 2101742 1589203 1542706 1889214 1979019 1232658 -403481 -2204316 -3794201 -5112140
4966 -5112140 -5687798 -5164236 -3905401 -2511877 -1129682 317210 1898096 3161483 3726246
4957 3726246 3522701 2876061 2283743 2102041 2739931 3745866 4316315 4080713 3029521
4948 3029521 1752414 1308132 2115758 3648393 4999287 5753556 5811272 4918301 3497647
4939 3497647 2434529 2013627 1741371 1081539 -162218 -1587307 -2660068 -3571384 -4805575
$$ packed form
5003C463609q77234q37122j016474o99756k19508o30204j467173j373520n95527
4994d252909L10665P25217L04983J69000P64086J481838J425411Q67523M63344
4985B259158J55543r119J63226N03188O41915M13509n4688n69956p47631o53403
4975B101742n12539m6497L46508Q9805p46361j636139j800835j589885j317939
4966e112140n75658N23562J258835J393524J382195J446892J580886J263387N64763
4957C726246k03545o46640n92318j81702O37890J005935N70449k35602j051192
4948C029521j277107m44282Q07626J532635J350894P54269N7716q92971j420654
4939C497647j063118m20902k72256o59832j243757j425089j072761r11316j234191
$$ plain form
4930 -4805575 -6035808 -6345671 -5744726 -4976006 -4423021 -4197811 -4382624 -4894481 -5127316
4921 -5127316 -4763841 -4282311 -4103930 -3995795 -3591971 -3113918 -2896272 -2715821 -2143850 -1454192
4911 -1454192 -1084906 -934867 -568423 221854 1085448 1354384 912447 315229 -102171 -554786
4901 -554786 -1504420 -2932385 -4139877 -5047378 -5946567 -6503196 -6250029 -5049345 -3469066
4892 -3469066 -2352344 -1843286 -1868139 -2018431 -1800956 -1104065 -57297 885184 1496937
4883 1496937 2331796 3360312 3729416 3358029 2753887 2058276 1142316 56969 -812912
4874 -812912 -1579625 -2518013 -3334668 -3504174 -2923103 -2038240 -871461 537589 1559824
4865 1559824 1833134 1396481 448594 -506379 -905067 -608598 -64771 104731 -50851 76549
$$ packed form
4930d805575j230233l09863O00945P68720N52985K25210j84813n11857k32835
4921e127316L63475M81530J78381J08135M03824M78053K17646J80451N71971O89658
4911a454192L69286J50039L66444P90277Q63594K68936m41937n97218m17400m52615
4901e54786r49634j427965j207492r07501q99189n56629K53167J200684J580279
4892c469066J116722N09058k4853j50292K17475O96891J046768R42481O11753
4883A496937Q34859J028516L69104l71387o04142o95611r15960j085347q69881
4874h12912p66713r38388q16655j69506N81071Q84863J166779J409050J022235
4865A559824K73310m36653r47887r54973l98688K96469N43827J69502j55582J27400
$$ plain form
4855 76549 288515 159269 -162139 -806063 -1879250 -2947712 -3392343 -2836800 -1780012
4846 -1780012 -958836 -611264 -831087 -1509181 -2164644 -2446688 -2547636 -2819323 -2816747 -2059836
4836 -2059836 -937158 -250069 -342123 -932659 -1812143 -2730651 -3208371 -3395991 -3793883 -4249790
4826 -4249790 -3964540 -2960934 -2145137 -1694962 -1171794 -622121 -616683 -1393732 -2078554 -2216422
4816 -2216422 -2244792 -2453179 -2614501 -2235882 -1597182 -1239923 -1127599 -1040458 -1171060 -1647024
4806 -1647024 -2240692 -2568664 -2129051 -871266 1016285 3113919 4960618 6635245 7852947
4797 7852947 8071487 7350829 6031765 4557646 3481307 3158980 3895543 5561075 7572065
4788 7572065 9002221 8979931 7557950 5782047 4830930 5148095 6041956 6328994 5368050
$$ packed form
4855G6549K11966j29246l21408o43924j073187j068462m44631N55543J056788
4846a780012Q21176L47572k19823o78094o55463k82044j00948k71687K576P56911
4836b059836J122678O87089r2054n90536q79484r18508m77720j87620l97892m55907
4826d249790K85250J003606Q15797M50175N23168N49673N438p77049o84822j37868
4816b216422k8370k08387j61322L78619O38700L57259J12324Q7141j30602m75964
4806a647024n93668l27972M39613J257785J887551K097634J846699J674627J217702
4797G852947K18540p20658j319064j474119j076339l22327P36563J665532K010990
4788G572065J430156k2290j421981j775903r51117L17165Q93861K87038r60944
$$ plain form
4779 5368050 3098905 516700 -986355 -1329423 -1501919 -2212997 -3071588 -3040289 -1888502
4770 -1888502 -404985 542102 277788 -973050 -1890040 -1853618 -1709331 -2325603 -3413968
4761 -3413968 -4268011 -4561060 -4596623 -5073095 -5767347 -5997608 -5532257 -4564344 -3908448 -4119144
4751 -4119144 -4273674 -3454295 -2202982 -1471844 -1343368 -1404374 -1221396 -641046 -191578 -203346
4741 -203346 -499853 -566258 -212757 366202 1250532 2377519 3167442 3234103 2480259 1409494
4731 1409494 659336 316148 155700 -360972 -1232626 -1889265 -2190015 -2526523 -3291727 -3991705
4721 -3991705 -3902603 -3228488 -2574629 -2359497 -2549884 -2745924 -2088025 -479737 1011583
4712 1011583 1800366 2167022 2776486 3899026 4899344 5466285 5625942 5465997 5360188
$$ packed form
4779E368050k269145k582205j503055l43068j72496p11078q58591L1299J151787
4770a888502J483517R47087k64314j250838r16990L6422J44287o16272j088365
4761c413968q54043k93049l5563m76472o94252k30261M65351R67913O55896k10696
4751d119144j54530Q19379J251313P31138J28476o1006J82978N80350M49468j1768
4741b03346k96507o6405L53501N78959Q84330J126987P89923O6661p53844j070765
4731A409494p50158l43188j60448n16672q71654o56639l00750l36508p65204o99978
4721c991705Q9102O74115O53859K15132j90387j96040O57899J608288J491320
4712A011583P88783L66656O09464J122540J000318N66941J59657j59945j05809
$$ plain form
4703 5360188 5135129 4119432 2515050 1564771 1908296 3347871 5059540 5959794 5766144
4694 5766144 5059459 4569259 4378680 4000596 3463091 3317270 3682374 4089098 3732002 2131750
4684 2131750 -485530 -3325716 -5033713 -5161317 -4531822 -4057710 -3983662 -4043670 -4020324 -3748394
4674 -3748394 -3026379 -1777986 -317626 1046850 2464420 3675890 3909035 3033406 1716342
4665 1716342 491989 -340834 -731007 -842019 -743499 -821333 -1111083 -1159119 -1256738 -1650593
4655 -1650593 -1894640 -1918903 -1968956 -1638600 -755017 63829 676894 1220547 1510907 1666947
4645 1666947 1861482 1972531 1774437 1471132 1636826 2315209 2824142 2528375 1397796
4636 1397796 -105955 -1206949 -1312524 -732233 -106681 245986 89594 -666082 -2051324
$$ packed form
4703E360188k25059j015697j604382r50279L43525J439575J711669R00254j93650
4694E766144p06685m90200j90579l78084n37505j45821L65104M06724l57096j600252
4684B131750k617280k840186j707997j27604O29495M74112P4048o0008K3346K71930
4674c748394P22015J248393J460360J364476J417570J211470K33145q75629j317064
4665A716342j224353q32823l90173j11012R8520p7834k89750m8036r7619l93855
4655a650593k44047k4263n0053L30356Q83583Q18846O13065N43653K90360J56040
4645A666947J94535J11049j98094l03305J65694O78383N08933k95767j130579
4636A397796j503751j100994j05575N80291O25552L52667j56392p55676j385242
$$ plain form
4627 -2051324 -4027749 -5578831 -5864227 -5642421 -5624505 -5396602 -4649516 -3706326 -2791169
4618 -2791169 -2046420 -1817200 -2158262 -2636141 -2707009 -2264521 -1745460 -1593366 -2144230 -3294471
4608 -3294471 -4471877 -5287316 -5635936 -5465183 -4630350 -3251037 -1969920 -1444533 -1567859
4599 -1567859 -1953819 -2423145 -3123508 -4151941 -4988830 -5196145 -4578245 -3321470 -1907937
4590 -1907937 -260564 1759632 3488237 4377541 4476704 4041753 2958720 1312181 -345802
4581 -345802 -1558573 -1917597 -1361032 -302251 591400 924077 762643 163128 -1437178
4572 -1437178 -3946570 -6250824 -7760303 -8428988 -8697399 -8608044 -7805418 -6383625 -4602653
4563 -4602653 -3074276 -2431349 -2286242 -2003120 -1613097 -1165064 -597564 -3771 404177
$$ packed form
4627b051324j976425j551082k85396K21806J7916K27903P47086R43190R15157
4618b791169P44749K29220l41062m77879p0868M42488N19061J52094n50864j150241
4608c294471j177406q15439l48620J70753Q34833J379313J281117N25387j23326
4599a567859l85960m69326p00363j028433q36889k07315O17900J256775J413533
4590a907937J647373K020196J728605Q89304R9163m34951j083033j646539j657983
4581c45802j212771l59024N56565J058781Q93651L32677j61434n99515j600306
4572a437178k509392k304254j509479o68685k68411Q9355Q02626J421793J780972
4563d602653J528377O42927J45107K83122L90023M48033N67500N93793M07948
$$ plain form
4554 404177 627858 837021 1199517 2056191 3630819 5626595 7233348 7776263 7493021
4545 7493021 7290399 7393942 7058634 5517479 3119928 976649 -9789 389893 1472285
4536 1472285 2204049 2396229 2352854 1785689 638031 -558342 -1386372 -1688539 -1916011
4527 -1916011 -2163889 -2073885 -1600911 -942802 -787682 -1489902 -2035666 -1254459 662939 2462479
4517 2462479 3455385 3935937 4362027 5049014 5649275 5471729 4771350 4254809 4026066 4057572
4507 4057572 4132869 3820637 3147410 2083227 558123 -1047996 -2038548 -2285440 -2536951
4498 -2536951 -3163882 -3987734 -4794629 -5230751 -5385696 -5267274 -4588578 -3750604 -3251862 -3131356
4488 -3131356 -3229072 -3510645 -3815940 -3883736 -3802701 -3768136 -3669159 -3223202 -2621775 -2179878
$$ packed form
4554D04177K23681K09163L62496Q56674J574628J995776J606753N42915k83242
4545G493021k02622J03543l35308j541155k397551k143279r86438L99682J082392
4536A472285P31764J92180m3375n67165j147658j196373q28030l02167k27472
4527a916011k47878R0004M72974O58109J55120p02220n45764P81207J917398J799540
4517B462479R92906M80552M26090O86987O00261j77546p00379n16541k28743L1506
4507D057572P5297l12232o73227j064183j525104j606119r90552k46892k51511
4498b536951o26931q23852q06895m36122j54945J18422O78696Q37974M98742J20506
4488c131356r7716k81573l05295o7796Q1035L4565R8977M45957O01427M41897
$$ plain form
4478 -2179878 -1722805 -1046037 -390642 -53584 114176 362947 326422 -314636 -1213661 -1558372
4468 -1558372 -819196 215045 502206 250548 189964 220828 -248590 -1182620 -2038328 -2454224
4458 -2454224 -2461900 -1927809 -892860 247035 1217700 1898139 1944228 867424 -992155
4449 -992155 -2255398 -2459503 -2384835 -2749398 -3669940 -4665890 -5066466 -5107517 -5436004 -6201509
4439 -6201509 -7071689 -7628645 -8138036 -9006492 -9794181 -9552545 -8199341 -6193767 -3948544
4430 -3948544 -1913900 -355103 784218 1354700 1136196 213321 -1029249 -2505679 -3811426
4421 -3811426 -4334719 -4053622 -3376574 -2645189 -1827195 -787094 375203 1723955 3453971
4412 3453971 5004854 5722478 5737524 5395304 4639894 3114234 671594 -1667160 -3054107
$$ packed form
4478b179878M57073O76768O55395L37058J67760K48771l6525o41058q99025l44711
4468a558372P39176J034241K87161k51658o0584L0864m69418r34030q55708m15896
4458b454224p676N34091J034949J139895R70665O80439M6089j076804j859579
4449i92155j263243k04105P4668l64563r20542r95950m00576m1051l28487p65505
4439f201509q70180n56956n09391q68456p87689K41636J353204K005574K245223
4430c948544K034644J558797J139321N70482k18504r22875j242570j476430j305747
4421c811426n23293K81097O77048P31385Q17994J040101J162297J348752J730016
4412C453971J550883P17624J5046l42220p55410j525660k442640k338754j386947
$$ plain form
4403 -3054107 -3714525 -4035543 -4314533 -4480956 -4483204 -4353824 -4149200 -3643909 -2535158 -1137396
4393 -1137396 -191738 130453 198130 240964 362271 541956 441442 -254129 -1326328 -2050414
4383 -2050414 -2265406 -2421186 -2658481 -2567822 -1713627 -89032 1868412 3502863 4259289
4374 4259289 4245595 4256203 4454977 4503196 4201802 3394890 1830652 -86251 -1445457 -1993657
4364 -1993657 -1970780 -1788509 -1794075 -2140036 -2366114 -1614658 83108 1569394 1835259 1009933
4354 1009933 -79729 -1287909 -2590507 -3560807 -3684599 -2514358 -591950 637587 784677
4345 784677 429768 -251698 -1194953 -2127277 -2669557 -2663936 -2546863 -2669675 -2699705 -2209127
4335 -2209127 -1194304 -264224 74531 233947 646798 1201054 1492067 1167340 265082
$$ packed form
4403c054107o60418l21018k78990j66423k248J29380K04624N05291J108751J397762
4393a137396R45658L22191O7677M2834J21307J79685j00514o95571j072199p24086
4383b050414k14992j55780k37295R0659Q54195J624595J957444J634451P56426
4374D259289j3694J0608J98774M8219l01394q06912j564238j916903j359206n48200
4364a993657K2877J82271n566l45961k26078P51456J697766J486286K65865q25326
4354A009933j089662j208180j302598r70300j23792J170241J922408J229537J47090
4345G84677l54909o81466r43255r32324n42280N621J17073j22812l0030M90578
4335b209127J014823R30080L38755J59416M12851N54256K91013l24727r02258
$$ plain form
4326 265082 -550235 -782745 -366012 155821 -40853 -738665 -916931 -559475 -383559 -295169
4316 -295169 11035 244443 261193 261231 662897 1390087 1535468 693320 -239257 -196801 876564
4305 876564 2228574 3165062 3693156 3843538 3495053 2960993 2439382 1649666 438845
4296 438845 -1269612 -3182308 -4903628 -6181102 -7039043 -7317729 -6810565 -5895527 -4838142
4287 -4838142 -3670969 -2646351 -2258673 -2682690 -3396229 -3654378 -3139153 -2077756 -739911
4278 -739911 474935 1145033 1241937 950428 491717 -98689 -854938 -1583718 -1997479 -2438930
4268 -2438930 -3049713 -3085822 -2240621 -1134621 -298161 153788 854827 2437823 4353997
4259 4353997 5598613 5673125 5091064 4379152 3233382 1748025 406050 -776844 -1721854
$$ packed form
4326B65082q15317k32510M16733N21833j96674o97812j78266L57456J75916Q8390
4316b95169L06204K33408J6750L8M01666P27190J45381q42148r32577M2456J073365
4305H76564J352010R36488N28094J50382l48485n34060n21611p89716j210821
4296D38845j708457j912696j721320j277474q57941k78686N07164R15038J057385
4287d838142J167173J024618L87678m24017p13539k58149N15225J061397J337845
4278g39911J214846O70098R6904k91509m58711n90406p56249p28780m13761m41451
4268b438930o10783l6109Q45201J106000Q36460M51949P01039J582996J916174
4259D353997J244616P4512n82061p11912j145770j485357j341975j182894r45010
$$ plain form
4250 -1721854 -2158392 -2276047 -2444789 -2665068 -2941713 -3277550 -3460637 -3553757 -3568308 -3453421
4240 -3453421 -3544773 -3645462 -3282696 -2362920 -1103943 339008 1927913 2955417 2716097
4231 2716097 1444180 -163806 -1438660 -2200803 -2579150 -2745264 -2685192 -2434159 -2368207
4222 -2368207 -2691245 -3051727 -3082920 -3110291 -3482118 -3721582 -3846045 -4138333 -3871267 -2368308
4212 -2368308 -193176 1489384 2067207 1568936 528255 -255881 -442077 -216772 187613
4203 187613 730160 1192410 1266544 1088493 1010950 1251005 1707702 1690098 994762 344183
4193 344183 76613 -56712 -276144 -401641 -217256 261886 791785 1007670 775874 206455
4183 206455 -418640 -964790 -1247674 -1208529 -572594 387706 743938 341962 -192597 -114059
$$ packed form
4250a721854m36538j17655j68742k20279k76645l35837j83087r3120j4551J14887
4240c453421r1352j00689L62766R19776J258977J442951J588905J027504k39320
4231B716097j271917j607986j274854p62143l78347j66114O0072K51033O5952
4222b368207l23038l60482l1193k7371l71827k39464j24463k92288K67066J502959
4212b368308K175132J682560N77823m98271j040681p84136j86196K25305M04385
4203A87613N42547M62250P4134j78051p7543K40055M56697j7604o95336o50579
4193C44183k67570j33325k19432j25497J84385M79142N29899K15885k31796n69419
4183B06455o25095n46150k82884L9145O35935R60300L56232m01976n34559P8538
$$ plain form
4173 -114059 717468 1586842 2299020 3054183 3512712 3624314 3922604 4708508 5584823 5740091
4163 5740091 4813201 3280218 2048158 1461067 1332848 1325654 1009885 523044 579427 1225803
4153 1225803 1881287 2240616 2499608 2908982 3355725 3578528 3883717 4681940 5129735 4514959
4143 4514959 3227016 1408622 -481155 -1763426 -2170804 -1613177 -550565 361236 1027586
4134 1027586 1303795 752228 -456508 -1800600 -2668672 -2524852 -1429127 156113 1560779
4125 1560779 2668490 3695653 4852624 5823464 5913600 4877109 2977440 1277006 835392
4116 835392 1313919 2047941 2819692 3273764 3148498 2535476 1805023 1341215 1426813 1951506
4106 1951506 2435040 2238162 1553511 1078973 1200237 1707529 2151973 2404549 2563234 2539599
$$ packed form
4173a14059Q31527Q69374P12178P55163M58529J11602K98290P85904Q76315J55268
4163E740091r26890j532983j232060n87091j28219p194l15769m86841N6383O46376
4153A225803O55484L59329K58992M09374M46743K22803L05189P98223M47795o14776
4143D514959j287943j818394j889777j282271m07378N57627J062612R11801O66350
4134A027586K76209n51567j208736j344092q68072J43820J095725J585240J404666
4125A560779J107711J027163J156971R70840R0136j036491j899669j700434m41614
4116H35392M78527P34022P71751M54072j25266o13022p30453m63808Q5598N24693
4106A951506M83534j96878o84651m74538J21264N07292M44444K52576J58685k3635
$$ plain form
4096 2539599 2384424 2451168 2723797 3051544 3441794 3485422 2938600 2195387 1140083 -624364
4086 -624364 -2651617 -3949521 -3821917 -2481000 -996297 -366518 -571300 -985983 -1346698
4077 -1346698 -2025598 -3056270 -3890543 -4420245 -4609805 -4074088 -2982506 -1834800 -978660
4068 -978660 -311131 322257 895979 1248111 1385069 1424284 1158487 511238 -81371 -294442
4058 -294442 86666 1182463 2435007 3046407 2814488 2053726 922446 66793 377306
4049 377306 1386767 2117444 2029783 987795 -640705 -2088494 -2928407 -3381007 -3705744
4040 -3705744 -3910609 -3831248 -3441737 -2887989 -2179158 -1387911 -627227 94153 235754 -557712
4030 -557712 -1526799 -1591728 -475925 959179 2087182 3006891 3869724 4658814 5390991
$$ packed form
4096B539599j55175O6744K72629L27747L90250M3628n46822p43213j055304j764447
4086f24364k027253j297904J27604J340917J484703O29779k04782m14683l60715
4077a346698o78900j030672q34273n29702j89560N35717J091582J147706Q56140
4068i78660O67529O33388N73722L52132J36958L9215k65797o47249n92609k13071
4058b94442L81108J095797J252544O11400k31919p60762j131280q55653L10513
4049C77306J009461P30677q7661j041988j628500j447789q39913m52600l24737
4040c705744k04865P9361L89511N53748P08831P91247P60684P21380J41601p93466
4030e57712r69087o4929J115803J435104J128003R19709Q62833P89090P32177
$$ plain form
4021 5390991 6102751 6521781 6248275 5400030 4647546 4551077 4738492 4667640 4353929 3982125
4011 3982125 3618501 3207133 2655985 2097396 1967817 2095654 1715559 628789 -498903
4002 -498903 -863983 -664439 -677710 -1266907 -2236759 -3023940 -3060767 -2920464 -3235615 -3664047
3992 -3664047 -3651675 -2980388 -1985451 -1115923 -800002 -1374489 -2307407 -2722750 -2537795 -2034419
3982 -2034419 -1563981 -1654788 -2430339 -3411487 -4186561 -4713224 -5377573 -6244985 -6859819 -6873534
3972 -6873534 -6217567 -4970978 -3739770 -3292514 -3606573 -4044121 -4287411 -4450218 -4546301
3963 -4546301 -4483805 -4299416 -3965979 -3191350 -2072928 -1320911 -1032586 -942916 -1402957 -2408939
3953 -2408939 -3149030 -2993544 -2052451 -794528 199431 402493 40916 -381043 -749583
$$ packed form
4021E390991P11760M19030k73506q48245p52484r6469J87415p0852l13711l71804
4011C982125l63624m11368n51148n58589j29579J27837l80095j086770j127692
4002d98903l65080J99544j3271n89197r69852p87181l6827J40303l15151m28432
3992c664047J2372O71287R94937Q69528L15921n74487r32918m15343J84955N03376
3982b034419M70438r0807p75551r81148p75074n26663o64349q67412o14834j3715
3972f873534O55967J246589J231208M47256l14059m37548k43290j62807r6083
3963d546301O2496J84389L33437P74629J118422P52017K88325Q9670m60041j005982
3953b408939p40091J55486R41093J257923R93959K03062l61577m21959l68540
$$ plain form
3944 -749583 -1306647 -2023283 -2438284 -2664843 -2943619 -2843830 -2087669 -1248872 -728431 -690470
3934 -690470 -1327055 -2232716 -3008110 -3486255 -3711515 -3712928 -3664551 -3573213 -2691788 -1326844
3924 -1326844 -816064 -1098827 -1088676 -321890 390276 486523 432528 545740 919874 1697041
3914 1697041 2911377 4508513 6323802 7340339 7010320 6017926 4847588 3482246 2007647
3905 2007647 544655 -515428 -521821 314613 1326146 2031145 2251841 2130183 1974367
3896 1974367 1876918 1708965 1498106 1613317 2313140 2909441 2770092 1903606 254522 -1796834
3886 -1796834 -3336993 -3964125 -4125221 -4223780 -4068991 -3458102 -2449001 -1528105 -996597
3877 -996597 -859696 -1118301 -1606039 -2257243 -3258184 -4311496 -4559051 -3556499 -2025591
$$ packed form
3944g49583n57064p16636m15001k26559k78776R9789P56161Q38797N20441L7961
3934f90470o36585r05661p75394m78145k25260j413M8377R1338Q81425J364944
3924a326844N10780k82763J0151P66786P12166R6247n3995J13212L74134P77167
3914A697041J214336J597136J815289J016537l30019r92394j170338j365342j474599
3905B007647j462992j060083o393Q36434J011533P04999K20696j21658j55816
3896A974367r7449j67953k10859J15211O99823N96301j39349q66486j649084k051356
3886a796834j540159o27132j61096r8559J54789O10889J009101R20896N31508
3877i96597J36901k58605m87738o51204j000941j053312k47555J002552J530908
$$ plain form
3868 -2025591 -1019813 -769151 -1029524 -1501730 -1888353 -1915911 -2005905 -2820422 -4222930 -5855466
3858 -5855466 -7588627 -9051332 -9984756 -10187391 -9508284 -7998671 -5784148 -3215244 -1172944
3849 -1172944 -493724 -971137 -1837533 -2544075 -2670210 -2122117 -1468894 -1213420 -1389633 -1869156
3839 -1869156 -2434405 -3194023 -4142688 -4905164 -5172810 -4612005 -3246246 -1578104 -1497
3830 -1497 1229421 2086092 2505234 2497686 2300730 1881871 1428671 1450772 1786875 1801522 1670538
3819 1670538 2309839 3325769 3666043 3399568 2923033 2148094 1128665 183027 -611522
3810 -611522 -1057213 -828871 -1815 1134574 2422854 3543348 3931411 3476004 2537938
3801 2537938 1473950 681557 135420 -570255 -1269234 -1493586 -1317451 -1258260 -1192897 -560555
$$ packed form
3868b025591J005778K50662k60373m72206l86623k7558q9994q14517j402508j632536
3858e855466j733161j462705r33424k02635O79107J509613K214523K568904K042300
3849a172944O79220m77413q66396p06542j26135N48093O53223K55474j76213m79523
3839a869156n65249p59618r48665p62476k67646N60805J365759J668142J576607
3830a497J230918Q56671M19142p548j96956m18859m53200K2101L36103J4647j30984
3819A670538O39301J015930L40274k66475m76535p74939j019429r45638p94549
3810f11522m45691K28342Q27056J136389J288280J120494L88063m55407r38066
3801B537938j063988p92393n46137p05675o98979k24352J76135N9191O5363O32342
$$ plain form
3791 -560555 610888 1989758 3052821 3336824 2909344 2010277 846092 -310772 -1074544
3782 -1074544 -1197188 -795708 -433918 -741124 -1529057 -2213268 -2541090 -2377024 -1320009
3773 -1320009 527642 2244718 3374559 3794987 3338162 2222649 766581 -599769 -1406697
3764 -1406697 -1437479 -1112840 -1062989 -1250869 -1682677 -2684676 -3761798 -4127130 -4229584 -5065631
3754 -5065631 -6616531 -7694791 -7544551 -6661919 -5398435 -3828816 -2263528 -1133796 -495780
3745 -495780 -38978 342431 698240 918007 924451 715326 472279 338868 324506 160090
3735 160090 -465057 -1452047 -2325212 -2387984 -1549964 -583869 -188804 -324266 -218644 468926
3725 468926 1108090 1218331 1062671 1107943 1564848 2236855 3063474 3927974 4579053 5186289
$$ packed form
3791e60555J171443J378870J063063K84003m27480q99067j164185j156864p63772
3782a074544j22644M01480L61790l07206p87933o84211l27822J64066J057015
3773a320009J847651J717076J129841M20428m56825j115513j456068j366350q06928
3764a406697l0782L24639M9851j87880m31808j001999j077122l65332j02454q36047
3754e065631j550900j078260J50240Q82632J263484J569619J565288J129732O38016
3745d95780M56802L81409L55809K19767O444k09125k43047j33411j4362j64416
3735A60090o25147r86990q73165o2772Q38020R66095L95065j35462J05622O87570
3725D68926O39164J10241j55660M5272M56905O72007Q26619Q64500O51079O07236
$$ plain form
3715 5186289 5532981 5411045 5291945 5414707 5237900 4050732 2089321 540646 -39428
3706 -39428 -19467 114793 182041 394024 972011 1711308 2075230 1873778 1295100 562953
3696 562953 10783 -391639 -493205 13512 989168 2046080 2773739 3023530 2874526 2804876
3686 2804876 3220705 3826467 3799417 2618428 714675 -1139220 -2597824 -3224190 -3058101
3677 -3058101 -2818226 -2774931 -2596555 -2298366 -1962079 -1458054 -860738 -306195 -68629 -106323
3667 -106323 -118772 413017 1401726 1839023 1327795 529979 -406315 -1732704 -3157960 -4259418
3657 -4259418 -4942463 -5412754 -5861876 -5925892 -5182417 -3998587 -3427752 -3834003 -4474342 -4589962
3647 -4589962 -4175962 -3859037 -3498469 -2559662 -1174740 100584 899046 775783 -701434
$$ packed form
3715E186289L46692j21936j19100J22762j76807j187168j961411j548675n80074
3706c9428J9961J34260O7248K11983N77987P39297L63922k01452n78678p32147
3696E62953n52170m02422j01566N06717R75656J056912P27659K49791j49004o9650
3686B804876M15829O05762k7050j180989j903753j853895j458604o26366J66089
3677c058101K39875M3295J78376K98189L36287N04025N97316N54543K37566l7694
3667a06323j2449N31789R88709M37297n11228p97816r36294j326389j425256j101458
3657d259418o83045m70291m49122o4016P43475J183830N70835m06251o40339j15620
3647d589962M14000L16925L60568R38807J384922J275324P98462j23263j477217
$$ plain form
3638 -701434 -2788820 -3955877 -3669928 -2556456 -1311042 -377641 -162888 -645420 -1342677
3629 -1342677 -1967547 -2354279 -2395170 -2276531 -2087842 -1472389 -207440 1388954 2612140
3620 2612140 3183911 3372759 3066736 1983524 577355 -561413 -1610928 -2714439 -3432364
3611 -3432364 -3863925 -4357438 -4783004 -5042226 -4850455 -3886068 -2147858 66656 1889878
3602 1889878 2350469 1369788 -385900 -2309172 -3485899 -3403353 -2472732 -1185747 119178
3593 119178 1299042 2367867 3269728 3851625 3959028 3466604 2985178 2907972 2780898 2232180
3583 2232180 1447946 973896 1157770 1987149 3054430 4190943 5531299 6519622 6534464
3574 6534464 5756347 4330576 2450117 364054 -1508648 -2675936 -2895812 -2439400 -1284254
$$ packed form
3638g01434k087386j167057K85949J113472J245414R33401K14753m82532o97257
3629a342677o24870l86732m0891J18639J88689O15453J264949J596394J223186
3620B612140N71771J88848l06023j083212j406169j138768j049515j103511p17925
3611c432364m31561m93513m25566k59222J91771R64387J738210K214514J823222
3602A889878M60591r80681j755688j923272j176727Q2546R30621J286985J304925
3593A19178J179864J068825R01861N81897J07403m92424m81426p7206j27074n48718
3583B232180p84234m74050J83874Q29379J067281J136513J340356R88323J4842
3574F534464p78117j425771j880459k086063j872702j167288k19876M56412J155146
$$ plain form
3565 -1284254 495877 2147418 3365668 4017309 3720658 2838489 2269667 1934226 1131737
3556 1131737 -188220 -1225077 -1655645 -2022151 -2608518 -3013953 -2792638 -2123493 -1503206
3547 -1503206 -1228983 -1281098 -1418056 -1128407 -17102 1027980 1007233 298430 -296761 -816009
3537 -816009 -1392699 -1683545 -1474951 -689840 386182 994680 771106 134607 -392376 -213766
3527 -213766 705628 1817564 3055249 4561929 6104429 7535358 8354747 8118620 6973150
3518 6973150 5426338 4033131 2893285 2048708 1531464 1097554 912681 1192997 1643488
3509 1643488 2158658 2550806 2420095 1390263 -527617 -2382499 -3189339 -3079530 -2726459
3500 -2726459 -2520467 -2492087 -2320414 -1882083 -1610428 -1816264 -2060120 -2228839 -2375085 -2318425
$$ packed form
3565a284254J780131J651541J218250O51641k96651q82169n68822l35441q02489
3556A131737j319957j036857m30568l66506n86367m05435K21315O69145O20287
3547a503206K74223n2115j36958K89649J111305J045082k0747p08803n95191n19248
3537h16009n76690k90846K08594P85111J076022O08498k23574o36499n26983J78610
3527b13766R19394J111936J237685J506680J542500J430929Q19389k36127j145470
3518F973150j546812j393207j139846q44577n17244m33910j84873K80316M50491
3509A643488N15170L92148j30711j029832j917880j854882q06840J09809L53071
3500b726459K05992K8380J71673M38331K71655k05836k43856j68719j46246N6660
$$ plain form
3490 -2318425 -2108034 -2191535 -2797222 -3161979 -2939405 -2616443 -2533445 -2419075 -1699718 -558660
3480 -558660 191106 147789 -540059 -1238569 -1757294 -2277172 -2411220 -1982038 -1335875 -874224
3470 -874224 -679764 -724752 -1023186 -1224268 -737443 644223 2432340 4131458 5774222
3461 5774222 7130695 7128250 5540895 3305898 1520768 1059017 2044160 3561426 4648417
3452 4648417 4873430 4049424 2632906 1375721 762542 1029002 1765333 2444248 3041615
3443 3041615 3726363 4029198 3401363 1918498 169830 -1317756 -2614177 -3690710 -4642871
3434 -4642871 -5865812 -7181951 -7985834 -8097717 -7606848 -6609521 -5505959 -4816031 -4453930
3425 -4453930 -4026880 -3407114 -2541306 -1416964 -257247 324912 188429 -154732 -326463
$$ packed form
3490b318425K10391q3501o05687l64757K22574L22962Q2998J14370P19357J141058
3480e58660P49766m3317o87848o98510n18725n19878j34048M29182O46163M61651
3470h74224J94460m4988k98434k01082M86825J381666J788117J699118J642764
3461E774222J356473k445j587355k234997j785130m61751R85143J517266J086991
3452D648417K25013q24006j416518j257185o13179K66460P36331O78915N97367
3443C041615O84748L02835o27835j482865j748668j487586j296421j076533r52161
3434d642871j222941j316139q03883j11883M90869R97327J103562O89928L62101
3425d453930M27050O19766Q65808J124342J159717N82159j36483l43161j71731
$$ plain form
3416 -326463 -220297 89612 272468 238126 215588 228914 139234 -12760 -201589 -441270
3406 -441270 -648877 -778917 -618525 -208083 -175248 -1058894 -2572618 -3806498 -4348756 -4384332
3396 -4384332 -3885601 -2873734 -2093369 -2091099 -2336148 -2397502 -2100939 -1431095 -924553 -791397
3386 -791397 -830944 -799768 -623466 -130541 691992 1266279 1011070 339041 165282 521227
3376 521227 660672 -201149 -1822958 -3402347 -4530288 -4941166 -4668479 -4168779 -4004207
3367 -4004207 -4050847 -3724186 -2897582 -1702109 -396112 484036 778619 929645 1153423
3358 1153423 1154301 907115 871081 1026572 813783 77221 -531051 -417548 301128 1264110
3348 1264110 1948633 1622711 357238 -1205934 -2743175 -3671191 -3404243 -2435610 -1613605
$$ packed form
3416c26463J06166L09909J82856l4342k2538J3326q9680j51994j88829k39681
3406d41270k07607j30040J60392M10442L2835q83646j513724j233880n42258l5576
3396d384332M98731J011867P80365K270k45049o1354K96563O69844N06542J33156
3386g91397l9547L1176J76302M92925Q22533N74287k55209o72029j73759L55945
3376E21227J39445q61821j621809j579389j127941m10878K72687M99700J64572
3367d004207m6640L26661Q26604J195473J305997Q80148K94583J51026K23778
3358A153423Q78k47186l6034J55491k12789p36562o08272J13503P18676R62982
3348A264110O84523l25922j265473j563172j537241r28016K66948R68633Q22005
$$ plain form
3339 -1613605 -1050775 -678150 -294504 105382 236653 110646 -125656 -388863 -287838 439358
3329 439358 1439593 2390666 3022418 3128135 2763745 1879522 871588 663181 1545368
3320 1545368 3014230 4122046 4112359 3023921 1517475 149304 -1131103 -2490138 -3598244
3311 -3598244 -3867313 -3053101 -1687064 -310096 889909 1746980 2120490 2018960 1843815
3302 1843815 1926503 2033916 1845084 1444665 1030297 606637 274425 143791 210640 334461
3292 334461 365695 362844 32387 -1160361 -2460003 -2807423 -2560265 -2368400 -2461451 -3075986
3282 -3075986 -3879098 -4202495 -3556967 -2086085 -637625 -27395 -323272 -1007050 -1483793
3273 -1483793 -1378074 -1131979 -1003966 -702223 -126707 303444 169405 -469557 -1348293 -2403194
$$ packed form
3339a613605N62830L72625L83646L99886J31271j26007k36302k63207J01025P27196
3329D39358J000235R51073O31752J05717l64390q84223j007934k08407Q82187
3320A545368J468862J107816r687j088438j506446j368171j280407j359035j108106
3311c598244k69069Q14212J366037J376968J200005Q57071L73510j01530j75145
3302A843815Q2688J07413j88832m00419m14368m23660l32212j30634O6849J23821
3292C34461L1234k851l30457j192748j299642l47420K47158J91865r3051o14535
3282c075986q03112l23397O45528J470882J448460O10230k95877o83778m76743
3273a483793J05719K46095J28013L01743N75516M30151j34039o38962q78736j054901
$$ plain form
3263 -2403194 -3269685 -3767124 -4093799 -3967357 -3441698 -3037202 -2969979 -3133256 -3410747 -3646363
3253 -3646363 -3807155 -4475354 -5831333 -6773419 -6721192 -6331614 -6125594 -6001809 -5929050 -6088723
3243 -6088723 -6432878 -6843779 -7387962 -8024243 -8356221 -8275230 -7781579 -6953625 -5986354 -4823733
3233 -4823733 -3536748 -2581791 -2248565 -2377245 -2502173 -2150692 -1273268 -494608 -324978
3224 -324978 -338231 -100665 225262 304553 124514 -71169 167162 735883 1046337 937100
3214 937100 608613 153211 -378248 -575952 -305406 -153351 -108213 532413 1335715 1351995
3204 1351995 463644 -888530 -2367018 -3776021 -4793159 -5216295 -4841558 -3795228 -2320685
3195 -2320685 -1045503 -469232 -410403 -847481 -1650387 -2261734 -2606767 -2847095 -3061543 -3776096
$$ packed form
3263b403194q66491m97439l26675J26442N25659M04496O7223j63277k77491k35616
3253c646363j60792o68199j355979r42086N2227L89578K06020J23785P2759j59673
3243f088723l44155m10901n44183o36281l31978Q0991M93651Q27954R67271J162621
3233d823733J286985R54957L33226j28680j24928L51481Q77424P78660J69630
3224c24978j3253K37566L25927P9291j80039j95683K38331N68721L10454j09237
3214I37100l28487m55402n31459j97704K70546J52055M5138O40626Q03302J6280
3204A351995q88351j352174j478488j409003j017138m23136L74737J046330J474543
3195b320685J275182N76271N8829m37078q02906o11347l45033k40328k14448p14553
$$ plain form
3185 -3776096 -5231054 -6819608 -7295006 -5975430 -3677641 -1729485 -991121 -1283144 -1626128
3176 -1626128 -1672689 -1681900 -2033562 -2677073 -3068042 -3232844 -3066387 -2604023 -2398711 -2556561
3166 -2556561 -2713614 -2683370 -2376539 -1789058 -1198046 -984725 -1515867 -2540977 -3329145 -3473040
3156 -3473040 -3030302 -2085496 -984230 363919 2123123 3688889 4521214 4354649 3468438
3147 3468438 2371448 1340245 321249 -1119465 -2387560 -2418559 -1470809 -458030 103686
3138 103686 -52718 -1089499 -2724098 -4051552 -4727000 -4925617 -4932483 -4864954 -4537795 -4112760
3128 -4112760 -3933556 -3990370 -4113804 -4112906 -3922396 -3814618 -3914469 -4160413 -4634798 -5374198
3118 -5374198 -6000793 -6010400 -5195586 -3753338 -2471710 -1927886 -1897404 -2210112 -2789877 -3233807
$$ packed form
3185c776096j454958j588554m75398J319576K297789J948156P38364k92023l42984
3176a626128m6561r211l51662o43511l90969j64802J66457M62364K05312j57850
3166b556561j57053L0244L06831N87481N91012K13321n31142j025110p88168j43895
3156c473040M42738R44806J101266J348149J759204J565766Q32325j66565q86211
3147C468438j096990j031203j018996j440714j268095l0999R47750J012779N61716
3138A03686j56404j036781j634599j327454o75448j98617o866O7529L27159M25035
3128d112760J79204n6814j23434Q98J90510J07778r9851k45944m74385p39400
3118e374198o26595r607Q14814J442248J281628N43824L0482l12708n79765m43930
$$ plain form
3108 -3233807 -3413395 -3250820 -2739191 -2145556 -1810488 -2271549 -3501916 -4488551 -4497411 -4047904
3098 -4047904 -4150779 -4900865 -5250089 -4658284 -3476395 -1996247 -389960 1011796 1706042
3089 1706042 1478372 811660 670325 1267953 1685941 1548043 803094 -365944 -1226853
3080 -1226853 -1324752 -1114326 -1278745 -1554405 -1399649 -870481 -193634 565436 1341871 1965320
3070 1965320 2253684 1896209 1137670 964365 1584852 2282409 2633149 2766759 3015133 3717640
3060 3717640 4490663 4555620 3706300 2357790 1072747 689426 1478451 2440144 2790966
3051 2790966 2449623 1721333 1277348 1313311 1391657 1337880 1523874 2343609 3566591 4236564
3041 4236564 3862760 3073583 2730480 2914175 3415294 4288962 5331537 6211100 6628276
$$ packed form
3108c233807j79588J62575N11629N93635L35068m61061j230367r86635q860M49507
3098d047904j02875p50086l49224N91805J181889J480148J606287J401756O94246
3089A706042k27670o66712j41335N97628M17988j37898p44949j169038q60909
3080a226853r7899K10426j64419k75660J54756N29168O76847P59070P76435O23449
3070A965320K88364l57475p58539j73305O20487O97557L50740J33610K48374P02507
3060C717640P73023O4957q49320j348510j285043l83321P89025R61693L50822
3051B790966l41343p28290m43985L5963P8346n3777J85994Q19735J222982O69973
3041D236564l73804p89177l43103J83695N01119Q73668J042575Q79563M17176
$$ plain form
3032 6628276 6584859 6311427 5707091 4690173 3972392 4141495 4676996 4460809 3095695
3023 3095695 1469831 357084 -109693 134773 642121 686417 159559 -495416 -1066574
3014 -1066574 -1240038 -1078331 -1301219 -2122303 -2982497 -3430122 -3599152 -3727143 -3673159 -3593635
3004 -3593635 -3740253 -3768835 -3783442 -4228765 -4336394 -3186981 -1411433 -212624 -126903 -897965
2994 -897965 -2065825 -2845877 -2666471 -2010412 -1976365 -2454015 -2328841 -1492962 -812559 -706101
2984 -706101 -809598 -704711 -265565 577729 1518698 1948069 1829858 1475251 888460 136115
2974 136115 -713939 -1678325 -2333064 -2092478 -1202859 -349434 26222 -568008 -2172465 -4099225
2964 -4099225 -5670295 -6470198 -6348367 -5893851 -5471799 -5099866 -5105038 -5582426 -6204957 -6531112
$$ packed form
3032F628276m3417k73432o04336j016918p17781J69103N35501k16187j365114
3023C095695j625864j112747m66777K44466N07348M4296n26858o54975n71158
3014a066574j73464J61707k22888q21084q60194m47625j69030j27991N3984P9524
3004c593635j46618k8582j4607m45323j07629J149413J775548J198809Q5721p71062
2994h97965j167860p80052J79406O56059L4047m77650J25174Q35879O80403J06458
2984g06101j03497J04887M39146Q43294R40969M29371j18211l54607n86791p52345
2974A36115q50054r64386o54739K40586Q89619Q53425L75656n94230j604457j926760
2964d099225j571070p99903J21831M54516M22052L71933n172m77388o22531l26155
$$ plain form
2954 -6531112 -6106860 -4622706 -2608025 -911899 18987 166099 -283687 -1255789 -2450756
2945 -2450756 -3547677 -4285125 -4430024 -3993840 -3087559 -2253188 -2136136 -2402700 -2493753 -2300229
2935 -2300229 -1626583 -415716 981499 2165742 2881203 3031111 2644393 2024795 1375538
2926 1375538 755536 173637 -208071 -93777 371162 683237 532113 -127996 -999818 -1629925
2916 -1629925 -1706448 -1558712 -1504918 -1277171 -894289 -750744 -1019905 -1599797 -2366533 -3183255
2906 -3183255 -3919467 -4654374 -5465187 -5905450 -5845958 -5623365 -4978474 -3735759 -2570377
2897 -2570377 -1745933 -1036293 -567915 -503552 -674806 -1004883 -1014577 -583164 -479868 -646945
2887 -646945 -429384 550492 2207918 3627284 4341283 4942808 5783799 6370996 6365074 5901170
$$ packed form
2954f531112M24252J484154K014681J696126R30886J47112m49786r72102j194967
2945b450756j096921p37448j44899M36184R06281Q34371J17052k66564r1053J93524
2935b300229O73646J210867J397215J184243P15461J49908l86718o19598o49257
2926A375538o20002n81899l81708J14294M64939L12075j51124o60109q71822o30107
2916a629925p6523J47736N3794K27747L82882J43545k69161n79892p66736q16722
2906c183255p36212p34907q10813m40263N9492K22593O44891J242715J165382
2897b570377Q24444P09640M68378O4363j71254l30077r694M31413J03296j67077
2887f46945K17561R79876J657426J419366P13999O01525Q40991N87197n922m63904
$$ plain form
2877 5901170 5169217 4522269 4193342 4149121 4254336 4268570 4318651 4373685 3929473 2867209
2867 2867209 1389338 -129537 -1036909 -1069348 -428044 679947 1576298 1768359 1593949
2858 1593949 1584158 2079106 2808242 2847820 1831192 447556 -715159 -2037697 -3842218
2849 -3842218 -5462264 -6127587 -5915445 -5304726 -4613678 -4376904 -4976898 -6181338 -7306728
2840 -7306728 -7699118 -7028886 -5789829 -5224596 -5503242 -5499209 -4474167 -2643085 -660255
2831 -660255 769612 1148937 616834 89866 325687 1162509 2203204 3044081 3453856
2822 3453856 3689141 3858771 3410364 2294512 1238019 777588 874829 1152087 832625
2813 832625 -730169 -3377248 -5984549 -7165086 -6459128 -4848936 -3886386 -3838480 -3866945
$$ packed form
2877E901170p31953o46948l28927m4221J05215J4234N0081N5034m44212j062264
2867B867209j477871j518875r07372l2439O41304J107991Q96351J92061j74410
2858A593949r791M94948P29136L9578j016628j383636j162715j322538j804521
2849c842218j620046o65323K12142O10719O91048K36774n99994j204440j125390
2840g306728l92390O70232J239057N65233k78646M033J025042J831082J982830
2831f60255J429867L79325n32103n26968K35821Q36822J040695Q40877M09775
2822C453856K35285J69630m48407j115852j056493m60431R7241K77258l19462
2813H32625j562794k647079k607301j180537P05958J610192R62550M7906k8465
$$ plain form
2804 -3866945 -3299694 -2257781 -1256817 -296812 533823 512084 -392036 -1281683 -1503830
2795 -1503830 -1164191 -736314 -848405 -1726078 -3050866 -4026819 -4229294 -3893723 -3059826
2786 -3059826 -1742024 -317234 929767 1846680 1946409 786701 -747241 -1580626 -1382048
2777 -1382048 -230713 1027073 1758009 2141111 2384489 2433600 2157175 1614746 1212777
2768 1212777 1278335 1768945 2222076 2181912 1558338 531026 -454692 -972122 -1004181 -897622
2758 -897622 -970813 -1036529 -853309 -617441 -485092 -432661 -388809 -148670 213603 370943
2748 370943 202758 -8185 -110472 -531774 -1146054 -1428600 -1324774 -881512 -90733 794373
2738 794373 1648116 2744284 3860083 4878032 6148276 7645648 8579387 8482735 7966139
$$ packed form
2804c866945N67251J041913J000964R60005Q30635k1739r04120q89647k22147
2795a503830L39639M27877j12091q77673j324788r75953k02475L35571Q33897
2786c059826J317802J424790J247001R16913R9729j159708j533942q33385J98578
2777a382048J151335J257786P30936L83102K43378M9111k76425n42429m01969
2768A212777O5558M90610M53131m0164o23574j027312r85718n17430l2059J06559
2758h97622p3191o5716J83220K35868J32349N2431M3852K40139L62273J57340
2748C70943j68185k10943j02287m21302o14280k82546J03826M43262P90779Q85106
2738G94373Q53743J096168J115799J017949J270244J497372R33739r6652n16596
$$ plain form
2729 7966139 7674917 7589164 7399408 6895234 5834012 4277590 2975440 2293050 2132044
2720 2132044 2306951 2624402 3175975 3784708 4115210 4316820 4591080 4937318 5383128 5280793
2710 5280793 3828870 1586816 14547 -396040 -404638 -915758 -1910881 -2950855 -3912500
2701 -3912500 -4552857 -4387669 -3355434 -2057514 -1257312 -968650 -552487 337938 1301156
2692 1301156 1909435 1981435 1407733 398227 -528522 -656746 21347 858161 1831795 2907677
2682 2907677 3443278 2991071 2045664 1084619 200990 -498440 -958922 -1192555 -1318739 -1274060
2672 -1274060 -934741 -479 1541547 3162680 4275631 5038528 5908173 6687473 7160612
2663 7160612 7441804 8069586 8960077 9211284 8689522 7540475 5337745 2487425 205424
$$ packed form
2729G966139k91222q5753j89756n04174j061222j556422j302150o82390j61006
2720B132044J74907L17451N51573O08733L30502K01610K74260L46238M45810j02335
2710E280793j451923k242054j572269m10587q598n11120r95123j039974r61645
2701c912500o40357J65188J032235J297920Q00202K88662M16163Q90425R63218
2692A301156O08279P2000n73702j009506r26749j28224O78093Q36814R73634J075882
2682B907677N35601m52207r45407r61045q83629o99430m60482k33633j26184M4679
2672a274060L39319R34262J542026J621133J112951P62897Q69645P79300M73139
2663G160612K81192O27782Q90491K51207n21762j149047k202730k850320k282001
$$ plain form
2654 205424 -1041121 -1462961 -1600222 -1754198 -1538735 -999914 -634097 -477772 -337894 -236166
2644 -236166 -528840 -1269887 -2112569 -3004513 -4322103 -6082388 -7674110 -8047369 -7114815
$$ packed form
2654B05424j246545m21840j37261j53976K15463N38821L65817J56325J39878J01728
2644b36166k92674p41047q42682q91944j317590j760285j591722l73259R32554
$$ [...]
##END NTUPLES=NMR SPECTRUM
##END=
