##TITLE=C13_DE-46EA_D2O_R
 D2O, 22600sc

 22.7.2024
##JCAMPDX= 6.0         $$ Bruker NMR JCAMP-DX V2.0
##DATA TYPE= NMR SPECTRUM
##DATA CLASS= NTUPLES
##ORIGIN= UXNMR, Bruker Analytische Messtechnik GmbH
##OWNER= root
$$ XWIN-NMR		Version 3.5
$$ Tue Jul 23 13:39:08 2024 Russian Standard Time (UT+4h)  she@DPX200
##.OBSERVE FREQUENCY= 50.327896
##.OBSERVE NUCLEUS= ^13C
##.ACQUISITION MODE= SIMULTANEOUS
##.ACQUISITION SCHEME= undefined
##.AVERAGES= 22601
##.DIGITISER RES= 17
##SPECTROMETER/DATA SYSTEM= spect
##.PULSE SEQUENCE= zgpg30
##.SOLVENT NAME= D2O
##.SHIFT REFERENCE= (INTERNAL, D2O, 0, 222.565)
##AUDIT TRAIL= $$ (NUMBER, WHEN, WHO, WHERE, WHAT)
$$ ##TITLE= Audit trail, XWIN-NMR		Version 3.5
$$ ##JCAMPDX= 5.01
$$ ##ORIGIN= Bruker BioSpin GmbH
$$ ##OWNER= she
$$ F:/spectra/data/she/nmr/c13/1/pdata/1/auditp.txt
$$ ##AUDIT TRAIL=  $$ (NUMBER, WHEN, WHO, WHERE, WHAT)
(   1,<2024-07-23 13:37:15.67 +0400>,<she>,<DPX200>,
      <created by zg, POWCHK disabled, PULCHK disabled
       terminated by command 'halt'
       configuration hash MD5:
       00 E9 B6 7A A2 85 ED C7 34 08 36 98 17 FE 4E 26
       data hash MD5: 32K
       1B FC 82 4B 4C B7 44 CC 72 54 A1 BB FD 60 15 9B>)
(   2,<2024-07-23 13:37:19.54 +0400>,<she>,<DPX200>,
      <Start of raw data processing
       efp BC_mod = 2 LB = 2 FT_mod = 6 PKNL = 1 PHC0 = -536.8243 PHC1 = 25.18844 SI = 32K 
       data hash MD5: 32K
       96 04 9D 83 D4 FC 45 54 C1 E2 86 72 D7 8F B3 F6>)
(   3,<2024-07-23 13:37:22.51 +0400>,<she>,<DPX200>,
      <abs ABSG = 5 
       data hash MD5: 32K
       E7 68 DA 6D B0 51 CF 07 46 FE FD 98 9C 6F 14 11>)
(   4,<2024-07-23 13:38:24.09 +0400>,<she>,<DPX200>,
      <pk PHC0 = 2.795064 PHC1 = -17.19998 
       data hash MD5: 32K
       1A FF E8 F0 91 23 B1 AE 0B 57 67 BD 69 8E E1 EE>)
(   5,<2024-07-23 13:38:28.40 +0400>,<she>,<DPX200>,
      <abs ABSG = 5 
       data hash MD5: 32K
       89 DB B2 FE 93 26 99 4F 31 97 DE DC 99 48 69 E8>)
$$ ##END=
$$ 
$$ hash MD5
$$ C0 C6 33 1D 7B E7 74 2C C4 69 3B 01 DA D9 0F 7D
##$RELAX= 
##$RELAX= 
##$RELAX= 
##$RELAX= 
##$RELAX= 
##$RELAX= 
##$RELAX= 
##$RELAX= 
$$ Bruker specific parameters
$$ --------------------------
##$DU= <F:/spectra>
##$EXPNO= 1
##$NAME= <c13>
##$PROCNO= 1
##$TYPE= <nmr>
##$USER= <she>
##$AMP= (0..31)
100 100 100 100 100 100 100 100 100 100 100 100 100 100 100 100 100 100 
100 100 100 100 100 100 100 100 100 100 100 100 100 100 
##$AQSEQ= 0
##$AQ_mod= 1
##$AUNM= <au_zg>
##$AUTOPOS= <>
##$BF1= 50.322709
##$BF2= 200.13
##$BF3= 50.322709
##$BF4= 500.13
##$BF5= 500.13
##$BF6= 500.13
##$BF7= 500.13
##$BF8= 500.13
##$BYTORDA= 1
##$CFDGTYP= 0
##$CFRGTYP= 5
##$CHEMSTR= <none>
##$CNST= (0..31)
1 1 145 1 1 1 1 1 1 1 1 1 1 1 1 1 1 1 1 1 1 1 1 1 1 1 1 1 1 1 1 1 
##$CPDPRG= <waltz16>
##$CPDPRG1= <>
##$CPDPRG2= <waltz16>
##$CPDPRG3= <>
##$CPDPRG4= <mlev>
##$CPDPRG5= <mlev>
##$CPDPRG6= <mlev>
##$CPDPRG7= <mlev>
##$CPDPRG8= <mlev>
##$CPDPRGB= <>
##$CPDPRGT= <>
##$D= (0..31)
$$ [...]
##$SUBNAM4= <"">
##$SUBNAM5= <"">
##$SUBNAM6= <"">
##$SUBNAM7= <"">
##$SUBNAM8= <"">
##$SUBNAM9= <"">
##$SW= 239.972175391363
##$SWIBOX= (0..15)
0 1 3 0 0 0 0 0 0 0 0 0 0 0 0 0 
##$SW_h= 12077.2946859903
##$TD= 32768
##$TD0= 1
##$TE= 0
##$TE2= 300
##$TE3= 300
##$TEG= 300
##$TL= (0..7)
120 120 120 120 120 120 120 120 
##$TP= (0..7)
150 150 150 150 150 150 150 150 
##$TP07= 0
##$TPNAME0= <>
##$TPNAME1= <>
##$TPNAME2= <>
##$TPNAME3= <>
##$TPNAME4= <>
##$TPNAME5= <>
##$TPNAME6= <>
##$TPNAME7= <>
##$TPOAL= (0..7)
0.5 0.5 0.5 0.5 0.5 0.5 0.5 0.5 
##$TPOFFS= (0..7)
0 0 0 0 0 0 0 0 
##$TUNHIN= 0
##$TUNHOUT= 0
##$TUNXOUT= 0
##$USERA1= <user>
##$USERA2= <user>
##$USERA3= <user>
##$USERA4= <user>
##$USERA5= <user>
##$V9= 5
##$VALIST= <valist>
##$VCLIST= <CCCCCCCCCCCCCCC>
##$VD= 0
##$VDLIST= <DDDDDDDDDDDDDDD>
##$VPLIST= <PPPPPPPPPPPPPPP>
##$VTLIST= <TTTTTTTTTTTTTTT>
##$WBST= 1024
##$WBSW= 4
##$XGAIN= (0..3)
0 0 0 0 
##$XL= 0
##$YL= 0
##$YMAX_a= 39264028
##$YMIN_a= -131519232
##$ZGOPTNS= <>
##$ZL1= 120
##$ZL2= 120
##$ZL3= 120
##$ZL4= 120
##$ABSF1= 222.5654
##$ABSF2= -17.4314
##$ABSG= 5
##$ABSL= 3
##$ALPHA= 0
##$AQORDER= 0
##$ASSFAC= 0
##$ASSFACI= 0
##$ASSFACX= 0
##$ASSWID= 0
##$AUNMP= <proc_1d>
##$AZFE= 0.1
##$AZFW= 0.5
##$BCFW= 0
##$BC_mod= 2
##$BYTORDP= 0
##$COROFFS= 0
##$CY= -3
##$DATMOD= 1
##$DC= 0
##$DFILT= <>
##$DTYPP= 0
##$F1P= 0
##$F2P= 0
##$FCOR= 0.5
##$FTSIZE= 32768
##$FT_mod= 6
##$GAMMA= 0
##$GB= 0
##$INTBC= 1
##$INTSCL= 4.134877e-10
##$ISEN= 128
##$LB= 2
##$LEV0= 0
##$LPBIN= 0
##$MAXI= 10000
##$MC2= 0
##$MEAN= 0
##$ME_mod= 0
##$MI= 0.1934396
##$NCOEF= 0
##$NC_proc= -1
##$NLEV= 6
##$NOISF1= 120.0001
##$NOISF2= 80.00006
##$NSP= 0
##$NTH_PI= 0
##$NZP= 0
##$OFFSET= 222.5654
##$PC= 1.4
##$PHC0= -534.0292
##$PHC1= 7.988461
##$PH_mod= 1
##$PKNL= yes
##$PPARMOD= 0
##$PSCAL= 0
##$PSIGN= 0
##$REVERSE= no
##$SF= 50.3227345484362
##$SI= 32768
##$SIGF1= 140
##$SIGF2= 120
##$SINO= 11.81781
##$SIOLD= 32768
##$SREGLST= <13C.CDCl3>
##$SSB= 0
##$STSI= 32768
##$STSR= 0
##$SW_p= 12077.2946859903
##$SYMM= 0
##$S_DEV= 0
##$TDeff= 32768
##$TDoff= 0
##$TI= <>
##$TILT= no
##$TM1= 0
##$TM2= 0
##$TOPLEV= 0
##$USERP1= <user>
##$USERP2= <user>
##$USERP3= <user>
##$USERP4= <user>
##$USERP5= <user>
##$WDW= 1
##$XDIM= 32768
##$YMAX_p= 152293347
##$YMIN_p= -13554622
$$ End of Bruker specific parameters
$$ ---------------------------------
##NTUPLES= NMR SPECTRUM
##VAR_NAME=  FREQUENCY,     SPECTRUM/REAL,   SPECTRUM/IMAG
##SYMBOL=    X,             R,               I
##VAR_TYPE=  INDEPENDENT,   DEPENDENT,       DEPENDENT
##VAR_FORM=  AFFN,          ASDF,            ASDF
##VAR_DIM=   32768,         32768,           32768
##UNITS=     HZ,            ARBITRARY UNITS, ARBITRARY UNITS
##FACTOR=    0.368581032318806, 1,           1
##FIRST=     11200.0995020947, 0,            0
##LAST=      -877.195183895579, 0,           0
##MIN=       -877.195183895579, -13554622,   0
##MAX=       11200.0995020947, 152293347,    0
$$ Real data points
##PAGE= N=1
##DATA TABLE= (X++(R..R)), XYDATA
$$ [...]
##PAGE= N=2
##DATA TABLE= (X++(I..I)), XYDATA
30093 199570069 199837762 199776210 198994145 197750160 196918406 196910614 197077246 196793404 196647515
30084 196647515 197253273 198097379 198850707 199593269 200343516 201126174 201551978 201041793 199783072
30075 199783072 198472821 197230536 196327578 196415760 197420836 198601480 199513485 200001094 200353737
30066 200353737 201022330 202159455 203320386 203577313 202645340 200989587 199115177 197642102
30058 197642102 197019928 196847575 196684369 196698727 196664115 196272172 196140436 196519960 196776465
30049 196776465 196688103 196451720 196336365 196492251 197368490 199019538 200619645 201641124 202283802
30040 202283802 202774085 203317877 203804625 203643362 202623585 201386243 200875455 201599151 203148456
30031 203148456 204796922 206143746 207010681 207242090 206737633 205735474 204682708 204223810
30023 204223810 204632444 205179223 205271884 205038879 204278180 202680622 200929637 200286344 200841691
30014 200841691 201591457 201959986 202188804 202897371 203960827 204469958 203944500 202528584 200780260
30005 200780260 199332426 198279038 197884539 198762543 200735879 202864328 204256799 204473181
29997 204473181 203798858 202811376 201806163 200760102 199731564 199298839 199653045 200272472 200504814
29988 200504814 200140112 199416832 198488090 197298656 196116274 195692223 196524198 198270484 200252652
29979 200252652 202345145 204142778 205266004 205808451 205552632 204320372 202771057 201641928
29971 201641928 201147657 201402137 202024299 202065116 201455195 200811879 200161807 199316646 198760544
29962 198760544 198838359 199063473 198585526 197214600 195618060 194362999 193636086 193550608 194367601
29953 194367601 195984035 197700540 198921732 199190003 198225257 196711900 195648199 194953221
29945 194953221 194332351 193896837 193752469 194220689 195095608 196016068 196941372 197752521 198415648
29936 198415648 199080427 199931126 201208947 202768993 204261597 205473798 206445977 207364343
29928 207364343 207904842 207243344 205055797 201936704 199121912 197590281 196998453 196423792
29920 196423792 195758461 195648742 196117139 196982965 198169882 198863959 198653363 197851172 197047283
29911 197047283 196543665 196327323 196700758 198133551 200394443 202139863 202569843 202281642 201863164
29902 201863164 201359141 200969835 200705410 200397496 200223087 200590364 201953009 204092226 205687291
29893 205687291 205547173 203835335 201433705 199155894 197817973 197916964 199088147 199749033
29885 199749033 198448526 195744893 193541480 192865741 193628455 195418698 197562249 199150764
29877 199150764 199886998 200314988 200838349 201221590 200860846 199566118 198253895 197822790 198342033
29868 198342033 199526792 200463551 200452009 200149105 200193706 200492030 201087017 201793025 202434682
29859 202434682 202812700 202728810 202533988 202487442 202207338 201772963 201672985 201885219 202020389 202018490
29849 202018490 202517685 203498577 204031257 203404792 201991890 200758180 200070905 199944264 200118334
29840 200118334 200169404 199682823 198546099 197090723 195841332 195082044 194824747 195241468 196100358
29831 196100358 197062499 198259009 199826758 201768482 203491685 204259707 204025176 203254328
29823 203254328 202245737 201318232 200770157 200414281 200192213 200551255 201530166 202434666 202576881
29814 202576881 201951025 201229941 200828852 200466207 199938069 199263759 198623815 198282685 198158377
29805 198158377 197750100 196843882 195769808 194867545 194248085 194059681 194373778 195191961 196598469
29796 196598469 198318636 199842639 200944167 201511595 201745585 201772799 201377288 200613952 200236814
29787 200236814 200962064 202485657 203944559 205089704 205929984 206465954 206384047 205252899 203821476
29778 203821476 203094639 203254674 203408749 202882218 202043271 201328778 200546587 199747536 199639874
29769 199639874 200667805 202527781 204235908 205207469 205560245 205353106 204347326 202762766
29761 202762766 201484196 200949204 201320194 202451442 203270999 203020908 202050369 201148238 200910983
29752 200910983 201127587 201128652 200850627 200613209 200672345 201139621 201823193 202455891 202928798 202941877
29742 202941877 202293353 201402752 200899088 200881087 201186055 201405917 201539708 202084376 203145580
29733 203145580 203790765 203141873 201991220 201091011 200131019 198790733 197232794 196086326
29725 196086326 195684081 195751847 195692290 195439037 195482156 196053022 197250622 198489932 198922563
29716 198922563 198880541 198926866 198858514 198659991 198941891 200044550 201382698 202014868 201800104
29707 201800104 201866472 202843569 203907920 203553416 201218578 198045067 195976319 195576815 195683986
29698 195683986 195599676 195574926 195841487 196539017 197745928 199385420 200783291 201329043 201293728
29689 201293728 201431244 202143159 202732781 202545709 201942819 201973615 202770642 203306544 203234841
29680 203234841 202766643 202081183 201418256 200876332 200089734 198864197 197831550 197122189 195848840
29671 195848840 193969240 192130263 190706146 190295979 191173285 192789619 193835617 193760882
29663 193760882 193450312 193689211 194762881 196396713 197848326 198847411 199519325 200020250 200368087
29654 200368087 200267109 199782463 199395031 199221925 198630848 197506248 196425481 195753549 195877838
29645 195877838 196856731 198121328 199089765 199338027 199102322 198776011 198333780 198066800 197893217
29636 197893217 197367440 196898803 196891999 197062052 197265896 197723989 198368884 198857351 199140299
29627 199140299 199137923 198554313 197504881 196196527 194862880 193746597 193211367 193445895 194213809
29618 194213809 195377148 196806951 198516588 200641093 202679874 204056799 204769961 204984662
29610 204984662 204602378 203882479 203426683 203422372 203861244 204453079 204719749 204484448 204134481
29601 204134481 203608705 202834399 201935567 200915693 199810989 198691438 197788260 197353426 197510287
29592 197510287 198111994 199206754 200635116 202005283 203037980 203552253 203437360 203058967
29584 203058967 203090906 203749646 204419399 204479235 204345117 204601345 205198578 205776572 206162402
29575 206162402 206543294 207240910 208465854 209824580 210274547 209321932 207522779 205850683
29567 205850683 205007769 204551750 204077782 203488950 202508855 201295011 200253711 199286108 198245623
29558 198245623 197274297 196177702 194921589 193969715 194076458 195699035 198190982 200186698
29550 200186698 201166789 201132883 200183586 198939223 197966953 197077992 196150356 195538688 195441374
29541 195441374 195531538 195287538 194624190 194466206 195652668 197415445 198662481 199431344 200243421
29532 200243421 201017217 201804574 202891564 204102095 204912158 204946495 204341117 203383298 202316796
29523 202316796 201147305 199535683 197729779 196153514 194957807 194243291 194000918 194294909
29515 194294909 195021284 195866457 196744119 197592284 197927188 198023312 198539878 199253514 199444413
29506 199444413 198719670 197585002 197039902 197451773 198175346 198703369 199387751 200342907 201190074
29497 201190074 201716032 201598437 200878089 200167745 199864312 200263419 201441563 202899446 203820532
29488 203820532 204040951 204066474 204011105 203940757 203481019 201792602 199624328 198105261 197158262
29479 197158262 196812194 197228107 197811846 197864235 197164344 195657488 193800409 192777723 193094097
29470 193094097 194442381 196414993 198418384 199843993 200484833 200655354 200812090 201272881
29462 201272881 202264061 203940605 205757150 206731394 206766652 206394887 205982615 205680689 205284639
29453 205284639 204595639 203743220 202739464 201640222 200967186 201125540 201760551 202487824 203152948
29444 203152948 203677456 204094461 204473968 204619351 204481674 204253140 204101954 204353548 205080736
29435 205080736 206037311 206940232 207716991 207944916 206791088 204198658 201481376 199943885
29427 199943885 199480218 199049834 198451653 197805813 197100444 196734209 197178775 198262885 199214042
29418 199214042 199956835 200733305 201497915 202285669 203064909 203339736 202988531 202649573 202420420
29409 202420420 201596119 199675802 197125422 195076145 194815293 196362474 198435337 199955074
29401 199955074 200798470 200935826 200541597 200519429 200842749 200529563 199471192 198855657 199412013
29392 199412013 200479794 201036840 200763230 199970030 198978648 197834195 196729455 196149773 196494564
29383 196494564 197523788 198636553 199556197 200045363 200007781 199614372 199120847 198669806 198091816
29374 198091816 197486314 196833838 196271988 196067831 195939158 195884770 196166591 196608869 196920774
29365 196920774 197107915 197182679 197278504 197718343 198363919 198943677 199210969 198882322 197961585
29356 197961585 196844334 196365104 196637347 196884703 196762012 196226084 195511211 195038662 194992590
29347 194992590 195217228 195369088 195219075 194369626 192816327 191919871 192649317 194330599 195806047
29338 195806047 196385252 195976218 195332078 195100235 195261637 195503950 195821578 196443802 197074968
29329 197074968 197203066 197108911 197101122 196762382 195944165 194609415 193058212 192229435 192954998
29320 192954998 194704718 196373863 197752604 199152698 200677122 202100552 203174594 203756856
29312 203756856 203778478 203172736 202101029 200760981 199113620 197356202 196135260 195936618
29304 195936618 196898080 198513822 199891448 200382766 199789178 198827805 198548740 199165949 200142021
29295 200142021 201183080 202091157 202774902 203172816 203037352 202365402 201190401 199850265 199187684
29286 199187684 199379261 199984269 200421755 200193993 199387882 198361068 197433961 196708794 196346487
29277 196346487 196452189 196548113 196350203 196280506 196646376 197132473 197245820 196763375 195679420
29268 195679420 194437640 194024615 194695682 195812527 196771847 197144020 196727417 195794791 194980612
29259 194980612 194604582 194431498 194353951 194583375 195298713 195923336 195683329 194702116 193160247
29250 193160247 191263570 190083476 190341831 191694744 193310228 194181930 193702664 192305609
29242 192305609 190842265 189936150 189804986 190413891 191604866 193079681 194433761 195445832
29234 195445832 196678136 198261530 199342814 199700851 199540481 199376043 200125292 201315614
29226 201315614 201460983 200053970 197957071 196471247 195390184 193943262 192880052 192958352
29218 192958352 194153887 195685858 196708808 197063206 196690622 195727511 194751288 194471825 194948073
29209 194948073 195901280 197185064 198403526 199130027 199482494 200239083 201788191 203446572
29201 203446572 204377141 204541304 204265454 203821309 203239410 202346833 201086625 199891723 199361591
29192 199361591 199399965 199729544 200230025 200539848 200470609 200263146 199661761 198102330 195751312
29183 195751312 193686146 193043673 193726355 195039189 196685160 198617842 200353006 201303601
29175 201303601 201010044 199350750 197425958 196577479 197205644 198618739 199690102 200146904
29167 200146904 200619335 201278695 201575860 201190094 200414378 199394809 198050524 196510752 195048333
29158 195048333 194102783 193672466 193359999 193392268 194029216 194501252 194343447 193787906 193307269
29149 193307269 193360463 193911078 194534573 195088155 195998170 197262601 198179208 198192499 197339348
29140 197339348 196372175 195661138 194644923 193080492 191469044 190589926 191002316 192719790
29132 192719790 194789158 196387929 197548767 198207555 198288506 198012665 197436665 196885634 197077124
29123 197077124 198232714 199907497 201625829 202814548 203036444 202546262 201987642 201716076
29115 201716076 201918103 202296185 202497002 202543288 202327614 202177765 202189365 201617684 200233419
29106 200233419 198774539 198008833 197883359 197864033 197818455 197911775 197880331 197438892 196857897 196724448
29096 196724448 197637034 199167472 200063157 199524308 197847227 196046087 194776859 194629772
29088 194629772 196020641 198446399 200623669 201816732 202077449 201507635 200272745 198823235
29080 198823235 197581939 196566776 195876685 195764504 196105482 196392757 196503507 196207906 195138874
29071 195138874 193899707 193665303 194638021 195997305 197293012 198698349 199994354 200515376
29063 200515376 199594937 197648438 196335288 196611080 197708759 198798958 199742712 200235303
29055 200235303 199877966 199065366 198835299 199703835 201379400 203123871 203984679 203745452 202774264
29046 202774264 201307808 199650501 198267548 197325035 196522271 195548786 194931570 195075692 195364781
29037 195364781 195295469 195301655 195731543 196018792 196036424 196045553 196147432 196362945 196844623 197606047
29027 197606047 198391514 198772750 198510209 197827847 197163439 196768189 196924669 197670199 198444165
29018 198444165 198703648 198301456 197622478 196791142 195816023 195025504 194524461 194143503 193699299
29009 193699299 193333549 193233042 193524309 194562906 196054657 197481194 198823592 199817527
29001 199817527 200201456 200318462 200366693 200367824 200808506 201860055 203238330 204649965 205962397
28992 205962397 206825473 206769688 205648110 204288130 203759529 203880319 203601954 202859883 202032281
28983 202032281 200956470 199652867 198436073 197954853 198672797 199695111 199623799 198583790
28975 198583790 197784446 197784243 198372544 199231120 200319436 201582486 202493431 202693581 202327270
28966 202327270 201325862 199899012 198601511 197420406 195951325 193813660 191420792 189754687
28958 189754687 189665142 190793976 191937122 193221302 195252125 197465649 199357001 201012273
28950 201012273 202397320 203544813 204648735 205552098 206095138 206664103 207359585 207357650 206154781
28941 206154781 204109641 202119270 201127987 200752665 200027704 199275604 199062027 199058918 198937755
28932 198937755 198993775 199236602 199510876 199845339 200148942 199969967 199078007 197892965 196903386
28923 196903386 196006276 194850804 193814532 193441831 193913750 194727801 195105602 195018812 194872310
28914 194872310 194827529 194994164 195800074 197221333 198643203 199315359 199156512 198825555 198645266
28905 198645266 198587705 198742451 198927288 198830406 198653891 198765104 198988168 199056686 199152242 199391283
28895 199391283 199783190 200302359 200834933 201370109 201713235 201483650 200759101 199964372 199386267
28886 199386267 199019903 198773958 198281613 197280839 196459274 196562505 197311012 198051352 198816628
28877 198816628 199840845 200672396 200804729 200683273 200977451 201763371 202616011 203202651 203755645
28868 203755645 204334235 204554697 203714415 201747754 199929381 199527027 200373997 201513644 202315254
28859 202315254 202555895 201889375 200355099 199005082 198673753 199026972 199326749 199706559 200570513
28850 200570513 201568448 201967865 201482143 200707398 200395480 200933628 201935262 202443468 201502217
28841 201502217 199512735 197929416 197253475 196884436 196723653 197433966 198730021 200026694
28833 200026694 201447671 202658265 203087579 202835492 202221320 201339127 200593855 200320966 200375261
28824 200375261 200513698 200236433 198982146 197486043 196731801 196228408 195389843 194581253 194290413
28815 194290413 194250303 194181174 194647481 196310880 198990566 201582064 203118050 203652097 203717948
28806 203717948 203868026 204051194 203792264 202955162 201900415 200634768 199245182 198194354
28798 198194354 197554131 197432003 198303332 200028161 201603624 202313127 202310150 202109433 201998593
28789 201998593 201633970 200393861 198400860 196589745 195947184 196561818 197771198 199021236
28781 199021236 200141988 201292893 202648883 203961655 204742357 204481480 203166168 201504931
28773 201504931 200394627 200526289 201552303 202770781 203625945 203805334 203798523 203963952 204141514
28764 204141514 203947879 203098270 201832006 200353422 198491225 196371446 194758402 194377648
28756 194377648 195213106 196566507 197883565 199084142 200051310 200855275 201396804 201287966 200888615
28747 200888615 200804214 201024319 201378028 201426252 200887946 200147191 199568023 199314579 199368472 199495272
28737 199495272 199569634 199304104 198637573 197889554 197465231 197484949 197812026 198306411 198997025
28728 198997025 199751177 199924618 199329837 198401540 197360396 196155010 195057241 194297168 193770461
28719 193770461 193593918 194259384 195484839 197119629 199132831 200774497 201492786 201633015
28711 201633015 201867234 202252112 202655721 203056765 203658281 204509325 204884668 203944635 201908737
28702 201908737 199803572 198406545 197723916 197212319 196737675 196705956 197128607 197567500 197733825
28693 197733825 197806016 197753123 197377830 197129179 197575310 198210518 198676185 199813938 201808189
28684 201808189 203502318 203926388 203558486 203043126 202780577 203276593 204273471 204992940 204824240
28675 204824240 203686679 202397787 201889171 201809121 201564929 201336682 201083534 200450405 199544699
28666 199544699 198244085 196429925 194921443 194703021 195324135 195580333 195279433 195363296 196296281
28657 196296281 197420644 198778961 200452123 201412515 200640726 198479680 196302615 195242227
28649 195242227 195528978 196249829 196357360 195966533 195934553 196320795 196513675 196347390 196139617
28640 196139617 196378823 197377923 198686554 199414704 199375141 199116707 199225036 199766674 200482016
28631 200482016 201319989 202234658 202899039 203074023 202739964 201773174 200231098 199043048 198962040
28622 198962040 199353908 199477279 199215485 198888673 198467616 197317209 195789535 195037024 195576788
28613 195576788 196971286 198821971 200843716 202681530 204000875 204636635 204628832 204304227 204130794
28604 204130794 204083374 203618111 202099825 199938303 197977619 196600286 196151430 196277802 196147751
28595 196147751 195908985 196144066 196767843 197122532 196661452 195727663 195112238 195119445 195292634
28586 195292634 195425199 196546014 199206444 202540106 205456312 207112685 207545388 207161805
28578 207161805 205765114 203640017 201612605 199986068 198585454 197183871 195963789 195288167
28570 195288167 195061453 194969094 194854418 194781874 194875143 195026383 194760900 193850969 193071166 193172089
28560 193172089 193812325 194197222 194243402 194670952 195652631 196633871 197047788 197084075 197063443 196743259
28550 196743259 195932159 194817555 194038804 193925914 194237607 194763983 195187526 195513354 196379889
28541 196379889 197827539 198955361 199271787 199170698 199197343 199614210 200407869 201311480 202088783
28532 202088783 202618762 202690459 202243528 201461614 201001615 200934889 200520373 199254068 197155284
28523 197155284 194826922 193144730 192545259 192993753 193804287 194170034 194269933 195193791 197122019
28514 197122019 198823546 199794714 200125617 199482466 198530610 198490310 199298680 200247950 200486960
28505 200486960 199525067 198308566 197981572 198638084 199610465 199893106 198909024 197004968 195147351
28496 195147351 193640106 192249134 191761211 192646387 193812387 193922003 193243610 193069724 193715360
28487 193715360 194691894 195576032 195822201 195667602 195735318 196073564 196365478 196499233 197058774
28478 197058774 198193257 199034557 199184806 199275860 199413519 199366092 199425152 199762729 199815647 199308115
28468 199308115 198482045 197622325 197213722 197647893 198303580 198367867 197736068 196701635 195547092
28459 195547092 194362449 193194527 192077432 191804641 193196981 196139877 199606201 202403103
28451 202403103 203945009 204759436 205394966 205383151 204550686 203201444 201606904 199992755 198613132
28442 198613132 197518615 196830225 196519363 196474861 196656203 196853784 197063617 197211148 197312848
28433 197312848 197623916 198117210 198660416 199131455 199512881 199919766 200074776 199453608 198390226
28424 198390226 197746363 197852481 198468184 199246589 199746166 199873413 200185749 200680031 201139221
28415 201139221 201716367 202099617 201759447 200518729 198644914 196734253 195118911 193766909
28407 193766909 192677356 191866913 191736443 192188424 192596602 192997717 193775777 194979145 196260592
28398 196260592 196839575 196819400 196998919 197606913 198469470 199213291 199040709 197928378 196800674
28389 196800674 196032285 195236496 194477927 194403518 195237579 196378704 197250196 198052804 198889337
28380 198889337 199473395 199414909 199052421 199230791 199908933 200574465 201149370 201663978 201758369
28371 201758369 201428632 200910556 200165203 199432208 199443615 200322068 201174492 201372706 200817028
28362 200817028 200006765 199668096 199821646 199487617 197881934 195600406 193421344 191421287
28354 191421287 190029591 189621429 189863238 190312416 190988787 191885708 192796274 193739930 194540796
28345 194540796 195108161 195490116 195609190 195684238 195868203 195645916 194839911 194200893 194109753
28336 194109753 194365384 194671308 194680822 194372609 193829268 193088531 192541273 192670377 193303180
28327 193303180 193762150 193876205 194256850 195797023 198468474 200990367 202476577 202938910
28319 202938910 202788414 202625111 202413264 201532136 199636884 197230970 195096740 193563854
28311 193563854 193046539 193763643 195094631 196221297 196954713 197653153 198915550 200514197
28303 200514197 201631390 202350882 202759360 202648665 202508169 202889362 203910107 205119097 205694702
28294 205694702 205616560 205438592 204878575 203543605 201774097 200317282 199774450 199804210 199530533
28285 199530533 199271210 199919835 201460901 203003353 203746478 203598816 202749674 201654693 200788544
28276 200788544 200282897 200099714 200154113 200102504 199695156 199079248 198642449 198163270 197311876
28267 197311876 196562521 196204615 196261012 196944813 197862308 198136675 197636516 196762301 195751597
28258 195751597 195100256 195443398 196650624 197937538 198638129 198909419 198926628 198049294 196690836
28249 196690836 195814235 195458450 195583566 196279422 197104960 197281936 196760778 195857550 194830278
28240 194830278 194321551 194775451 195716237 196702252 197457642 197651168 197493170 197715156 198575404
28231 198575404 199217932 199381788 199423541 199107431 198642878 198684693 199054427 199231696 199117767
28222 199117767 198777458 198290530 198151860 198327549 198373688 198372444 197925506 196853139 196048122
28213 196048122 196030469 196415988 196551504 196549891 196564667 196542238 196746082 197258767 198007199 198965461
28203 198965461 199985322 200738371 200709374 199940359 199551879 200186510 201188840 201779244 201455630
28194 201455630 200475020 199630715 199464730 199854665 200219768 200438496 200437725 200177941 199868792 199413361
28184 199413361 198844501 198470288 198638674 199130153 199783811 200834669 202376401 204234183 205672488
28175 205672488 206379932 206931309 207241479 206776602 205722677 204427549 202944663 201617231
28167 201617231 200842070 200654395 200847285 200894446 200430340 199346558 197829038 196734587 196164377
28158 196164377 195271887 194282379 194057242 194750982 195798129 196415159 196707791 197238048 198053716
28149 198053716 199021351 199908305 200463790 200439333 199425091 197175388 194166465 191585528 190034468
28140 190034468 189416160 189610526 190071363 190260638 189888091 189211836 188712106 188386831 188056721
28131 188056721 187480650 186324695 184767760 183827760 184155465 185107995 185922725 186943167 188605323
28122 188605323 190433501 191733082 192228819 192458628 193518081 195377934 197282833 198838156
28114 198838156 200102134 201193108 202024813 202806365 203475697 203655179 203239665 202312826 200831438
28105 200831438 199121295 197746195 197156743 197112236 196929282 196511251 196173301 196228060 197035415
28096 197035415 198173328 198343964 196919783 194790034 193095884 192454797 193177652 194505292
28088 194505292 195432539 196232622 197366626 198658922 199755409 200608400 201132790 201299488 201271078
28079 201271078 200923943 200343946 200205517 200565868 200411937 199595898 198760267 198006136 197299705
28070 197299705 196970460 197018517 197188730 197641456 198514953 199349585 199464269 198695904 197956273
28061 197956273 198127131 198675153 198576431 197998917 197864684 198197687 198450572 198553965 198367510
28052 198367510 197140355 194945982 193217407 192858629 193370143 194000090 194476137 194653912 194756539
28043 194756539 195296646 196252019 197158288 197513975 197309154 196958138 196440378 195829801 195514256
28034 195514256 195230376 194274971 193066078 192492393 192133599 191853172 192426057 193713648 194951750
28025 194951750 195601495 195436293 195018165 195432918 196859026 198457329 199542039 199784514 199341963
28016 199341963 198689267 197819412 196240690 194181243 192626909 192069496 192407799 193068119 193408803
28007 193408803 193170417 192571753 192047172 191688943 191724946 192136143 192616539 193207206 193564775
27998 193564775 193528442 193542155 193833691 194226072 194496085 194656913 194687274 194411987 193872012 193485688
27988 193485688 193215346 192933217 193061195 193958440 195285061 196133634 196348556 196570525 197019102
27979 197019102 197506436 197955000 198262450 198393614 198415567 198448589 198397703 198227643 198176978 198402410
27969 198402410 198789491 199154041 199558631 200150039 201163487 202666723 203839744 203773544 202331085
27960 202331085 200456939 199405936 199338958 199737262 200018098 199917679 199429915 198508659 197466407
27951 197466407 196594632 195866575 195641759 196102242 196684336 196661502 196128616 195461232 194744819
27942 194744819 194352209 194786739 195892135 197049181 198002234 198783306 199317224 199546597 199617870
27933 199617870 199833337 200168896 200337096 199920987 199433034 199580024 200490990 201760807 202798129
27924 202798129 203324115 203446360 203544984 203568679 202962402 201928407 201337184 201699350 202686164
27915 202686164 203744928 204592402 204601878 203425161 201258408 198613662 196359411 195501636 196045402
27906 196045402 196766722 196835080 196303356 195709776 195530794 195370344 194912078 194786105 195337290
27897 195337290 195923791 195599266 194404364 193439344 193522445 194340984 194916734 194787604 194273578
27888 194273578 194176330 195059977 196557409 197766039 198178446 197882588 197287559 196623853 196142800
27879 196142800 196102137 196194132 196238689 196563878 197551121 198872566 199275589 198477925 197730182
27870 197730182 198051022 199392739 200848182 201633814 201599706 201184932 200987703 200759948 199830488
27861 199830488 198431170 197409248 196876170 196509777 196286274 196241184 196307615 196437090 196076755
27852 196076755 194798768 192988474 191130164 189679961 189102290 189287379 189917326 191107546
27844 191107546 192856358 194691892 196074906 196948252 197866640 199084573 199926609 199826715 199268224
27835 199268224 198908470 198546282 197745151 196810046 196245376 196066656 196249572 196799379 197043417
27826 197043417 196009517 194103489 192612013 191970628 191999698 192614151 193916799 195138146
27818 195138146 195320132 194586678 193422655 192184901 191148312 190380176 189550774 188859948 188675175
27809 188675175 188885831 189278224 189644522 190144757 190927380 191890206 193072519 194128475 194564900
27800 194564900 194339802 193967029 193873972 193836169 193853098 194675988 196201346 197427329 197504752
27791 197504752 196065233 193511346 190966746 189687387 189822503 190592080 191683466 193353005
27783 193353005 195079250 195923625 195677381 194887063 193983179 192719191 190805185 188675132
27775 188675132 187236737 186997754 187941960 189744357 191730508 193378209 194646424 195641297
27767 195641297 196653964 197798961 198642791 198874067 198432769 197406287 195921418 194443760
27759 194443760 193543827 193338349 193596159 194324015 195500668 196815363 198204110 199182096 198948448
27750 198948448 197889719 197493912 198483996 199702678 200088179 199894604 199805331 199820720 199142186
27741 199142186 197369441 195330720 194275360 194130414 193817152 193216250 193069937 193691687 194544794
27732 194544794 195198263 195755414 196319896 196770736 196978433 197066276 197364472 197671564 197755972
27723 197755972 197703011 197533201 197360006 197048615 196426216 196056132 196122723 196155589 196481099 197304042
27713 197304042 197944294 197946755 197383874 196556848 196206565 196526338 196865838 197119289 197810317
27704 197810317 198781929 199528374 199919053 200345159 200937365 201296350 201608653 201958415 201967749
27695 201967749 201662534 201484193 201971943 203048162 203308625 201874782 199659698 198226970
27687 198226970 198066743 198533207 198715621 197965619 196768499 196078880 195992389 196086773 196039449
27678 196039449 195968339 196218585 196811394 197569844 198407635 199126358 199312767 198663107 197456284
27669 197456284 196359300 195658909 194877541 193963072 193348246 193113591 193991309 196273629 198902419
27660 198902419 200949459 202113020 202561255 202267779 201303804 200407201 199953015 199637659 199233524
27651 199233524 199237779 199684382 199888729 199489134 198683934 197861626 197140034 196617508 196447292
27642 196447292 196689219 197526542 198822603 199723042 199387189 197941278 196527078 195874652 195609417
27633 195609417 194984173 193474156 190978379 188712470 187962123 188476213 189481529 189932570
27625 189932570 189494019 189146543 189608617 190629750 191478331 192063377 192914525 194288055 196055586
27616 196055586 197532953 197982439 197464099 196526970 195669644 195220831 195160762 195384095 195531279
27607 195531279 195292180 195001912 195055011 195577392 196376107 197271129 197956686 198040605 197771661
27598 197771661 197843465 198501141 199262452 199299751 198191241 196768298 195982821 196119743 197220012
27589 197220012 198745788 200069248 201153716 201699441 201369490 200438141 199333616 198669551
27581 198669551 199271265 200757958 201607310 201327753 200312778 199163284 198276134 197386269 196520649
27572 196520649 195741538 194846714 193880899 193145479 192582583 191874664 191174946 190837406 191048434
27563 191048434 192111076 194106994 196265833 197398657 197330824 196875395 196423600 196003022 196152830
27554 196152830 197126472 198359381 199424193 200371880 200970930 200541075 198921763 196862165
27546 196862165 195259750 194103216 193108143 192293733 191966518 192609618 194129231 195885895
27538 195885895 196975982 197223351 197054293 196764354 196822139 197341127 198022801 198577862 198737527
27529 198737527 198750486 199480963 200804099 201778462 202127653 201861874 201184460 200734335 200382337
27520 200382337 199624466 198666467 197902296 197285905 196884293 197159983 198028196 198996029 199745502
27511 199745502 199920058 198962986 196875614 194476508 192562601 191353490 190556647 189916305
27503 189916305 189663772 190097002 190916759 191635838 192552495 193866529 195401851 196782340 197416316
27494 197416316 197158703 196599944 196197540 196087197 196701054 198370120 200383991 201953694 203104768
27485 203104768 203983246 204592891 205081522 205627560 205658479 204377354 202099228 199637555 197557761
27476 197557761 196309107 195957911 195877128 195504666 195022821 195057116 195829061 196947239 197951797
27467 197951797 198425739 198281669 197614775 196417025 195497565 195736121 196534896 196989454 197166277
27458 197166277 197681397 198883164 200392810 201604914 202295003 202154384 201266333 200605448 200904137
27449 200904137 201577761 201811668 201576592 200949792 199976741 199111847 198284738 197199375 195963957
27440 195963957 194773128 194020308 194047032 194491259 194494047 193937583 193568505 193887078 194770247
27431 194770247 195855402 196243074 195308570 193595835 192267458 191981362 192637961 194169548
27423 194169548 196386241 198515213 199596962 199517074 198991827 198312385 197073749 195423989
27415 195423989 194222685 193994007 194439802 195072298 195679056 195923831 195478501 194603634 193734723
27406 193734723 193023925 192425050 191831091 191597810 192477366 194466173 196921834 199366437 201691150
27397 201691150 203639579 204584366 204469016 204168478 204404902 204934333 204982318 204433187 203700693
27388 203700693 202942325 202099608 201340286 200817421 200373376 200179434 200653946 201577702 202325388
27379 202325388 202073914 200691990 199373297 198664991 198261458 198025050 197679594 197034762 196329238
27370 196329238 195700763 195276757 195317477 196109197 197319664 198483192 199713422 200815402 201082058
27361 201082058 200696434 199991309 198515357 196099768 193520266 191592940 190980693 191693338
27353 191693338 192559389 192873320 193451475 194791784 196020276 196238838 195357132 194204752 193809959
27344 193809959 194186189 194902379 195782187 196621784 197088813 196916276 196653983 196755719 196833916
27335 196833916 196658040 196362325 196286734 196778835 197140985 196608897 195998368 196056860 196325815
27326 196325815 196538241 196638431 196524503 196333705 196477170 197322651 198888074 200700518 202087062
27317 202087062 203020626 203722539 204240563 204682884 204900486 203842349 201177031 198783912 197883094
27308 197883094 197750167 197836328 197963732 197777511 197047705 195288304 192391081 189463549 188088151
27299 188088151 188937402 190907048 192411402 193107017 193311107 193217963 193392709 194401579 196092505
27290 196092505 197806308 199007617 200022281 201168507 201801955 201400426 200338308 198672420
27282 198672420 196393949 194538251 194194865 195127045 196408163 197511162 198454777 199493440
27274 199493440 200711981 201663388 201953752 201657057 200911484 200049940 199478811 199266553 199561732
27265 199561732 200552180 201549553 202025694 202132502 202221623 202625901 203300352 203941201 204252801
27256 204252801 203950153 203235259 202766107 202551655 202132043 201542304 200870111 199987155 198959333
27247 198959333 198152440 197834896 197924871 198324959 198951272 199773779 200947847 202597365 204440709
27238 204440709 205902003 206518993 206108902 205130700 204025453 203068615 202626168 203188288 204443802
27229 204443802 205616332 206204489 205898300 205200579 204195507 202812293 201868846 201688568 201937051
27220 201937051 202617128 203787038 205197416 206062447 205972574 205394552 204763361 204404086 204350526
27211 204350526 204254371 203900305 203350887 202374440 200609908 198558234 197248734 196802160 196419325
27202 196419325 195672918 195058357 194892912 194795031 194437112 194109265 194400860 194933930 194921518
27193 194921518 194265837 193248885 192089550 190944469 190056315 189707295 190499354 192713897
27185 192713897 195452940 197833159 200025531 202287919 204435315 206154705 206582950 205323032
27177 205323032 202977068 200850667 200168612 200691868 201588852 202056374 201530979 200231885 198659356
27168 198659356 197754141 198158781 199335471 200408633 200899962 200777330 200286629 199457661 198104381
27159 198104381 196431984 195254053 194972362 195408742 196220515 197240636 198381997 199680298
27151 199680298 200947400 202144556 203415611 204185830 203640038 201913810 200045884 198598822
27143 198598822 197513568 196318833 194677142 193162178 192519279 192841887 193873334 195490042
27135 195490042 197592192 199781455 201188077 201273941 200631232 199983004 199327837 198796497 198886751
27126 198886751 199733551 200710959 201168526 201034859 200503877 200003223 199846791 199387167 198171191
27117 198171191 196997348 196766633 197266282 197721066 197713567 197470640 197164240 196519995 195656963
27108 195656963 195259093 195621427 196204209 196653229 197359891 198191095 198516355 198241504 197823111
27099 197823111 197385194 196585430 195588333 194738232 194182873 194131058 194524298 194647532 193997012
27090 193997012 193207876 192689822 192017758 191514894 191959385 193422456 195199694 196685164 197625167
27081 197625167 198124913 198450746 198422149 197739890 197034843 196781866 196587164 195972910 194885096
27072 194885096 193897748 193596005 193625180 193554033 193548938 193734482 194383076 195252330 195320290 194160223
27062 194160223 192439148 191339120 191684328 193041653 194634185 196073443 196809350 196706927
27054 196706927 196259581 195861305 195738865 195861144 196017414 195742949 195168477 195024595 195156259
27045 195156259 195077051 195345494 196231504 197000829 197314204 197599833 197998931 198510007 198978622
27036 198978622 198977999 198685948 198743271 199514023 200933946 202301261 202600282 201703085 200250822
27027 200250822 199511019 199929727 200861478 201585910 202059389 202524540 202868420 202775810 202287510
27018 202287510 201689570 200873249 200214857 200059547 200114721 199879481 199521872 199898064 201179070
27009 201179070 202780017 203953473 204552958 204708267 204090063 203005694 202464082 202295240 201716342
27000 201716342 200957257 200425302 199738465 198322669 196186476 193951394 192023525 190599078
26992 190599078 189672679 189384522 190392032 193027256 196077663 198224094 199629149 200612694
26984 200612694 200894442 200813044 201033435 201851268 202928900 203265172 202140392 199590044 196889035
26975 196889035 195467358 195733640 197104869 198767506 200396686 201368975 201291398 200697866 200071774
26966 200071774 199664230 199611634 199689799 199624473 199583899 199622805 199758383 200329332 201490943 202961165
26956 202961165 204300052 205312650 206017276 206079316 205446453 204772223 204330738 203818081 203351006
26947 203351006 203249104 202836041 201702544 200650955 200397563 200656893 200975639 201440238 202139376
26938 202139376 202402126 201728229 200741116 200036802 199515954 199098519 198787435 198655777 198512287
26929 198512287 197879762 196647166 194859551 192958546 192023799 192363622 193666864 195534197
26921 195534197 197331686 198729730 199650421 200138347 200690700 201291479 201624336 201821563 202085208
26912 202085208 202469636 202837204 202681274 201533072 200003119 199217308 199099961 198813067 198508982
26903 198508982 198838710 199847577 201230867 202741166 203820502 203942144 203119553 201872925
26895 201872925 201032406 201083204 201802162 202536743 202574149 202040451 201485241 200710297 199519044
26886 199519044 198253192 197570846 197796669 198042071 197497347 196913508 197311827 198348505 198998558
26877 198998558 198680282 197687199 197036792 197066510 196837300 195716200 194278843 193139326 192493440
26868 192493440 192200283 191835440 191568933 191826203 192545123 193635867 195152526 196883295 198009477
26859 198009477 198024359 197437492 197037868 196968186 197207070 198326141 200160307 201479912 201276056
26850 201276056 199847156 198360340 197612549 197547939 197761679 197778375 197414189 197176390 197327161
26841 197327161 197600261 197951726 198444681 198795580 198810340 199043078 200000855 201358316 202685249
26832 202685249 203579519 203649315 203094962 202410146 201667117 201029054 200919549 201242607 201992976
26823 201992976 203173393 203830551 203312743 202080095 200792147 199775381 199185415 199046214
26815 199046214 198801424 197763073 196111662 194586612 193688933 193603085 194354437 195670959 196874094
26806 196874094 197431549 197374710 197283272 197269561 197015416 196927081 197441491 198191884 198678058 198860214
26796 198860214 198891904 198626255 198424725 198451621 198591161 199167488 199806459 199789597 199678103 200433305
26786 200433305 202028307 203899807 205549121 206579833 207027391 207671148 208856914 209567994
26778 209567994 209106881 207903816 206690356 205799869 204819147 203614052 202734181 202205869 201586742
26769 201586742 200487073 199279149 198752360 198584904 198194230 197763397 197696574 197957412 198370707
26760 198370707 199116381 200158259 201110829 202115734 203436974 204749551 205359144 204913025
26752 204913025 203658762 202217474 201063916 200466899 200518130 200645401 199975861 198483104 197077989
26743 197077989 196318818 195695101 194922945 194276101 194161880 194871377 196394107 198603628 200657140
26734 200657140 201760795 202058325 202083513 201800540 200855822 199457906 197968636 196875693 196920868
26725 196920868 198302716 200228905 201561088 202120890 202311065 202380069 202501691 202458387 202010661
26716 202010661 201503351 201160993 200773173 200019602 199301562 199601737 201012456 202831409 204092973
26707 204092973 204441092 204875508 205842187 206713772 206949363 206564266 205530474 203616924 201216637
26698 201216637 198803147 196558057 194715584 193471305 192757575 192434282 192223296 192181426 192867895
26689 192867895 194494665 196523960 198269424 199481303 199999203 199761540 198945397 198064041
26681 198064041 197985829 198951326 200210045 200850173 200110112 197969660 195227411 193031259 192361197
26672 192361197 193401026 195363675 197302371 198526281 198884366 198918000 198765230 198362665 197871791
26663 197871791 197330577 196879404 197096382 198350506 199729446 200100415 199547985 198780783 198504656
26654 198504656 198972073 199652942 199970628 200150229 200569561 201131145 201220209 200193307 198754389
26645 198754389 198469193 199508967 200430186 200128801 198865269 197693071 197633213 198803457 200791042
26636 200791042 203175161 205248132 206123594 205765311 204993687 204289169 203897021 203665032 202973783
26627 202973783 201972127 201364519 201504851 201968928 201932427 200966978 199558119 198704414 198508851
26618 198508851 198277985 197601119 196792350 196486688 197418047 199755434 202508996 204639652 205755616
26609 205755616 205804239 205309112 205187431 205410558 205181431 204601547 204340309 204205404 204089359
26600 204089359 204462965 205034719 205091473 204729062 204469108 204721907 205536640 206601286 207519322
26591 207519322 208072897 208208463 207718763 206346850 204499220 202688774 201103417 200302236
26583 200302236 200417608 200438098 199646947 198301669 196648485 195393853 195292520 195879587 196437483
26574 196437483 196844811 197575917 199131003 200925686 202381941 203513485 204098797 204028097 203517472
26565 203517472 202947677 202509094 202223275 202151101 201764644 200641139 199559510 199157289 199024635
26556 199024635 198888770 198833058 198932595 199225023 199397367 199167527 198590629 197552226 195761749
26547 195761749 193569209 191640225 190181343 189540002 190104297 191608174 193600854 195712619
26539 195712619 197468360 198594637 199324143 199736549 199637239 199345942 199398446 199866331 200096751
26530 200096751 199551287 198689100 198318751 198711278 199623705 200850792 202332153 203970116 205547469
26521 205547469 206646815 207146463 207508069 208046933 208511915 208992278 210148573 211845818 213167981
26512 213167981 213577691 212543691 209493481 204449421 198023616 191567030 186311544 182439155
26504 182439155 180222271 180245895 181796141 183593575 185070805 185972874 186524098 187179718 188035308
26495 188035308 189081071 190380059 191625505 192609421 193478846 194351158 195106964 195457050 195717563
26486 195717563 196619142 197997174 199334250 200487453 201210889 201312985 201394130 201938031 202911323
26477 202911323 204288440 205855178 207278446 208352925 209017923 209332588 209096853 207952434
26469 207952434 205735147 202189224 197535983 192705219 188203329 184041954 180868594 179325264
26461 179325264 179490824 180613560 181608804 182184569 182599140 183023286 183162812 182893284 182890093
26452 182890093 183121406 182994213 182940159 183117357 182872754 182213795 181808451 181963212 182500865
26443 182500865 183392754 184613242 185856683 186838626 187670490 188409109 188900279 188848726 188435577
26434 188435577 188223604 188196092 188274782 188566336 188816588 188955931 189168764 189171851 188656225 188378878
26424 188378878 189320661 191230604 192750770 192856593 191962247 191105021 190493424 190019698 189748503
26415 189748503 189854318 190113283 189714304 188567787 187438611 186897342 187098646 188180143 189828867
26406 189828867 191407235 192275757 192118995 191530394 191307626 191500993 191690751 191903073 192523319
26397 192523319 193682879 194806673 195018364 194406613 193879276 193910868 194138531 194111036 193982289
26388 193982289 194108744 194581256 195036802 195416267 195782292 195950878 195986396 196233149 196759866
26379 196759866 197465704 197886963 197400491 196446922 195681130 195198386 195012337 194787882 193865901
26370 193865901 192182521 190546865 189556224 189070311 188825206 188842300 189199030 189832920 190804484
26361 190804484 192152784 193684897 195083396 196061053 196860169 198010102 199212853 200320506
26353 200320506 201524928 202687204 203159431 202380005 200794014 199241661 198100991 197114774
26345 197114774 196313472 195963023 196191401 196775741 197299533 197438702 197047497 196631992 196576024
26336 196576024 196767477 197092404 197409052 197588418 197847594 198790047 200195749 200982186 200638102
26327 200638102 199879929 199436329 199289852 199419667 200260444 202104767 204279480 206259556 207667617
26318 207667617 208209886 208056101 207036132 205278636 203871552 203154763 202357367 201101286
26310 201101286 199853077 199061338 198340802 197271036 196417024 196420671 196724543 196527994 195745371
26301 195745371 194923399 194921305 195572676 196418106 197565660 198915161 199959248 200516679 200520417
26292 200520417 199721377 198199648 196677869 195616077 194851151 194470264 194463073 194967846 196241395
26283 196241395 198030028 199948166 201782579 203158081 203736928 203599821 203272866 203166349
26275 203166349 203394123 203632859 203235370 202212909 201139789 200638283 200893122 201365205 201632282
26266 201632282 201926732 202502983 203454797 204670473 205957689 206849456 207095593 206813337 205904133
26257 205904133 204634576 203887829 203793882 203966009 204720753 206130828 207777786 209174941 209992182
26248 209992182 210132943 209823950 209225546 208520216 208262137 208256505 207381023 205384960 203496377
26239 203496377 202344770 201617667 200816033 199557501 198436906 198341400 199293697 200795727 202440352
26230 202440352 204279435 206203433 207713010 208477860 208796619 209178565 209458274 209693683 210257879
26221 210257879 211062289 211220108 209887267 207958186 206785497 206730592 207358289 208232801 209596253
26212 209596253 211881433 214787385 217336360 218832470 219525690 219956456 220234804 219803521
26204 219803521 218655254 217741703 217066834 215362431 211581395 205697150 198698047 192435750
26196 192435750 188517370 186972174 186627338 186677910 187804607 190778609 194673120 198415808
26188 198415808 201423236 203244420 203991109 204104912 204094540 204089841 204305082 205079908 206301085
26179 206301085 207604448 208501021 208626438 208317991 208432095 209385869 210563935 211099370 210971956
26170 210971956 210924823 211329300 211683348 210929746 207864904 202677988 196988996 192068968 188175748
26161 188175748 185054431 182574313 181120861 181091734 182497440 184922126 187406159 189372432
26153 189372432 191029857 192429902 193730403 195019955 195900988 196366674 196960573 198146266
26145 198146266 199820036 201626603 203323477 204999272 206785978 208542028 209901272 210734357
26137 210734357 211388247 212486546 214839094 218351811 221357031 222674059 222632390 221313242
26129 221313242 218472552 213811004 206568273 196011788 183135173 170911262 162091657
26122 162091657 157308335 155318940 154701502 154544993 154305845 153702831 152695279 151528592
26114 151528592 150726047 150954868 152364802 154142407 155286926 155681790 155851547 156534013 158311250
26105 158311250 161133110 164054809 166198143 167811743 169493835 171299495 172878654 174048748
26097 174048748 174746095 175103168 175762377 176677541 177436699 178084796 178537445 178855557 179180217
26088 179180217 179628737 180140078 180312469 180138654 180174050 180870475 181797000 182312854 182893044
26079 182893044 183777528 184340469 184028661 183014161 181856614 180347137 178552749 177286545
26071 177286545 176916354 177317987 178103645 178614522 178790632 179033494 179533142 180397082 181446894
26062 181446894 182353785 182999291 183501290 183964040 184316143 184557894 184662733 184652948 184864266
26053 184864266 185667472 186851073 187497062 187035638 185887846 184792671 184216745 183869382 182942326
26044 182942326 181521649 180575325 180749499 181699977 182601277 183085093 183442751 183830010 183892422
26035 183892422 183638497 183541463 184237633 186019642 187914425 188990222 189268523 188691386 187558826
26026 187558826 186838149 186990450 187374950 187405024 187232583 187083785 186766181 186405776 186405245 186936417
26016 186936417 187341251 186797878 185735632 185286993 185296966 184908115 184046814 182990144 182046901
26007 182046901 181207323 180829715 181459327 182612208 183459814 183669736 183390635 182747043 181342465
25998 181342465 179517755 178415619 178267931 178264454 178219259 178359424 178385360 177919070 177379364
25989 177379364 177527770 178014713 178061578 177996468 178507119 179246249 179570811 179831521 180405146
25980 180405146 181242012 182011421 182142006 181551525 180719668 180042930 179578994 179603764 180256121
25971 180256121 181127661 182259674 183831203 185520236 186717865 187478039 188280333 188931546
25963 188931546 188965156 188404581 187704465 187091927 186814401 187330741 188767149 190119341 190383030
25954 190383030 189930378 189811377 190532521 191793977 193126195 194134704 194729919 194577375 193258599
25945 193258599 191362081 189553470 188129221 187510995 187706674 188027770 187914756 187162558 186110128
25936 186110128 185569407 185820650 186720829 187909371 188596595 188636339 188507754 188348826 188309905
25927 188309905 188678023 188981568 188979351 189083353 189032711 188501371 187767707 187060596 186681567 187173627
25917 187173627 188380430 189137845 188901216 188324237 187761845 186994965 185819354 184797170 184605274
25908 184605274 185063039 185568753 185955140 186489714 186685950 185874342 184614429 184003879 184391973
25899 184391973 185123347 185527103 185585242 185403164 185084379 185107314 185898017 187635344 189714147
25890 189714147 190899600 191171837 191352155 191370487 190741559 189627808 188566988 187813064 187354819
25881 187354819 187302824 187577548 187837658 187905849 187728686 187458555 187737992 188817545 189827930
25872 189827930 190373297 190903385 191721319 192850823 194024002 194686975 194415373 193574142 192736916
25863 192736916 192269899 192362763 192682238 192607653 192060853 191611918 191926138 193026321 194141780
25854 194141780 194878241 195059755 194654106 193910958 192612972 190776753 189048357 187792400
25846 187792400 186933913 186593937 187387331 189347719 191596601 193400860 194357223 194217785 193100426
25837 193100426 191915034 191635903 192097105 192499029 192570326 192116096 191065373 189697773 188604796
25828 188604796 187987472 187655700 187660113 188229861 189173904 190225281 191047461 191327916 191623970
25819 191623970 192612351 194258673 195695405 195944487 194807686 193000961 191384570 190636530
25811 190636530 190866676 191550480 192395149 193200158 193403948 192880055 192374585 192359012 192568458
25802 192568458 192391135 191846301 191503949 191263650 190751512 190061660 189364263 188885022 188842188
25793 188842188 189044930 189271743 189225745 188506007 187345504 186253097 185670733 185969042 186598371
25784 186598371 186759463 186863419 187423054 188321568 189125948 189397881 189257573 189157845 189604714
25775 189604714 190576706 191734163 192468929 191829797 190152671 188622274 187632229 187095890 186801858
25766 186801858 186634697 186303145 185463515 184238150 182968806 182138839 181631074 181071129 180472743
25757 180472743 180087567 179782500 179051215 178295880 178507171 179971918 181840452 183186925 183540978
25748 183540978 182991567 182255638 181786316 181632333 182152152 183184631 183941765 184029487 183497223
25739 183497223 183099348 183723715 185240645 187105398 188542826 188739418 187789771 186786436
25731 186786436 186506394 186635847 186773305 186960541 187064523 186979759 186757785 186238361 185304255
25722 185304255 184786128 185059586 185562478 186288994 187104749 187473496 187365090 187153348 187077852
25713 187077852 187347102 187901185 187959171 187402305 187138764 187121910 186778800 186044741 185390003
25704 185390003 185314982 185810628 186773676 187861696 188798414 189170757 188294920 186256322 184398503
25695 184398503 184149822 185243061 186178831 186180404 185616320 185512810 186349260 187553134 188570017
25686 188570017 188869663 188622464 188840406 190056947 191774612 193625509 195053371 195251166
25678 195251166 194419830 193480757 193257202 193874372 194685450 195225172 195442349 195296203 194815265
25669 194815265 194227655 193817098 193262592 192133118 190803424 189645933 188565756 187494320
25661 187494320 186666362 185978270 185052532 184051432 183628960 184042818 184883952 185714954 186093994
25652 186093994 185946662 185834560 186287723 186800226 186925778 187106960 187805113 188179625 187280153
25643 187280153 185845155 184865897 184324580 184103967 184368353 185051369 185944521 186916814 187896698
25634 187896698 188702165 189174874 189045207 188158253 186846714 185812153 185773500 186812818 188271332
25625 188271332 189057419 188406534 186920586 185803067 185323197 185119271 185012644 185617451 186993811
25616 186993811 188024621 187998804 187353330 186881332 186993730 187363243 187404185 187067782 186551800
25607 186551800 185823288 184670608 183569183 183476073 184377958 185534124 186360294 186492536 186085596
25598 186085596 185464171 184460655 183049951 181852741 181604236 182294109 183097891 183476691 183780413
25589 183780413 184780938 186622966 188252654 189174717 189893080 190768543 191702161 192576125 193266266
25580 193266266 193301800 192574608 191409893 190157212 188835350 187682945 187256712 187700755 188613071
25571 188613071 189871521 191815873 193879894 195148038 195905702 196699193 197208876 197108218
25563 197108218 196486213 195225042 193332932 191467709 190683688 191224807 192209264 192545833 191788712
25554 191788712 190428019 189454224 189630586 190932475 192616308 194029362 194708290 194618776 194566922
25545 194566922 195224646 196007554 195817358 194446726 192511106 190934995 190139653 190331388 191450595
25536 191450595 192785605 193968279 194753811 194688791 194005717 193309027 193001690 192744153 192099052
25527 192099052 191428193 190978235 190586646 189972438 189493715 189431377 189630605 190450789 192076379
25518 192076379 193980741 195065111 194790465 193794540 192727983 192059280 191950771 191911709 191652805
25509 191652805 191286726 190912203 190917786 191430844 191898357 192008057 191721949 191303113 191333347 191534530
25499 191534530 191575598 192056809 193230684 194314192 194585460 194071578 193183544 192172548 190646076
25490 190646076 188571037 187212596 187754991 189902011 192372687 194191075 195320551 195976863
25482 195976863 196401251 196774932 196833558 196062555 194392342 192468634 191007905 190382105 190665462
25473 190665462 191603921 192242365 192216527 192187734 192373656 192548080 192433528 191960461 191332347
25464 191332347 190279473 189150744 189146475 190720052 192855803 194329074 194706634 193822976 191887939
25455 191887939 189492645 186780643 183825677 181569595 181032174 181951676 183349747 184595910
25447 184595910 185422000 185625287 185174232 184462106 183927556 183738650 184112068 184930718 185778332
25438 185778332 186634355 187791996 189576806 191897584 194381144 196737660 198612877 199420506
25430 199420506 198966489 197847637 196569541 195390352 194432103 193980171 194217866 194489327 194697282
25421 194697282 195005049 194606154 193212743 191690134 190443663 189316807 188585620 189013100
25413 189013100 190242970 190958280 190937596 190513165 189850554 189356459 189300559 189559919 189993452
25404 189993452 190325659 190049988 189454361 189149973 189229114 189504886 189745919 190131602 190791485
25395 190791485 191704213 192736010 193611500 194184760 194189078 193461473 192267131 190923253 189555150
25386 189555150 188662704 188921289 190174821 191320895 191394569 190266493 188404056 186490982
25378 186490982 185011910 184149110 184198221 185213444 186621091 187420644 187276032 187054437 187642446
25369 187642446 189107285 190556585 191331907 191377645 191077102 190916371 191112992 191282512 191032308
25360 191032308 190889308 191301044 191750318 191850487 191674212 191459039 191457627 191873524 192653391
25351 192653391 193601331 194712619 196077274 197051898 196937274 196047191 195070985 193970473 192427479
25342 192427479 190716866 188947562 187462983 187159807 187910957 188760926 189258224 189125433 188567558
25333 188567558 188002127 187163352 185924806 185077845 184675864 184152678 183789192 183842767 183997829
25324 183997829 184241009 184763623 185476553 185800477 185835715 186098616 186246710 185987834 185528785
25315 185528785 185560526 186097385 186345838 185994449 185293389 184202996 182748266 181746152 181659326
25306 181659326 182000135 182336720 183009258 184340160 186092887 188067665 190105343 191766444
25298 191766444 192285438 191353944 189829568 188950708 189173290 190081139 190990790 191218899 190808614
25289 190808614 190299579 189872954 189565172 189578622 189728699 189629708 189499725 189906284 190642307
25280 190642307 191064264 191223470 191463700 191901646 192135512 191710223 190731289 189571066 188414146
25271 188414146 187223169 186580191 187216388 188582472 189754994 190644637 191270358 191366089 191173030
25262 191173030 190980538 190833255 190825461 190837542 190653281 190270826 189660702 188752934 187592797
25253 187592797 186183131 184938288 185136469 187068044 189257943 190198430 189426304 187525487
25245 187525487 185285605 183326746 182216785 182027338 182292081 182662787 183245909 184240586 185554633
25236 185554633 187031008 188397076 189648627 190727710 191194255 190839178 190005033 189468551
25228 189468551 189841554 191001076 192766717 194559198 195223835 194520133 193230342 191870729
25220 191870729 190466215 188972188 187642274 186838459 186436400 186008684 185710652 185781033 186404945
25211 186404945 187412321 188374826 189017580 188833592 187658548 186131223 185232912 185494255 186595275
25202 186595275 187526989 188014758 188545845 188988903 189444659 190200896 190794137 190829944 190681565
25193 190681565 190769221 190809654 190464559 189728489 188712978 187725942 187277894 187618722 188657520
25184 188657520 190027391 191256003 192286353 193349993 194325477 194902938 195127540 195219675 194828813
25175 194828813 193539213 192127025 191548635 192063298 193260495 194457575 195075276 194867782
25167 194867782 194282586 193881755 193746923 193830817 194060123 193780762 192680780 191185618 189836500
25158 189836500 188696103 187553417 186255982 184802271 183852779 183838106 184354409 184931270 185498675
25149 185498675 185820805 185774881 185942985 186911224 188609292 190243855 191280896 191767991 191733778
25140 191733778 191129180 189947250 188436036 187414286 187601354 188693260 189620977 189620621 188976672
25131 188976672 188466233 188670201 189746868 191180486 192254209 192642145 192556341 192412518 192389629
25122 192389629 192455233 192839252 193982391 195827117 197573140 198510571 198673243 198236054 197052266
25113 197052266 195348143 193277823 191012931 189314070 188310595 187444288 186700681 186227421
25105 186227421 186065437 186570739 187700748 188819889 189288929 188997715 188277183 187890571 188186762
25096 188186762 188501176 188321144 188129543 188208946 188497918 189024974 189781157 190541752 191049368
25087 191049368 191067274 190685746 190253218 189883338 189742046 190259334 191334149 192258912 192365536
25078 192365536 191224550 189286622 187760408 187493540 188225053 189244564 189948105 189853598 188843755
25069 188843755 187459033 186194413 185088628 184359975 184107620 184062158 184067494 184528724 185974130
25060 185974130 188361704 191001959 192925832 194172719 195236024 196100980 196367503 195743092
25052 195743092 194710175 193875005 193113640 192549176 192655439 193409576 194388479 195355598 196215609
25043 196215609 196601820 195909701 193864795 191450620 190031004 189767525 189943463 189838471 189326954
25034 189326954 188992469 189194489 189805331 190632300 190743733 189369808 187243790 185471443 184141120
25025 184141120 183486202 183800875 184713677 186001292 187743242 189469849 190465541 190558672 190238229
25016 190238229 189866056 189338877 188725866 188437790 189192293 190669227 191533814 191696454 192025190
25007 192025190 192450041 192395693 192102059 191575183 190910377 190563983 190642332 190842588 191032733
24998 191032733 191218519 190952913 190371224 190399197 191333063 192448576 192895039 191788468 189217932
24989 189217932 186522595 185243259 185547924 186261522 186749538 187331860 188151597 188825745 188977060
24980 188977060 188398409 187144431 185676896 184150080 182856961 182437193 183119330 184463674
24972 184463674 185675648 186038716 185795037 185619704 185548800 185583988 186043478 186933615 187968250
24963 187968250 188390562 188147226 188264005 188985397 189605493 190127250 191430763 193395642 195268501
24954 195268501 196716262 197512585 197348830 195985573 194065414 192919697 192897063 193195840 193459918
24945 193459918 193634175 193399669 192886438 192393970 192002523 191278206 189825729 188166573 187208906
24936 187208906 187150086 187455327 187864729 188500114 189120008 189396143 189267076 188614681 187568700
24927 187568700 186622290 186361937 187018436 188432367 190194258 191672267 192418056 192478833 192276110
24918 192276110 192031858 191906132 191714581 191151682 190190456 188694865 186919511 185861512 186231437
24909 186231437 187763624 189499457 190866326 191605949 192012736 192701115 193315266 193280087 192545409
24900 192545409 191530748 190568942 189544857 188454946 187626080 187136373 187007934 187441276 188457018
24891 188457018 189444767 189740127 189646582 189545761 189282637 189001048 189180338 189851884 190474848
24882 190474848 190842863 191467189 192668897 193977986 194609685 194278868 193453466 192281418 190965661
24873 190965661 190321192 190566357 190900702 190828521 190794895 191285750 192114074 192844944 193475604
24864 193475604 193904648 193789501 192666994 190959152 189954254 190126039 190566344 190273604 189876393
24855 189876393 190432504 191352437 191724378 191866356 192099342 192087036 191883512 192001199 192678570
24846 192678570 193385236 193448203 192671326 191721362 191102882 190756165 190903794 191505085 191710043
24837 191710043 191113122 190315515 189858069 189527201 188656864 187298209 186448438 186715192 187666015
24828 187666015 188316922 188204629 187548892 186782861 186590045 187322048 188518983 189791157 190968132
24819 190968132 191652410 191919095 191978997 192136829 192907048 194694289 196858322 198301218 198647368
24810 198647368 198055794 196677563 194862547 193430840 192914661 193384555 194649070 195954085
24802 195954085 196241165 194960873 192403340 189799113 188505706 188672772 189897546 192122882
24794 192122882 194548340 195656551 195477498 194939649 193687055 191276464 188396375 186466229
24786 186466229 185907419 186140197 186818201 187684694 188912706 190653802 192274735 193182377 193717359
24777 193717359 194275571 194640915 194673747 194771964 194734228 193847456 192382300 191390900 191295156 191864402
24767 191864402 192539421 192685246 192101492 191270574 190985252 191020596 190717930 190265966 189901593
24758 189901593 189427741 188789861 188048097 187198039 186289898 185489590 185481028 186683908 188280399
24749 188280399 189275183 189247652 188455821 187579014 186778483 185880541 184936330 184347564 184258057
24740 184258057 184641576 185305780 185731856 185571650 185164257 184865213 184505424 184252743 184185142
24731 184185142 183942304 183448951 182752762 181614724 180120997 179098786 179421198 181151372
24723 181151372 183446840 185116271 185421851 184869272 184134585 183414153 183338479 184381393 185950439
24714 185950439 187165773 188060108 188939642 189891024 190653401 190645721 189890108 188968119 188247230
24705 188247230 188096665 188426166 188629544 188649894 188706679 188692583 188619185 188907464 189580640 190122845
24695 190122845 190432687 190718360 190908215 191007205 191298689 191957245 192677651 193035912 192779310
24686 192779310 192004953 191311289 191050025 191037179 191184587 191569589 191586856 190678940 189673018
24677 189673018 189824206 191104717 192874841 194920441 196732021 197685720 197513610 196207196
24669 196207196 194316203 192674716 191624719 191071455 190984248 191369803 191725943 191594004 191460032
24660 191460032 191631286 191844331 191923941 192239752 192752888 193084288 192893623 192039073 191147681
24651 191147681 190425927 189514522 188711971 188194530 187973172 188103541 188185320 187970891 187643187
24642 187643187 187089731 186531513 186923067 188119624 189225192 190175700 190985958 191073232 190172774
24633 190172774 188601910 187026889 185942133 185316905 184810311 184134852 183655741 183868476 184764902
24624 184764902 185819193 186141754 185733231 185817973 187114608 188786855 189880025 190295347 189994511
24615 189994511 188985334 187682398 186828687 186673290 186819966 186779579 186617066 186956481 187916951
24606 187916951 188710222 188661940 188240515 187949000 187890566 188515237 189813688 191380200 192837429
24597 192837429 193901710 194444421 194515702 194169232 193588540 192977243 192105970 190820969 189380036
24588 189380036 188171529 187563810 187514470 187812313 188479093 189488687 190431707 190742743 190266277
24579 190266277 189527488 189195275 189221324 189383340 189745285 190018100 189772063 189523507 189348726
24570 189348726 188630207 187552988 186659133 186025961 185937937 186895005 188572484 190597459 192975888
24561 192975888 195156953 196614200 197581337 198234949 197991594 196931250 196061257 195694529 195118289
24552 195118289 194002958 192698912 191476784 190847817 191471713 192635166 192815243 191648971
24544 191648971 189879269 188047557 186484624 185500741 185062114 184932616 184872221 185134668 185995887
24535 185995887 187020735 187959182 188550090 188181036 186947294 186087502 186622813 188481153 190622945
24526 190622945 192202689 192938539 192943149 192710642 192616624 192652460 192982183 193381325 193187194 192095819
24516 192095819 190211327 188359399 187410938 187501531 188394128 189547206 190411922 190988853 191531097
24507 191531097 192165418 192806513 193132876 193158379 192865064 192182522 191360195 190559556 189845313
24498 189845313 189388182 189202814 188922711 188775274 189498149 191141975 192916848 194204894 194970938
24489 194970938 195426361 195595686 195427097 194951060 194161195 192977642 191789528 191225274 191124598
24480 191124598 190768680 190153967 189564725 189152183 189070510 189199983 189372974 189383964 189333808 189396450
24470 189396450 189585626 189781182 189614184 189191838 189141571 189811108 190741917 191199232 191023132
24461 191023132 190561623 189951047 189665311 190532944 192624830 195211804 197075466 197575406 196871471
24452 196871471 195082515 192608693 190288981 188932573 188678599 189171528 189379509 188532272
24444 188532272 187366334 186815381 187132862 188408749 190115899 191900577 193564511 194529696
24436 194529696 194625571 193729063 192013799 190286322 189179561 188497407 187877880 187516831 187755589
24427 187755589 188796526 190200007 191211223 191742655 191997150 191741286 191238055 191765610 193236751
24418 193236751 194006125 193611015 192719056 191585776 190549846 189889118 189225944 188656183 188387013
24409 188387013 187946030 187133553 186355975 185754272 185174740 184712815 184739872 185480019 186601460
24400 186601460 187555590 188447014 189723047 191434733 193051960 193561030 192689367 191244882
24392 191244882 189999152 189081354 188491517 187851140 186576779 184828121 183345547 182911260
24384 182911260 183836095 185382807 186560930 187113044 187244469 187377677 187946364 189008057 190312359
24375 190312359 191649320 192603458 193061024 193129984 192800479 192142402 191178931 190547418 190790348
24366 190790348 191412842 191387577 190387574 188963679 187919453 187755828 188268632 188809855 189263169
24357 189263169 189863056 190536811 191232390 191919467 192430311 192724752 192541730 191614631 190359270
24348 190359270 189329550 188871166 188889917 189119561 189349596 189182049 188906590 188990222 189394328
24339 189394328 190267844 191800217 193441432 194246073 194096750 193423938 192250750 190612680
24331 190612680 189543151 189910606 191078451 191929564 191889761 191309668 190863331 190687050 190791128
24322 190791128 190744134 190132313 189112639 187801729 186667449 186592179 187665547 189400632 191234252
24313 191234252 192808736 194309013 195800248 196953300 197588579 197775087 197561504 196679002
24305 196679002 195247085 193995919 193243340 192512309 191431187 190036602 188374952 186541359
24297 186541359 185065187 184852691 186128363 187911400 189165808 189835797 190292352 190696997
24289 190696997 191077330 191335428 191543363 191906704 192441953 192864344 192937254 192644346 191853530
24280 191853530 190730274 189711077 188782449 187765299 186740231 185890458 184983577 183872063
24272 183872063 183267731 183449110 183869950 184142698 184212644 184386299 185131916 186511555 188246166
24263 188246166 189443076 189583812 189421357 189522690 189840109 190262224 190307288 189572222 188119709
24254 188119709 186248546 184757194 184534776 185548835 186720870 186798605 185946516 185426185 185416641
24245 185416641 185397542 185092037 184584332 184581158 185591643 187080847 187971986 188020928 187774075
24236 187774075 187329924 186495316 185546202 185298875 186119885 187806912 189918996 191879801 193622128
24227 193622128 195235029 196302419 196650033 196713400 196596200 196270609 195650773 194654133 193879367
24218 193879367 193560693 193181449 192673269 192621072 193137325 193518072 193799336 194630823 195662897
24209 195662897 196269997 196402521 196350939 196276426 195997291 195198780 193988543 192817538 191726245
24200 191726245 190658701 189689750 188989515 188933171 189585091 189942478 189241847 188254487 187862298
24191 187862298 187967743 188291555 188696715 189187568 189777135 190138563 189957823 189268844 188415938
24182 188415938 187994746 188517034 189678744 190812844 191776328 192323483 192228562 191893883 191636757
24173 191636757 191351033 190914984 190855342 191465959 192314889 192877750 192789067 192424098 191895710
24164 191895710 190618520 188413197 185909050 184066150 183034504 182157094 181149422 180671122
24156 180671122 181063786 181789979 182266959 182151946 182048625 182900905 184634457 186778340 188782370
24147 188782370 190095840 190709081 190583979 189701085 188273505 186268464 184426280 183761140
24139 183761140 184290338 185866301 188407646 190890474 192385632 193368398 194199320 194399081
24131 194399081 193719997 192479211 191124788 190201241 190149589 190847618 191143845 190223345 188486725
24122 188486725 186867853 186219466 186687147 187583054 188523138 189599720 190556973 190997664 191087226
24113 191087226 191124041 190795182 189987673 189167673 188845164 189127324 189520452 189240940 188006687
24104 188006687 186386381 185111901 184754918 185164973 185552276 185505127 185050084 184589780 184561061
24095 184561061 184931236 185233562 185444152 185581600 185544723 185604603 185943643 186344571 186297621 185965706
24085 185965706 185968344 186455958 187246910 188399042 189969195 191259448 191424730 190862649 189965188
24076 189965188 188491356 186666309 185304249 185107289 186075505 187634507 189105683 189700580
24068 189700580 189090459 187792907 186671749 186269753 186329017 186401186 186819570 187513865 187729309
24059 187729309 187112267 185726883 183885229 182121948 181180543 181609517 183004739 184376179
24051 184376179 185571193 186673783 187758815 188861852 189719702 190126831 190098332 189663946 188823983
24042 188823983 187802761 187239321 187701397 188808411 189900890 190703583 191441286 192053353 191457163
24033 191457163 189313437 186587105 184303825 183275090 183690126 184992325 186393875 187405091
24025 187405091 187729133 187601683 187540895 187727605 188321509 189429674 190895396 192373247 193497729
24016 193497729 193786780 193488557 193115992 192834509 192962290 193749053 194777214 195530709 195900407
24007 195900407 195630122 194351206 192549007 191370158 190682210 189432595 187543104 185811688
23999 185811688 184386225 182852316 181365304 180492129 180725435 182356750 184656239 185966570
23991 185966570 185661813 184903921 185066539 186290791 187838654 189152976 190664347 192429940
23983 192429940 193256765 192740522 191787244 191280698 191223912 191190971 190670594 189362446 187640178
23974 187640178 186269542 185724116 185990554 186704885 187553985 188607921 189695661 190222341 189653382
23965 189653382 188539142 187938588 187989701 188300543 188539365 188437477 187826237 186768557 185814530
23956 185814530 185347730 185409270 185666955 185821388 185722989 185644819 185885091 186052189 185763772 185111413
23946 185111413 184401538 184033008 184416727 185334891 185879470 185872713 185650990 185319183 185227888 185443956
23936 185443956 186039243 187506836 189659282 191078457 190655578 189129741 188032993 187504195
23928 187504195 187076977 186901110 186961928 186614616 185823010 185200462 185205948 185967346 187173966
23919 187173966 188130789 188369884 188193464 187864494 187356843 187001851 186675895 185957161 184758646
23910 184758646 183695275 183883743 185295998 186344624 185993102 184805200 183359472 181649182
23902 181649182 180160291 179750240 180419314 181511989 182570213 183804871 185497421 187208932
23894 187208932 188205304 188477620 188494463 188499601 188785095 189476917 190571870 191692518 192074590
23885 192074590 191715907 190892597 189745628 189043494 189054025 189415598 189822814 189745972 188994333
23876 188994333 187989173 187303886 187405575 188079446 188655884 188930782 189395550 190286683 191391835
23867 191391835 192448875 192993089 192846443 192346526 191822183 191333556 190827665 190191322 189240624
23858 189240624 187799240 186308770 185551506 185781138 186588981 187462392 188424896 189592437 190720925
23849 190720925 191663807 192367871 192535012 192003655 190622707 188572084 186673660 185113899
23841 185113899 183742101 183103960 183393226 183907048 184025944 183826513 183668372 183925594 184908212
23832 184908212 186314129 187656107 188371316 188719021 189579468 190910692 191425548 190476673 189178687
23823 189178687 188740769 189013497 189447378 189870745 190196213 190132951 189705391 189239661 188699799
23814 188699799 188243129 188084610 188077169 188707846 190372329 192339775 193363316 192980234 191438892
23805 191438892 189354989 187541691 186611423 186709231 187521278 188382945 188623080 187933300 186730965
23796 186730965 186088915 186435454 187159859 187748016 187971911 188028989 188626243 189782984 190736609
23787 190736609 191134394 190943029 190416388 189650961 188492927 187603239 187601265 187961995 188209046
23778 188209046 188730426 189516753 190267786 191146908 192252706 193412936 194698934 196141214
23770 196141214 197107919 196841129 195378436 193411221 191646531 190713800 190625416 190804299 190945986
23761 190945986 191168078 191600515 192186343 192902330 193657788 193970391 193745511 193109896 192337001
23752 192337001 191979458 192089977 192128610 191487998 190094856 188664841 188378130 189303435 190589947
23743 190589947 191574884 191767995 191357527 191093295 191215643 191464806 191908153 192693850 193180240
23734 193180240 192501363 190766352 189058881 188168168 188078164 188559679 189183399 189429380 189633376
23725 189633376 189989579 189935822 189360955 188607466 187611144 185986858 183901558 182195675 181701138
23716 181701138 182600630 184214976 185729502 186371648 185801190 184986550 184823784 185029151 185159743
23707 185159743 185167462 185517116 186305055 187039016 187753292 188711375 189482163 190051341 190599190
23698 190599190 190683935 190203607 189483232 188896811 188682509 188575060 188047323 186991434 185818162
23689 185818162 184777115 183735319 182576292 181544669 180858453 180603114 180558014 180763682 181530300
23680 181530300 182594304 183234192 183344761 183650927 184344491 184992708 185683243 186750514 188124532
23671 188124532 189505963 190359226 190839281 191847086 193201447 194209957 194916553 195157705
23663 195157705 194514439 193372719 192606103 192243285 191790246 191093006 190651098 190854134 191354538
23654 191354538 191639152 191531618 191366147 191224455 190784573 190340652 190436550 191116438 192273218
23645 192273218 193432656 194175409 194100469 193343432 192587208 192228192 192110758 191846092 191299789
23636 191299789 190982325 191304102 192003750 192507005 192289643 191673837 191342882 191090034 190074137
23627 190074137 188303111 186790965 186469597 187343148 188862013 190650287 192323233 193259863
23619 193259863 193405046 193106994 192412290 191438703 190557368 189401215 187511889 185526438 184174247
23610 184174247 183652829 183795563 184483785 185530380 186739897 188060770 189219128 190054794
23602 190054794 190955439 191844126 192374617 192493667 192223867 191634274 191034278 190610879 190414203
23593 190414203 190323099 190246181 190108195 189713088 188830105 187590669 186699433 186508497 186790162
23584 186790162 187287398 187900849 188314572 188423526 188243298 187671327 186825699 185993773 184960730
23575 184960730 183619456 182942831 183373169 183906611 183784380 183442029 183798911 185023651 186730708
23566 186730708 188649192 190402140 191139807 190462194 188723967 186870583 185874417 185816791 186638778
23557 186638778 187869351 188652676 188833352 188956470 189311166 189497275 188969722 187621815 186020117
23548 186020117 185133535 185609740 187325768 189407435 190745366 191159105 191298968 191540466 191645114
23539 191645114 191283385 190238306 188587085 186796951 185304475 184204823 183331707 182666832
23531 182666832 182236482 181777473 181355177 181300092 181810538 182845939 184214591 185726823 187301216
23522 187301216 189052393 190516920 190921099 190752721 191108995 192521697 194624609 196634433
23514 196634433 197817308 198062831 197683047 196883871 195464975 193118518 190385069 188429013
23506 188429013 187929798 188654293 189606354 190092061 190520246 191166681 191758338 192287572 193003153
23497 193003153 193557303 193394010 192434996 190913369 189369262 188051777 186931239 186196952
23489 186196952 185876887 185671567 185603715 185867422 186260016 186832795 187535305 188120435 188520998
23480 188520998 188748914 189151255 189965840 191140172 192264312 192804642 192886319 192717358 192047375
23471 192047375 190797148 189450397 188183583 186852574 185309812 183347239 181553291 181069145
23463 181069145 181887528 183273538 184890319 186906607 189371254 191598723 193048880 193618327
23455 193618327 193743075 193817192 193501428 192819635 192435436 192376041 192197154 191721974 191084767
23446 191084767 190923134 191297877 191399801 191352898 191595220 192099241 192532255 192426634 191771145
23437 191771145 190883588 190049806 189502690 189093285 188455458 187378004 185953142 184957547 184649902
23428 184649902 184514621 184590974 184761447 184556204 184119550 183648574 183292346 183350865 183622867
23419 183622867 183597518 183086972 182370819 182195615 182973637 184430239 186333096 188689529 190882472
23410 190882472 192551784 194235248 196265104 197966307 198477530 197711023 195792012 193519271
23402 193519271 191861115 190931568 190259218 189599538 189123731 189139861 189730947 190741620 191723513
23393 191723513 192183930 191991486 191475573 190875181 189904876 188489714 187022022 186004873 185528143
23384 185528143 185350455 185571961 186115070 186592357 186624319 186155346 185231523 184007276 183138269
23375 183138269 183164267 183893433 184940346 186066745 187035576 187461055 187113196 186263174 185428916
23366 185428916 185077977 185487134 186426494 187176770 187628417 187955864 187863294 187344343 186615427
23357 186615427 185749751 184615038 182738411 180297465 178468464 178223317 179024040 179907713
23349 179907713 180548317 181091398 181402036 181424096 181626383 182197699 183296706 184768713 186019135
23340 186019135 187031724 188148210 188991829 189231458 189177751 188928215 188429242 187751081 186962912
23331 186962912 186113262 185418124 185427633 186162099 186895018 187219117 187196537 187089611 187123865 187414701
23321 187414701 187860539 188425345 188998510 189339071 189125249 188376583 187589797 187386879 187824461
23312 187824461 188620059 189195240 189023736 188387150 187726750 187184449 186536013 185871258 185634040
23303 185634040 186144256 187269876 188267307 188177062 186584931 184567893 183401865 183061917 182774498
23294 182774498 182378267 182237016 182453603 182847031 183579024 184584800 185254652 185528898 186034275
23285 186034275 187081383 188188733 189016566 189377285 189197240 188505885 187202364 185507217
23277 185507217 183741244 182314192 181493764 180909243 180620381 180755180 181378057 182503519 183555663
23268 183555663 183986571 183919107 183946803 184187306 184605597 185055851 185431489 185881982 186353916
23259 186353916 186605240 186426178 186268624 186663541 187294331 187717956 187501621 186542229 185469354
23250 185469354 184769602 184263148 183573244 182720439 182030638 181739460 181938911 182689210 183682415
23241 183682415 184240160 184352751 184283335 184277530 184450977 184651793 185176384 186021525 186160326 185272462
23231 185272462 183866613 182168141 180779666 180392104 181187073 182752744 184407533 185782499
23223 185782499 186827545 187360092 187249207 186518419 185542706 184919790 185199239 186580263 188412008
23214 188412008 189688278 190305012 190320686 189809513 189455477 189776998 190515939 191072116 191385472
23205 191385472 191716252 191841889 191570236 191132611 190672988 190272225 190327389 190760925 191146301
23196 191146301 191132730 190362212 189289571 188539904 187958780 187621818 187846007 187969396 187805346
23187 187805346 188171545 188623402 188406961 188009372 188122825 188913693 189502848 188943596 187935510
23178 187935510 187468733 187701658 188218881 188376569 188098087 187271418 185997349 185072982 185096289
23169 185096289 185981274 187450146 189272692 190880226 191712862 191873343 191975462 192427243 193193701
23160 193193701 193800126 193778741 193140600 191977146 190651188 189335539 187671636 185563119
23152 185563119 183557464 182184312 181529852 181614334 182543402 184206813 185666176 186194372 186004211
23143 186004211 185542141 185183699 184671212 183614760 182742766 182851518 184135328 186208275 187759589
23134 187759589 187903145 186825136 185062404 183582860 183177510 183302094 183222630 183173938 183528022
23125 183528022 184536611 186050870 187640068 188909130 189187320 188283810 187031603 185988636
23117 185988636 185177042 184655031 184603661 185095490 185917319 186842851 187434386 187080493 185992320
23108 185992320 185207602 184925663 184718156 184665059 184550162 184044813 183318327 183158143 184170556
23099 184170556 185643244 186604668 187073816 187432361 188072036 189129647 190339575 191537646
23091 191537646 192345039 192436310 192306819 192304552 192082891 192239316 193014630 193474381 193279797 192536290
23081 192536290 191692392 191440186 191698415 191557249 190718848 190115983 190329368 190969469 191474359
23072 191474359 191234810 190166927 189034942 188439318 188082315 187348661 186444154 185950087 185971578
23063 185971578 185877774 185535359 185475653 185854744 186439220 186715325 186128940 184841628 184012865
23054 184012865 184396512 185551831 186620986 187099795 186783464 185871407 184870144 184332280 184978160
23045 184978160 186935960 189206894 190747386 191290034 191123540 190674096 190044336 189100389 187750471
23036 187750471 186524760 186005743 186000146 185880023 185436915 184469941 183524805 183915831 185749176
23027 185749176 187725550 189054103 189616938 189424913 189011116 188966912 188907022 188131436 186803363
23018 186803363 185899191 186408452 188151689 190260011 191946000 192733344 192918248 192852280 192342632
23009 192342632 191311055 190464868 190323952 190465727 190611891 190906520 190751184 189607394 188306431
23000 188306431 188008433 188637546 189747504 191102717 192196813 192816877 192838373 192266504 191709263
22991 191709263 191805544 192215131 192487196 192971612 193621088 194140828 194527511 194602603 194276374
22982 194276374 193683773 193013631 192370414 191894292 191715257 191781226 192060543 192650492 193400224
22973 193400224 194233197 194985738 195297838 194904022 193736564 192049031 190562889 190045119 190215588
22964 190215588 190649078 191657101 193462740 195454043 196392316 195794267 194074091 192259585
22956 192259585 191354682 191426588 192082637 192954956 193700353 194218602 194885717 195413904 195370827
22947 195370827 194811673 193662057 192048897 190762167 190315556 190292537 190288466 189975325 189594588
22938 189594588 189796351 190550000 191117367 190637297 189018164 186983756 185129937 183830031
22930 183830031 183512236 184338553 185836959 187659944 189607175 190932077 191033090 190276387
22922 190276387 189125928 187941589 187106455 187174429 188374799 189831096 190272659 189347744 187985260
22913 187985260 186893306 185956593 185758018 187081159 189159076 190454911 190335023 188910146
22905 188910146 186608654 184264235 182286040 180438996 179030031 178871613 180133992 182217794
22897 182217794 183887589 184080170 183085304 182068117 181971519 182775982 183836863 184513295 184582079
22888 184582079 184173552 183734141 183470985 183523962 184121993 184787458 185139436 185205358 185085538
22879 185085538 184714727 183503562 181398923 179434022 177955552 176820871 176547297 177146727
22871 177146727 178254855 179915802 182073935 184211494 185690013 186508048 187036022 187232083
22863 187232083 187131462 187012900 187137484 187021508 186243062 185354240 184962493 185134422 185750759
22854 185750759 186470533 186780075 187090271 187677998 187986002 187874725 187350321 186782962 186875440
22845 186875440 187561258 188480501 189681113 191110170 192106278 192472844 192475337 192107059 191466027
22836 191466027 190879486 190566128 190454434 190293366 189861148 188982676 187866947 187028607 186904267
22827 186904267 187453289 188410585 189349658 189656054 189268245 188842636 188954068 189604231 190571972
22818 190571972 191773072 192781546 192877866 192225989 191996387 192705407 193571315 194070486 194278288
22809 194278288 194261259 193822755 192740149 191213106 189810976 188449352 186920903 185501182
22801 185501182 184588435 183996796 183255676 182769937 183117028 184007328 185109967 186262091 187231672
22792 187231672 188089006 188972985 189757350 190066728 189739943 189203471 188851671 188471730 187871780
22783 187871780 187687437 188676483 190221264 191364191 192119392 192926270 193875071 194766020 195454019
22774 195454019 195702795 195124532 193674478 191556046 189527454 188760348 189338687 189991743 190188148
22765 190188148 190352453 190801817 191509338 192130925 192515609 193019096 193839904 194477397 194587518
22756 194587518 193873800 192304700 190488081 189296702 189364875 190102460 190604855 190614128 190348873
22747 190348873 190249221 190459819 190526765 190535568 190619281 190275807 189625102 188945937 188227796 187715691
22737 187715691 187548126 187577412 187750260 187797497 187475952 186908221 186257106 185770003 185608422
22728 185608422 185564482 185679268 186025629 186300021 186306062 185939965 185535787 185844168 186870981
22719 186870981 187955261 188842549 189429984 189802698 190008438 189433295 187869521 185782052 184342650
22710 184342650 184384352 185016727 184949019 184106991 183404735 183641122 184754288 185798640 186197002
22701 186197002 186535359 187283688 187988661 188457722 189011331 189486943 189518137 189527526 189874650 190032766
22691 190032766 189566148 188998043 188766374 188809902 189102867 189096256 188430847 187677073 187521078 187739601
22681 187739601 188027062 188588036 189189844 189203696 188392886 187219448 186524624 186745083 187413296
22672 187413296 187807574 187685192 187459463 187533389 187875541 188257542 188622292 189051273 189020862
22663 189020862 188360691 187927621 188083517 188470376 188888524 189319944 189401991 189125793 188915081
22654 188915081 189113253 189790914 190441475 190399371 189700084 189075660 189331490 190425781 191395619
22645 191395619 191474957 190737339 189547359 188154585 187139209 186594735 185488684 183480177
22637 183480177 181775960 181567356 182586955 183981391 185326123 186400803 187098150 187727675
22629 187727675 188860242 190297377 190915061 190137167 188532568 186825505 185534359 185189446
22621 185189446 185496630 185280828 183960346 182385895 181698647 181895091 182489515 182997381 183136265
22612 183136265 183315476 183938022 184778850 185070822 184603375 184037527 183781075 184071558 185032231
22603 185032231 186075807 186273423 185686112 185218490 185078790 184656202 183918817 183547651 184119509
22594 184119509 185771213 187376951 187579757 186500206 185068792 184235058 184476855 185271699
22586 185271699 186082092 187014511 188235278 189513947 190326684 190327543 189529781 188549740 187821617
22577 187821617 186958124 185810231 184951084 185107041 186326474 187842166 189161733 189541834
22569 189541834 188640930 187852929 188172634 189160671 189952994 190077891 189942675 190181589 190659435
22560 190659435 190570336 189726567 188401321 186828994 185450872 184758884 185052442 186068344 187115233
22551 187115233 187836099 187797082 186540717 184700074 183187061 182439660 182825037 184315583 186069118
22542 186069118 186969219 187007995 187342432 188564562 190202403 191452752 192136662 192511324 192631867
22533 192631867 192861579 193336975 193348396 192560146 191197649 189614800 187967422 186635632 186085582
22524 186085582 186141891 186227440 185901310 185262973 185008011 185393747 185773601 185772636 185630955 185394715
22514 185394715 184862917 184042114 183440380 183396324 183647286 183757869 183646594 183581497 183892863
22505 183892863 184743017 185799883 186798366 187889711 188824671 188767959 187772939 187068861 187217428
22496 187217428 187685154 188089748 188208601 188015403 188041339 188617439 189123328 189325332 189708646
22487 189708646 190436932 191151880 191280709 190758583 190193817 189707872 188849919 187575656 186125857
22478 186125857 184919134 184452691 184753678 185394423 185890072 186257881 186539817 186685212 186608680
22469 186608680 185820603 184251797 182475712 181208921 180933665 181416820 182377474 183486594
22461 183486594 184392572 185147164 185800017 186092780 186098583 186230606 186798720 187601768 188162762
22452 188162762 188189051 187636627 186969147 186591852 186520669 186986924 187733702 188342653 188939037
22443 188939037 189404676 189868452 190746474 191831130 192738387 193313802 193275518 192465665 191346520
22434 191346520 190769370 191237490 192397397 193254591 192926020 191482672 189891287 188984348 188684359
22425 188684359 188452687 188005368 187607047 187598070 187965373 188383530 188695479 188634137 187780119 186542660
22415 186542660 185618960 185394210 185638063 185916234 186218086 186880676 187921881 188954709 189951384
22406 189951384 191041603 191792495 192067240 192029180 191622894 191116755 190828987 190885628 191310767
22397 191310767 192027447 192537935 192091893 190768736 189390151 188733078 188652996 188530760 188697756
22388 188697756 189787410 191253677 192209259 192453006 191828428 190579190 189697427 189665038 190203574
22379 190203574 190936694 191807170 192824280 193533341 193554527 192814570 191327368 189461649 187453208
22370 187453208 185651456 184587425 184324877 184523977 184803631 184932467 184599588 183850811 183235625
22361 183235625 183186403 183699852 184351395 184677551 184660730 184492843 184091040 183587711 183545646 184313016
22351 184313016 185673040 186945749 187853638 188557363 189033685 189120521 188564538 187253579 185601673
22342 185601673 184099450 183203703 183079188 183535372 184738552 186705758 188396854 189183372
22334 189183372 189246322 188754692 188309559 188556128 189264261 190115286 190931812 191475663 191537604
22325 191537604 190977035 189846186 188570104 187922580 188131724 188455015 188443928 188329938 188179523
22316 188179523 188020272 187882341 187912320 187978111 187713797 187483082 187871851 188911398 190387782
22307 190387782 191805684 192761925 193047326 192425435 191548604 191019067 190359734 188798646 186425863
22298 186425863 184058443 182429994 181574853 181128560 181041045 180835204 180111367 179503205 179963157
22289 179963157 181531301 183303937 184360494 184500290 184021288 183402319 183094316 183608695 185110658
22280 185110658 186993961 188767798 189873622 190170160 189902200 189162611 188198895 187073115
22272 187073115 185895204 184693098 183380283 182467969 182477502 183117397 183749214 184056273 184327628
22263 184327628 184722368 185325424 186316363 187285828 187426824 186671860 185731714 185192287 185081432
22254 185081432 184846239 183935421 182549661 181069057 180001358 179946917 180714433 181733261 182930441
22245 182930441 184247949 185019912 184753973 184172610 184164310 184779648 185588122 186520144 187877593
22236 187877593 189109965 189545976 189307336 188946687 188812259 188440670 187548139 186572746 186008134
22227 186008134 185980166 186443385 187189638 188158433 189173031 189647821 189259846 188566296 188169830
22218 188169830 187847510 187247870 186419702 185796484 185488002 185040189 184515185 184345402 184475741
22209 184475741 184483503 184119629 183553711 183349762 184021058 185383025 186340383 186485520 186421333
22200 186421333 186453731 186366722 186126536 186014993 186273857 186960900 187550045 187258901 186274285
22191 186274285 185362023 184678862 184374171 184481917 184516012 184433665 184496603 184611837 184679810 184928120
22181 184928120 185992626 187978906 190111673 191299637 190972089 189844772 189009022 188923296
22173 188923296 189135041 189225207 189907345 191341931 192243883 191997547 190939815 189385352 188102386
22164 188102386 187858801 188127715 188035800 187460790 187006985 187370127 188221461 188511159 187835225
22155 187835225 186774724 186029029 185657621 185465413 185389876 185502568 185858554 186296549 186610801
22146 186610801 186746121 186732360 186464494 185952170 184967229 183266189 181116073 179059825 177648830
22137 177648830 176995341 176700434 176428811 176441176 177133087 178542491 180410794 182377234 184004290
$$ [...]
##END NTUPLES=NMR SPECTRUM
##END=
