##TITLE=C13_DE-44EA3_D2O_b
 D2O, 22000 sc

 18.7.2024
##JCAMPDX= 6.0         $$ Bruker NMR JCAMP-DX V2.0
##DATA TYPE= NMR SPECTRUM
##DATA CLASS= NTUPLES
##ORIGIN= UXNMR, Bruker Analytische Messtechnik GmbH
##OWNER= root
$$ XWIN-NMR		Version 3.5
$$ Thu Jul 18 13:40:25 2024 Russian Standard Time (UT+4h)  she@DPX200
##.OBSERVE FREQUENCY= 50.327896
##.OBSERVE NUCLEUS= ^13C
##.ACQUISITION MODE= SIMULTANEOUS
##.ACQUISITION SCHEME= undefined
##.AVERAGES= 20822
##.DIGITISER RES= 17
##SPECTROMETER/DATA SYSTEM= spect
##.PULSE SEQUENCE= zgpg30
##.SOLVENT NAME= D2O
##.SHIFT REFERENCE= (INTERNAL, D2O, 0, 222.565)
##AUDIT TRAIL= $$ (NUMBER, WHEN, WHO, WHERE, WHAT)
$$ ##TITLE= Audit trail, XWIN-NMR		Version 3.5
$$ ##JCAMPDX= 5.01
$$ ##ORIGIN= Bruker BioSpin GmbH
$$ ##OWNER= she
$$ F:/spectra/data/she/nmr/c13/1/pdata/1/auditp.txt
$$ ##AUDIT TRAIL=  $$ (NUMBER, WHEN, WHO, WHERE, WHAT)
(   1,<2024-07-18 10:07:53.17 +0400>,<she>,<DPX200>,
      <created by zg, POWCHK disabled, PULCHK disabled
       terminated by command 'halt'
       configuration hash MD5:
       00 E9 B6 7A A2 85 ED C7 34 08 36 98 17 FE 4E 26
       data hash MD5: 32K
       58 64 A6 7E D8 D4 E2 54 A3 39 E3 D6 6D B3 48 8F>)
(   2,<2024-07-18 13:31:10.98 +0400>,<she>,<DPX200>,
      <Start of raw data processing
       efp BC_mod = 2 LB = 2 FT_mod = 6 PKNL = 1 PHC0 = -545.5547 PHC1 = 27.58845 SI = 32K 
       data hash MD5: 32K
       AB AE 2E A7 15 9D B5 F7 1C FB 7C 67 3D 1A 51 6C>)
(   3,<2024-07-18 13:31:13.82 +0400>,<she>,<DPX200>,
      <abs ABSG = 5 
       data hash MD5: 32K
       8D 45 8A 24 ED D3 EB D6 60 DE BB E4 3D 3A 4E 5B>)
(   4,<2024-07-18 13:31:50.95 +0400>,<she>,<DPX200>,
      <pk PHC0 = 28.18513 PHC1 = -4.199999 
       data hash MD5: 32K
       92 8E 99 3E 30 DD 15 79 46 C2 6C 95 BE DC 54 26>)
(   5,<2024-07-18 13:32:08.82 +0400>,<she>,<DPX200>,
      <pk PHC0 = -97.55793 PHC1 = 0 
       data hash MD5: 32K
       0B 39 44 59 09 D7 EA 21 46 45 BD 34 7A 9F 1F 02>)
(   6,<2024-07-18 13:33:12.45 +0400>,<she>,<DPX200>,
      <pk PHC0 = 83.08576 PHC1 = 10.59999 
       data hash MD5: 32K
       53 C1 DB B3 11 7E DC DC 63 BB 75 9E 93 81 83 70>)
(   7,<2024-07-18 13:33:16.32 +0400>,<she>,<DPX200>,
      <abs ABSG = 5 
       data hash MD5: 32K
       D3 49 76 A0 24 50 92 4A 91 68 89 7F D1 E0 10 6E>)
$$ ##END=
$$ 
$$ hash MD5
$$ F1 2A DB 0D 2C 35 68 04 48 D4 DD 95 1C 4F 44 1C
##$RELAX= 
##$RELAX= 
##$RELAX= 
##$RELAX= 
##$RELAX= 
##$RELAX= 
##$RELAX= 
##$RELAX= 
$$ Bruker specific parameters
$$ --------------------------
##$DU= <F:/spectra>
##$EXPNO= 1
##$NAME= <c13>
##$PROCNO= 1
##$TYPE= <nmr>
##$USER= <she>
##$AMP= (0..31)
100 100 100 100 100 100 100 100 100 100 100 100 100 100 100 100 100 100 
100 100 100 100 100 100 100 100 100 100 100 100 100 100 
##$AQSEQ= 0
##$AQ_mod= 1
##$AUNM= <au_zg>
##$AUTOPOS= <>
##$BF1= 50.322709
##$BF2= 200.13
##$BF3= 50.322709
##$BF4= 500.13
##$BF5= 500.13
##$BF6= 500.13
##$BF7= 500.13
##$BF8= 500.13
##$BYTORDA= 1
##$CFDGTYP= 0
##$CFRGTYP= 5
$$ [...]
##$SUBNAM4= <"">
##$SUBNAM5= <"">
##$SUBNAM6= <"">
##$SUBNAM7= <"">
##$SUBNAM8= <"">
##$SUBNAM9= <"">
##$SW= 239.972175391363
##$SWIBOX= (0..15)
0 1 3 0 0 0 0 0 0 0 0 0 0 0 0 0 
##$SW_h= 12077.2946859903
##$TD= 32768
##$TD0= 1
##$TE= 0
##$TE2= 300
##$TE3= 300
##$TEG= 300
##$TL= (0..7)
120 120 120 120 120 120 120 120 
##$TP= (0..7)
150 150 150 150 150 150 150 150 
##$TP07= 0
##$TPNAME0= <>
##$TPNAME1= <>
##$TPNAME2= <>
##$TPNAME3= <>
##$TPNAME4= <>
##$TPNAME5= <>
##$TPNAME6= <>
##$TPNAME7= <>
##$TPOAL= (0..7)
0.5 0.5 0.5 0.5 0.5 0.5 0.5 0.5 
##$TPOFFS= (0..7)
0 0 0 0 0 0 0 0 
##$TUNHIN= 0
##$TUNHOUT= 0
##$TUNXOUT= 0
##$USERA1= <user>
##$USERA2= <user>
##$USERA3= <user>
##$USERA4= <user>
##$USERA5= <user>
##$V9= 5
##$VALIST= <valist>
##$VCLIST= <CCCCCCCCCCCCCCC>
##$VD= 0
##$VDLIST= <DDDDDDDDDDDDDDD>
##$VPLIST= <PPPPPPPPPPPPPPP>
##$VTLIST= <TTTTTTTTTTTTTTT>
##$WBST= 1024
##$WBSW= 4
##$XGAIN= (0..3)
0 0 0 0 
##$XL= 0
##$YL= 0
##$YMAX_a= 30160525
##$YMIN_a= -101909006
##$ZGOPTNS= <>
##$ZL1= 120
##$ZL2= 120
##$ZL3= 120
##$ZL4= 120
##$ABSF1= 222.5654
##$ABSF2= -17.4314
##$ABSG= 5
##$ABSL= 3
##$ALPHA= 0
##$AQORDER= 0
##$ASSFAC= 0
##$ASSFACI= 0
##$ASSFACX= 0
##$ASSWID= 0
##$AUNMP= <proc_1d>
##$AZFE= 0.1
##$AZFW= 0.5
##$BCFW= 0
##$BC_mod= 2
##$BYTORDP= 0
##$COROFFS= 0
##$CY= -3
##$DATMOD= 1
##$DC= 0
##$DFILT= <>
##$DTYPP= 0
##$F1P= 0
##$F2P= 0
##$FCOR= 0.5
##$FTSIZE= 32768
##$FT_mod= 6
##$GAMMA= 0
##$GB= 0
##$INTBC= 1
##$INTSCL= 4.134877e-10
##$ISEN= 128
##$LB= 2
##$LEV0= 0
##$LPBIN= 0
##$MAXI= 10000
##$MC2= 0
##$MEAN= 0
##$ME_mod= 0
##$MI= 0.1934396
##$NCOEF= 0
##$NC_proc= -2
##$NLEV= 6
##$NOISF1= 120.0001
##$NOISF2= 80.00006
##$NSP= 0
##$NTH_PI= 0
##$NZP= 0
##$OFFSET= 222.5654
##$PC= 1.4
##$PHC0= -531.8419
##$PHC1= 33.98844
##$PH_mod= 1
##$PKNL= yes
##$PPARMOD= 0
##$PSCAL= 0
##$PSIGN= 0
##$REVERSE= no
##$SF= 50.3227345484362
##$SI= 32768
##$SIGF1= 140
##$SIGF2= 120
##$SINO= 11.81781
##$SIOLD= 32768
##$SREGLST= <13C.CDCl3>
##$SSB= 0
##$STSI= 32768
##$STSR= 0
##$SW_p= 12077.2946859903
##$SYMM= 0
##$S_DEV= 0
##$TDeff= 32768
##$TDoff= 0
##$TI= <>
##$TILT= no
##$TM1= 0
##$TM2= 0
##$TOPLEV= 0
##$USERP1= <user>
##$USERP2= <user>
##$USERP3= <user>
##$USERP4= <user>
##$USERP5= <user>
##$WDW= 1
##$XDIM= 32768
##$YMAX_p= 143992941
##$YMIN_p= -204461028
$$ End of Bruker specific parameters
$$ ---------------------------------
##NTUPLES= NMR SPECTRUM
##VAR_NAME=  FREQUENCY,     SPECTRUM/REAL,   SPECTRUM/IMAG
##SYMBOL=    X,             R,               I
##VAR_TYPE=  INDEPENDENT,   DEPENDENT,       DEPENDENT
##VAR_FORM=  AFFN,          ASDF,            ASDF
##VAR_DIM=   32768,         32768,           32768
##UNITS=     HZ,            ARBITRARY UNITS, ARBITRARY UNITS
##FACTOR=    0.368581032318806, 1,           1
##FIRST=     11200.0995020947, 0,            0
##LAST=      -877.195183895579, 0,           0
##MIN=       -877.195183895579, -204461028,  0
##MAX=       11200.0995020947, 143992941,    0
$$ Real data points
##PAGE= N=1
##DATA TABLE= (X++(R..R)), XYDATA
$$ [...]
1626C323233j640001j393019L14893K615198L631002K843516Q63081r81562j378111
1617H198230l85668L09117m39586k153126l181373k660330j436508l51384P93662
1608a306966J667790J756017J495292J183368N64234m95816j309494j952503k931978
1599a330056k999828j072549J985989L789169L589238K856835J975706K04395
1591H998899j962507l537266l984051l079277j686595r49278j610942k712793
1583a0523810l432658l401858j483391J663353L481784L281271K254107J821410
1575f339792K079446J967382N68493j012802j949930j808175L12090L080729L932351
1566H29792K974941J631389Q99097L56678r51832k354967j955091k41724N63492
$$ y = [3323233, 1683232, 290213, 605106, 3220304, 6851306, 9694822, 10557903, 9576341, 8198230, 7812562, 8121679, 7682093, 5528967, 2347594, -312736, -1749244, -2100628, -1306966, 360824, 2116841, 3612133, 4795501, 5359735, 4863919, 3554425, 1601922, -1330056, -4329884, -5402433, -3416444, 372725, 3961963, 6818798, 8794504, 8998899, 7036392, 3499126, -484925, -3564202, -5250797, -6200075, -7811017, -10523810, -13956468, -17358326, -18841717, -17178364, -13696580, -10415309, -8161202, -6339792, -4260346, -2292964, -1724471, -2737273, -4687203, -6495378, -6183288, -3102559, 829792, 3804733, 5436122, 6335219, 6691897, 5740065, 3385098, 1430007, 1188283, 1751775]
1557A751775N90979P21221J365786J986926K416649J782973j156276l893850l482115
1548B084068j033786J470764K517547J641024n575j241416j788449k045281j867258
1539b68362j583409j553732p20053J217722K646756K462549J357173O28360K78515
1530D465519l12306j240617j887936j392197L24252J722226J415457l45513j381143
1521A367742r52030k54937m86013j521152j371825J84136J525358K218472K319921
1512C029672J241448l50657j436822j415975j032012r87855j16397O79464n3854
1503d42988q72337o09588L63593J588086K427042K237072J696416J171022L35619
1494G893937q75430j707426j911082j270683L17045K217896L118626K493048J404013
$$ y = [1751775, 2342754, 3063975, 4429761, 6416687, 8833336, 10616309, 9460033, 5566183, 2084068, 1050282, 2521046, 5038593, 6679617, 6674042, 5432626, 3644177, 1598896, -268362, -1851771, -3405503, -4125556, -2907834, -261078, 2201471, 3558644, 4187004, 4465519, 4153213, 2912596, 1024660, -367537, -43285, 1678941, 3094398, 2748885, 1367742, 415712, 160775, -325238, -1846390, -3218215, -3034079, -1508721, 709751, 3029672, 4271120, 3920463, 2483641, 1067666, 35654, -952201, -1068598, -389134, -442988, -1315325, -1924913, -1561320, 26766, 2453808, 4690880, 6387296, 7558318, 7893937, 7018507, 5311081, 3399999, 2129316, 2446361, 4664257, 7782883, 10275931, 11679944]
1485A1679944J417148R11058j502386k939173k150667j69461J338916J197077
1477I782456J51170K0804l5056q29751j175144n83954J98272Q8687j565119l122057
1467B930308k477412j568763j378625l96318O97919J258811J766060K037664J419196
1458D288840P77046J096701J226481M59559q21395j844046k530923l090319k951668
1449c389724k293072j285748l83610M45946J748280K099769P33537j216155k131494
1440e672271j806138j291108q97226K76900K355396L780428M034494L521403K741099
1431G042977J985293J166641N14504m80841j957771l085229k887744j708707l15818
1422B73305M90759O43154J464783K976300L248837J658381l65258j335192j084147
$$ y = [11679944, 13097092, 14008150, 12505764, 9566591, 7415924, 7246463, 8585379, 9782456, 9933626, 9954430, 9919374, 9089623, 7914479, 7330525, 7528797, 7617484, 6052365, 2930308, 452896, -1115867, -2494492, -2890810, -2192891, -934080, 831980, 2869644, 4288840, 5065886, 6162587, 7389068, 7848627, 7027232, 5183186, 2652263, -438056, -3389724, -5682796, -6968544, -7352154, -6906208, -5157928, -3058159, -2324622, -3540777, -5672271, -7478409, -8769517, -9666743, -9389843, -7034447, -3254019, 780475, 4301878, 7042977, 9028270, 10194911, 10709415, 10228574, 8270803, 5185574, 2297830, 589123, 273305, 764064, 1407218, 2872001, 5848301, 9097138, 10755519, 10390261, 9055069, 7970922]
1413G970922q95818n99282J38594L46383q98382l007195l907470k831888j449657
1404e133793j026437p21606j87699q02245j488965q78282q63770j725908j230033
1395a4058738J083242K903400K678472J683156N39198n99754n03151P94240J870954
1386c608981K816532M449256N980164O063044L764610p2598l410252m707355l250320
1377H024100o08716R98399K177529K850757J840368j31862j555916j569915p47239
1368A1277505l77883l36310r8199l1324j84726j47143l7256j58478o13471j264470
1358H028245j513603j262758n85360j54947o31610q62902o65621l38530K23633
1349B236547P4526o50276p81615M29932J572426J080089k75093j065442n80682
$$ y = [7970922, 7075104, 6475822, 6614416, 6960799, 6062417, 3055222, -852248, -3684136, -5133793, -6160230, -6881836, -7069535, -7871780, -9360745, -10239027, -11102797, -12828705, -14058738, -12975496, -10072096, -7393624, -5710468, -5171270, -5771024, -6274175, -5479935, -3608981, -792449, 3656807, 9636971, 15700015, 19464625, 19392027, 15981775, 11274420, 8024100, 7415384, 8413783, 10591312, 13442069, 15282437, 15150575, 13594659, 12024744, 11277505, 10899622, 10563312, 10465113, 10433789, 10249063, 10101920, 10064664, 9906186, 9292715, 8028245, 6514642, 5251884, 4666524, 4511577, 3879967, 3017065, 2351444, 2012914, 2236547, 2311073, 1660797, 879182, 1309114, 2881540, 3961629, 3686536, 2621094, 2040412]
1340B040412J50180k65562p57575p48338j118909j706561j870592j271472k04011
1331e752428J057712J745856P81300o73171p29642M89103J594177J675601J402764
1322A591272J789242K046938K025808J310835N47185R97060J867072J340522m35281
1313A3080653j738798j529326r57837j847071k698465j684504o8088P98534L44877
1304C699975m51358k31495J9357j98291j332827k903204k670752o70706N77833
1295d161468L0768j015398j567711r97850J882242N341098O129931M584173L196949
1286A3422734K140211N46593j041285k030154k979924l457010k229556L62685
1278D734294J882956P62786k55785r9629j113853k913447k952582q25543Q26900
$$ y = [2040412, 2190592, 1925030, 1167455, 419117, -699792, -2406353, -4276945, -5548417, -5752428, -4694716, -2948860, -2167560, -2840731, -3570373, -3081270, -1487093, 188508, 1591272, 3380514, 5427452, 7453260, 8764095, 9311280, 10308340, 12175412, 13515934, 13080653, 11341855, 9812529, 8854692, 7007621, 4309156, 2624652, 2556564, 3355098, 3699975, 3248617, 3017122, 3036479, 2838188, 1505361, -1397843, -4068595, -4739301, -4161468, -4130700, -5146098, -6713809, -7711659, -5829417, -488319, 5641612, 10225785, 13422734, 15562945, 16109538, 15068253, 13038099, 10058175, 6601165, 4371609, 4734294, 6617250, 7380036, 7124251, 7024622, 5910769, 2997322, 44740, -780803, 46097]
1269D6097Q51375P67497O51407l46074j144420l68161Q66525K59492j462306k673486
1259b552054k140235m07140R95610J673109J757811J224201P56040R86958J605942
1250C900242J476064J4532k028179l444455l615231l152495k416906j244541L60915
1241a0150054J918436K576433K165935J313550O43611K30976N32469J332453J949228
1232B513037K671987L097970K041398O15262M00291L16922M34454J168722J013651
1223A4273694l3822p21300r30512j054594q26026l4557q4365j268247k407197
1214F913074l141682k877670j412032J05321Q2878j060265j006816N55632K291359
1205D49799K879113J779578k82700j843591j968143k065068k395702j439563m34024
$$ y = [46097, 897472, 1664969, 2316376, 1970302, 825882, 457721, 1324246, 1583738, 121432, -2552054, -4692289, -5099429, -4103819, -2430710, -672899, 551302, 1307342, 2294300, 3900242, 5376306, 5390838, 3362659, -81796, -3697027, -6849522, -9266428, -10510969, -10150054, -8231618, -5655185, -3489250, -2175700, -1532089, -1301113, -768644, 563809, 2513037, 5185024, 8282994, 10324392, 10939654, 11339945, 11656867, 12091321, 13260043, 14273694, 14239872, 13518572, 12588060, 11533466, 10707440, 10672883, 10588518, 9320271, 6913074, 3771392, 893722, -518310, -412989, -330111, -1390376, -2397192, -1841560, 449799, 3328912, 5108490, 4825790, 2982199, 1014056, -1051012, -3446714, -4886277, -5320301]
1196e320301l58112j23645O54298J289720J781237K357281J913997P03828j09384
1187B788919o62228j077655j285916j286345j211544r39495r39364o08572l50423
1178e572623j391713k848126k507477q39456l16184o73746r11005p12593l65720
1169a6138643k77787J24890Q05696J127798R92477O99281J515547K933991K959079
1160e257671K045355J547157J819340K727209L313739K365200L2710k121660k530788
1151C940591j984035j463837l04845J118185Q46673q39262j407356N08484K858711
1142C273309L142904K601817K371968J747934P79404N43056P81483j83674j864275
1133A3193926k558843k970321l513793l483276l010006k524445j233272O09994
$$ y = [-5320301, -5678413, -5802058, -5147760, -3858040, -2076803, 280478, 2194475, 2898303, 2788919, 2126691, 1049036, -236880, -1523225, -2734769, -3674264, -4613628, -5222200, -5572623, -6964336, -9812462, -12319939, -13159395, -13475579, -14149325, -15060330, -15772923, -16138643, -16416430, -16291540, -15485844, -14358046, -13365569, -12666288, -11150741, -8216750, -5257671, -3212316, -1665159, 154181, 2881390, 6195129, 8560329, 8593039, 6471379, 3940591, 1956556, 492719, 187874, 1306059, 2152732, 1313470, -93886, 414598, 3273309, 6416213, 9018030, 11389998, 13137932, 13917336, 14460392, 15241875, 15058201, 13193926, 10635083, 7664762, 4150969, 667693, -2342313, -4866758, -6100030, -5490036]
1125e490036K022376K705296K363433J290534N87975K70255N0194n2089p40549
1116C007389k149617k716626k035601o79692J016327J911713J324787J86785l41135
1107d75670N96303J864988K670939K497791N13035j035896j349154j859087k263474
1098A159775j631936J30598J337689M22389j340274k408073k469595k298141j787344
1089h884912n70333N29494J045353J250105J782436J741092M89345k6663R64063
1080a680020K111853K235553J484084O61929N72501M53680j90072j059724j109659
1071C480125q9447L81293k22692p16686n77354r9186m96955j216780r77449o06549
1061a141680k93330l31133j023632j682255j689541r86383k54824j17814q23529
$$ y = [-5490036, -3467660, -762364, 1601069, 2891603, 3479578, 3749833, 3800027, 3747938, 3007389, 857772, -1858854, -3894455, -4574147, -3557820, -1646107, -321320, -134535, -475670, 120633, 1985621, 4656560, 7154351, 7667386, 6631490, 5282336, 3423249, 1159775, -472161, -341563, 996126, 1418515, 78241, -2329832, -4799427, -7097568, -8884912, -9455245, -8925751, -7880398, -6630293, -4847857, -3106765, -2617420, -2644083, -1680020, 431833, 2667386, 4151470, 4813399, 5385900, 5839580, 5649508, 4589784, 3480125, 3390678, 3771971, 3549279, 2832593, 2255239, 2156053, 1659098, 442318, -535131, -1141680, -1435010, -1766143, -2789775, -4472030, -6161571, -7147954, -7402778, -7520592, -8344121]
1052h344121j534055k305072k773112j927221r15669m43877N02332J937840K778613
1043a3024342L047244L577793L814272K921881J419888j28865j142612j548936
1035a063677j397610k5949K339072L861071L655641K205346o5861k491116l541472
1026C475445k071977k61083n04661j697252j638130N65744K457102J906691r6666
1017B135213j215403n05214O31508P90412N16524K25813j84794l76152n86840
1008A431067j056928j222035l32296J421306K507041J834982O31283k94008o41416
999D278996o35325j376798k665404k608521k35883K275523L204301K758368J856468
990F851725J199685Q92260P53496P81615N03046l4200p01326j534032j569828
$$ y = [-8344121, -9878176, -12183248, -14956360, -16883581, -17799250, -18243127, -17740795, -15802955, -13024342, -9977098, -6399305, -2585033, 336848, 1756736, 1627871, 485259, -1063677, -2461287, -2487236, -148164, 3712907, 7368548, 9573894, 9508033, 7016917, 3475445, 1403468, 1142385, 637724, -1059528, -2697658, -2131914, 325188, 2231879, 2135213, 919810, 414596, 1046104, 1836516, 2353040, 2578853, 2394059, 2017907, 1431067, 374139, -847896, -1180192, 241114, 2748155, 4583137, 5214420, 4920412, 4278996, 3643671, 2266873, -398531, -3007052, -3242935, -967412, 2236889, 4995257, 6851725, 8051410, 8943670, 9697166, 10478781, 10981827, 10947627, 10246301, 8712269, 7142441]
981G142441q31548p30503j404896j267753j03985J029382J231241j35640j951349
972B977390k996057l155070j352565J755868K967257R11431j645926k913923l285706
963f737301l002110k807221j415829J277768K782925K429477J354515J238466
955d879310K020608K003572R33784k63640j098561j223210k36261J248336J265971
946b28711J24353o31937j227300r33436L81719J335930Q79563l51440j226271
937a877530j940057k276991j395147J77334Q42300N92467Q14544N31814n14458
928e045724q81040L49364K519127L644703L302436K396192J304719K87160Q8687
919G965624J039576J929929J040254j414443l639007m234489l256906j811072
$$ y = [7142441, 6310893, 5580390, 4175494, 2907741, 2803756, 3833138, 5064379, 4928739, 2977390, -18667, -3173737, -4526302, -2770434, 196823, 1108254, -537672, -3451595, -6737301, -9739411, -12546632, -13962461, -12684693, -9901768, -7472291, -6117776, -4879310, -2858702, -855130, 78654, -184986, -1283547, -2506757, -2743018, -1494682, -228711, -104358, -736295, -1963595, -2897031, -2515312, -1179382, -299819, -651259, -1877530, -3817587, -6094578, -7489725, -7312391, -6470091, -5877624, -5063080, -4531266, -5045724, -5926764, -5577400, -3058273, 586430, 3888866, 6285058, 7589777, 7876937, 7965624, 9005200, 10935129, 11975383, 10560940, 6921933, 2687444, -569462, -2380534]
911b380534p79156n07167o68517j168200j549584j485780q25432J079258K887513
902e397599L536816K808979J293214j64020j534943k239314j546279k92664O24044
893b911766Q50423L48167K03178O47128P85517Q78981R27660Q39469M03765o19152
883B353370o53369L23181Q33551K65592q43265j207356m88253Q99793K031898
874C515142K831288K855032J038238k202986m612526m592976k810317r33963k70430
865e183498j71923M45356M84681l46950q74959r44113j188059j512191q90587
856a0182243O63272K438350L860010L915273K409268N42358j373372j942878j570062
847a240024j564847j568861r31600K98891J218716J100181L86721P3704M7057
$$ y = [-2380534, -3159690, -3666857, -4335374, -5503574, -7053158, -8538938, -9364370, -8285112, -5397599, -1860783, 948196, 2241410, 2077390, 542447, -1696867, -3243146, -3535810, -2911766, -2061343, -1713176, -1509998, -862870, -77353, 801628, 1729288, 2568757, 2972522, 2353370, 1700001, 2023182, 2856733, 3122325, 2279060, 1071704, 583451, 1483244, 3515142, 6346430, 9201462, 10239700, 8036714, 3424188, -1168788, -3979105, -4913068, -5183498, -5355421, -4910065, -4425384, -4772334, -5647293, -6591406, -7779465, -9291656, -10182243, -9518971, -7080621, -3220611, 694662, 3103930, 3646288, 2272916, 330038, -1240024, -2804871, -4373732, -5305332, -5006441, -3787725, -2687544, -2300823, -2227119, -2180062]
838b180062o29841j474201m09740J638307J897904o1650k110003k416015j008289
829f753590P64170J625781J501467J188143J184553J372199J411662J416235N86995
820D297615p71953r59189o44844j439905k682510l146836k758979j598765j70591
811i875957J424199K429288K195371Q96757m69450q92077n90916J41871J331026
802c409888J808194J501970J024617k26266n58026Q14554J857887J649358N59925
793E022325o82923j149565r83551j551347j980736n61087J208999J265911O67411
784A255437O21583O10647Q86773J011915M7672j358761k174904j655279l61109
775a116026O59921P12924k23754q43874J69398J606149K051376J724447P74893
$$ y = [-2180062, -2809903, -4284104, -4693844, -3055537, -1157633, -1219283, -3329286, -5745301, -6753590, -5989420, -4363639, -2862172, -1674029, -489476, 882723, 2294385, 3710620, 4297615, 3525662, 2566473, 1921629, 481724, -2200786, -5347622, -8106601, -9705366, -9875957, -8451758, -6022470, -3827099, -2930342, -3399792, -4291869, -4882785, -4740914, -3409888, -1601694, -99724, 924893, 698627, 140601, 955155, 2813042, 4462400, 5022325, 4339402, 3189837, 2206286, 654939, -1325797, -1886884, -677885, 588026, 1255437, 1877020, 2487667, 3374440, 4386355, 4434027, 3075266, 900362, -754917, -1116026, -456105, 256819, 33065, -810809, -641411, 964738, 3016114, 4740561, 5515454]
766E515454O76447J431127J259150M47341k35424r94187j575692j023820K72188
757E772584P6580j850041l540781l452546j633143Q872J95934n18417n51000J5996
747e475962N9601k4967Q6954K47468M01448O10608M8208j012965j154314J0167
737f203754J541203K039201J381368J109759J674697J437866K68742p62872j479577
728A006633k117222k743010k249964m85251J190215J207774M5271n42143o75216
719e362913l82282J292802L140051K800154R01315n49227o04293l13286j101787
710a79466k016520j513169m41964M51946J192492N24512q98968j293150n59539
701d733826L91293N78665n57438j858581k227354j351670P0709J198774J607361
$$ y = [5515454, 6191901, 7623028, 8882178, 9329519, 9094095, 8099908, 6524216, 5500396, 5772584, 5849164, 3999123, 458342, -2994204, -4627347, -4618475, -4422541, -4940958, -5491958, -5475962, -5416361, -5441328, -5354374, -5106906, -4705458, -4094850, -4046642, -5059607, -6213921, -6203754, -4662551, -2623350, -1241982, -132223, 1542474, 2980340, 3249082, 2486210, 1006633, -1110589, -3853599, -6103563, -6588814, -5398599, -4190825, -4145554, -4687697, -5362913, -5745195, -4452393, -1312342, 1487812, 2389127, 1839900, 1235607, 922321, -179466, -2195986, -3709155, -4151119, -3699173, -2506681, -1982169, -2881137, -4174287, -4733826, -4342533, -3763868, -4321306, -6179887, -8407241, -9758911, -9688202, -8489428, -6882067]
692f882067J400000L16564j414825j765174j77151Q53628N10660J25948n76725
683g609142r22230O14146K564671K539659J330931L36810N4624N10404J840602
674A260475L382242L273075J096086j167952k727735l653327l637504k977307
666e151947j550136M91537R70807m26493j305037k31249J264016J120685P24372
657d093445J419101J808553J220000N68423J47626k47992o49105j392117k002469
648c221425j822161j120481m93721n27725r09271j258320p99011j06480n49054
639a0807649j034043n53410n89441j372823j148569L15827K029867K792456K887632
630g480153L833247M829683M155575K796834J986967J425329Q11147M41636p78007
$$ y = [-6882067, -5482067, -5165503, -6580328, -8345502, -8522653, -7669025, -7158365, -7032417, -7609142, -8531372, -7917226, -5352555, -2812896, -1481965, -1145155, -1090531, -580127, 1260475, 4642717, 7915792, 9011878, 7843926, 5116191, 1462864, -2174640, -5151947, -6702083, -6210546, -5239739, -5666232, -6971269, -7202518, -5938502, -4817817, -4093445, -2674344, -865791, 354209, 922632, 1070258, 822266, 173161, -1218956, -3221425, -5043586, -6164067, -6657788, -7185513, -8094784, -9353104, -10152115, -10258595, -10807649, -11841692, -12395102, -12984543, -14357366, -15505935, -15190108, -13160241, -10367785, -7480153, -3646906, 1182777, 5338352, 8135186, 10122153, 11547482, 12358629, 12800265, 12022258]
621A2022258k829592l158225j983950p97313M83411J091242M87455m98968o34474
612D181844J09749K52975l60536m45397K45278P41530J03363p48363j385554k289225
602D05664k955720k557019j518409q62594j49872N47938R57658J799016K521147
593a812191K777656K742770J878636M09510L4147P9316q45689j264415n13391
584C486349k83607n78441J86976J037356M64012k39651O40395K260762K973923
575I948074K137212L88764j088605j567719j361326r36897q49548j829256l108485
566A732214k884519j045801m32059q81278l99443L77074O48550J222576K126970
557D64284J898898J74679j648602k057866q74758N34937J277707J126997R02137
$$ y = [12022258, 9192666, 6034441, 4050491, 3253178, 3736589, 4827831, 5315286, 4816318, 4181844, 4291593, 4544568, 4184032, 3738635, 3983913, 4725443, 4828806, 4080443, 2694889, 405664, -2550056, -5107075, -6625484, -7488078, -7637950, -7090012, -6132354, -4333338, -1812191, 965465, 3708235, 5586871, 5996381, 6030528, 6109844, 5264155, 3999740, 3486349, 3202742, 2624301, 2811277, 3848633, 4312645, 4072994, 4713389, 6974151, 9948074, 12085286, 12474050, 11385445, 9817726, 8456400, 7519503, 6669955, 4840699, 1732214, -1152305, -2198106, -2630165, -3511443, -3910886, -3533812, -2885262, -1662686, 464284, 2363182, 2537861, 889259, -1168607, -2043365, -1508428, -230721, 896276, 1798413]
548A798413J782578L148481L488378J833272n80127k059316k165682r95667L74727
539F625057K80450p90794j415071j367588j674967k718476l033863k752906k342788
530i190946j206739O16858K181556J784052n68891k354276j522711L79709K285043
521g596345K990238J896593P89907K49894N65544J628394K014338J642535O33658
512D814756q54809k037492k510559k299512j124487O53780J797828J414690l91189
503e36994k400219l733468k984293J12789K831288L276343K129813M78700j030916
494a856957j766464j453545q26831k75514N14370J268615J244670O31136J32780
485b387740J77485N66805N80518N89281M98940J04598M34017Q40511L37837k25317
$$ y = [1798413, 3580991, 6729472, 10217850, 12051122, 11470995, 9411679, 7245997, 6250330, 6625057, 6905507, 6114713, 4699642, 3332054, 1657087, -1061389, -4095252, -6848158, -9190946, -10397685, -9780827, -7599271, -5815219, -6384110, -8738386, -10261097, -9881388, -7596345, -4606107, -2709514, -1919607, -1669713, -1104169, 524225, 2538563, 4181098, 4814756, 3959947, 1922455, -588104, -2887616, -4012103, -3358323, -1560495, -145805, -536994, -2937213, -6670681, -9654974, -9542185, -6710897, -3434554, -1304741, -826041, -1856957, -3623421, -5076966, -5903797, -6179311, -5664941, -4396326, -3151656, -2520520, -2387740, -2210255, -1643450, -1062932, -473651, 25289, 129887, 563904, 1404415, 1742252, 1516935]
475A516935o61610j354936k011170k689694l175059k447543j289976j130482j079815
466a4323350k81958Q16761J413176J498296K431811M034094M205752K429520k72953
457A951149k116433j527074J02819M34116j25117l07590l44045j032426k404635
448e369236l974957m512698l225829q72426J632392K814616K143107J296593J134477
439h933961J126581J100841P93610J016084J817884J716849N23218q41289j700353
430c380536j822576j416379r40450n60311o39479j276780j201772J78649J200181
421i859453J065488L96284k85539p28710l12875Q12023J875174J638647J14504
412e284457j029563j418700j070261M1168L40691k51495m87301k52978k6840M75801
$$ y = [1516935, 855325, -499611, -2510781, -5200475, -8375534, -10823077, -12113053, -13243535, -14323350, -14605308, -13788547, -12375371, -10877075, -8445264, -4411170, -205418, 2224102, 1951149, -165284, -1692358, -1589539, -1155423, -1280540, -1588130, -1932175, -2964601, -5369236, -9344193, -13856891, -17082720, -17955146, -16322754, -13508138, -11365031, -10068438, -8933961, -7807380, -6706539, -5912929, -4896845, -3078961, -1362112, -838894, -1680183, -3380536, -5203112, -6619491, -7559941, -8120252, -8759731, -10036511, -11238283, -11059634, -9859453, -8793965, -8397681, -8683220, -9411930, -9724805, -8912782, -7037608, -5398961, -5284457, -6314020, -7732720, -8802981, -8761813, -8421122, -8672617, -9159918, -9412896, -9439736, -8963935]
402h963935J188987J148551Q97331J227735J546207J676665J672613J158964Q04557
393B357675M96653o55109j742372k213574k084591p38160Q84931J183913P1629
384b439005o08754K30516J046814O34684M38851M45238k28297j533301k766808
375d780062l204478k438190r34172o49064j343906q22715L59503R74783Q71440
366a1966861O84978M40111p0789k32496N50340J130508J047403J648033K603358
357d165415L212781L706793L618740K428085J378367R52605K72812j007976k227806
348H168986k490697j474746K14163O15157k72844j011432q41278p84M80856J41204
338C528585q85801j612303j374266k62380P62411O31946j97017r57140j418776
$$ y = [-8963935, -7774948, -6626397, -5729066, -4501331, -2955124, -1278459, 394154, 1553118, 2357675, 2854328, 2199219, 456847, -1756727, -3841318, -4579478, -3694547, -2510634, -2439005, -3047759, -2817243, -1770429, -1135745, -696894, -251656, -479953, -2013254, -4780062, -7984540, -10422730, -11356902, -12005966, -13349872, -14172587, -13813084, -12838301, -11966861, -11281883, -10841772, -10912561, -11145057, -10594717, -9464209, -8416806, -6768773, -4165415, -952634, 2754159, 6372899, 8800984, 10179351, 11131956, 11404768, 10396792, 8168986, 5678289, 4203543, 4417706, 5032863, 4760019, 3748587, 2907309, 2906525, 3387381, 3528585, 2642784, 1030481, -343785, -606165, 156246, 788192, 591175, -365965, -1784741]
329a784741j345944m81471J138579K576844K843286J897624K87275j321879j734475
320B075098j378796j191363j028462p01529k43322R3202L62655O85830P15733
311f10954R29850J837762J837648K90862p23162n96762n45381l04101m5930j29888
301A939944M99323J694632J740742P60911N58560P70574L64351n24110j683090
292F121837l229847l963138l361828k121546n28498J131095K195497K381837J829870
283D55279J263679J060586O42217M08865R45410J215271K39048j317860k503482
274B409013k623484j725311l42294M57794l1594j229615j836489j179584l87230
265f488794n14851p61030m97477J63567O64932K72583n08443n59368O80701K441790
$$ y = [-1784741, -3130685, -3612156, -2473577, 103267, 2946553, 4844177, 5131452, 3809573, 2075098, 696302, -495061, -1523523, -2225052, -2468374, -2375172, -2012517, -1326687, -610954, 318896, 2156658, 3994306, 4285168, 3562006, 2965244, 2419863, 2115762, 2069832, 1939944, 2439267, 4133899, 5874641, 6635552, 7194112, 7964686, 8329037, 7804927, 6121837, 2891990, -1071148, -4432976, -6554522, -7083020, -5951925, -3756428, -1374591, 455279, 1718958, 2779544, 3421761, 3830626, 4776036, 5991307, 6230355, 4912495, 2409013, -214471, -1939782, -2282076, -1824282, -1855876, -3085491, -4921980, -6101564, -6488794, -7003645, -7764675, -8262152, -8098585, -7433653, -7161070, -7669513, -8228881, -7548180, -5106390]
255e106390L439491K459723O47397k80923r13291j477955k027664j971979j025048
246f256639o02641j427149j998956j541023j236639k027859k392113l19054K896207
237a4905866M914550N411647M450444K102464k97295j553829j619108p47974K53102
228a991865J97103m51286j056160j760421j878551j222566N4612J198891J479037
219e431206J279359J315926J440080P69524j87250l22214N18865J254518M75996
210A113598j071510j695689j493829j123463o26105L16287J374951J513624M01068
201a291068j138600j803542o46475J069177J782032J253663o1759q73238q84556
192b594366n15690M64650Q23461l19099j913425k706549j885466j69767R24162
$$ y = [-5106390, -1666899, 792824, 1440221, 1159298, 246007, -1231948, -3259612, -5231591, -6256639, -6859280, -8286429, -10285385, -11826408, -13063047, -15090906, -17483019, -17802073, -14905866, -9991316, -4579669, -129225, 1973239, 1675944, 122115, -1496993, -2244967, -1991865, -1794762, -2246048, -3302208, -5062629, -6941180, -8163746, -8109134, -6910243, -5431206, -4151847, -2835921, -1395841, -626317, -813567, -1135781, -616916, 637602, 1113598, 42088, -1653601, -3147430, -4270893, -4896998, -4580711, -3205760, -1692136, -1291068, -2429668, -4233210, -4879685, -3810508, -2028476, -774813, -836572, -1709810, -2594366, -3110056, -2645406, -1821945, -2141044, -4054469, -6761018, -8646484, -8816251, -7892089]
183g892089J247828J099827P04814J18750p02893j592925j935347p99185J248063
174h503157K208745J890005J575862J444635J023181Q98994Q44507L76492k31821
165A527443k38016L05250O29495N79762P91556J485213J209859R9109n43277m06610
155E439784k03625m08395l53693J69962M11277L34457r8046j057301j915495k135876
145A83049j995171j430842n28428j15362k43957k63808J20098N64013M54787Q30486
135b425135J303319M93375l70440m44389n35697j030314j182215j044171r60416
126f196083q30685q02766l70508J097427K088634J353607n5127q58571q22506
117e396578l41467M32343R24695M91937J14103K5057q32621j583555j101230n04948
$$ y = [-7892089, -6644261, -5544434, -4839620, -4720870, -5423763, -7016688, -8952035, -9751220, -8503157, -6294412, -4404407, -2828545, -1383910, -360729, 538265, 1382772, 1759264, 1527443, 1289427, 1594677, 2224172, 2803934, 3595490, 5080703, 6290562, 6389671, 5846394, 5439784, 5236159, 4827764, 4474071, 4644033, 5055310, 5389767, 5291721, 4234420, 2318925, 183049, -1812122, -3242964, -3771392, -3886754, -4130711, -4394519, -4274421, -3710408, -3255621, -2425135, -1121816, -628441, -998881, -1443270, -1978967, -3009281, -4191496, -5235667, -6196083, -7026768, -7829534, -8200042, -7102615, -5013981, -3660374, -3715501, -4574072, -5396578, -5738045, -5305702, -4381007, -3889070, -3774967, -3749910, -4582531, -6166086, -7267316, -7772264]
107g772264k94486M64306J857090J760932n91881k175239j731519r34508o92008
98a0109577l64806k13759l36321j42026L41085M31052L7429R1662J112557K020070
88g132634J298890n87418k131164k446246j789692p25279K93298O25775P59622
79a1834848J233445J705178J947936J676844R55187P95336J279170R73067J88848
70a079837l03240p98092q05813L43646J576991J853898J116073j61981q29966
61I11679r07323j047681j493917j944840k179563k158609j454035l15312O1290
52a0528311m43357o19445K00700J491728K483150K991057K382942N07980j003375
43b536931j076691j77995N71919N65257Q14400J430056J370194O65016J06726
$$ y = [-7772264, -8066750, -7602444, -5745354, -3984422, -4576303, -6751542, -8483061, -9417569, -10109577, -10474383, -10688142, -11024463, -11166489, -10825404, -10394352, -10356923, -10265261, -9152704, -7132634, -5833744, -6421162, -8552326, -10998572, -12788264, -13513543, -13220245, -12594470, -11834848, -10601403, -8896225, -6948289, -5271445, -4316258, -3520922, -2241752, -1268685, -1079837, -1383077, -2181169, -2986982, -2643336, -1066345, 787553, 1903626, 1741645, 911679, 4356, -1043325, -2537242, -4482082, -6661645, -8820254, -10274289, -10589601, -10528311, -10971668, -11591113, -11390413, -9898685, -7415535, -4424478, -2041536, -1533556, -2536931, -3613622, -3791617, -3219698, -2654441, -1840041, -409985, 960209, 1625225, 1731951]
34A731951J39585L08777l43531j221995j315167j053458j165636j156666r96230
25e072370j126051j506466j669446r73280K71167J239158J454763J082716N83482
16e716327N95031R12782J092361R37885O56169R51313J774458K005868J149999
7D359539l69845j737269j888154m73648R34232R95645J88726
0B009226
$$ y = [1731951, 1871536, 2180313, 1836782, 614787, -700380, -1753838, -2919474, -4076140, -5072370, -6198421, -7704887, -9374333, -10347613, -10076446, -8837288, -7382525, -6299809, -5716327, -5121296, -4208514, -3116153, -2178268, -1522099, -570786, 1203672, 3209540, 4359539, 3989694, 2252425, 364271, -109377, 824855, 1820500, 2009226]
$$ Imaginary data points
##PAGE= N=2
##DATA TABLE= (X++(I..I)), XYDATA
32767C909263K722100K028529R72080O76084O78055k01388j078805q39595J54265
32758I020588J462203K281038J928577J029925L40736N66625J325121J800966
32750A9755779J847814J318992J13125q37894o42086O00155K295646K959765K012027
32741B9423323J134549J119122J214035M63060j045615j583371p62780J2478K06868
32732C0181669k4175k60305r558N36312Q64172R14907J022741J464031J660563
32723C6350357J507997K142578L314170L758463L693129L358636K586105J712326
32715E8423761O84766o97594j340754r30451n93091p84951j035564j052010q29063
32706E1845049p2438P48093J221339J305498J026458J053309J587951K100398
$$ y = [3909263, 6631363, 8659892, 9631972, 10308056, 10986111, 10784723, 9705918, 8866323, 9020588, 10482791, 12763829, 14692406, 15722331, 16063067, 16629692, 17954813, 19755779, 21603593, 22922585, 23035710, 22197816, 21555730, 22155885, 24451531, 27411296, 29423323, 30557872, 31676994, 32891029, 33354089, 32308474, 30725103, 29962323, 29974801, 30181669, 30157494, 29897189, 29887631, 30423943, 31288115, 32203022, 33225763, 34689794, 36350357, 37858354, 40000932, 43315102, 47073565, 50766694, 54125330, 56711435, 58423761, 59108527, 58410933, 57070179, 56139728, 55546637, 54761686, 53726122, 52674112, 51845049, 51772611, 52520704, 53742043, 55047541, 56073999, 57127308, 58715259, 60815657]
32698F0815657J854226R15564j70325n09185K18384P53128M7853o59560j48749
32689F3116993Q62062J693250K058630J376872j29805n27465J9015Q0898M7676
32680F8598126N74227J461449K055282K050762K305682K950936K511245J576777
32672H4084486J662897J726798J002529K72146O791j8667j0414k70090p10677
32663H7745799r83157n66413L34990K00342j026880j423489k03080J837024L205226
32654H9120362K990254J829374J159375J591789K141724K165211K112178K310257
32646A05420524K524360K685682K639019K086169J142846O34502R25488Q83780
32638A18942370N89991P62375J017742J162801J161492Q32762K95563k49430m28917
$$ y = [60815657, 62669883, 63585447, 63415122, 62905937, 63124321, 63877449, 63925302, 63265742, 63116993, 63979055, 65672305, 67730935, 69107807, 68978002, 68450537, 68469552, 68550450, 68598126, 69172353, 70633802, 72689084, 74739846, 77045528, 79996464, 82507709, 84084486, 85747383, 87474181, 88476710, 88748856, 88755647, 88736980, 88726566, 88456476, 87745799, 86762642, 86196229, 86531219, 86731561, 85704681, 84281192, 84078112, 85915136, 89120362, 92110616, 93939990, 95099365, 96691154, 98832878, 100998089, 103110267, 105420524, 107944884, 110630566, 113269585, 115355754, 116498600, 117133102, 118058590, 118942370, 119532361, 120294736, 121312478, 122475279, 123636771, 124469533, 124765096, 124515666, 124086749]
32629A24086749j54039L08419J361514K576479K407975J136928M57784M67119
32621A32648928L4165r10464j415016j049052k77693k24481l17578P43538K076371
32612A31308718K356552K008478J457542Q77582M44890r0374n08974n56194l08381
32603A36989839P4037J9872l37647k65144Q0486N2596k81254l44454K52520J025727
32593A37266578J022710M65428Q9957M44668J069441J151763P84654N95471P11033
32584A43601703O54044P34302J072872Q97593O57965J545003K465305K140675
32576A53769462J267919J101230J002693N45913N59119Q22156R77420J146647
32568A61192559K032386K836206J714790n24207j270919M487J237692J609775
$$ y = [124086749, 123932710, 124241129, 125602643, 128179122, 130587097, 131724025, 132181809, 132648928, 132683093, 131772629, 130357613, 129308561, 129030868, 128806387, 128488809, 129232347, 131308718, 133665270, 135673748, 137131290, 138008872, 138453762, 138363388, 137854414, 137298220, 136989839, 137063876, 137083748, 136746101, 136480957, 136561443, 136614039, 136332785, 135988331, 136240851, 137266578, 138289288, 138754716, 138844673, 139289341, 140358782, 141510545, 142295199, 142890670, 143601703, 144255747, 144990049, 146062921, 146960514, 147618479, 149163482, 151628787, 153769462, 155037381, 156138611, 157141304, 157687217, 158246336, 159068492, 160045912, 161192559, 163224945, 166061151, 167775941, 167251734, 165980815, 165985302, 167222994, 168832769]
32560A68832769J648378J547280J234128Q90710K79220o73928j289708j148511
32552A71320338k12883K81506k93415j101077j536603j286984m86137L4082L20567
32543A67039394R65472J795456K835251L681159L832620L766430K457966O59457
32535A87033205M16550R13020J002872K52316q28931r47313n53707p28391r30737
32526A85628884r18331j030586j019539o73687O5435J341726K737615L227449
32518A89358966K688760J590272J26227k74385Q36777J699521J580325J332831
32510A98939294Q68320n84542j462299m50144J408915K573775K773223K559290
32502B06625832J783158R47159N66317K98909l61386q50525o83890m20111o87539
$$ y = [168832769, 170481147, 172028427, 173262555, 174153265, 174432485, 173758557, 172468849, 171320338, 171107455, 171388961, 171095546, 169994469, 168457866, 167170882, 166684745, 166718827, 167039394, 168004866, 169800322, 172635573, 176316732, 180149352, 183915782, 186373748, 187033205, 187449755, 188362775, 189365647, 189617963, 188789032, 187841719, 187288012, 186559621, 185628884, 184710553, 183679967, 182660428, 181986741, 182052176, 183393902, 186131517, 189358966, 192047726, 193637998, 193764225, 193489840, 194326617, 196026138, 197606463, 198939294, 199807614, 199223072, 197760773, 197310629, 198719544, 201293319, 204066542, 206625832, 208408990, 209356149, 209922466, 210221375, 209859989, 209009464, 208325574, 207905463, 207217924]
32493B07217924r39465n83366m79283m38861j13914L05919N58318R27231J566513
32484B08021016K045415K396949K295757J105517n59767j583422j789174j495438
32476B10436853l00505J383993J791811J447750J726211K251059K363863J309215
32468B22410250j58186r15948j327202j074587k774L15160n94610j291952p19603
32459B16640548R70450K256225K081732P61360o07491o71914Q30560K973111M030015
32450B29264596M166500L479913Q16150k326508l557062k311411p46667K78195
32442B29063706J767736K849174K534773Q96492j36177O0193K23814L50523J01213
32433B37711447p69417j457330j100116L27616J372405R50800n80783r47620J17438
$$ y = [207217924, 206278459, 205695093, 205215810, 204776949, 204663035, 204968954, 205527272, 206454503, 208021016, 210066431, 212463380, 214759137, 215864654, 215304887, 213721465, 211932291, 210436853, 210136348, 211520341, 213312152, 214759902, 216486113, 218737172, 221101035, 222410250, 222252064, 221336116, 220008914, 218934327, 218931553, 219246713, 218652103, 217360151, 216640548, 217610998, 219867223, 221948955, 222710315, 222102824, 221430910, 222261470, 225234581, 229264596, 233431096, 236911009, 237727159, 235400651, 231843589, 229532178, 228785511, 229063706, 230831442, 233680616, 236215389, 237111881, 236975704, 237035897, 237259711, 237610234, 237711447, 236942030, 235484700, 234384584, 234712200, 236084605, 237035405, 236454622, 235507002, 235624440]
32424B35624440L16455j463094l106936k522287r87617j93365j915l86216n09076
32415B26770389J026048L029399L603934K558873J530350J408440J491146J698100
32407B43116679K639757L634550L332411J871240O36645l48850j946454k413042
32399B50522936j009553L40650P89033N09411l95145j547989j777874q62230J37066
32390B46706305L13724l960N974K45577L96991O30851M51819p30006j731045k012895
32380B44273335k376461j468697Q79268K797250L695302L976887L738149K625210
32372B58140243Q62849q61708k066816k185733j464622q90473q45446j289124
32364B49399170j583026r01749L84178K205774L726480L686956K896000K564656
$$ y = [235624440, 235940895, 234477801, 231370865, 228848578, 227860961, 227667596, 227665681, 227279465, 226770389, 227796437, 230825836, 234429770, 236988643, 238518993, 239927433, 241418579, 243116679, 245756436, 249390986, 252723397, 254594637, 255231282, 254882432, 252935978, 250522936, 249513383, 249854033, 250643066, 251152477, 250757332, 249209343, 247431469, 246569239, 246706305, 247020029, 247016069, 247022043, 247267620, 247664611, 248295462, 248747281, 248017275, 246286230, 244273335, 241896874, 240428177, 241307445, 244104695, 247799997, 251776884, 255515033, 258140243, 259003092, 258141384, 256074568, 253888835, 252424213, 251533740, 250688294, 249399170, 247816144, 246914395, 247298573, 249504347, 253230827, 256917783, 259813783, 262378439]
32356B62378439K258773J448463k75125j872372j657405p24736K84743J671623
32348B63512403J655294K9094j041919r34005j16339O95614J253909J721143J462383
32339B68237577P7355m85366J861l84065r94060j619933k465894k577459j080389
32330B58709627J239460K568365K474886K245325J627589Q84168Q21289O65933
32322B71236642N58511R35113J148971J163446J286017P82273k25330p13681o34574
32313B75537388l28548r0004k82028j151798k177104k473531j578896j29036N21225
32304B67847668R67671J896087K206957R64972j6913o3034r13550j546070r17652
32295B70426136m06178m96269p03720l03427Q83990J428645O70331m41684j433906
$$ y = [262378439, 264637212, 266085675, 265810550, 263938178, 262280773, 261556037, 261840780, 263512403, 265167697, 265196791, 264154872, 263220867, 263104528, 263800142, 265054051, 266775194, 268237577, 268314932, 267829566, 267831427, 267447362, 266453302, 264833369, 262367475, 259790016, 258709627, 259949087, 262517452, 264992338, 267237663, 268865252, 269749420, 270570709, 271236642, 271795153, 272730266, 273879237, 275042683, 276328700, 277110973, 276885643, 276171962, 275537388, 275208840, 275118836, 274836808, 273685010, 271507906, 269034375, 267455479, 267326443, 267847668, 268815339, 270711426, 272918383, 273883355, 273866442, 273803408, 272889858, 271343788, 270426136, 270019958, 269523689, 268819969, 268516542, 269400532, 270829177, 271499508, 271057824, 269623918]
32286B69623918k288419k387981j048502M82472J431103K008314K320099K696468
32278B72837472K404260K266988K883983L083669K319550N81461k034944m453382
32270B79889057m793558k954582n24786Q44866L77493j460280l284022l117897
32262B64976291j455753m33936m04881K1817J642840L704472N125410N834428
32254B79010688N202423K331595j032655l194396m530625m399263k714900n05694
32246B70167173J678562L672311N047269M791457L263488J744455Q72311k9020
32238B91208006j537329k205219j707615q97356J60652J001776J294790O61981
32230B87979686q94573j287403m72260m89187j358097j259459J45938J448320
$$ y = [269623918, 267335499, 264947518, 263899016, 264381488, 265812591, 267820905, 270141004, 272837472, 275241732, 277508720, 280392703, 283476372, 285795922, 286377383, 284342439, 279889057, 275095499, 272140917, 271616131, 272460997, 272838490, 271378210, 268094188, 264976291, 263520538, 263086602, 262681721, 262703538, 264346378, 268050850, 273176260, 279010688, 284213111, 286544706, 285512051, 282317655, 277787030, 273387767, 270672867, 270167173, 271845735, 275518046, 280565315, 285356772, 288620260, 290364715, 291237026, 291208006, 289670677, 287465458, 285757843, 284860487, 285021139, 286022915, 287317705, 287979686, 287085113, 285797710, 285325450, 284836263, 283478166, 282218707, 282364645, 283812965]
32222B83812965J533192Q53867L0279q96481j171984n64352R46955J881810J895136
32213B88321387J720323R56949n39926j899175k586381k545382j541980j82962
32205B81702853N61505M80335O2472J058649K700261L265203L636883L730021
32197B97198182K251831J04576j781843k655878k138739j616727j349212j188384
32189B88823806r32059n26070J66926L44851l42426o62458k20803R64136K032594
32180B89648497K112207J597106J234288p9880k264688l118253j709246K83099
32172B87703130J078126J311649K086526K392849J774959M71204n77337j834R81073
32163B97220345Q95786M45949L35546j63243r47534j483612j926151j646262j056127
$$ y = [283812965, 285346157, 286200024, 286230303, 285333822, 284161838, 283597486, 284544441, 286426251, 288321387, 290041710, 290998659, 290458733, 288559558, 285973177, 283427795, 281885815, 281702853, 282264358, 282744693, 282807165, 283865814, 286566075, 289831278, 293468161, 297198182, 299450013, 299554589, 297772746, 295116868, 292978129, 291361402, 290012190, 288823806, 287891747, 287365677, 287532603, 287877454, 287535028, 286872570, 286651767, 287615903, 289648497, 291760704, 293357810, 294592098, 294512218, 292247530, 289129277, 287420031, 287703130, 288781256, 290092905, 292179431, 294572280, 296347239, 296818443, 296241106, 296239272, 297220345, 298116131, 298562080, 298897626, 298734383, 297786849, 296303237, 294377086, 292730824, 291674697]
32154B91674697j740522k291597j343400o63869p67159q05095p23071k0641J102187
32145B84421530J724826K443458L620282M052575L356513J758836j082009m045099
32137B96250912n257957l666805p11009R28123N12768j001291j891785k056753
32129B83106203k043654j057152O30235J597639J165006l02024j078237k61328
32121B81756688J642048L046225K714459J266701L90227J95299k26970o65817
32113B90118860r39429k86123J116951J772206J035350P1805k52570p11186k021048
32104B89904816k810355j818476M10832J891207J711941O77770l8619o836k65088
32095B89657192p12511p74348j132512j747884j996991j386248k8258J423727
$$ y = [291674697, 289934175, 287642578, 286299178, 285635309, 284868150, 284063055, 283339984, 283319343, 284421530, 286146356, 288589814, 292210096, 296262671, 299619184, 301378020, 300296011, 296250912, 290992955, 287326150, 286615141, 287543264, 288056032, 287054741, 285162956, 283106203, 281062549, 280005397, 280635632, 282233271, 283398277, 283096253, 282018016, 281756688, 283398736, 286444961, 289159420, 290426121, 290816348, 291011647, 290784677, 290118860, 289179431, 288893308, 290010259, 291782465, 292817815, 292889620, 292637050, 291925864, 289904816, 287094461, 285275985, 285686817, 287578024, 289289965, 289967735, 289929116, 289922280, 289657192, 288944681, 288170333, 287037821, 285289937, 283292946, 281906698, 281878440, 283302167]
32087B83302167J565017O84825M15365J804465L752770L841697K181438O30596
32079B98178340M38052P57571L74337r01177k556355l675408l978605l428000
32071B85208755k143796n7092K397296L457893K805448J653497M53220n51241
32063B93223980O4611J740876K218776J558024O07913q74538j928942k417968
32055B94192732k520595j488030O20707K109023K411055J880278J190222J214655
32047B99610047J143433m50777k242759j670200P33346K118787J301123q69457
32039B99673543k678921k911472j921273o43422j51622n10873m64819J88677Q54699
32030B91434517J774044K968541L392219K320582J229327J300779P45677r97141
$$ y = [283302167, 284867184, 285552009, 285967374, 287771839, 291524609, 295366306, 297547744, 298178340, 298616392, 299373963, 299748300, 298847123, 296290768, 292615360, 288636755, 285208755, 283064959, 283007867, 285405163, 288863056, 291668504, 293322001, 293775221, 293223980, 293288591, 295029467, 297248243, 298806267, 299414180, 298539642, 296610700, 294192732, 291672137, 290184107, 290804814, 292913837, 295324892, 297205170, 298395392, 299610047, 300753480, 300302703, 298059944, 296389744, 297123090, 299241877, 300543000, 299673543, 296994622, 294083150, 292161877, 291518455, 291366833, 290855960, 290391141, 290579818, 291434517, 293208561, 296177102, 299569321, 301889903, 303119230, 304420009, 305165686, 304168545]
32022C04168545j700552j288324q37319j1643O34368P8280r70912j501363j344001
32013B97227079j050442j181573j585782j723826l61862K237566L861461M274255
32005C01696876L050249K5591k776565l593102k640849j427068O9643J575207
31997B95979982J356748K12245k20007q05836j729913j812568j519478j909796
31989B89551377j624638j31457L95194k99757o59456N93243L285254M642386L569364
31980B99321510K384098K336982K002675N72613j087237k076223j655211p0991
31972C01728216R52181l76156l243927m409823l069286q11041R50738J244769
31964B92965671L39644j116292k705633l840414l659621j785979M54214J581718
$$ y = [304168545, 302467993, 301179669, 300342350, 300330707, 300965075, 301043355, 300072443, 298571080, 297227079, 296176637, 294995064, 293409282, 291685456, 291323594, 293561160, 297422621, 301696876, 304747125, 304772716, 301996151, 298403049, 295762200, 294335132, 294404775, 295979982, 297336730, 297548975, 297328968, 296523132, 294793219, 292980651, 291461173, 289551377, 287926739, 287795282, 288190476, 287890719, 287231263, 287824506, 291109760, 295752146, 299321510, 301705608, 304042590, 306045265, 306617878, 305530641, 303454418, 301799207, 301728216, 302680397, 302304241, 299060314, 294650491, 291581205, 290770164, 291720902, 292965671, 293305315, 292189023, 289483390, 285642976, 281983355, 280197376, 280651590, 282233308]
31956B82233308J304076J088073K322762L312954K066594k49800k209169l847192
31948B86021606m330980l548877k053610K92041K736904L450358J159729j377684
31940B82349487r60056J321502K916067K588647R69667l37489n8414P72244J031641
31931B90593296L19600q46281j152943q09370q54828j494365k125688j842999
31923B81786422q8681J706235K405489K716059L115419L949047N138945M734665
31915C05463600J868559r99380j350669j86823K48681J73348K92710m13194j905277
31906C03191555k910881k830243j812479J82193K032099K783549K759335J577112
31898C04972240m26638j749352k046002k146501k318124j977985j394850j379098
$$ y = [282233308, 283537384, 284625457, 286948219, 290261173, 292327767, 292077967, 289868798, 286021606, 281690626, 278141749, 276088139, 276380180, 279117084, 282567442, 283727171, 282349487, 281389431, 282710933, 285627000, 288215647, 289185314, 288847825, 288789411, 289561655, 290593296, 290912896, 290066615, 288913672, 288104302, 287249474, 285755109, 283629421, 281786422, 281697741, 283403976, 285809465, 288525524, 291640943, 295589990, 300728935, 305463600, 307332159, 306332779, 304982110, 304795287, 305043968, 305217316, 305510026, 305096832, 303191555, 300280674, 297450431, 295637952, 295820145, 297852244, 300635793, 303395128, 304972240, 304545602, 302796250, 300750248, 298603747, 296285623, 294307638, 292912788, 291533690]
31890B91533690j099454k73580K70380L48051P43958J001366r2380q45403L04098
31881B91890726J915747K292591J462916l79586k399290l222794k506281j737525
31873B87316504j936751k445215k362566j413147J02382J288503J505359Q07354
31865B82862423n26925j419684p5786K071052L308792L526181K715836K111065
31857B94572954K454123K677269J567448j59973j723943k832606k124947J69715
31849B94600040R55392j67441j337438k802700m329555m213281k079805L42253
31841B80967465J127771R41656R17325J537857K123042K059185K158018K081967
31833B93914286J903693K030227K299792J812411N5718j691920k609839k812272
$$ y = [291533690, 290434236, 290160656, 290431036, 290779087, 291523045, 292524411, 292432031, 291586628, 291890726, 293806473, 296099064, 297561980, 297182394, 294783104, 291560310, 289054029, 287316504, 285379753, 282934538, 280571972, 279158825, 279261207, 280549710, 282055069, 282862423, 282335498, 280915814, 280840028, 282911080, 286219872, 289746053, 292461889, 294572954, 297027077, 299704346, 301271794, 301111821, 299387878, 296555272, 294430325, 294600040, 295555432, 295387991, 294050553, 291247853, 286918298, 282705017, 280625212, 280967465, 282095236, 283036892, 283954217, 285492074, 287615116, 289674301, 291832319, 293914286, 295817979, 297848206, 300147998, 301960409, 302016127, 300324207, 297714368, 294902096]
31825B94902096j702206N44694K635825L660698K630401K68823j138409r07030
31817C00894892p25468j160197k081332k637275k081286j224381o88841l04976
31809B89991136k45316K66929J049492J417803K058458K551283J408165r09584
31801B97588366k297123k376326k333676j951202j451446j443394j004823R56927
31793B85687303K979584M000070M453013L924110K141154J65191l39156R2414
31785C03103683M27162J15338j139876k678457l498721l605546l060990j839639
31777B87822954l33064K68698q21741k136438j957432p10600M0629j2136M43711
31768B82604581R72296Q51942J1044j425867j695920j07713J663772J785524P40236
$$ y = [294902096, 293199890, 293744584, 296380409, 300041107, 302671508, 302940331, 301801922, 300894892, 300169424, 299009227, 296927895, 294290620, 292209334, 290984953, 290296112, 289991136, 289745820, 290012749, 291062241, 292480044, 294538502, 297089785, 298497950, 297588366, 295291243, 292914917, 290581241, 288630039, 287178593, 285735199, 284730376, 285687303, 288666887, 292666957, 297119970, 301044080, 303185234, 303350425, 303011269, 303103683, 303530845, 303646183, 302506307, 299827850, 296329129, 292723583, 289662593, 287822954, 287489890, 287758588, 286936847, 284800409, 282842977, 282132377, 282173006, 282160870, 282604581, 283576877, 284428819, 284439863, 283013996, 281318076, 281210363, 282874135, 284659659, 285399895]
31759B85399895p20256j794611j071320j18998m137K48519J097655J934460J416622
31750B86387829R63381J713960J279296j231137l645370m142073k691830p92643
31742B77841413M02808N29313P490j86924J11884J367004K710170K178098K81301
31733B85242557j324247k044250j426862l78353j54500M6815J30157q12710j558719
31724B77719888r90555O01382K259964K925639K510407K275750K855936L238260
31716B93396671K516151Q40752j063302k072874j620782j242534k594247m313909
31708B83845926l894067j735245M09112K021508K462117J749340J428952J877076
31700B88164719K752208K738882R33148p48838p54815M294P91032J468078O25896
$$ y = [285399895, 284679639, 282885028, 281813708, 281694710, 281690573, 281939092, 283036747, 284971207, 286387829, 287351210, 289065170, 290344466, 289113329, 285467959, 281325886, 278634056, 277841413, 278244221, 278773534, 278781024, 278594100, 278705984, 280072988, 282783158, 284961256, 285242557, 283918310, 281874060, 280447198, 280068845, 279914345, 279961160, 280091317, 279278607, 277719888, 276729333, 277330715, 279590679, 282516318, 285026725, 287302475, 290158411, 293396671, 295912822, 296753574, 295690272, 293617398, 291996616, 290754082, 288159835, 283845926, 279951859, 278216614, 278625726, 280647234, 283109351, 284858691, 286287643, 288164719, 290916927, 293655809, 294588957, 293840119, 293085304, 293089598, 293880630, 295348708, 295974604]
31691B95974604j185315j716955j247916j006276j573599k410453k490500k087344
31683B82256246j531252k51081O94174J111555J840766K536223K602681J950631
31675B91209943L41524j086021j263431q53917K95115J825774J657919K83677
31667B92410583J10431M88085J53434O7202J14878O35322J711705J622440P68577
31658B98082657O72082J368135J674998L52815k071178l006462k443650k491466
31650B92137931k566238j990093j673414q44982L18025M94743k5039j22000m8250
31641B85680683k21373m53558m34662L73939J485004K150706K086629J811372
31633B92478740J414165O10153o7425m48766l58871R0953l0482k61191R09835
$$ y = [295974604, 294789289, 293072334, 291824418, 290818142, 289244543, 286834090, 284343590, 282256246, 280724994, 280473913, 281168087, 282279642, 284120408, 286656631, 289259312, 291209943, 291551467, 290465446, 289202015, 288348098, 288643213, 290468987, 292126906, 292410583, 292521014, 293009099, 293162533, 293229735, 293344613, 293979935, 295691640, 297314080, 298082657, 298754739, 300122874, 301797872, 302150687, 300079509, 297073047, 294629397, 292137931, 289571693, 287581600, 285908186, 285063204, 285381229, 285875972, 285850933, 285728933, 285680683, 285459310, 285005752, 284571090, 284945029, 286430033, 288580739, 290667368, 292478740, 293892905, 294503058, 294435633, 293986867, 293627996, 293718949, 293688467, 293427276, 294337111]
31624B94337111K684193L229393K709930Q72981j838017l006313k371726p49620
31616B95867932Q08737R77890N86071J086089J871456J343832m47517k045091
31608C00049399l080563l882351l722625j705585J122654L080440L301217J270600
31600B96433186j479808k221920j291679l56604m27998q29021r76380k160371
31592B86689405m007412l683119r00617J242083J366313L07039p08444k27583
31584B80077665J335062L072955M246765M141891K485441K51737n47316P6682
31576B95140882K15436l37950r22271j132574j338147j858025k004712q88906
31568B86873733P15261J939486K568803K000867P46679o67125k032751k728636
$$ y = [294337111, 297021304, 300250697, 302960627, 303833608, 301995591, 298989278, 296617552, 295867932, 296676669, 297654559, 298240630, 299326719, 301198175, 302542007, 302094490, 300049399, 296968836, 293086485, 289363860, 287658275, 288780929, 291861369, 295162586, 296433186, 294953378, 292731458, 291439779, 291083175, 290655177, 289826156, 288849776, 286689405, 282681993, 278998874, 278098257, 279340340, 280706653, 281013692, 280305248, 280077665, 281412727, 284485682, 288732447, 292874338, 295359779, 295611516, 295064200, 295140882, 295356318, 295018368, 294096097, 292963523, 291625376, 289767351, 287762639, 286873733, 287588994, 289528480, 292097283, 294098150, 294844829, 294177704, 292144953, 289416317]
31560B89416317j894620J65138K237789L099108J837394l86547j899975k397411
31552B90177193j774019r617J642855K139055K124806J646873J022768P73934
31544B97743848J128564K273258L050455K060819j54997k268953k951656k730186
31536B98151152k240693k162072k641361k225600r24447l64554m61025o07070
31528B86524330k50184Q53787J407783P23981K01059M90058O93507N36820J049753
31519B92230894J867671J783054Q82527m52908j317291j437005j391209j193272
31511B90972461j292743j440173j258815l66758P92656N35341o46135j197172
31503B86098662p21261P79309K567265L078559K001236P32184N46168Q36277R50385
$$ y = [289416317, 287521697, 287686835, 289924624, 293023732, 294861126, 294474579, 292574604, 290177193, 288403174, 288393557, 290036412, 292175467, 294300273, 295947146, 296969914, 297743848, 298872412, 301145670, 304196125, 306256944, 306101947, 303832994, 300881338, 298151152, 295910459, 293748387, 291107026, 288881426, 287956979, 287592425, 287131400, 286524330, 286274146, 287127933, 288535716, 289259697, 289460756, 289950814, 290644321, 291181141, 292230894, 294098565, 295881619, 296764146, 296311238, 294993947, 293556942, 292165733, 290972461, 289679718, 288239545, 286980730, 286613972, 287406628, 287941969, 287295834, 286098662, 285377401, 286156710, 288723975, 291802534, 293803770, 294535954, 295082122, 295918399, 296868784]
31494B96868784J111462M76039r68289j284887j52774Q80001R92662P44424J58036
31485B98825458k99259n66787r99027j352912j038282k57099m43962j014275q94422
31476B91959433l31296Q10730J719925J097987o31505l096069n198066m449381
31468B81881758j077402K303841L594144K580328J442997J413438J671612J348972
31460B95159688J30171k002811l981185m675350m180933k512221j77583R65264
31452B78725040M74926M25905J903494L600843L846834K519009J228440Q20418
31444B93544909N89845M6430q60042k101179k914202k791125j986262r13832j15394
31435B82499148O46344J053495J81362j302004j183702j70764n50605j705443
$$ y = [296868784, 297980246, 298456285, 297487996, 296203109, 296050335, 296930336, 297922998, 298667422, 298825458, 298526199, 297959412, 296960385, 295607473, 294569191, 294312092, 293868130, 292853855, 291959433, 291628137, 292438867, 294158792, 295256779, 294625274, 291529205, 286331139, 281881758, 280804356, 283108197, 286702341, 289282669, 290725666, 292139104, 293810716, 295159688, 295289859, 293287048, 289305863, 284630513, 280449580, 277937359, 277759776, 278725040, 279199966, 279625871, 281529365, 285130208, 288977042, 291496051, 292724491, 293544909, 294134754, 294181184, 293321142, 291219963, 288305761, 285514636, 283528374, 282614542, 282499148, 283145492, 284198987, 284380349, 283078345, 281894643, 281723879, 281173274, 279467831]
31427B79467831j576924n72219J34587O16892P67712P74389J326476K084774K662977
31418B85686495K580349J687080J148096J657922K351469K502709K475023K482764
31410C02571907J615246M8595l06842J33424K83906k36632j774654l596805l377180
31401B95360965r05110P29998P62313J124194J161427p77300l233881m483109
31393B89739497l956159k432341j034919M56643J637314J577933P95552J59849
31385B86943369j68972K9491O41875P86738Q16690J021424Q33273N42991M74164
31376B91921043L69383N78533J360129J934683J115971n88753p20685O25382J275025
31367B97870711Q05388K72101K46698J33292K67308J90081q72311j880249k062659
$$ y = [279467831, 277890907, 277318688, 277453275, 278070167, 278837879, 279612268, 280938744, 283023518, 285686495, 288266844, 289953924, 291102020, 292759942, 295111411, 297614120, 300089143, 302571907, 304187153, 304235748, 303928906, 304062330, 304346236, 304109604, 302334950, 298738145, 295360965, 294455855, 295185853, 295948166, 297072360, 298233787, 297456487, 294222606, 289739497, 285783338, 283350997, 282316078, 282772721, 284410035, 285987968, 286783520, 286943369, 286774397, 286803888, 287445763, 288232501, 289049191, 290070615, 290903888, 291446879, 291921043, 292290426, 292868959, 294229088, 296163771, 297279742, 296690989, 295970304, 296595686, 297870711, 298676099, 298948200, 299194898, 299328190, 299595498, 299785579, 298913268, 297033019, 294970360]
31358B94970360k144129j689161q37835j365032k597236k579840o47058J501070
31350B84611139K411952K567648J836059O40135j22553m59450N6053J045046J292141
31341B93878170R90937K07585j597770l000485k497208o36301Q92478J049239
31333B89286645P02715N36290N5921j14010R16955J562761M71705j392989k685003
31324B89340990k431919p42565J15599r06454j616413l44920J404999J508538
31316B86327855L3781j210874r45902N41032J843649J377131M76590J496449K367971
31307B92307682Q84392p32595r10878m91839o84988j822633k484892j830147r52879
31298B83281223l40723o5184J322860L451183M133486L673362K582446J219253
$$ y = [294970360, 292826231, 291137070, 290299235, 288934203, 286336967, 283757127, 283110069, 284611139, 287023091, 289590739, 291426798, 292066933, 291944380, 291484930, 291540983, 292586029, 293878170, 294869107, 295076692, 293478922, 290478437, 287981229, 287344928, 288237406, 289286645, 289989360, 290525650, 290581571, 290467561, 291384516, 292947277, 293418982, 292025993, 289340990, 286909071, 286166506, 286282105, 285375651, 283759238, 283414318, 284819317, 286327855, 286361636, 285150762, 284204860, 284745892, 286589541, 287966672, 288443262, 289939711, 292307682, 293192074, 292459479, 291548601, 291056762, 290371774, 288549141, 286064249, 284234102, 283281223, 282940500, 282875316, 284198176, 287649359, 291782845, 295456207, 298038653, 299257906]
31290B99257906K23192k91072n81720r14571j311278j933560j696007m4900O83923
31281B93391913M106J2476Q08610J688881J917920J066762k91101j863899k732051
31272B94003617k370788j736843q03330N63217J317104J592766J267645O42816
31264B94476204M77009N79834O31020P52177J123910J233554P52381N8683j96694
31255B99888078o03512j041155m1578J830451J751448k24251j714689j974574
31247B97870218j328013r77278j825426k840014k817817j776808K11613K334794
31239B88851269L263839L072534K692894K626985J986052j464j582433j521716
31231B99387960j119369n13111j41116j188828k637605k494770j303546J0549
$$ y = [299257906, 299481098, 299190026, 298608306, 297693735, 296382457, 294448897, 292752890, 292707990, 293391913, 293396019, 293408495, 294217105, 295905986, 297823906, 298890668, 298599567, 296735668, 294003617, 291632829, 289895986, 289092656, 289655873, 290972977, 292565743, 293833388, 294476204, 294953213, 295533047, 296164067, 296916244, 298040154, 299273708, 300026089, 300084772, 299888078, 299284566, 298243411, 298201833, 300032284, 301783732, 301559481, 299844792, 297870218, 296542205, 295564927, 293739501, 290899487, 288081670, 286304862, 286516475, 288851269, 292115108, 295187642, 297880536, 300507521, 302493573, 302492109, 300909676, 299387960, 298268591, 297755480, 297614364, 296425536, 293787931, 291293161, 289989615, 290000164]
31223B90000164R11911P31763r116M58340J556553K204702K392788J835050Q66144
31214C00948299N9638o41593j859882k584372k219169p41072O08022Q75435O02056
31205B95047362r04033k666210k362855m67829J376560J994555R64187k01396
31197B92780341j063747k032656k360264j102569O41772J017159j13505j633853
31189B86132678k048378o33028J330745K059011K030028K041292K134176J971067
31181B95017591J706384J290353M79812N9357M56110N18910o4839j10252N47065
31172B99900491P05463M54684P08125N92019p17303j946149k620383k754519k811672
31163B91510756l458447l526058k151620j084639j882951l097081k761452j360560
$$ y = [290000164, 290912075, 291643838, 291634722, 292093062, 293649615, 295854317, 298247105, 300082155, 300948299, 301007937, 300366344, 298506462, 295922090, 293702921, 292961849, 293569871, 294445306, 295047362, 294143329, 291477119, 289114264, 288646435, 290022995, 292017550, 292981737, 292780341, 291716594, 289683938, 287323674, 286221105, 286862877, 287880036, 287766531, 286132678, 284084300, 283451272, 284782017, 286841028, 288871056, 290912348, 293046524, 295017591, 296723975, 298014328, 298494140, 298553497, 299009607, 299528517, 299463678, 299353426, 299900491, 300605954, 301060638, 301768763, 302360782, 301643479, 299697330, 297076947, 294322428, 291510756, 288052309, 284526251, 282374631, 281289992, 279407041, 276309960, 273548508, 272187948]
31155B72187948L36906K014464K729553K285213J167065O24741Q78339J564253
31147B83788482J673489M47433o14487m4877J769404L647713L998929J480581
31139B96146667p63234p62066l92248j468752l074505l187915k490397j786925
31131B82220625n83202K18676L25374K82099p2154j39801N26044J435919J973727
31122B86187307J750198M82482j111770j334935p42076j201442k395839k951846
31114B78682079k306894r54752N66872J936767K374088J708985J733192K413767
31106B86154104K021498J000107P15631M47036k70340m64519j27943j54207l40491
31097B88980876P34114K142164J464247n16006q15827J065724L016920L647113
$$ y = [272187948, 272524854, 274539318, 277268871, 279554084, 280721149, 281345890, 282224229, 283788482, 285461971, 285909404, 285294917, 285250040, 287019444, 290667157, 294666086, 296146667, 295383433, 294621367, 294229119, 292760367, 289685862, 286497947, 284007550, 282220625, 281637423, 281856099, 282181473, 282463572, 282391418, 282251617, 282777661, 284213580, 286187307, 287937505, 288419987, 287308217, 285973282, 285231206, 284029764, 281633925, 278682079, 276375185, 275420433, 275987305, 277924072, 280298160, 282007145, 283740337, 286154104, 288175602, 289175709, 289891340, 290338376, 290068036, 289603517, 289475574, 289321367, 288980876, 289714990, 291857154, 293321401, 292805395, 291989568, 293055292, 296072212, 299719325]
31089B99719325L863079L603830J792828q26097k765123l053065j784211o81436
31081B99869130j013327k006570k658188k111610l96657N54924J56535p74407
31073B91619830j075178j135623j833025j998756j175444p64486r01485j96637
31065B82539196R42706J524921J797778K243258K984888L207176K278239L18672
31057B97836834k194067m051946l536996j002496L57673m48660j903529k369488
31049B82687325j773398j155708q73871q37336n62136J97556M48338O3993N26333
31040B78721096J958523K970688K851180K106895J895645J973683J210137m35166
31032B93252681k743998m685607l986857j341751O61640J482541J690353J190077
$$ y = [299719325, 303582404, 307186234, 308979062, 308152965, 305387842, 302334777, 300550566, 299869130, 298855803, 296849233, 294191045, 292079435, 291682778, 292237702, 292394237, 291619830, 290544652, 289409029, 287576004, 285577248, 284401804, 283637318, 282735833, 282539196, 283481902, 285006823, 286804601, 289047859, 292032747, 295239923, 297518162, 297836834, 295642767, 291590821, 288053825, 287051329, 287409002, 286960342, 285056813, 282687325, 280913927, 279758219, 278884348, 278047012, 277484876, 277682432, 278130770, 278194763, 278721096, 280679619, 283650307, 286501487, 288608382, 290504027, 292477710, 293687847, 293252681, 290508683, 285823076, 281836219, 280494468, 281156108, 282638649, 284329002, 285519079]
31024B85519079J56150n68856n12114K41791J221050J667102K162731K366274
31016B92253207J673105L25387q98811j151346q65418j7391O10472M41016J65035
31007B92535256o23137j852039k644243k224830m55712J411849K008279J298035
30999B89453458N86729J043136J340984k41112j964965j645110K848O51088l59184
30990B88867872j091961j97561J178692M72749j282043j615919j595745k358556
30982B82377528l111765k164036j76052J000834J299234J617316J409231O18600
30974B82870890P74831J644470K349280K269684J739044J367647R70154K68079
30966B94254079o57872j175727j252077k76548J164335O17188j534391k580776
$$ y = [285519079, 285675229, 285106373, 284594259, 284836050, 286057100, 287724202, 289886933, 292253207, 293926312, 294251699, 293352888, 292201542, 291336124, 291318733, 291929205, 292370221, 292535256, 291912119, 290060080, 287415837, 285191007, 284735295, 286147144, 288155423, 289453458, 290040187, 291083323, 292424307, 292183195, 290218230, 288573120, 288575968, 289227056, 288867872, 287775911, 287578350, 288757042, 289229791, 287947748, 286331829, 284736084, 282377528, 279265763, 277101727, 276925675, 277926509, 279225743, 280843059, 282252290, 282870890, 283645721, 285290191, 287639471, 289909155, 291648199, 293015846, 293986000, 294254079, 293596207, 292420480, 291168403, 290891855, 292056190, 292673378, 291138987, 288558211]
30958B88558211k267162j274296k70216N41517J405705J820736J405285K60527
30950B90180307j071839j600484j315423j018631p12369l98139K48241J092551
30942B85404214J93922j640916j478452J58305J153590J244909J008796J97645
30934B86242013k03857J107067K395148K377859J580939K02156j084780j516023
30926B91100522j878589k466894k351164j065380J36390N40226J220112K003997
30918B87239220K963779L187460J611462n81327j750939j149927N41874J929590
30910B93991192K171747R24072j063151k911702l449819k440277l30696J833731
30902B88725097J765425r6285j298540j308553l20113P76222M90502n78445p61761
$$ y = [288558211, 286291049, 285016753, 284746537, 285288054, 286693759, 288514495, 289919780, 290180307, 289108468, 287507984, 286192561, 285173930, 284461561, 284063422, 284311663, 285404214, 285598136, 283957220, 282478768, 282637073, 283790663, 285035572, 286044368, 286242013, 286038156, 287145223, 289540371, 291918230, 293499169, 293701325, 292616545, 291100522, 289221933, 286755039, 284403875, 283338495, 283474885, 284015111, 285235223, 287239220, 290202999, 293390459, 295001921, 294420594, 292669655, 291519728, 292061602, 293991192, 296162939, 297087011, 296023860, 293112158, 289662339, 287222062, 286891366, 288725097, 290490522, 290394237, 289095697, 287787144, 287467031, 288243253, 288733755, 288155310, 287393549]
30893B87393549N47876J936151K293200J823666O26378m66166m77178L17096J071158
30884B95065730P98336o82539k308879k935553k440998j201121K08915O26795
30876B87130686L40295N34859Q38486K97210n59882j315258j632675j233670r56230
30867B83443821j436839j806509j635456j028595p4147L01875K93199J112117
30859B79169466K043379J695620O34814N63237J467171K477443L808492M398060
30851B96257682K386834r01904k225445j707114p25209K73633Q66025L14396m82692
30842B94056206m01113L44267J47388k109583m531631m471211k410612J98971
30834B80822682K079936K128394M24708r29726n86924M89079R32746R46678J899747
$$ y = [287393549, 287941425, 289877576, 292170776, 293994442, 294620820, 294154654, 293677476, 293994572, 295065730, 295864066, 295181527, 292872648, 289937095, 287496097, 286294976, 286503891, 287130686, 287470981, 288005840, 288844326, 289141536, 288581654, 287266396, 285633721, 284400051, 283443821, 282006982, 280200473, 278565017, 277536422, 277462275, 277764150, 278057349, 279169466, 281212845, 282908465, 283543279, 284106516, 285573687, 288051130, 291859622, 296257682, 298644516, 297742612, 295517167, 293810053, 293084844, 293358477, 294224502, 294538898, 294056206, 293655093, 293999360, 294146748, 292037165, 287505534, 283034323, 280623711, 280822682, 282902618, 285031012, 285455720, 284525994, 283939070, 284428149, 285360895, 286307573, 288207320]
30825B88207320K757873K235995J183211N21539k21912j043963j486113r96818
30817B91157132l20854m90970j034213j565175j220318N81205K197219K023336
30809B91327362J185793O52110K8486m99514n37625p02585r18077p21679m16676
30800B89397595Q1086R15323Q52817k03758o91565l60771o32027j759012j995395
30791B85604293o18011J755459L941775M850074M398615K631707J72230j529942
30783C01206200k605935k992222k194761o96637k97057j508733k881938l542169
30775B84486748l082748k251562j989996j811820j021527m0449J87977L82202
30767B74858825J385172J879680K024351J630251M24203o60353p40212K5848L07049
$$ y = [288207320, 290965193, 293201188, 294384399, 294905938, 294684026, 293640063, 292153950, 291157132, 290836278, 290345308, 289311095, 287745920, 286525602, 287106807, 289304026, 291327362, 292513155, 293165265, 293193751, 292694237, 292156612, 291454027, 290535950, 289814271, 289397595, 289478681, 290394004, 291246821, 291043063, 290351498, 289990727, 289358700, 287599688, 285604293, 284986282, 286741741, 290683516, 295533590, 299932205, 302563912, 302736142, 301206200, 298600265, 295608043, 293413282, 292716645, 292419588, 290910855, 288028917, 284486748, 281404000, 279152438, 277162442, 275350622, 274329095, 274288646, 274476623, 274858825, 276243997, 278123677, 280148028, 281778279, 282202482, 281542129, 280801917, 280827765, 281134814]
30758B81134814Q7539n4838j97318k22731M89721J164600J632438K403145K662830
30749B89100200J624744L37926J23129Q60368O18965r09646k123015k770633k167895
30740B84694143M1690J843469J650548P33608N88872J675211L170803L126394
30732B97524738K067745J836758J819229P34528n77227j350522j821217j703215
30724B98530817j002609r25186j799737k761945k513641j081080J09197M35938
30716B88991754N85613J171435J413774J247367J102595P68044j25769j417036
30708B93737777j623120l15107o2977j418967j501004m06501m26467j148668j339316
30699B85495650k09954Q26788N91174J36899J38846N45262K032550L325554K810442
$$ y = [281134814, 281222353, 281167515, 280970197, 280747466, 281237187, 282401787, 284034225, 286437370, 289100200, 290724944, 291062870, 291185999, 292046367, 292665332, 291755686, 289632671, 286862038, 284694143, 284735833, 286579302, 288229850, 288963458, 289552330, 291227541, 294398344, 297524738, 299592483, 301429241, 303248470, 303982998, 303405771, 302055249, 300234032, 298530817, 297528208, 296603022, 294803285, 292041340, 289527699, 288446619, 288555816, 288991754, 289577367, 290748802, 292162576, 293409943, 294512538, 295280582, 295154813, 293737777, 292114657, 291799550, 291736573, 290317606, 288816602, 288410101, 287983634, 286834966, 285495650, 285285696, 286112484, 286703658, 286840557, 286979403, 287524665, 289557215, 292882769, 295693211]
30690B95693211J815169M83048m95017j59951L96450L59098q390n13950q49771
30681B96719897q95081j132270j491459j046351k74278o24228k422156l870263
30673B84963811m281517l925954k572475m74020J570964K860557L174799K722774
30665B84038939K091539K189949L075951K772470Q24081o37753j482244k258896
30657B90614036k311940j900513j434064r54553r87092j267758j387968j567307
30649B78802841j736024q73708J271296K342696J259315j57094q82108j050696
30641B78976518o18827m19160o44328r29119j111108l19159J434570K027315J220919
30632B79617621R85621J470072J493693M42441p81815j13703J673320K284562
$$ y = [295693211, 297508380, 297991428, 297496411, 297336460, 297732910, 298092008, 298083618, 297569668, 296719897, 295824816, 294692546, 293201087, 292154736, 291880458, 291256230, 288834074, 284963811, 280682294, 276756340, 274183865, 273709845, 275280809, 278141366, 281316165, 284038939, 286130478, 288320427, 291396378, 294168848, 294992929, 294355176, 292872932, 290614036, 288302096, 286401583, 284967519, 284012966, 283025874, 281758116, 280370148, 278802841, 277066817, 276193109, 277464405, 279807101, 281066416, 280909322, 280027214, 278976518, 278357691, 277938531, 277294203, 276365084, 275253976, 274934817, 276369387, 278396702, 279617621, 280603242, 282073314, 283567007, 284009448, 283227633, 283113930, 284787250, 287071812]
30624B87071812J357335N8652n97849j88393Q15442J138842J05310r41980j050751
30615B87768420j387279k173780k596343j715891K35577J120581p1727j472423
30607B79707135j519358k44526J010257L88329q07054j382442j401874l20827
30599B75429640J548261K930510L256481K198337L96751o23364j000748r89722
30591B83146146m3878J196855J772622J729763J247223O4412j678039l141540
30583B84293564l547409k418449k6481J710685J792485J071812N43012L54302
30575B83773521L46459K60110M83543R32824K51675j208336j874149j741129j813082
30566B79411436k008476k027224j701909l90184J434331L204453M631975N101222
$$ y = [287071812, 288429147, 288487799, 287889950, 287701557, 288516999, 289655841, 289761151, 288819171, 287768420, 286381141, 284207361, 281611018, 279895127, 280130704, 281251285, 281179558, 279707135, 278187777, 277943251, 278953508, 279341837, 278534783, 277152341, 275750467, 275429640, 276977901, 279908411, 283164892, 285363229, 285759980, 285136616, 284135868, 283146146, 283102268, 284299123, 286071745, 287801508, 289048731, 289113143, 287435104, 284293564, 280746155, 278327706, 278301225, 280011910, 281804395, 282876207, 283419219, 283773521, 284119980, 284380090, 284863633, 285796457, 286048132, 284839796, 282965647, 281224518, 279411436, 277402960, 275375736, 273673827, 273283643, 274717974, 277922427, 282554402, 287655624]
30558B87655624M363228K848870R22042l55715p14035j791997l242766l068032
30550B86617219p26972J652456K694216K281065P84738p81654j411464j253857
30542B89855747r79797p43336q75707j159558q62964l2810Q09923M94193p78060
30533B85727631j746651j618900p88995q8224N03253Q54040O36781N49629K69002
30524B84297566l48829m61624J28781J242654K341628K574179J675868k71200
30516B91179023k111911l095015k810688j038900J272399K290393J528674J088654
30508B88302629R49169N78812R51652J388526Q96031j18646q83018n29170R24895
30499B92460880J991900J397567m93136j705018j436162j313908j993621k476374
$$ y = [287655624, 292018852, 294867722, 295789764, 295434049, 294720014, 292928017, 289685251, 286617219, 285890247, 287542703, 290236919, 292517984, 293302722, 292521068, 291109604, 289855747, 288875950, 288132614, 287256907, 286097349, 285234385, 285201575, 286011498, 286505691, 285727631, 283980980, 282362080, 281573085, 281484861, 281988114, 282842154, 283478935, 284028564, 284297566, 283948737, 283487113, 283615894, 284858548, 287200176, 289774355, 291450223, 291179023, 289067112, 285972097, 283161409, 282122509, 283394908, 285685301, 287213975, 288302629, 289251798, 289830610, 290782262, 292170788, 293066819, 292948173, 292065155, 291535985, 292460880, 294452780, 295850347, 295357211, 293652193, 292216031, 290902123, 288908502, 286432128]
30491B86432128k352708j886320p23624R68940J759065J268331P92693J030518
30483B87289023J455548J588023J214296K02884q46415j594329j718515k49686
30475B87340829K099105L066885K371105J404896r9797k341765l282425k125717
30467B88433116o77225n92016j791048l295657l999179k961339q92096M70936
30459B74695492R58754J750022K595060K267450Q73513m14226q39549m82140m41809
30450B80962567p5952J385944K927030K553369N87982n65363j014699j890970
30442B84869908k459576k649342l336274l650746k466724J63220J899351J727798
30434B74097615J478030J098249Q63915J790636K814017K298185P51979k56223
$$ y = [286432128, 284079420, 282193100, 281469476, 282438416, 284197481, 285465812, 286258505, 287289023, 288744571, 290332594, 291546890, 291749774, 290903359, 289309030, 287590515, 287340829, 289439934, 292506819, 294877924, 296282820, 296183023, 293841258, 290558833, 288433116, 287755891, 287163875, 285372827, 282077170, 278077991, 275116652, 274224556, 274695492, 275654246, 277404268, 279999328, 282266778, 283140291, 282726065, 281886516, 281404376, 280962567, 280886615, 282272559, 285199589, 287752958, 288340940, 287775577, 286760878, 284869908, 282410332, 279760990, 276424716, 272773970, 270307246, 270470466, 272369817, 274097615, 275575645, 276673894, 277537809, 279328445, 282142462, 284440647, 285192626, 284936403]
30426B84936403j384365k185146j238705L21964J411998J377319M41199k60522
30418B83420145m44688n63048q21677j298063j534691j155280q41283n83745P43865
30409B76921535K778415M437259M327072J883658o08054j727391j802383j410663
30401B84799448q44845o02852p62041j515176j781183r00442j17800j33435o73247
30392B77468427n62460P86391K110384K348247J454078M55109J43675J3224m65496
30383B83751579p94214j470343k396715k233577j843922k605457l129350k778892
30375B66499109j695387Q47695K770316K255726J256639J004120J016043R10720
30367B74864981O36154P92099J326694J628161J505380O86994n32055j605490
$$ y = [284936403, 283552038, 281366892, 280128187, 280450151, 281862149, 283239468, 283680667, 283420145, 282975457, 282412409, 281590732, 280292669, 278757978, 277602698, 276761415, 276177670, 276921535, 279699950, 284137209, 288464281, 290347939, 289739885, 288012494, 286210111, 284799448, 283954603, 283351751, 282589710, 281074534, 279293351, 278392909, 278275109, 278141674, 277468427, 276905967, 277692358, 279802742, 282150989, 283605067, 284060176, 284203851, 284217075, 283751579, 282957365, 281487022, 279090307, 276856730, 275012808, 272407351, 269278001, 266499109, 264803722, 265651417, 268421733, 270677459, 271934098, 272938218, 273954261, 274864981, 275501135, 276293234, 277619928, 279248089, 280753469, 281440463, 280908408, 279302918]
30359B79302918k080635r70272J181773J769281J18867j591309j172907P68482
30351B77326198J907939J27256k306272j718789J017877K788506L322713L183389
30343B85648817K159301L56860j221500j244219n55113p43201j185539l62773
30335B82852633M37864j01200o6494J273729J790379Q33459L4326k46269m63023
30326B86345404p1022J069274K079065K414946J895714Q00574m63512j845447
30318B92224996k522883j615203O64613K369850K485867J183122n36320q83857
30310B93370185j99035m8017p03432j525684k556364l444650l350903j952369
30302B79589731l81125M17048Q11005J048609J162154Q31135N64151M64475K66359
$$ y = [279302918, 277222283, 276252011, 277433784, 279203065, 279321932, 277730623, 276557716, 277326198, 279234137, 279361393, 277055121, 275336332, 276354209, 279142715, 282465428, 285648817, 287808118, 288164978, 286943478, 285699259, 285144146, 284400945, 283215406, 282852633, 283290497, 283189297, 283122803, 284396532, 286186911, 287020370, 287054696, 286808427, 286345404, 286274382, 287343656, 289422721, 291837667, 293733381, 294533955, 294070443, 292224996, 289702113, 288086910, 288751523, 291121373, 293607240, 294790362, 294254042, 293370185, 293171150, 293123133, 292419701, 290894017, 288337653, 284893003, 281542100, 279589731, 279208606, 279625654, 280436659, 281485268, 282647422, 283478557, 284042708, 284507183, 284773542]
30293B84773542n25595j617972j215022L02N70672J128577J822854K236064K377533
30284B89550955K020690J662541J014795k55032j348680j527984r86000m18012
30276B89713273L12960J402149J575630M11179j1282N15679L97984o02927j940014
30267B91774631l076506l661308l235832k211742j658449j026910j51790N67245
30259B77319339K69499O9865J178054J583631P61839p1384L07819J626440K583840
30250B85628942K575139K660187L937439M863861L100736o66877k941110l114015
30242B96044302k677407k407162k302920k164856k087390k571951k446428o21731
30234B78764457J259862J512099J81916q49075j220414j601338j774869j950132
$$ y = [284773542, 284247947, 282629975, 281414953, 281415255, 281985927, 283114504, 284937358, 287173422, 289550955, 291571645, 293234186, 294248981, 293993949, 292645269, 291117285, 290131285, 289713273, 290026233, 291428382, 293004012, 293415191, 293403909, 293919588, 294317572, 293714645, 291774631, 288698125, 285036817, 281800985, 279589243, 277930794, 276903884, 276752094, 277319339, 277588838, 277658703, 278836757, 280420388, 281182227, 281110843, 281418662, 283045102, 285628942, 288204081, 290864268, 294801707, 299665568, 302766304, 302099427, 299158317, 296044302, 293366895, 290959733, 288656813, 286491957, 284404567, 281832616, 279386188, 278764457, 280024319, 281536418, 281718334, 280869259, 279648845, 278047507, 276272638, 274322506]
30226B74322506k286029k550139j925302k3639J753354K191578K091579J800230
30218B75374138J017262J89370K31747J300925K483739K706008J539111l01697
30210B84540603j742870k321806k062903j942460j972479j730942p36573R80907
30202B73011477J947616R47413j520748l776961m044448k578491o78045K51508
30194B63559321R37101K662622M080293M405886M010363K395971J48525j021837
30186B81178245o78416K66865P52105J071534J047763l72042k474106k893192
30178B77898756n83196K412794L152112J599599J58869K40592Q58168J371836
30170B87109530J317835P88432P76516O90911K10974K75272P86526J492783J975855
$$ y = [274322506, 272036477, 269486338, 267561036, 267537397, 269290751, 271482329, 273573908, 275374138, 276391400, 276580770, 276812517, 278113442, 280597181, 283303189, 284842300, 284540603, 282797733, 280475927, 278413024, 276470564, 274498085, 272767143, 272030570, 273011477, 274959093, 275906506, 274385758, 270608797, 266564349, 263985858, 263307813, 263559321, 264496422, 267159044, 271239337, 275645223, 279655586, 282051557, 282200082, 281178245, 280499829, 280766694, 281518799, 282590333, 283638096, 283266054, 280791948, 277898756, 277315560, 279728354, 282880466, 284480065, 284638934, 284879526, 285737694, 287109530, 288427365, 289215797, 289992313, 290683224, 290894198, 291169470, 291955996, 293448779, 295424634]
30161B95424634K169757J546219n41949k103722k482149k403426j960019o37435
30153B89011910J157447J921861J572002L27478j060577j775375j280977l0742
30145B89843027M64081M91850L79173l71644k88509J321129K423318J383759o57038
30136B94989146j807383k424744k616128j630185K106J055962J582482J715587
30128B90866843Q92634j00670p04281q20488l71501o84635j802560k326414j826288
30119B83122640j130937j161653j427618j436294j632227j309731L526M88996
30111B75516702L21848O58919J877043L343189L675025L136051K343115J228045
30103B92099937L19676O84158J528443J738773Q07073m07517n85052j59139K7950
$$ y = [295424634, 297594391, 299140610, 298598661, 296494939, 294012790, 291609364, 289649345, 289011910, 290169357, 292091218, 293663220, 293990698, 292930121, 291154746, 289873769, 289843027, 290307108, 290798958, 291178131, 290806487, 290517978, 291839107, 294262425, 295646184, 294989146, 293181763, 290757019, 288140891, 286510706, 286512812, 287568774, 289151256, 290866843, 291759477, 291658807, 290954526, 290134038, 289762537, 289077902, 287275342, 284948928, 283122640, 281991703, 280830050, 279402432, 277966138, 276333911, 275024180, 275027706, 275516702, 275838550, 276497469, 278374512, 281717701, 285392726, 288528777, 290871892, 292099937, 292419613, 293103771, 294632214, 296370987, 297178060, 296770543, 296185491, 296026352, 296054302]
30094B96054302m36350j406015j864734j101660J84686R73447P29470m95025j493876
30085B91144245k169195l553289l510657p00599K228452K757056J700308J046047
30077B88942368Q19713L51170J14751K97305L30362K63749L20721O54124Q62023
30068B92956286N87723p03025k546458l193749k601419j019662J029663K186555
30060B86695914J732151J9302k122629l175371k360921j118595r67496q23704
30052B77878651N94155J527709j13101l089075m659038l227338n00034J304844
30044B69716773K299440K850507J683746o86041j473126m96899Q59634K141112
30036B76895146K323652P72187o13460p33053p93554j235380p30867Q28632J216444
$$ y = [296054302, 295617952, 294211937, 292347203, 291245543, 291430229, 292403676, 293133146, 292638121, 291144245, 288975050, 285421761, 281911104, 281210505, 283438957, 286196013, 287896321, 288942368, 289762081, 290113251, 290228002, 290525307, 290855669, 291119418, 291440139, 292094263, 292956286, 293544009, 292840984, 290294526, 287100777, 284499358, 283479696, 284509359, 286695914, 288428065, 288447367, 286324738, 283149367, 280788446, 279669851, 278702355, 277878651, 278472806, 280000515, 279887414, 276798339, 272139301, 268911963, 268411929, 269716773, 272016213, 274866720, 276550466, 275864425, 274391299, 273894400, 274754034, 276895146, 279218798, 279990985, 279377525, 278644472, 277850918, 276615538, 275884671, 276713303, 277929747]
30027B77929747L11354m34287n16638k68307q37603j771073j390238o2172Q00884
30018B73761667J018646R64550J114735J341082J074706r7953j836637k267530
30010B75073266r93311O79430J929185J796236O45224q24898k315497k106993
30002B73882642k7317J804188K228320J304183L65469J18017N10666J352448J175689
29993B82714305N0843M0653J260663J528394Q33372N84969J141910J463512J245966
29984B90864587J426202J945817J528287j23364j237069k062742l200738l291359
29976B85849621k399253p24356J995916M273991M708442L848124K792922J149185
29968C01494592j217079k637055k811172k865216k379877j604853m91722M31812
$$ y = [277929747, 278241101, 277806814, 277290176, 277021869, 276184266, 274413193, 273022955, 272960783, 273761667, 274780313, 275744863, 276859598, 278200680, 279275386, 279177433, 277340796, 275073266, 274079955, 274759385, 276688570, 278484806, 279130030, 278305132, 275989635, 273882642, 273855325, 275659513, 277887833, 279192016, 279557485, 279675502, 280186168, 281538616, 282714305, 282765148, 282805801, 284066464, 285594858, 286428230, 287013199, 288155109, 289618621, 290864587, 292290789, 294236606, 295764893, 295641529, 294404460, 292341718, 289140980, 285849621, 283450368, 282726012, 284721928, 288995919, 293704361, 297552485, 300345407, 301494592, 300277513, 297640458, 294829286, 291964070, 289584193, 287979340, 287487618, 287919430]
29960B87919430M39806q79898j822268r26146M41224N32533j24363M62383J932820
29951B87975521K962286L339519L053397J611597m47976j986481k410142j535334
29943B92562387q126J535595K196019J058994j371474l202524k922466j828172
29935B88020233j618833k294485l364965l427360k098584j127007r10169l30988
29927B72847842L50164P94888R48789P71039P34414J055663J615115J586244O85413
29918B81389571Q2462j83303m06760k97375q83850j772490r76651J208667K241350
29909B80401621R35900j447255k104386p50411J596513L106450K125261k58643
29901B83605050k119177k565350k219572j958714j503375l6049K420911M596768
$$ y = [287919430, 288359236, 287479338, 285657070, 284730924, 285172148, 285704681, 285580318, 286042701, 287975521, 290937807, 294277326, 297330723, 298942320, 298494344, 296507863, 294097721, 292562387, 292554261, 294089856, 296285875, 297344869, 295973395, 292770871, 289848405, 288020233, 286401400, 284106915, 280741950, 277314590, 275216006, 274088999, 273178830, 272847842, 273198006, 273992894, 274941683, 275712722, 276447136, 277502799, 279117914, 280704158, 281389571, 281472033, 281288730, 280881970, 280584595, 279700745, 277928255, 276951604, 278160271, 280401621, 281337521, 279890266, 277785880, 277035469, 278631982, 281738432, 283863693, 283605050, 281485873, 278920523, 276700951, 274742237, 273238862, 273202813, 275623724, 280220492]
29893B80220492N528619N066426L148675J278963Q10336J171341O31443r18530
29885B96937765j937568j362200J14448M92595p02366j965033k529994k792219
29877B86255428k642780k419126k439575j651243J49046J465555J918828J459664
29869B82095797M31167K57227Q25204J008826J040815Q80492M48859o16694j761904
29860B84609789j925593j580856j445848j687298j598719j767500k207096j430874
29852B70966005L16299J399172P29521p87648j246680j59970J088088J953030
29844B74257817K416850J968187J343180J626432K476070K300997Q69937k75946
29836B86983524p72061n65052N43695J289809J343098J639219J213826j448347
$$ y = [280220492, 285749111, 290815537, 293964212, 295243175, 296053511, 297224852, 297856295, 296937765, 295000197, 293637997, 293752445, 294245040, 293542674, 291577641, 289047647, 286255428, 283612648, 281193522, 278753947, 277102704, 277251750, 278717305, 280636133, 282095797, 282526964, 282784191, 283609395, 284618221, 285659036, 286539528, 286988387, 286371693, 284609789, 282684196, 281103340, 279657492, 277970194, 276371475, 274603975, 272396879, 270966005, 271282304, 272681476, 273410997, 272623349, 271376669, 271216699, 272304787, 274257817, 276674667, 278642854, 279986034, 281612466, 284088536, 286389533, 287259470, 286983524, 286211463, 285646411, 286190106, 287479915, 288823013, 290462232, 291676058, 290227711]
29828B90227711m085796m535159l175563r75013N03098Q88282J103793J389212
29820B81340565J752361J470779K20509r61922j462819j370543j274604j995219
29812B77719107k240132q43935J93248k80318r71797p17984O76851K248347K985275
29803B78768662K595350R08232M3147K82417K52429Q44560K139734K858318K255150
29794B90947999R91973M18579N79096L27006j025748k406810k607057k021175
29786B85203863j147503l33981P21236J750737J805048J303694J067265Q65337
29778B91235696Q29108J028525Q89090O5511q47915m85936J031242J667388N14840
29769B95927549j309232k497357k810601k622969j306021P62619K014529J760743
$$ y = [290227711, 286141915, 281606756, 278431193, 277456180, 277959278, 278847560, 279951353, 281340565, 283092926, 284563705, 284784214, 283822292, 282359473, 280988930, 279714326, 277719107, 275478975, 274635040, 274828288, 274547970, 273576173, 272858189, 273535040, 275783387, 278768662, 281364012, 282272244, 282315391, 282597808, 282850237, 283694797, 285834531, 288692849, 290947999, 291939972, 292358551, 292937647, 293264653, 292238905, 289832095, 287225038, 285203863, 284056360, 283722379, 284443615, 286194352, 287999400, 289303094, 290370359, 291235696, 292064804, 293093329, 293982419, 294047930, 293200015, 292714079, 293745321, 295412709, 295927549, 294618317, 292120960, 289310359, 286687390, 285381369, 286143988, 288158517, 289919260]
29761B89919260Q43100J25768l00908n24692q88474j657831k471057k098526l86478
29752B82560162J80245q31203j450508r51790p24706p56681o04073m1366J074811
29743B78454891J615595J484403J397884J196804L86461n27839p87521r29660
29735B82291018q21985m73353m12081K78963J168147P04635j72447l76578L95164
29726B82581483J554036J560941M54430l79794l77569j15926L75823j01896j568145
29717B83983383k019189j323941q50656r58060k70196J300195J692187M61996
29709B82015719p20722p74024j208919k893141m873857m788325j953912P76870
29701B65579689J519214J604371J700069R93149R37261K512971L890121L620396
$$ y = [289919260, 290762360, 290888128, 290587220, 290062528, 289174054, 287516223, 285045166, 282946640, 282560162, 282740407, 281909204, 280458696, 279506906, 278782200, 278025519, 277421446, 277380080, 278454891, 280070486, 281554889, 282952773, 284149577, 284536038, 284008199, 283220678, 282291018, 281469033, 280995680, 280583599, 280862562, 282030709, 282735344, 282562897, 282186319, 282581483, 284135519, 285696460, 286150890, 285771096, 285393527, 285277601, 285653424, 285551528, 283983383, 281964194, 280640253, 279789597, 278831537, 278561341, 279861536, 281553723, 282015719, 281294997, 280520973, 279312054, 276418913, 271545056, 266756731, 264802819, 265579689, 267098903, 268703274, 270403343, 271396492, 272333753, 274846724, 278736845, 282357241]
29693B82357241K346760J131035l35198k421359l307162k081301m87036J90596
29685B77393576Q10607K023054K301331J210738N43457R07954J335033J231106
29677B87756856M50012j026139k985207l891553l676426l187766k669385j601918
29669B69168474k63486K37346P77088J282230J213359J034679J119354K94820
29661B74863864j532359k355343j645398l40634R13496J954888K117096J345631
29653B75321241J180683K299587K658454Q76076j348201k837122l381633k441593
29645B72327492J8083K473726L576232K649563K34995j764148k937613l028636
29637B73549694k005521p81451l32553m01220K79422J839281L081654K906152
$$ y = [282357241, 284704001, 285835036, 285499838, 283078479, 279771317, 277690016, 277202980, 277393576, 278204183, 280227237, 282528568, 283739306, 284282763, 285190717, 286525750, 287756856, 288206868, 287180729, 284195522, 280303969, 276627543, 273439777, 270770392, 269168474, 268904988, 269142334, 269919422, 271201652, 272415011, 273449690, 274569044, 274863864, 273331505, 270976162, 269330764, 268990130, 269903626, 271858514, 273975610, 275321241, 276501924, 278801511, 281459965, 282336041, 280987840, 278150718, 274769085, 272327492, 272345575, 274819301, 278395533, 281045096, 281280091, 279515943, 276578330, 273549694, 271544173, 270762722, 270430169, 270028949, 270308371, 272147652, 275229306, 278135458]
29629B78135458J730861Q65863J42989j162431l104967m657281m141458j241811
29621B66567223J565164K000931Q03897L58411J786421L736160L960659K688711
29613B83467577J046574n12643j240841j395706j467209q84732J25058Q69074
29605B80007152J164375R37288M61611k69561l30328O20900Q43093L65041P6867
29596B83876438N52649K120597K930191K194026J077586P0690r39268j171243
29588B90711666m90476k5369j25217o48456j378522j306702J74758J372335M87046
29579B88771063j268017k298610k116687r40781P2456P21474J070787Q64081J70875
29570B85046641o82333j154381j175037j452053j058606N07437J997661J638278
$$ y = [278135458, 279866319, 280732182, 280875171, 279712740, 276607773, 271950492, 267809034, 266567223, 268132387, 270133318, 270937215, 271295626, 273082047, 276818207, 280778866, 283467577, 284514151, 284001508, 282760667, 281364961, 279897752, 279013020, 279138078, 280007152, 281171527, 282108815, 282570426, 282300865, 281970537, 282591437, 283434530, 283799571, 283876438, 284429087, 286549684, 289479875, 291673901, 292751487, 292822177, 291882909, 290711666, 290221190, 290195821, 290070604, 289422148, 288043626, 286736924, 286911682, 288284017, 288771063, 287503046, 285204436, 283087749, 282146968, 282219424, 282940898, 284011685, 284875766, 285046641, 284364308, 283209927, 282034890, 280582837, 279524231, 280031668, 282029329, 283667607]
29562B83667607j258047l191316j971644j59902J66939J80478J128379K677646
29554B81240140L146104K582680K283270J436530l3994j298533k510126l134961
29546B83711110k798301k404161k031316j570836k8156K071966L348932L547869
$$ y = [283667607, 282409560, 279218244, 277246600, 277086698, 277253637, 277434115, 278562494, 281240140, 284386244, 286968924, 289252194, 290688724, 290654730, 289356197, 286846071, 283711110, 280912809, 278508648, 276477332, 274906496, 274878340, 276950306, 280299238, 283847107]
$$ [...]
##END NTUPLES=NMR SPECTRUM
##END=
