##TITLE=C13_DE-44EA3_D2O_b
 D2O, 25200 sc

 18.7.2024
##JCAMPDX= 6.0         $$ Bruker NMR JCAMP-DX V2.0
##DATA TYPE= NMR SPECTRUM
##DATA CLASS= NTUPLES
##ORIGIN= UXNMR, Bruker Analytische Messtechnik GmbH
##OWNER= root
$$ XWIN-NMR		Version 3.5
$$ Fri Jul 19 13:40:27 2024 Russian Standard Time (UT+4h)  she@DPX200
##.OBSERVE FREQUENCY= 50.327896
##.OBSERVE NUCLEUS= ^13C
##.ACQUISITION MODE= SIMULTANEOUS
##.ACQUISITION SCHEME= undefined
##.AVERAGES= 25201
##.DIGITISER RES= 17
##SPECTROMETER/DATA SYSTEM= spect
##.PULSE SEQUENCE= zgpg30
##.SOLVENT NAME= D2O
##.SHIFT REFERENCE= (INTERNAL, D2O, 0, 222.565)
##AUDIT TRAIL= $$ (NUMBER, WHEN, WHO, WHERE, WHAT)
$$ ##TITLE= Audit trail, XWIN-NMR		Version 3.5
$$ ##JCAMPDX= 5.01
$$ ##ORIGIN= Bruker BioSpin GmbH
$$ ##OWNER= she
$$ F:/spectra/data/she/nmr/c13/1/pdata/1/auditp.txt
$$ ##AUDIT TRAIL=  $$ (NUMBER, WHEN, WHO, WHERE, WHAT)
(   1,<2024-07-19 13:38:23.25 +0400>,<she>,<DPX200>,
      <created by zg, POWCHK disabled, PULCHK disabled
       terminated by command 'halt'
       configuration hash MD5:
       00 E9 B6 7A A2 85 ED C7 34 08 36 98 17 FE 4E 26
       data hash MD5: 32K
       47 95 33 75 F1 86 F0 5F FC 5E 4F 5C 29 6A 1F 94>)
(   2,<2024-07-19 13:38:25.87 +0400>,<she>,<DPX200>,
      <Start of raw data processing
       efp BC_mod = 2 LB = 2 FT_mod = 6 PKNL = 1 PHC0 = -531.8419 PHC1 = 33.98844 SI = 32K 
       data hash MD5: 32K
       74 FD BF 80 E9 9D C4 2D 2A 50 AB 6C 15 BF 2D 03>)
(   3,<2024-07-19 13:38:29.03 +0400>,<she>,<DPX200>,
      <abs ABSG = 5 
       data hash MD5: 32K
       E8 D9 81 F4 E8 F9 B4 79 EC 8E 08 FC 89 A7 21 07>)
(   4,<2024-07-19 13:39:27.43 +0400>,<she>,<DPX200>,
      <abs ABSG = 5 
       data hash MD5: 32K
       A1 B3 18 A6 E2 5E A1 CC D2 F2 E3 B3 C2 99 A7 70>)
(   5,<2024-07-19 13:39:45.54 +0400>,<she>,<DPX200>,
      <pk PHC0 = 1.112102 PHC1 = -32.40001 
       data hash MD5: 32K
       A2 5D 70 C5 B0 0F CC FE F8 70 6E DF 0D F9 78 4C>)
(   6,<2024-07-19 13:39:49.29 +0400>,<she>,<DPX200>,
      <abs ABSG = 5 
       data hash MD5: 32K
       F4 F9 81 5C 9B EB 9E 0A 49 A9 2E 28 91 E9 D4 0F>)
$$ ##END=
$$ 
$$ hash MD5
$$ E9 89 0E 85 FB E7 21 08 5C ED BC BD 6F 13 33 97
##$RELAX= 
##$RELAX= 
##$RELAX= 
##$RELAX= 
##$RELAX= 
##$RELAX= 
##$RELAX= 
##$RELAX= 
$$ Bruker specific parameters
$$ --------------------------
##$DU= <F:/spectra>
##$EXPNO= 1
##$NAME= <c13>
##$PROCNO= 1
##$TYPE= <nmr>
##$USER= <she>
##$AMP= (0..31)
100 100 100 100 100 100 100 100 100 100 100 100 100 100 100 100 100 100 
100 100 100 100 100 100 100 100 100 100 100 100 100 100 
##$AQSEQ= 0
##$AQ_mod= 1
##$AUNM= <au_zg>
##$AUTOPOS= <>
##$BF1= 50.322709
##$BF2= 200.13
##$BF3= 50.322709
##$BF4= 500.13
##$BF5= 500.13
##$BF6= 500.13
##$BF7= 500.13
##$BF8= 500.13
##$BYTORDA= 1
##$CFDGTYP= 0
##$CFRGTYP= 5
##$CHEMSTR= <none>
##$CNST= (0..31)
1 1 145 1 1 1 1 1 1 1 1 1 1 1 1 1 1 1 1 1 1 1 1 1 1 1 1 1 1 1 1 1 
##$CPDPRG= <waltz16>
##$CPDPRG1= <>
##$CPDPRG2= <waltz16>
##$CPDPRG3= <>
##$CPDPRG4= <mlev>
$$ [...]
##$SUBNAM4= <"">
##$SUBNAM5= <"">
##$SUBNAM6= <"">
##$SUBNAM7= <"">
##$SUBNAM8= <"">
##$SUBNAM9= <"">
##$SW= 239.972175391363
##$SWIBOX= (0..15)
0 1 3 0 0 0 0 0 0 0 0 0 0 0 0 0 
##$SW_h= 12077.2946859903
##$TD= 32768
##$TD0= 1
##$TE= 0
##$TE2= 300
##$TE3= 300
##$TEG= 300
##$TL= (0..7)
120 120 120 120 120 120 120 120 
##$TP= (0..7)
150 150 150 150 150 150 150 150 
##$TP07= 0
##$TPNAME0= <>
##$TPNAME1= <>
##$TPNAME2= <>
##$TPNAME3= <>
##$TPNAME4= <>
##$TPNAME5= <>
##$TPNAME6= <>
##$TPNAME7= <>
##$TPOAL= (0..7)
0.5 0.5 0.5 0.5 0.5 0.5 0.5 0.5 
##$TPOFFS= (0..7)
0 0 0 0 0 0 0 0 
##$TUNHIN= 0
##$TUNHOUT= 0
##$TUNXOUT= 0
##$USERA1= <user>
##$USERA2= <user>
##$USERA3= <user>
##$USERA4= <user>
##$USERA5= <user>
##$V9= 5
##$VALIST= <valist>
##$VCLIST= <CCCCCCCCCCCCCCC>
##$VD= 0
##$VDLIST= <DDDDDDDDDDDDDDD>
##$VPLIST= <PPPPPPPPPPPPPPP>
##$VTLIST= <TTTTTTTTTTTTTTT>
##$WBST= 1024
##$WBSW= 4
##$XGAIN= (0..3)
0 0 0 0 
##$XL= 0
##$YL= 0
##$YMAX_a= 42661572
##$YMIN_a= -142697558
##$ZGOPTNS= <>
##$ZL1= 120
##$ZL2= 120
##$ZL3= 120
##$ZL4= 120
##$ABSF1= 222.5654
##$ABSF2= -17.4314
##$ABSG= 5
##$ABSL= 3
##$ALPHA= 0
##$AQORDER= 0
##$ASSFAC= 0
##$ASSFACI= 0
##$ASSFACX= 0
##$ASSWID= 0
##$AUNMP= <proc_1d>
##$AZFE= 0.1
##$AZFW= 0.5
##$BCFW= 0
##$BC_mod= 2
##$BYTORDP= 0
##$COROFFS= 0
##$CY= -3
##$DATMOD= 1
##$DC= 0
##$DFILT= <>
##$DTYPP= 0
##$F1P= 0
##$F2P= 0
##$FCOR= 0.5
##$FTSIZE= 32768
##$FT_mod= 6
##$GAMMA= 0
##$GB= 0
##$INTBC= 1
##$INTSCL= 4.134877e-10
##$ISEN= 128
##$LB= 2
##$LEV0= 0
##$LPBIN= 0
##$MAXI= 10000
##$MC2= 0
##$MEAN= 0
##$ME_mod= 0
##$MI= 0.1934396
##$NCOEF= 0
##$NC_proc= -2
##$NLEV= 6
##$NOISF1= 120.0001
##$NOISF2= 80.00006
##$NSP= 0
##$NTH_PI= 0
##$NZP= 0
##$OFFSET= 222.5654
##$PC= 1.4
##$PHC0= -530.7298
##$PHC1= 1.588432
##$PH_mod= 1
##$PKNL= yes
##$PPARMOD= 0
##$PSCAL= 0
##$PSIGN= 0
##$REVERSE= no
##$SF= 50.3227345484362
##$SI= 32768
##$SIGF1= 140
##$SIGF2= 120
##$SINO= 11.81781
##$SIOLD= 32768
##$SREGLST= <13C.CDCl3>
##$SSB= 0
##$STSI= 32768
##$STSR= 0
##$SW_p= 12077.2946859903
##$SYMM= 0
##$S_DEV= 0
##$TDeff= 32768
##$TDoff= 0
##$TI= <>
##$TILT= no
##$TM1= 0
##$TM2= 0
##$TOPLEV= 0
##$USERP1= <user>
##$USERP2= <user>
##$USERP3= <user>
##$USERP4= <user>
##$USERP5= <user>
##$WDW= 1
##$XDIM= 32768
##$YMAX_p= 81067815
##$YMIN_p= -31948598
$$ End of Bruker specific parameters
$$ ---------------------------------
##NTUPLES= NMR SPECTRUM
##VAR_NAME=  FREQUENCY,     SPECTRUM/REAL,   SPECTRUM/IMAG
##SYMBOL=    X,             R,               I
##VAR_TYPE=  INDEPENDENT,   DEPENDENT,       DEPENDENT
##VAR_FORM=  AFFN,          ASDF,            ASDF
##VAR_DIM=   32768,         32768,           32768
##UNITS=     HZ,            ARBITRARY UNITS, ARBITRARY UNITS
##FACTOR=    0.368581032318806, 1,           1
##FIRST=     11200.0995020947, 0,            0
##LAST=      -877.195183895579, 0,           0
##MIN=       -877.195183895579, -31948598,   0
##MAX=       11200.0995020947, 81067815,     0
$$ Real data points
##PAGE= N=1
##DATA TABLE= (X++(R..R)), XYDATA
$$ [...]
3281 -11926101 -7845648 -3442664 -1046542 -1301372 -1914612 -847022 332174 -797143
3273 -797143 -4416229 -8858241 -12401126 -14157621 -14811997 -15403481 -15922977 -16341215 -17142228
3264 -17142228 -18464745 -19570479 -19930123 -19427033 -17835105 -13941081 -7834685 -1953885
3256 -1953885 1772501 3707813 4598429 4780701 5076318 5752973 6974251 9318668 12411053
3247 12411053 14803716 15190238 13357904 10390186 8037361 6864849 6511424 5967860 3785867
3238 3785867 -50625 -4849101 -9407718 -11606712 -10426288 -6964545 -3357486 -2134699
3230 -2134699 -3313655 -4847948 -5435757 -4558789 -2347122 373430 3011224 4520142 4230358
3221 4230358 2931594 1946227 1761466 1759519 1317613 526460 -1016686 -2853490 -3749981
3212 -3749981 -3899477 -4026768 -3845645 -3631403 -4423297 -5698398 -6610565 -7158714 -7577080
3203 -7577080 -8164356 -8853181 -9609442 -9987158 -8604422 -4974486 -324325 3694743 6163744
3194 6163744 7088498 7308116 7564997 8068619 8632678 8958984 9187160 9274748 9098955 8244924
3184 8244924 6257183 3366704 652888 -329433 299919 2171394 5262396 8456341 10011928
3175 10011928 9808607 9575457 10298069 11524439 11532870 8779656 3938534 -846958 -4526810
3166 -4526810 -7339003 -9491529 -11666975 -13753412 -15012986 -15954432 -17546985 -19063618
3158 -19063618 -19039931 -18225438 -17679100 -16582440 -14045195 -10697921 -8233951 -8197338 -10355042
3149 -10355042 -12058622 -10706727 -6611240 -2342442 32148 10322 -1901456 -4407131
3141 -4407131 -6982562 -9448850 -11252231 -11999772 -11751504 -10974610 -9531445 -7920123 -7158965
3132 -7158965 -7146101 -7042714 -6568296 -6019706 -5857862 -5816115 -5718976 -5230556 -3378856 -848160
3122 -848160 397909 -108773 -1511129 -3100696 -4710285 -6803993 -9851613 -12599311 -13043552
3113 -13043552 -10599231 -6024727 -344022 4849242 7738099 8026107 6657874 4457239
3105 4457239 2662635 1948932 1405007 740068 266766 -807172 -2812805 -4274243 -4662403
3096 -4662403 -4620746 -3954599 -3144065 -2960328 -3263468 -4100808 -5999179 -8087199 -8473790
3087 -8473790 -6807273 -4365762 -2029654 596504 3262532 5324230 7344936 9920919
3079 9920919 12645563 14497166 15078863 14727934 14041123 13341652 12557920 11760305 10871262
3070 10871262 9969514 8800985 7431852 6564296 6555736 7466311 8700918 9774316 10168337
3061 10168337 10450665 11297879 11701577 10989475 9420578 7526791 6455385 6761255 6320766
3052 6320766 3884647 794281 -803434 -166788 1859697 4214828 6353592 7698067
3044 7698067 7430129 5358712 2586205 -332847 -3908776 -7386124 -9556869 -9953301 -9325086
3035 -9325086 -8965716 -8486064 -8011287 -8180757 -8191228 -7731622 -7487832 -8092946 -9770386 -11529670
3025 -11529670 -11677786 -10164260 -8318378 -5903201 -2054151 2185639 5035772 5476741
3017 5476741 3934558 1690991 -668414 -2566519 -3030579 -2380358 -2416630 -4776182 -9030622
3008 -9030622 -13594962 -16484414 -16583408 -14780102 -12142507 -9667399 -8668920 -9307062 -9653679
2999 -9653679 -8652575 -7597292 -7773085 -8596014 -9352867 -9805740 -9414428 -8433043 -8012908
2990 -8012908 -8458031 -9275560 -9546011 -8089028 -5033751 -2086203 -58798 1032129 1462727
2981 1462727 1738519 1428780 485453 512341 2056144 3368823 2959859 1082583 -576590
2972 -576590 -457900 2493380 6895789 10118451 11411534 11254099 9772976 7819413 6860761
2963 6860761 6919779 6648453 5271370 2833630 -52422 -2530767 -3819045 -4367793 -5781215
2954 -5781215 -7952367 -8638443 -6506181 -3511799 -2538012 -2909440 -2217658 -888228 -377318
2945 -377318 -1450936 -4548183 -8851226 -12694931 -14612363 -14531055 -13906002 -13458519 -12171624
2936 -12171624 -9630834 -6919971 -4488835 -1643333 1154581 3582763 5220701 5233937
2928 5233937 4494921 4249993 4269492 3695485 1709827 -1981268 -6283737 -9686200 -11579664
2919 -11579664 -12145278 -11557621 -10359037 -9149416 -7492013 -5127270 -2392192 117871
2911 117871 1820789 2925557 3423973 1985156 -2266059 -7719517 -12477714 -16014389 -17929429
2902 -17929429 -17902718 -16485362 -14940202 -14188392 -13823514 -13413786 -13419521 -13460069 -12477729 -9864231
2892 -9864231 -6336391 -3454068 -2079614 -1634287 -892519 -36352 -554248 -2956955 -6471923
2883 -6471923 -9993849 -12316215 -13533501 -14417453 -14461900 -13373635 -12158652 -11377638 -10080913
2874 -10080913 -7595806 -4734552 -2086474 -331473 546049 1774298 3716928 5215675
2866 5215675 5471078 4398377 2945696 1223814 -1406482 -3362286 -3289184 -2611500 -2620940
2857 -2620940 -3099848 -3024513 -2443495 -2529925 -3308820 -3874627 -3824967 -3706037 -4131431 -5422910
2847 -5422910 -7843378 -11917167 -17966410 -24274024 -28094120 -28498825 -26040759 -20832095
2839 -20832095 -13954455 -7924940 -3862404 -780302 1830497 2856852 1806486 -315744
2831 -315744 -2669299 -4271555 -4087766 -3120490 -2563532 -2277674 -1706765 -548713 382963
2822 382963 -169945 -2145150 -4759373 -7065356 -7957698 -7161131 -6191923 -6416471 -7182948
2813 -7182948 -7221246 -4887165 -261431 4361139 6942644 5862362 1462179 -3316855 -5915034
2804 -5915034 -6254456 -5722093 -5551656 -5659265 -5135020 -3628292 -2001051 -2405112 -5485527
2795 -5485527 -9063722 -10593048 -10032257 -8532051 -6865693 -5252233 -3418330 -1189522
2787 -1189522 1359513 2822159 1705842 -522326 -1478432 -688105 546396 1712524 3615533
2778 3615533 5274710 5885078 6220753 6857814 7609528 8596966 9261392 9189938 9610118 11450951
2768 11450951 13199893 13124493 11545901 8123548 2434542 -3649560 -7829602 -9259704
2760 -9259704 -7978774 -5081090 -2764425 -2164454 -2150074 -1239764 785116 3065418 5331094
2751 5331094 7508482 8889086 8354497 7164978 7437510 8084817 7485203 5957585 4290276
2742 4290276 3474066 3017712 1495951 -736078 -2334075 -3027627 -3636027 -4237172 -3759375
2733 -3759375 -2007593 -2748 1523501 3267953 5818296 7673242 8072062 7561729 6521468
2724 6521468 5140868 4513154 4794363 4146263 2323992 707236 -436067 -1009566 -353055
2715 -353055 987040 1736042 1066434 -874768 -2984988 -4849996 -6664133 -7240004 -5079226
2706 -5079226 -486133 4595689 8381718 10574481 11336988 11047903 9984563 7445745 3438938
2697 3438938 214262 -942993 -639453 -216087 -811619 -2645504 -5599497 -8275871 -8644211
2688 -8644211 -7145797 -5186867 -3346031 -1833942 -664288 -521245 -2737880 -6584187
2680 -6584187 -9860928 -11340105 -10899425 -8794171 -5219024 -1148159 1508134 1918496 2008270
2671 2008270 2973010 3657974 3689538 4233009 4677735 3161623 496993 -409412 575664
2662 575664 1005046 -477370 -4250808 -9049677 -12235647 -12089600 -9622649 -6533404 -3914186
2653 -3914186 -2804577 -2791280 -2037224 722531 4095766 6073247 6375730 5272556 3358019
2644 3358019 950444 -2138731 -4770595 -5278502 -3464606 -427461 2263924 3687362
2636 3687362 3724008 2280777 79302 -2005448 -2626749 -1457248 -557651 -1507263 -3270329
2627 -3270329 -4710545 -5597640 -5319605 -4469746 -4381445 -5536869 -6725077 -6689887 -5350114
2618 -5350114 -4420598 -5752495 -8180453 -9308374 -9231444 -9501529 -10812967 -13061316 -14695187
2609 -14695187 -13905488 -11568820 -9122954 -7546170 -7661954 -9249625 -10730591 -10639742 -9181175
2600 -9181175 -7711192 -6773714 -6140139 -5954367 -6122265 -6205303 -6392685 -6521549 -5603609 -3005249
2590 -3005249 535187 3208951 3712989 2668104 2116702 2424200 2892119 4196454 6315964
2581 6315964 7654276 8236660 8970369 8826517 7239358 5746905 4491334 2508312 202886
2572 202886 -1427217 -1593722 -680306 573138 1684838 2119464 1935519 2511408 3579915
2563 3579915 3596280 2884942 2268650 2397918 3031839 2755752 2401188 3060462 3064486 1381863
2553 1381863 -1332219 -4495278 -6589474 -5746483 -3086291 -1136411 -100979 545138 -341115
2544 -341115 -3066261 -5534352 -5907305 -4876956 -4441075 -4568564 -3724133 -2220313 -794209
2535 -794209 924767 3532434 6630944 9064764 10384859 10842031 9996603 7834645 5481978
2526 5481978 3482140 2148493 1715768 1755883 1376334 727436 966665 2520508 5044302
2517 5044302 7357109 8422343 8263758 6600780 3757797 1877643 2259898 4112063 6433080
2508 6433080 7810082 7387716 6191796 4565599 2951286 2748921 3678132 4370725 4379646
2499 4379646 3683966 2757169 1690020 -326952 -3674742 -7902525 -11987966 -14081348 -13265012
2490 -13265012 -10765134 -8427021 -7129311 -6310267 -5162939 -3847636 -3198772 -4211742
2482 -4211742 -6260188 -7748493 -8167230 -7098433 -3955104 -209025 2095551 2441951 2419149
2473 2419149 3444984 5510336 8749544 12441298 14906925 14986958 13160520 10895995 9272839
2464 9272839 7858465 5497729 3035578 2296560 3230177 4733607 6307313 6826503 6142946
2455 6142946 5794543 6305582 6979219 7330303 7714775 8871499 10293805 10722270 10690483
2446 10690483 12386724 15911671 19350879 21155124 20244256 16656059 11860061 8021934
2438 8021934 5939754 4789952 4029536 3993160 5236526 7425006 9816394 12199545 13858012
2429 13858012 14804020 15953129 17546904 18664785 18695936 17994724 17542550 17588760 17646808
2420 17646808 17605952 18521231 21102580 24049975 25540944 24967011 22840801 18623903 12173645
2411 12173645 5432490 893055 -415064 253178 940642 651792 -828547 -3708166 -7730245
2402 -7730245 -11550500 -12687001 -10099204 -5524307 -573005 4311214 8565432 11559129
2394 11559129 13315059 15050340 16777569 16686593 14614095 12181390 10360081 9339932
2386 9339932 9031998 9505473 10638047 11037596 10247154 9105452 7909519 6405629 5370556
2377 5370556 5033148 5017699 5379378 5545581 4901020 3399440 1926596 1895871 3670580
2368 3670580 5821943 6645577 6190221 4901026 3226428 2940899 5480494 9597935 12478491
2359 12478491 12459461 10210769 7526680 6235852 6981918 7526659 5044818 -472607 -6799266
2350 -6799266 -11628443 -13902046 -13655388 -10388967 -4097968 3016241 8203445 10508698
2342 10508698 11373185 11360933 9979118 7497591 4906265 2784649 1059383 -500042 -1301233
2333 -1301233 -350801 1714692 3776126 5499128 6726476 7527949 8265676 8658405 8115453
2324 8115453 6469310 4973916 4552008 3128754 -58367 -3023712 -4526402 -5023767 -4765603
2315 -4765603 -2907073 -354599 857464 377064 -808681 -2162518 -3519980 -4996697
2307 -4996697 -6706443 -7580558 -7213753 -6692241 -6578886 -5873472 -4452109 -3706863 -3415130
2298 -3415130 -2718297 -2564474 -2879325 -1764806 734582 2802046 3784080 4080135 3374492
2289 3374492 1216141 -1744969 -4701381 -6094134 -4378345 10776 5305491 9888779
2281 9888779 13252736 15999951 18503325 20686753 22491588 23036647 21954053 20011000
2273 20011000 17629947 14946548 12363701 10368189 8954328 7184150 4823264 2948483
2265 2948483 2312848 2210750 1463001 483971 -52745 53626 620615 341143 -1634944
2256 -1634944 -4511849 -7114559 -8347927 -7963758 -8062123 -10157896 -12932692 -14338541 -13112375
2247 -13112375 -9817372 -7058376 -6602699 -7782692 -9803537 -12829815 -15239650 -15399219
2239 -15399219 -13730512 -11449606 -9222868 -7189331 -5571706 -4366942 -3670163 -4397042
2231 -4397042 -6049295 -6393651 -4395964 -1964175 -1057424 -894383 -158891 1159207 2301862
2222 2301862 2600015 3208011 6055064 9958749 11633630 10087867 6827575 3192043 570049
2213 570049 36573 335357 38442 -544242 -786669 -907482 -605214 561263 2661532
2204 2661532 5122879 7030904 7419765 6064663 4363527 3997742 4870549 5747306 5700655
2195 5700655 4351547 1503685 -2026301 -4420529 -5205823 -5583401 -6290988 -5913532 -3248634
2186 -3248634 501143 3652429 5442833 5140566 2149771 -2409424 -6555126 -8947967
2178 -8947967 -9572323 -8692942 -6609901 -4689194 -4686433 -7014476 -9819182 -10802036 -10152446
2169 -10152446 -9710242 -9289244 -8648089 -9034787 -10229736 -9853660 -7525933 -4894932 -3177932
2160 -3177932 -2799783 -3461735 -4738776 -6133690 -6909828 -6439394 -4886166 -2943482 -1624625
2151 -1624625 -1710144 -2538669 -2624377 -1882258 -1513130 -1973680 -2428881 -1596213 1781816 7054269
2141 7054269 11286965 12723858 12133754 11271082 10218071 8131689 5292808 1657446 -2212351
2132 -2212351 -4325269 -3886844 -2795562 -2602217 -3337588 -3895960 -2844183 -571383 1057378
2123 1057378 685417 -1989396 -5848627 -8944786 -10816620 -12123738 -13500898 -14289814 -13513157
2114 -13513157 -11586160 -8756968 -4456424 66489 3424739 5725577 6731059 5681776
2106 5681776 2757279 -24803 -948995 -907493 -865241 -1019749 -2230861 -4408098 -6899439
2097 -6899439 -8982938 -9327452 -8061822 -6333215 -4163312 -2380656 -2257823 -2194426 -599689
2088 -599689 714144 -268428 -2988711 -5890777 -8575269 -11144852 -13326906 -15316995 -17206724
2079 -17206724 -17984360 -16991645 -14519051 -11462046 -8652061 -6189983 -4441992 -3800877 -4031365
2070 -4031365 -4417112 -4174803 -3305693 -2277254 -771629 1723999 4998827 7373582 7594585
2061 7594585 6477044 5246617 4375927 3683155 3168451 2430678 1681064 883146 -584735
2052 -584735 -2277665 -2945094 -2046876 -773725 -671268 -2270062 -4560490 -6944186 -9844884
2043 -9844884 -12328840 -12936244 -12243509 -12191642 -12696093 -12677175 -12450896 -13095123 -14956964 -16419538
2033 -16419538 -16755199 -16382506 -15262953 -13801180 -12188879 -10038840 -7488655 -4475287
2025 -4475287 30379 5670911 9827910 11716615 12412866 13474948 16018398 19629604
2017 19629604 23175108 25807641 26207316 23573355 19449568 15057301 10738681 7183771
2009 7183771 4929159 3471057 2171543 1751609 2750027 4046390 4455895 3704889 1247316
2000 1247316 -2497615 -5166131 -4896542 -2143589 1216217 3149042 2556360 290415 -1171175
1991 -1171175 22993 2603717 4551692 5207031 4042732 1558746 -998759 -2696648
1983 -2696648 -3000031 -1971097 -402974 590090 912651 1534764 3226345 5537495 8060423
1974 8060423 10043064 10733063 11074866 11551580 11861752 11998202 11805189 10942687 9229649
1965 9229649 6855933 4598982 3450241 3864746 6005188 9242687 11817484 12608192 11320507
1956 11320507 9477442 9006906 10205288 11744479 12221774 12297243 12255194 10839070 8088637
1947 8088637 5620609 4341082 4561898 5152156 4334870 2158486 110647 -741782 -429578
1938 -429578 247001 1028437 1669841 1888323 2742046 3813760 4025318 5156807 8634359
1929 8634359 12340187 14039765 13010273 9777953 6038407 2482821 -913621 -3561063
1921 -3561063 -5169043 -5894953 -5079041 -2626969 -135618 433312 -594610 -1201935 -1486783
1912 -1486783 -3023649 -5686730 -7287222 -6456291 -4653306 -3925527 -4644911 -6076875 -6990917
1903 -6990917 -6419141 -4471300 -2464924 -1004454 527097 1703676 1882350 1596109 1227843
1894 1227843 1349198 2786532 4197551 3943754 2553546 1360993 195563 -1690525 -3763788
1885 -3763788 -4444028 -3900018 -3911892 -4347977 -4572696 -5332498 -7551386 -10212809 -11772504
1876 -11772504 -12021081 -11593935 -10810086 -9669042 -8210005 -6706491 -5324010 -4013142 -3310230
1867 -3310230 -3989223 -5849230 -8002417 -9601732 -10137840 -9856928 -8986624 -6925557 -4072463
1858 -4072463 -891908 2754672 5189475 4599767 1487100 -2323756 -5270182 -6969989
1850 -6969989 -7709752 -7942246 -8279161 -8463653 -7747259 -6757754 -6627474 -7419192 -7726771 -6571472
1840 -6571472 -5540260 -6317511 -7526766 -6659176 -3955594 -2018430 -2560435 -4831570 -7056364
1831 -7056364 -8454400 -8967314 -8730589 -8670923 -9601731 -10929327 -12057792 -12887432 -12543418
1822 -12543418 -10859242 -8534476 -5619112 -2568453 -701840 -677973 -2074701 -3071202 -1935597
1813 -1935597 126987 428495 -1063287 -2345452 -2035677 -759960 -542898 -1837053 -3927296
1804 -3927296 -6712801 -9305286 -10392988 -9458017 -7036745 -4358867 -1396545 2312085
1796 2312085 5539828 6638186 6049092 5121410 4617518 4546831 4207010 2721780 -182128
1787 -182128 -2532206 -2770135 -1634064 -249394 821913 1263826 -13640 -3342948 -7038008
1778 -7038008 -9626266 -10788411 -11540604 -12281134 -11918808 -10469303 -8683231 -7158170 -6303552
1769 -6303552 -6461176 -7238032 -7661353 -7149765 -5228969 -2201010 1305054 4733599 7140054
1760 7140054 6886259 3622836 -619163 -3712528 -4858517 -4117710 -3144152 -3583533 -5553487
1751 -5553487 -8416114 -10952961 -12686201 -13029269 -11449688 -9907940 -10591222 -12045610 -11508791
1742 -11508791 -8767775 -5271531 -2896608 -2733379 -4404873 -7004481 -8819230 -8707145
1734 -8707145 -7368002 -5768996 -3989145 -1633036 1231088 3347531 2711437 70145
1726 70145 -1724972 -888599 2168830 4592334 4426958 2420237 455721 270247 1759778
1717 1759778 3830731 5436673 6244797 6531112 6104338 5387031 4967140 4584949 3228331
1708 3228331 640040 -1290315 -1092162 123511 1027386 1806426 3124392 4912988 7546368
1699 7546368 11956389 17031641 20156896 20130004 18441309 15900073 11897283 6871953 2484469
1690 2484469 -631463 -3031670 -3915335 -2288861 524010 2606807 3510842 3893844 3931279
1681 3931279 3245501 2283401 2254225 4133885 7061680 8792221 8514506 7673385 6906513
1672 6906513 5552143 4334875 4290674 4856416 5221201 6080544 8188488 10204407 10452713
1663 10452713 8327188 4769730 1781656 552800 244884 -620943 -2168019 -3487980
1655 -3487980 -3567220 -1952118 678151 2427088 2015055 122629 -1784199 -2631409 -1819195
1646 -1819195 97510 1703897 1646996 313435 -1122639 -2481961 -2933946 -1784926 420631
1637 420631 3190233 6162226 8529034 9987279 10629719 10507463 8549765 4682673 924213
1628 924213 -534191 300102 1713532 2986598 3613356 4044370 5057381 5123087 2834922
1619 2834922 -666754 -3402442 -3961295 -1919804 1195950 3479779 4689293 5562210 6049016
1610 6049016 5659789 3843804 467520 -2480752 -2681874 -869836 556410 473951 -1054791
1601 -1054791 -2693318 -3031733 -1978294 -249028 1227939 1654996 928606 -20756 -515508
1592 -515508 -978435 -1664407 -1986968 -1405641 169355 2756590 5852596 8520661 10904830
1583 10904830 13492102 15251842 14072854 10130669 6390579 4224174 3550789 4900518
1575 4900518 7460418 9264974 9111049 7505710 4894282 1024495 -3833911 -7664615
1567 -7664615 -8531759 -6739833 -3738367 -1221740 -96041 133594 272023 794065 2064606
1558 2064606 3893502 4951225 3959628 1724961 -201127 -1495296 -1760899 -19803 3517156
1549 3517156 7437121 10642265 13184843 15183653 16276904 16546830 16533020 15723316 14012888
1540 14012888 11667052 8556471 4474741 438608 -2008753 -3267567 -4427499 -5994930
1532 -5994930 -7870028 -9546738 -10428383 -10604776 -9808895 -7203274 -3265048 -214478 48341
1523 48341 -1128063 -581320 2095757 4505531 5693140 5918101 4691766 2821158 2513606
1514 2513606 4549364 7487066 10088090 11409400 10457042 8230521 6456305 6144071 6606220
1505 6606220 6041055 3623560 -558249 -5434086 -9689142 -12821202 -14709900 -15091493 -14614227
1496 -14614227 -14696397 -15484228 -15699584 -13717725 -9004176 -3003923 1519047 3421012 4333898
1487 4333898 5482819 5723016 4094554 1958123 528887 270694 518732 -453058 -2308704
1478 -2308704 -4228129 -5582752 -6005150 -6329054 -6616731 -5332155 -2129865 1430201 4017562
1469 4017562 5682570 6732482 7496832 7941682 7465800 6141121 5055253 4911474 5762956
1460 5762956 6695876 5424015 1364476 -3787366 -7375677 -6710664 -1902829 2756833 3963267
1451 3963267 2712716 893421 -499705 -1287100 -1933649 -2392427 -2601532 -2369431 -2110908
1442 -2110908 -1636633 -208762 1891128 3973275 4977919 4469163 3543555 2940775 2293435
1433 2293435 1755507 2426227 4519741 6657178 7208689 6053448 4292826 2189518 -405525
1424 -405525 -2343642 -2381795 -1626866 -1928888 -3326243 -3490911 -938823 2177498 3652831
1415 3652831 3222690 1608178 479561 1571711 4807840 7381538 6404298 3051865 1576512
1406 1576512 3443137 7294086 12105391 16278299 18572480 18651233 16358163 12322213 7452258
1397 7452258 2779058 -344310 -1139633 -31154 2404275 6000248 8961659 9332773 7351884
1388 7351884 4749386 3496686 4049663 5762050 8887789 12989052 16718406 19369214
1380 19369214 20770375 20904402 20545073 20849391 21660001 22300126 22847373 23791920 24258920
1371 24258920 23077724 19673041 14838103 9870426 4509421 -591922 -3563323 -4634290
1363 -4634290 -5348942 -5565083 -5044989 -3360418 -567524 1675846 1724904 -380608 -2707240
1354 -2707240 -3033722 -767601 1646795 1812198 559664 199524 1351038 2834374 3953714
1345 3953714 4685709 4815930 4421555 3643373 3365135 4788587 6576324 6989422 6070981
1336 6070981 4201143 2277566 1494300 2634858 4898852 5575510 3273808 -417685 -3124547
1327 -3124547 -3323422 -1193212 2355925 5864403 7651237 7134850 5464884 3684921 1328171
1318 1328171 -832278 -1769453 -2501793 -4695865 -7732367 -9576447 -9512499 -8044210 -5744570
1309 -5744570 -3600281 -1943978 -255844 2080957 5049715 7206703 7935193 7455986 6128146
1300 6128146 5403146 5445602 5060503 4107976 3263431 2184248 632201 -489095 -270789
1291 -270789 1189967 2760706 3129884 2101052 1047005 141286 -1329404 -2768756 -3016040
1282 -3016040 -2282290 -1995242 -2969525 -4796313 -6898740 -8083939 -7771003 -6523008 -5034224
1273 -5034224 -4094549 -3468489 -2632829 -2082838 -1919730 -1676305 -1923899 -2781502 -3035137 -2656282
1263 -2656282 -2376154 -2418820 -2074227 -590253 1646439 3695839 4960503 5047385 4519068
1254 4519068 4714596 6046444 7363510 7257118 6030520 4201826 1944144 -237341 -1621402
1245 -1621402 -1410528 -622611 -797215 -1375436 -662768 2067712 5943790 9608057 12016314
1236 12016314 12578901 11753664 10734075 10341562 10865806 11647886 11436426 11080904 11424289
1227 11424289 11530457 11082511 10307394 9543509 9569803 10376687 11267646 11382790 10041562
1218 10041562 7600601 6086443 6269102 6669498 6071069 4857163 4002983 4165033 4877213
1209 4877213 4642779 3581171 2609028 2194306 1996014 1838302 1566964 544356 -713280
1200 -713280 -1045471 -717422 -583189 -557131 -1092295 -2650728 -4208884 -4473241 -3400839
1191 -3400839 -1595410 -14245 833015 1645768 2560969 3199930 3437553 3363020 3041086
1182 3041086 2564922 2270617 2499857 3875318 6629911 9316289 9962842 8585124 6183351
1173 6183351 3358817 1123572 37978 56894 1362427 3022270 3609613 3174728 2668963
1164 2668963 2351409 1999048 1632370 1287797 535343 -426836 -763992 -86468 2020720
1155 2020720 5098163 7756526 9301801 9952563 9635820 8514643 8258103 8960283 8924344
1146 8924344 8229742 8106018 8631168 9268162 9497079 8278186 5655917 2494823 -925020
1137 -925020 -4206736 -7096547 -9178558 -9626600 -7922694 -3487850 2137430 5617225 5652869
1128 5652869 3236585 182648 -3194680 -7150771 -10532117 -12214953 -11905182 -10704337
1120 -10704337 -9995116 -9164768 -6540927 -2531186 757241 1619495 670788 33532 338186
1111 338186 1331918 2505546 2953492 2354924 1199826 262870 648000 2039096 3106227
1102 3106227 4297118 6009356 7778194 9615562 11117789 10778540 8946889 8013850 8050994
1093 8050994 6887331 4089945 1734901 1343877 1741357 1881867 1257266 -697520 -2466554
1084 -2466554 -2729934 -1983591 -1811448 -3162733 -4054895 -2975093 -779524 2368085 6871617
1075 6871617 11276096 13476339 12555420 9560207 6224145 3195004 565371 -1790535
1067 -1790535 -3352784 -2729374 -293835 2268336 4256101 5209233 5208307 5332554 6709401
1058 6709401 8565797 9179218 9182453 9939740 10087853 8040309 4835735 2186989 632498
1049 632498 532001 2723588 5906554 8719243 10723459 10885515 9199794 7256484 6245757
1040 6245757 6734328 8915332 11853654 14218651 14741414 12801144 9514048 6930593 6660629
1031 6660629 8576335 11001604 12283950 11778312 10321141 8276923 4773881 911359
1023 911359 -1655151 -3376804 -3816781 -1388489 3525861 8970746 13565998 16357139 16745492
1014 16745492 14419354 10576915 7621629 6610782 7134650 9453812 13638438 17747761
1006 17747761 19430673 17737309 14688782 12993664 13053508 13688713 14120005 14507051 14706880
997 14706880 14761043 15470102 16367801 15596206 13035630 10524511 8634469 7477494 7404996
988 7404996 7287548 6094381 5212745 5741540 6480182 6990671 7661089 8177464 7981463 7062167
978 7062167 6281651 6281470 6896452 7802930 8144243 7430388 5787643 2805530 -1381559 -4999981
968 -4999981 -6437205 -5642870 -4051640 -3219543 -2613837 -1068541 1023406 2221266 2367241
959 2367241 1637509 396986 -333296 -961035 -2626233 -5120201 -7193977 -8283421 -8737248
950 -8737248 -9348527 -10111715 -10790689 -11036555 -9454943 -6008900 -3316639 -2340257 -2616605
941 -2616605 -3818027 -5761258 -8169613 -10756971 -13038105 -14059343 -13545117 -12460304 -12055284
932 -12055284 -11593778 -9358703 -5632564 -1943739 171280 105861 -653942 -369665 951563
923 951563 2173604 2433044 1655486 177533 -2979380 -8464373 -14397432 -17900121 -18574533
914 -18574533 -17686369 -16326861 -15525230 -15505836 -15068790 -13059742 -9881119 -6795513 -5171067
905 -5171067 -4919340 -3834783 -1257609 1306501 1762850 -355710 -3153294 -5163610 -6237071
896 -6237071 -6609207 -6863152 -8054117 -10069439 -12405154 -14045803 -14200202 -13065582 -11252070
887 -11252070 -9363802 -7094807 -4404420 -2749396 -2920601 -3969022 -4636873 -4534699 -4598806
878 -4598806 -5287953 -6154953 -6750593 -6709830 -6355137 -5669557 -4197856 -1932014 592120
869 592120 3037376 6128262 9783017 12604388 13114191 10700061 6580281 2544919 -531082
860 -531082 -2812689 -4081747 -3742098 -2672595 -1921813 -1854226 -1652952 -352885 464414
851 464414 -461166 -1503659 -1013603 983846 3286214 4305181 3493217 1392773 -1080167
842 -1080167 -3847883 -7186929 -10380130 -12314610 -13265528 -13920613 -14288258 -14535137 -14361475
833 -14361475 -12946624 -10837642 -9308809 -8433583 -8064569 -8118683 -8301662 -7995882 -6204852
824 -6204852 -2992466 -96503 1345047 1114589 -292035 -2465637 -5146859 -6948521 -7163120
815 -7163120 -6403342 -5323642 -4285376 -3818401 -3551456 -2270680 945825 5459013 9954052
806 9954052 13106288 13868957 11970107 7382968 1781986 -3456127 -8268862 -11597017 -12703815
797 -12703815 -12172643 -10669283 -7873893 -4165930 -2203442 -3177980 -5206841 -5539450 -3149557
788 -3149557 413312 3716306 6583385 8965674 10124495 10842139 12874750 15596262 16282360
779 16282360 13721691 9215622 4160585 400308 -892277 -1073154 -1678011 -2446086 -2155892
770 -2155892 -238808 2180648 3769930 3951379 3110151 1750008 -655099 -3127387 -4819683
761 -4819683 -6751524 -7877570 -6666476 -4635430 -3424808 -2980353 -3183968 -4546791 -7438654
752 -7438654 -10882836 -13767820 -15801733 -16616374 -15786096 -14060903 -12742994 -11915485 -11040284
743 -11040284 -10266453 -10156786 -9630625 -7408720 -3812880 66890 3577021 7217606 10628274
734 10628274 11441188 9159145 6085928 3772183 2314916 889941 -1762365 -5961630
726 -5961630 -10470065 -13665924 -14981097 -15779158 -16818091 -17578515 -16876555 -14555016 -11770962
717 -11770962 -8492022 -4445351 -1019342 1467045 4043480 6373397 7410744 7131476
709 7131476 6804548 6427150 5210658 3608027 2713661 3548745 6808331 11080682 13501432
700 13501432 12928919 10109668 6852914 4787143 4422907 5544797 7281000 8308159 8771894
691 8771894 9325597 9992476 10557309 10589674 9773975 7508158 3679167 -435492 -2607121
682 -2607121 -1993688 921378 4749724 7575053 8781961 9285730 8844535 7296594 5910117
673 5910117 5040876 3539076 1105615 -606001 -550386 1426467 4132973 5541502 5461816
664 5461816 4785759 3284205 1607216 460623 -943585 -2490072 -3264824 -2327115 619186
655 619186 4990915 9413254 12473712 13635746 13198150 11656887 9232728 6554460 4173045
646 4173045 2158295 211803 -1021544 -652961 292817 1013298 1450419 870246 -778545
637 -778545 -2923416 -5316564 -6535459 -5231417 -3181777 -2514247 -2812879 -2797166 -1964419
628 -1964419 -977598 -547002 -727322 -1167261 -2388966 -4650602 -7047744 -8810544 -9215297
619 -9215297 -8367598 -7457036 -7188649 -7372747 -7948404 -8610432 -8501238 -6403403 -2930990
610 -2930990 -524647 -816151 -3180130 -5633839 -7164767 -8670852 -11124033 -14181298 -16969819
601 -16969819 -18380174 -17572721 -14730504 -10299585 -4948586 -321033 2329112 3067251 2475147
592 2475147 656327 -2265518 -5283025 -6731233 -6451435 -4952324 -1871576 2273497 6160451
583 6160451 7998890 7301708 5535898 3093338 113615 -2161401 -3001293 -3045255 -4076472
574 -4076472 -6796261 -9227605 -10074553 -10087140 -9451893 -8313030 -7774722 -7746417 -7081249 -5660033
564 -5660033 -3868052 -2641011 -2279339 -1139894 1002788 2681970 3323325 3397984 3291320
555 3291320 2649055 1309571 -333872 -1592388 -1785198 -1408754 -1998422 -4470607 -7893837
546 -7893837 -11380960 -14758324 -17647687 -19097589 -18155239 -15681131 -14349723 -15261694 -17414278
537 -17414278 -19592585 -21069632 -21890094 -22077624 -21155723 -18658209 -14738468 -10497723 -6782769
528 -6782769 -3787986 -1534365 487491 1735567 1616145 457634 -1207537 -2678161 -4192167
519 -4192167 -5901911 -6891179 -6764161 -6228080 -6628514 -8191201 -9441316 -9574593 -9095468
510 -9095468 -9260807 -10900805 -12982115 -13597491 -11655960 -8364463 -5676869 -4182335 -2823245
501 -2823245 -338701 2174313 2583923 1156403 -467007 -1439874 -1826509 -1894054 -2253001
492 -2253001 -2514776 -1553409 317738 2725703 6346800 10845310 14398592 16538841 18048965
483 18048965 18514960 17638107 16511491 16285937 16437428 15780799 14150901 12439007 11353393
474 11353393 10138900 8200418 5946977 3639331 721241 -2380509 -4800030 -5918673
466 -5918673 -5042897 -2035074 2251593 5660847 6476210 4979302 2865049 1979931 2631167
457 2631167 2979077 2324408 1268796 130511 -1282475 -3685907 -6799613 -9797459 -11883497
448 -11883497 -12997954 -13614466 -13393403 -12184633 -10501029 -8899920 -7175952 -5471546 -4928046
439 -4928046 -5997979 -7289780 -5715680 -728532 3867817 5572466 4346095 1539855
431 1539855 -694026 -1560269 -1457276 -568738 965600 2261756 2456719 1028788 -1431779
422 -1431779 -3552149 -5215800 -7101320 -8804876 -8751768 -7140868 -6088978 -6374595 -7360666
413 -7360666 -8324655 -8535279 -7329269 -4579837 -805798 2336627 3467181 3483179 3724673
404 3724673 4375443 5187224 5150536 4009597 3231461 4251856 6758727 9035597 10144733
395 10144733 10166241 9258251 8742207 9809864 11859423 12980284 11682066 8481037 4739980
386 4739980 1216886 -1114152 -1225895 356632 1910508 2117597 1770078 2350508 3288001
377 3288001 3333740 2456172 1584744 1658507 2405948 2972643 3157572 3196529 2929703 2765612
367 2765612 3154557 2892637 963107 -1807534 -3870460 -4757632 -4833383 -4515567 -4383303
358 -4383303 -4644386 -4665423 -3821019 -3070185 -3517571 -4859697 -6532649 -8617960 -11284853
349 -11284853 -13813865 -14500381 -12713404 -9733489 -7796062 -7650193 -8449665 -9179092 -8852725
340 -8852725 -7521806 -5771608 -3632288 -1946474 -1588924 -1835249 -1505116 -1085451 -1673304
331 -1673304 -3341763 -5629632 -7858811 -9534433 -10517899 -11113723 -11250002 -10887220 -10741604
322 -10741604 -10706994 -10289198 -9476178 -7847306 -6085376 -5730746 -7153310 -9052623 -9658287
313 -9658287 -9371585 -9682383 -10251508 -9959989 -9042273 -7143144 -2830076 2071489 4139613
304 4139613 3331999 1845348 620480 -196951 -797453 -1498370 -1890512 -1689262 -1016580
295 -1016580 -352824 -322693 -456567 -185395 647866 2458035 4963027 6465219 6102205
286 6102205 4931316 4459691 5359675 6874546 7565472 6280040 3021831 -894393 -4055981
277 -4055981 -5943935 -6397179 -5980002 -6261192 -8854254 -13003586 -16061812 -16217124 -13505732
268 -13505732 -9977492 -7263147 -5887204 -5612597 -5721105 -6208446 -6820787 -7070811 -7106957
259 -7106957 -7081441 -6734054 -5761578 -4195770 -2580482 -1303768 -346138 487912 1630412
250 1630412 2692178 2879859 2307362 406933 -3103522 -6582926 -8843136 -9498584 -7855083
241 -7855083 -3831602 924203 3941347 4942777 5773954 6201250 4920488 2979884 1876690
232 1876690 686524 -1330314 -3857990 -6043102 -7373584 -7544694 -6181656 -4018789 -2403777
223 -2403777 -1647020 -1377659 -1282855 -1036628 -428759 92935 94726 -31843 -60560 -55001 81292
212 81292 392764 1086701 2177603 2843791 2338439 537044 -2398510 -5955612 -9189125
203 -9189125 -10680041 -10236575 -9597895 -9607631 -9912442 -10186520 -10148820 -10463495 -11976015 -13788685
193 -13788685 -14865426 -14943827 -14115731 -12918161 -11549764 -9994044 -8523027 -7115933 -5384786
184 -5384786 -4060370 -4266724 -5367199 -5876566 -5800669 -5636300 -5250674 -4241933 -2835280
175 -2835280 -1887004 -1705226 -2277050 -3598519 -5140306 -5937484 -5511267 -4000352 -1678561
166 -1678561 531360 1832402 2593932 3116041 3306211 2811524 1726285 396950 -511264
157 -511264 -926898 -1291496 -1488750 -1493386 -1957602 -2981474 -4084002 -5126408 -6039680 -6866269
147 -6866269 -7610503 -8331024 -8633386 -7221369 -4494542 -2161260 -1182783 -2064021 -4507236
138 -4507236 -7303534 -8865131 -8157816 -5900167 -3563264 -1792685 -334366 1042905 1688087
129 1688087 604680 -2124784 -5725197 -8968195 -10799731 -10906125 -9481866 -6871171 -3865784
120 -3865784 -1570552 -383929 -345248 -811750 -1423204 -2573647 -3832938 -4568245 -4751132
111 -4751132 -4378226 -3463465 -2033811 -544088 -67871 -564420 -1022150 -1498022 -2283724
102 -2283724 -2515540 -1380894 -30672 151703 -607758 -1325528 -1729828 -1943991 -2056708
93 -2056708 -2227186 -1870113 -688134 395400 688118 388414 58569 -291080 -1458061
84 -1458061 -3614228 -5991871 -7478140 -8067815 -8243070 -8389175 -9315038 -10930920 -12053396
75 -12053396 -11699839 -9993144 -8031258 -7041983 -7848450 -9785635 -11193552 -11410985 -10792910
66 -10792910 -9755666 -8686896 -7795965 -7053584 -5607139 -3666467 -2874014 -3391322 -3817280
57 -3817280 -3190193 -1865244 -1103586 -1760975 -3171905 -4103102 -4344652 -4069534 -2810858
48 -2810858 -607023 1460413 2783161 3292871 2968232 1665067 -631527 -3108434 -5107967
39 -5107967 -5976895 -5439740 -4374135 -3094448 -1826184 -1595529 -2742447 -4456007 -5800984
30 -5800984 -6572445 -7265299 -7256508 -5835001 -4164067 -3320100 -3127270 -3107693 -3053611 -3067546
20 -3067546 -2678538 -1555313 -399291 -75414 -669974 -2111428 -4214136 -5734661 -6041685
11 -6041685 -5661472 -4987240 -4016509 -3044935 -2809081 -3890794 -5958549 -7609751 -8316533
2 -8316533 -8661873 -9941927
0 -9941927
$$ Imaginary data points
##PAGE= N=2
##DATA TABLE= (X++(I..I)), XYDATA
32767 51053068 49863522 47556300 46587918 47370095 48407464 49061299 49890834 50703718 51280043
32758 51280043 52085894 53340879 55172589 57996742 61761984 65464439 68223124 70427982
32750 70427982 72957953 75493264 77075402 77626626 77641894 77377880 76361740 74590875 73325253
32741 73325253 73405755 74716392 76489576 78127056 79329488 80026746 80042395 79789562 80306535
32732 80306535 81755497 83176190 84667253 87239675 90675885 94038431 96986552 99752988
32724 99752988 102625250 104945509 106432542 107484016 107786503 107606629 107894215 108910772
32716 108910772 110230987 110933436 110563710 110039458 110251791 111254917 113369583 116196946
32708 116196946 118573441 120447138 122339318 123855532 124418404 124575107 125531375 127291903
32700 127291903 128872781 129468991 129046302 128444759 128160674 128301686 129363010 131327450 133671119
32691 133671119 136927083 141444777 145859418 148519581 148685830 147257020 145647789 144761544
32683 144761544 145131425 146428381 148269997 150035168 151481105 152898652 154168764 154966356
32675 154966356 155034970 154341099 153881051 155019363 157402101 158939954 158892869 157953749 157222997
32666 157222997 157655001 158729835 159773198 161028940 163262614 166719197 170560600 174061465
32658 174061465 177830396 182078850 185207267 186476560 186317905 185449993 185024694 185550073
32650 185550073 186128040 185885154 185023070 184148434 183651404 183720089 184370923 185185244 186188581
32641 186188581 187731031 190014023 192540209 194638634 196195223 197061624 197562356 198542345
32633 198542345 199955615 201547138 203171247 204103955 204222288 204370372 205252078 206886052
32625 206886052 208657289 210297740 211347393 210987539 209724235 208542361 207670702 207194474
32617 207194474 207225032 207206493 207067338 207577842 209509583 212798502 216562032 219725915 222013713
32608 222013713 223789469 225631570 227700179 228949836 228614761 227512926 226895960 227300638
32600 227300638 228663294 230336632 232101851 234116727 236260548 239009140 242656097 245509872
32592 245509872 246155454 244888352 243013691 241785584 241562592 241980632 243296999 245741119
32584 245741119 248522129 250880688 252725766 253989389 254530241 254776219 255346514 256377871
32576 256377871 258053966 259998628 261448315 262030068 261602665 260786469 260268505 260018829 260486192
32567 260486192 261794804 263502497 265876019 268619575 271026630 273307786 276073193 278796809
32559 278796809 280524403 280681773 279330380 277714770 276392427 275296240 274953805 275901393
32551 275901393 277312575 277907684 278245498 279782120 282492976 285802656 288806414 290009351
32543 290009351 288812338 286592234 285560617 286207363 287471106 288552041 288927235 288957712
32535 288957712 288953234 288829681 288853644 289225702 290880960 293807516 296452912 297949969 298179764
32526 298179764 297130618 294762461 292108730 290593437 289933490 290016962 291504578 293981041
32518 293981041 296694168 299876550 303731877 307550854 311164945 314500466 316837004 318400519
32510 318400519 319903850 321780779 323773619 324732979 323827860 321563944 319380043 317969628
32502 317969628 317105427 317180271 318259382 319196571 319846222 321194968 323157854 325360914 327104644
32493 327104644 327411579 326209557 324291641 322994470 322894266 323278848 323614792 323982232 324848281
32484 324848281 326431687 328852140 332315769 336524139 340686470 344095055 346247749 346651059
32476 346651059 344580801 340765326 336998258 333879566 331533310 330093727 330142762 331756644
32468 331756644 333793661 335712127 337570164 339247552 340410589 341020437 341447272 341467131
32460 341467131 341085584 341332529 343130071 346066992 348787391 350530377 351671702 352366508
32452 352366508 352822400 353670454 354755150 355721155 356390851 357246500 358985105 361271608 363038653
32443 363038653 363987306 364946217 366525226 368109618 368467438 367188696 365605507 365098480
32435 365098480 365614800 366326273 366829673 367106959 367209760 367260782 367120753 366612716 365864853
32426 365864853 364858687 363728996 363093566 362816006 362106792 361348989 361953045 364299139 367282574
32417 367282574 370390327 373606007 376330681 377110617 375285104 372765111 371666667 371977883
32409 371977883 373169234 374804140 376812230 379469760 382006154 383583562 384391024 384506234
32401 384506234 383859210 383583306 385049799 388049092 390476617 391019839 390334529 389581134 388770995
32392 388770995 388174477 388701168 390153806 391657753 393192444 394967279 396685713 397716592
32384 397716592 397524991 396339209 394542424 392739838 391074192 389851946 389736845 389961045
32376 389961045 390051912 390852014 392994411 396220098 399083881 400119190 399022281 396654631
32368 396654631 395019560 395247913 396855576 399729794 403362647 405883901 405884093 403424291 399989687
32359 399989687 396755017 394411042 393332522 393578118 395140072 397846183 401329289 404746317
32351 404746317 407314115 409278271 411036644 412400885 412805772 412506889 412719992 413748715
32343 413748715 415431693 417574958 418262046 415855155 412729140 412416821 414972957 417523420
32335 417523420 418216770 418005279 418446119 419893094 421520833 423215420 424913680 426389929
32327 426389929 428169807 430287691 432606236 434225095 433575046 430815589 427370961 423961065
32319 423961065 421207987 419098730 416213483 412036341 408310421 407161248 409022535 412742135
32311 412742135 416826046 419914402 420115088 417147842 413627365 411335218 410009141 409494544
32303 409494544 409738033 410174267 410661795 411304344 412620352 414943962 417244420 419270494
32295 419270494 421851623 424252014 426622255 429869729 432797104 433738916 432938525 431880851
32287 431880851 431574802 432616236 434391033 435620384 436271728 436563965 435857884 434217188
32279 434217188 432864562 432962537 434836352 437841385 440750624 442507481 443384251 443638947
32271 443638947 443311451 442847138 441211731 438325510 435793727 434329301 434149728 434562621
32263 434562621 434952137 435165900 435074866 434907881 434841841 435738523 438371606 441069872 441753358
32254 441753358 439843781 436392073 433003961 430382267 428741839 427918112 427442264 427463641
32246 427463641 427250760 425716931 423406133 421623575 421513973 423871558 428161985 432626829
32238 432626829 435039605 434504580 432793430 431925093 432671201 434776413 437590045 439981890
32230 439981890 441315668 441990506 442954670 444108521 443988014 441841942 439123259 438460736
32222 438460736 439772979 440789750 440827016 440873535 440937075 440443068 439616434 438997883 438625684
32213 438625684 438312739 438201044 438473724 438979143 439122659 438708173 438057974 437696266 438063110
32204 438063110 439892506 443106021 446144567 447437312 446884249 445381864 443977113 443368707
32196 443368707 443652901 443421047 442057914 441368923 441627618 441585323 441515932 442178841 443201080
32187 443201080 444583871 446372633 447923576 447919404 445506167 442237207 439960930 438579747
32179 438579747 438663820 440295625 441742662 442157427 442942149 444185385 443786505 441288747 438215248
32170 438215248 436061918 435514643 436471933 438715680 441326638 443520504 445369956 446969099
32162 446969099 448448860 449810235 450444532 449255626 447293675 446930813 447756364 448474886
32154 448474886 449642693 451453807 454190766 457117358 458060246 456373726 453454276 449967327
32146 449967327 446175674 443102439 441615463 441157549 440794879 440667069 441629839 443690233
32138 443690233 445288136 445416064 445123098 445999186 448269383 450914206 452265081 451942922
32130 451942922 451663870 452980293 454363964 454252330 453426272 453263291 453886784 454318452 453372154
32121 453372154 451355117 449881953 449422929 449486441 450782276 454361351 459195476 462493762
32113 462493762 462718003 461675361 461117886 461384375 462495824 464078890 464956152 464508475 462995372
32104 462995372 460921885 459177885 458540795 459076124 460015926 460231830 460548953 462422233 465382656
32095 465382656 468571296 470769520 470700527 468442137 464812150 461264975 457981542 454189558
32087 454189558 450715489 448858273 448351310 449604693 452525615 454371334 453241872 450498361
32079 450498361 448820843 449221578 450794004 452314515 453412014 453739703 453213253 452244945
32071 452244945 451415058 451476215 452834854 454191883 454638220 454309332 453145564 450808003 447984593
32062 447984593 447111416 448520979 450002337 450172154 449332984 448011958 446217478 444035973
32054 444035973 441789041 440081161 439647702 440025525 440268289 440521936 441240336 442420121 443599119
32045 443599119 443878379 443215301 441965404 440571462 440230146 441337579 442753506 443473503
32037 443473503 443277236 442773968 443016355 444303965 446015245 446520214 446123006 447028578 449468124
32028 449468124 452737092 455410112 455693104 453635182 450355669 446894132 444024972 442040221
32020 442040221 442047748 444370259 447892826 451665761 454464901 455222737 454260465 453410440 453375299
32011 453375299 453184728 451930220 449334302 446279835 443285791 440294247 438147326 437877660
32003 437877660 439380745 441542877 443606985 445943487 448413056 449585942 448705810 446704136
31995 446704136 444818652 443218759 441313764 439355368 438337497 438330412 438917036 439903187 440759768
31986 440759768 440575368 439781169 439699335 439946427 438932021 436528233 434859254 436198504 440188761
31977 440188761 444546785 448190643 451142994 452911152 453284688 453153716 452997596 452761693
31969 452761693 452030227 450907937 450351989 451106852 452723187 453379433 452448460 450809527 448758491
31960 448758491 447115807 447093467 448098008 448674930 447811574 445609089 442673944 440259235
31952 440259235 439535744 440348806 442272750 444713820 446708337 447345515 446167842 443627062
31944 443627062 441187615 440428586 442112524 445243010 448391185 451107324 452857019 452845470
31936 452845470 451604598 450895411 450826619 450923272 450704841 449294508 446805310 444631050 444301117
31927 444301117 446516860 449923934 452204841 453023413 453288563 453061398 452051773 451020387
31919 451020387 450779611 450851507 450763320 450712053 450658403 449843251 448481622 447260352 446828796
31910 446828796 447697664 449623135 451875916 453297879 453793854 454115979 454627520 455397803 456381001
31901 456381001 457078901 457247422 457589294 458830537 459774997 458507568 455526770 453727395
31893 453727395 454385049 456746016 459478608 460891238 460656029 459696484 458864669 458817244 460074335
31884 460074335 461929775 463272346 463756634 462872239 460215254 455832803 450794980 446702158
31876 446702158 444018082 442010024 440091103 438864427 439045207 440185248 441634421 443236904
31868 443236904 444032626 443339595 442143099 440821361 439932876 439936468 440421423 441927898 445390432
31859 445390432 450361898 454805547 457437220 458727776 459510972 460400054 461525281 461852996
31851 461852996 460434330 457600982 454459044 453052359 454152905 456537688 459076170 460557454
31843 460557454 460619579 459797062 459113351 458867727 458525522 457358730 455187861 452580165 450306740
31834 450306740 448916031 448577476 449646774 452404447 455901846 458774985 460014455 459452127
31826 459452127 458036557 457547417 459112796 462077955 464377879 463487476 459205745 454049284
31818 454049284 450255199 447921485 446411121 445696937 445794066 446474875 447431902 448103169 448271142
31809 448271142 447992016 446872587 445112141 443356557 442003534 441863056 442403953 441732429
31801 441732429 440122358 439638415 441260978 444877803 449011076 451594040 452568393 453291446
31793 453291446 454638693 456403043 458692556 461014030 461902730 461719194 461459838 461248773
31785 461248773 461066453 460593037 460041509 459649557 459090578 458541056 459189285 460837176 461438886
31776 461438886 459750444 456779022 454160819 453517990 455840419 459769904 462408352 462034833
31768 462034833 459766086 458084129 457531615 457951235 459932113 462629933 464642996 465638195
31760 465638195 465888058 465446842 465028474 465672837 466418930 466012986 464229906 461893344 460369288
31751 460369288 460093400 460163343 459847589 459225280 458125366 456635064 455721415 455906638 455939515
31742 455939515 454575111 452193295 450092874 448706806 447749811 447201514 447194318 448165374 449796083
31733 449796083 451233122 452824083 454763087 455916428 455023737 452336405 449151205 446301548
31725 446301548 443936790 442244795 441240110 441180440 441643144 441194874 439359850 437194134
31717 437194134 436024029 436544527 438217905 439299022 438628771 437065600 436015890 435931330
31709 435931330 436915231 438688603 440670303 442715529 444214742 444347255 443017730 440722441
31701 440722441 438241413 436131167 434112022 432581680 432298263 432496502 432150937 431313416
31693 431313416 431360909 432955765 434925820 437558900 441653589 445631290 448838702 452253839
31685 452253839 455269288 457185671 458664567 459807896 460332021 460677527 460477305 459766557
31677 459766557 459600707 459912957 459832006 458497321 455619834 451667206 448321811 446797112
31669 446797112 446540713 447058989 447915574 448768974 449663014 450628283 450962757 449610529 446358030
31660 446358030 442967528 441684478 442808956 444512006 444843767 444729520 445689016 446123201
31652 446123201 444683083 442789121 442624917 444543812 447493538 450551100 452845021 454343731
31644 454343731 455650673 456577344 455803095 453044817 450066337 448710065 449147615 450364692
31636 450364692 451079492 450673280 449638071 449039748 449668255 451315250 453479967 455019506
31628 455019506 454370780 451843105 448881624 446418248 445823066 447318631 449698413 451727840
31620 451727840 452385412 451534025 450255706 449116650 448049980 447447603 447842303 449371663
31612 449371663 451173936 451960610 450971642 448910992 447099791 446111606 445623868 444864390 443360998
31603 443360998 441176765 439214603 438095558 438079688 440797533 446037710 450456004 452045224
31595 452045224 451112099 448552156 445719170 443537720 442621601 443382052 445160944 446517408
31587 446517408 446904388 446952350 447874820 449071872 449139048 448842780 449240171 450179501 451137820
31578 451137820 451179795 449920219 448858752 448949273 449735643 450851205 452028082 452286857 451364426
31569 451364426 449940408 449137855 449247208 449102188 448392298 447261522 445784762 443969329
31561 443969329 441817022 439295636 437102188 436408034 437757124 440877297 444410447 446523775
31553 446523775 446307493 444365872 441383865 437849630 435206430 434545335 434848666 434815330 434267763
31544 434267763 433589364 433803949 435470142 438363104 442480045 447060896 450596412 452224646
31536 452224646 451546607 449387559 447228881 446268686 447068509 448865492 451005966 452807336
31528 452807336 453780164 454091767 454580456 455445715 456419881 457131063 456908561 456497036 457025705
31519 457025705 458287357 459660931 460646314 461172205 460906295 460069979 459210882 458196186 456923905
31510 456923905 455729065 454605749 452399956 449149909 446512165 445415236 445577871 445841406
31502 445841406 445502484 445416588 447107274 451068949 455658490 459383793 462280794 464056513
31494 464056513 464827078 465350069 465724874 464749939 461815815 457890944 454900555 453536434
31486 453536434 453079989 453094632 453581241 453678939 452218515 449426480 446472962 444566864 444566273
31477 444566273 446001929 447605315 449125064 450185165 450197740 449089871 447284592 445733585
31469 445733585 444921338 444890605 445167597 444795213 444513463 444843793 445028809 445022565 445904736 447725691
31459 447725691 449482626 450556151 450733895 450978435 452242938 453957234 455333545 456248707
31451 456248707 456500300 455465825 452600884 448901770 446260039 444858484 443852466 442539739
31443 442539739 442047014 442988314 444059160 444076226 443147977 441563759 439759609 437690714 435339985
31434 435339985 433701480 433983312 435500324 437166961 439753236 443188645 446115789 447881553
31426 447881553 449292886 450671143 451112422 449422613 445454180 441322618 439740760 441448012
31418 441448012 444594598 446859824 447459705 447681734 448830649 451036802 454528880 458465677
31410 458465677 460968550 460886923 458324213 454096761 448909432 443922694 440846437 439960289
31402 439960289 440093197 440725309 441222218 441293342 441245383 440228490 437735459 435040543 434142746
31393 434142746 435483510 437715913 440016713 443063590 446809075 449623377 450340224 449400553
31385 449400553 448199638 447564638 447616778 448986171 452358390 456583046 459785929 461594024
31377 461594024 461727522 460236488 458311520 456566680 454487317 451323880 447676611 444796631
31369 444796631 443067599 442583966 443176435 444543918 445095645 443363225 440622291 438866206
31361 438866206 438317791 438144369 437943469 437550813 436918570 436894055 438304346 441206255 445264222
31352 445264222 450019694 454546579 458347791 461165785 462072826 461050852 459078440 456180353
31344 456180353 452271694 448329474 445134518 442834193 441376073 441479062 443746235 447524081
31336 447524081 451831418 455142205 455906271 454327731 451401116 447739057 444761199 444293677
31328 444293677 445439503 446112412 445559989 444997000 446158366 448759202 451373839 452940558
31320 452940558 453458933 453410675 452587308 451033555 449715569 448377612 446299428 444932484
31312 444932484 445167311 445803524 445819026 444687720 442820007 441556364 440514142 438645253
31304 438645253 437166038 437295123 439026247 441833312 444599789 447024960 448667953 448341206
31296 448341206 446085021 442880020 440101923 439219082 440605595 444016337 448912349 453488068
31288 453488068 455808563 455518949 453138763 450194431 448383140 448257832 449140205 450393585
31280 450393585 451732085 452629604 453016303 453321079 453729190 454625406 456461150 458491585 459733924
31271 459733924 460172400 460102554 459193003 456521127 452880350 450311709 449148139 448995506 449543195
31262 449543195 450871527 452721492 453509232 452631414 450931865 448846107 446579000 444972364
31254 444972364 443968893 442675326 440296420 437805782 437470738 439850465 443680614 447490308
31246 447490308 449903715 450468394 449984189 449090112 448705574 449301675 450556549 452125839 453549134
31237 453549134 454237885 453925000 452486814 450485620 449263315 448734850 447639463 445976772
31229 445976772 443773930 440895321 438345804 437595570 438568309 440418001 442507916 444345490
31221 444345490 445033910 443874213 441182631 437491518 433952676 431712700 431380603 433141656
31213 433141656 436065457 439176622 442063355 443851575 443826723 442615215 441793904 442543767
31205 442543767 445258998 448001913 448552488 447464297 446043980 444488017 443617511 444544041
31197 444544041 447360854 450947346 452849931 452161510 451156064 451016653 451306624 451178726
31189 451178726 450421350 450488780 452179238 455167529 458738113 462170007 464307737 464720854
31181 464720854 463876066 461664248 458313518 455389037 453935128 452959786 451598753 450854182
31173 450854182 451842163 453849896 455196561 455759882 457041183 459828332 463020616 464825104
31165 464825104 464612418 463217801 462080722 461969667 462284305 462589792 462924469 462775580 461112976
31156 461112976 458332717 455660098 453750651 453035504 453524642 454581893 454989741 453280949
31148 453280949 449589990 445308987 442204550 442115403 444980398 448145758 449237639 448289098
31140 448289098 446310746 443364381 439909840 436721255 434181757 433394526 435325327 438444126
31132 438444126 441432918 444203476 446616843 448657236 450034629 450230589 449741683 449483852
31124 449483852 449862968 451194180 452532147 452473908 451299244 449728597 448488821 448759164
31116 448759164 450409057 451553365 450741066 448713784 447383448 447192785 447121615 446368408 445089318
31107 445089318 443836910 443189376 443406579 444541538 446726676 449507380 451791411 452441900
31099 452441900 451429951 449462035 446861647 444079711 442642763 443918480 447206036 450563577
31091 450563577 452212691 451783296 449960252 448206644 447883611 448854163 450507586 452443097
31083 452443097 454564578 456329755 457432362 457854314 456759999 453922107 450242877 446905048
31075 446905048 444328206 442079109 440099893 437545767 434606190 433368675 434972843 438098373
31067 438098373 440380274 440887877 440394535 440872458 443356129 446372744 448624729 450527183
31059 450527183 452179271 452496146 450884795 449154177 449426771 450979343 452457326 453164213
31051 453164213 453018541 452824007 452664184 451956359 450621682 449728889 451156452 454331602 456760399
31042 456760399 457750564 458065290 458381696 458885295 459660441 459142869 456093793 453002836 452564230
31033 452564230 453656916 452664188 448680108 444060049 440878216 439881317 440797797 442521889
31025 442521889 444294800 445823211 446383626 445845249 445252934 445285730 446395249 448226040 449640491
31016 449640491 449519853 448618279 448566384 448926151 448591938 447577700 446031224 444148950 442725544
31007 442725544 442749540 443812586 445072179 446063802 446528204 446910899 447551451 448261303 448434307
30998 448434307 447635195 446694652 446112473 445256261 444059916 442841871 441707778 440438751
30990 440438751 438538477 436126373 433767853 431673412 430324688 430270548 431058972 431342611
30982 431342611 430346625 428952214 428560209 429179961 430208027 432085402 434943341 437709052
30974 437709052 440040936 442312218 444659601 446560214 447251487 447380656 447389638 446338982 444077105
30965 444077105 442459085 443345956 445778309 446843179 446244975 445432368 444553217 442763362
30957 442763362 439677713 435830191 432177389 429751380 429022282 430154518 432667374 435530480
30949 435530480 439151871 444607431 451204586 456562901 459216293 459687769 459431989 459264256
30941 459264256 458999536 458680921 458163311 457827952 458613752 459828148 460086233 459542361 458935645
30932 458935645 458369153 457234458 455437775 453631054 453448579 455765321 459490799 462984325
30924 462984325 464068782 461509584 456531155 451716369 448959506 447470479 445887694 444568988
30916 444568988 444635171 446619352 449972354 453079438 454383098 453352564 450885734 449113848
30908 449113848 448637575 448501371 448193635 448641635 450383143 452837958 454819052 455538031 455336193
30899 455336193 454609707 453929035 453384612 452512935 451613560 450793757 450391669 451332284 453025539
30890 453025539 454068087 453133769 449575641 444733435 441301553 440696384 442233809 444023168
30882 444023168 445129829 446071368 447309567 448701450 448936532 447264813 444959930 442881807
30874 442881807 440755239 438613235 437108042 436464710 436342243 437111264 438887879 440413672
30866 440413672 440640812 439885415 439378011 439347986 438974835 438250348 437641690 437735970 439276619
30857 439276619 441604486 443479555 444502731 444846046 444864688 444722172 444149439 443576514 443643055
30848 443643055 444976489 448331622 451418854 451602077 449438144 447071094 446257378 447072593
30840 447072593 448225060 448730128 448335070 447856338 447196911 445170754 441857148 438401223
30832 438401223 435077435 431783515 429096581 428051497 429204246 431177929 432418112 432593081
30824 432593081 431957882 430670375 429618839 429752453 431085145 433717547 437071920 439367408
30816 439367408 439591959 438785054 438014235 437420108 436702729 435722696 434777988 434250954 434331231
30807 434331231 434905986 435801750 436954944 438264952 439702686 441389353 442480469 442102511
30799 442102511 440539388 438292669 436908540 437391552 438817105 440785753 443176747 444891878
30791 444891878 444919632 443680873 442634055 442631219 443349979 445188149 448354330 452027940 455392168
30782 455392168 457454745 457810749 457365438 455963558 453651004 451623543 450643912 450363305
30774 450363305 449674286 447954820 445941468 444563515 443592332 442690802 441857203 441522142 442227375
30765 442227375 443240309 443043441 441839986 441023112 440481548 439566780 438993886 440031497 442625387
30756 442625387 445143940 446709414 448044371 448720187 447796863 446386177 445426722 444400494
30748 444400494 443687734 443929469 445262803 447142911 447748946 447001847 446163840 445533020 445280071
30739 445280071 445443415 445871027 446793578 448726687 451980139 455636587 457508928 456859770
30731 456859770 455081615 454251328 455700351 458390772 459894568 458826223 456453980 455271840
30723 455271840 455601216 456477326 458290741 460826738 462525393 462773143 461619583 459072514
30715 459072514 455921133 453001952 450829770 450150235 450367933 451124177 453026520 455201722
30707 455201722 456018533 455027160 453656117 452863055 451913709 450991275 450501845 449766334 448715292
30698 448715292 447816719 446578804 445508695 445897485 447079695 447768277 448096115 448405429 449232596
30689 449232596 451165179 452699174 452570633 451723609 451126654 451079435 451792059 453034826 453716524
30680 453716524 453447718 453009659 453535044 455109186 456395951 456555805 455475539 454216123
30672 454216123 453690280 453351901 452416477 450886553 448764213 445666631 442339313 439919909
30664 439919909 438373622 437844838 439042727 442475771 447554092 452376766 455461649 457117949
30656 457117949 457545377 456802607 455838055 455327937 455823758 457392966 459124304 460171352 460066397
30647 460066397 458686544 456261701 453402176 451539370 451345304 452087785 453161274 453842224
30639 453842224 453565259 453015583 452803645 452828201 453071461 453705061 454243868 454018737 453547724
30630 453547724 453830125 455072915 457060475 459244676 460033463 458302879 455252184 452319047
30622 452319047 449908428 448680200 449338530 451967138 455553560 459129763 461994123 462520315
30614 462520315 459859069 455769148 453148763 452101082 451372484 450416809 448810390 446891810
30606 446891810 445214820 443995103 443413708 444267106 446498538 448641327 449786017 450878581
30598 450878581 452337113 453257341 452515174 449807219 445956749 442618015 441876240 444077365
30590 444077365 446956041 447806500 445778856 442799354 441390417 440852457 440155020 439783870
30582 439783870 440523502 443171550 447009272 449974859 450740794 449277010 446660677 444103834
30574 444103834 441963258 440254977 439273077 438804215 438691758 438936352 439052006 439191675 439805876
30565 439805876 440265937 440653752 442229998 444764949 446364397 445784542 444505848 444072720
30557 444072720 444456269 445115148 445175847 444308736 443271559 443166531 445015879 449460508 454719881
30548 454719881 458918603 462060231 463533412 463446547 463563188 463642733 461768190 457766361 453400408
30539 453400408 450685282 450214120 451356229 453876167 457395046 460148428 460921019 460744209
30531 460744209 460649561 460502196 460040880 458969259 457286912 454784973 451584055 448267207
30523 448267207 446326714 446227691 447582272 448882044 448371626 446163059 444092288 443092729
30515 443092729 442458364 441665332 441717411 443379522 446153173 449713094 453642506 456884344
30507 456884344 457802824 456374631 454178434 452397902 450448359 448349896 448074423 450464658
30499 450464658 453858744 456698756 459020308 460626929 460614055 458652380 455600324 452541306
30491 452541306 449769744 447665950 447130277 447691501 447617570 445749983 443106436 441983756
30483 441983756 443255908 445589814 447633353 449458074 450574226 449495580 446384403 443581865
30475 443581865 443366501 445757920 448967605 451912421 453891544 453479696 450173687 445590982
30467 445590982 441999171 440002340 438653181 437536802 437496780 438237206 438795996 439486190 440688477
30458 440688477 442211170 444044446 446723119 449506666 451622433 454005619 456541007 458831594
30450 458831594 461598387 464915323 467480818 467848034 466276665 464216277 462262955 460224191
30442 460224191 458101613 455396005 452542233 450824106 450995096 452248149 453049500 453446567
30434 453446567 453813839 453911981 453272064 451969344 450492751 448953196 449068432 452549399 458034827
30425 458034827 463033288 466524285 467580293 466043039 463454588 459787128 454398408 448555085
30417 448555085 444193920 442530335 442813740 443176890 442615041 441059726 439335537 439728082
30409 439728082 442753095 446138538 447406677 446460735 445112679 444982968 446123789 447707221
30401 447707221 449434066 451194571 452721160 453602607 454022619 453700357 452032414 450014014
30393 450014014 448942059 448897969 449154813 450026100 452321103 455390579 457873666 458452635 456796085
30384 456796085 454076394 451344566 449097389 447755283 446923127 446624719 447015818 447636787
30376 447636787 448051655 447993382 447567019 446865352 446527621 446788123 446556405 445285522 443326069
30367 443326069 441165912 438913109 436812920 435781511 436068662 436624981 436444221 436333552
30359 436333552 437484289 439495099 441304614 441524902 439848377 437835241 436603233 436181895
30351 436181895 436617400 438065835 440405823 443166928 445042399 444666860 442119479 439682528
30343 439682528 439112362 440209051 442281054 443436401 441943142 438763780 435473479 432466353
30335 432466353 429897686 428894367 429788433 431276972 432894383 434444331 435343298 435262231
30327 435262231 434974675 435358595 436757617 439258998 441730155 443165106 444094871 444687392
30319 444687392 444992925 445317411 445364480 444391311 442484554 440203939 437707328 435756495 435055124
30310 435055124 435825507 437403565 438669065 440320352 443461688 447481472 451189083 453919357
30302 453919357 454655394 452146490 446513705 439689657 434057862 430651020 429503343 430450345
30294 430450345 432468658 433819384 434230828 434816200 436199604 438038725 439419162 439499327
30286 439499327 437954070 435987236 435217626 435622335 436030584 435096540 433326794 433269199 436073219
30277 436073219 440840644 446094684 449789341 450856539 450596522 450727912 450776014 449644606
30269 449644606 447892251 446353397 445748599 446528140 448089720 449957473 451509978 452422292
30261 452422292 453310404 454047583 453932206 452882409 451196984 449648349 449760250 451057494
30253 451057494 451271230 449399124 445545475 442218419 442064465 442907117 441792440 440303353
30245 440303353 440949933 442781639 443088997 441800206 440921918 441486789 442950397 443843483 443146019
30236 443146019 441975421 442499515 444657562 447170748 449919374 453163281 455383275 455009803
30228 455009803 452613467 449864338 447954891 446839890 446416011 446369425 446558464 447836282
30220 447836282 449794363 451517287 452601529 452229431 449754156 446147761 442550873 439420002
30212 439420002 437969904 438969477 442101492 446140199 449623623 451666128 452408634 452403711 452222863
30203 452222863 452315629 453069038 453677658 452946320 450739825 447977745 445839429 444757325 443356299
30194 443356299 440466442 437127852 435448194 436269736 438626515 441326563 443330433 443948180
30186 443948180 442936998 441305827 440731443 441400944 442968000 445068097 446367117 446144150
30178 446144150 444584808 441627698 437804794 434201958 431226012 429223328 429197667 431131084
30170 431131084 433360554 435895577 439539693 443590980 446773570 448500323 449178109 449527056
30162 449527056 450079401 450630272 450718463 451141348 452535976 454208340 454764476 453415868 451034851
30153 451034851 448407077 446165477 445507229 446752821 449603913 452804289 454308379 453673041
30145 453673041 452542159 452313908 452234193 450827326 447998361 445398513 444765813 445911088
30137 445911088 447413340 447965093 446803952 444505069 442125420 440475730 440159962 440850444
30129 440850444 441815728 442524024 443036340 443313062 442345883 440260719 438722895 438964929 440959023
30120 440959023 443576332 446529132 449696914 451870506 451504971 448019097 442605785 437731529
30112 437731529 434653466 433301336 434072256 436670772 440020695 442437082 443074021 443041640
30104 443041640 443092620 443115071 442921304 443001599 443484060 444146927 444657302 444251029 443057790
30095 443057790 442694264 444679445 449349924 455892158 462212318 466055095 466625651 464980391
30087 464980391 463011502 461108357 458189706 454092100 450292978 447808958 446623153 445721121
30079 445721121 443576407 440028226 436821159 435987074 437780858 440647776 443081129 444449105
30071 444449105 444943184 445591526 446881731 447533893 447061953 447026705 447898772 448249234 447093714
30062 447093714 444327255 440537260 437654645 436619619 436250681 435090433 433721919 433986049
30054 433986049 436451396 440331848 443430573 443313366 440642051 437208446 433201560 429541430
30046 429541430 427696582 427832770 428999675 431139131 434955293 439975439 444425874 446694016
30038 446694016 446312446 443874072 440456863 437806169 437978741 441326620 446359580 450710405
30030 450710405 452963414 453295158 452924312 452941482 453413346 453646646 452342239 448775454 444526010
30021 444526010 442234334 442596011 444550995 446776139 449367752 452231072 454746444 456892389
30013 456892389 458905871 460401764 460737641 459862435 458175629 456628048 455660769 455259463
30005 455259463 455178870 454534633 452837901 450586086 448232472 446488207 445176747 443629289
29997 443629289 442990831 445012534 448566562 450718703 450787138 449578375 447747874 446157994
29989 446157994 445290440 445136138 445431014 445696495 445442816 444512667 442713479 440583979 439252320
29980 439252320 438479471 437563268 437673766 439192641 440698678 440827388 439776847 439118630 440027517
29971 440027517 442631392 446422219 449845265 450524585 447462872 442214334 437357758 434544443
29963 434544443 433851580 434324597 434685798 435414474 437906437 441414989 444548860 446514568
29955 446514568 446810154 446251136 445469166 443603267 440628169 438443818 437175657 434725580
29947 434725580 431230173 428988405 429237632 430695202 431880629 432636863 433457056 434961171
29939 434961171 436860437 437271979 434867488 431304485 428995416 428821925 430488130 432823459
29931 432823459 434114671 433761247 433095449 433196370 434091430 435318183 436397722 439074222
29923 439074222 444430291 449473848 450756433 447520358 441335270 434533313 428782319 425623116
29915 425623116 425948062 428196826 430170544 431748126 432913259 432698527 432059258 433359516
29907 433359516 437509258 443212971 447683178 449527193 449200241 447232228 444780240 443252831
29899 443252831 443195511 443503922 443440808 443639965 445184216 448528884 452883492 456865321 458250914
29890 458250914 455769582 450698972 445428115 441585783 439508472 438137935 437029858 436765470
29882 436765470 437180134 437853257 439130876 441303927 444201364 447712334 450647869 452040475
29874 452040475 452569925 452603101 452383412 452479317 452863795 453322523 453636934 453499062 453330216
29865 453330216 453211721 451801500 448417540 443844704 440497653 439734153 440242335 440492281
29857 440492281 440534665 440613938 440934481 441609511 441340825 439520521 437478512 436628127 437009653
29848 437009653 438118852 439746798 440949226 440915459 440627803 441104174 441465587 441087683 441839628
29839 441839628 444852220 448419218 451282653 453972923 456786944 459165422 459767350 457185548
29831 457185548 452320154 447123332 442682466 439920707 439352775 440389556 441371781 441739704
29823 441739704 441441135 439837599 437162321 433828353 430418380 428166374 428317017 432211445
29815 432211445 439175671 445533999 448857739 449555824 448539945 446343877 443433668 440735771
29807 440735771 439054179 438820624 439379445 440035592 440864579 441752039 442137418 441502626 439860606
29798 439860606 437342493 435401189 435233852 436014579 436981248 438135024 440176637 443170556
29790 443170556 446004155 447759984 448357080 448756618 449567515 449936841 449503033 448737420 447027649
29781 447027649 444377286 442338825 442363816 444387883 446894577 447034401 443414103 437247070
29773 437247070 431380126 429418460 432240245 437035556 441324870 444472890 445678628 444410472
29765 444410472 442218820 441524986 443236259 445177869 445815370 445933012 445140302 442721203
29757 442721203 440550258 440857911 442097767 441954195 441327584 442121925 443718336 444241884 443076975
29748 443076975 440895276 439200215 439099932 440459739 442399615 444237346 446311674 448178803
29740 448178803 448880713 448427828 447156788 446015820 445911802 446491095 446614406 445764938 444508443
29731 444508443 443787486 444496474 446730728 448334970 448341847 448247009 448463906 448890976 449786557
29722 449786557 451110823 452254903 452558652 452033723 451168885 451125810 452933415 456581053 460809897
29713 460809897 463177903 462733859 460262461 457233045 455113312 453475936 450965966 448209256
29705 448209256 446507310 445370588 443981726 442954484 442726101 442848029 442334897 441429397
29697 441429397 441290386 441525929 441321141 441098773 441693374 442594929 442849920 442238269 440692170
29688 440692170 439195753 438492111 439244239 441406305 443302964 444922057 446661118 447334449
29680 447334449 446300148 444055127 441803171 440936325 441765397 444075763 446710277 448396742
29672 448396742 449512608 450531641 451144658 451706607 451772328 449956038 446580471 443692659
29664 443692659 442970733 443902431 445360620 447143004 448387598 447847847 444470618 438916783
29656 438916783 433818956 431160558 431602894 433794172 435343600 435914926 437050859 439557992
29648 439557992 442512928 444577219 445618607 445363659 443638714 441494728 439867489 439580499
29640 439580499 440347215 440682811 440759793 441918716 444321373 446756804 447465589 446146142 444509779
29631 444509779 444154461 444898598 445179315 444841710 445186740 446070537 446864078 448247650 449994486
29622 449994486 450415618 448408528 445495060 444793666 447225401 450969847 453908272 455167065
29614 455167065 454377343 451046058 445872794 441622355 441193803 445358976 452023031 456646896
29606 456646896 457307238 456124001 454690384 453772220 453518990 452507896 449864535 447004839
29598 447004839 444532448 442790239 443145731 444934282 446031729 445878715 446305440 448348609
29590 448348609 450391716 450051550 446802400 442488528 439722578 439482090 441047674 443850984
29582 443850984 446716253 448551482 449331057 448911860 447205478 444668183 442441418 441710384
29574 441710384 441961954 442416238 442857008 442609521 441509384 440282313 439676467 440346934 441739574
29565 441739574 443025405 443908122 444623468 445957769 447912505 449194503 448847407 447065291
29557 447065291 444301699 442032498 441352384 441897748 443376058 445485967 447404099 448581797
29549 448581797 449828185 451255319 452118851 452159545 451337645 450138267 448979845 447968111
29541 447968111 447478614 447331913 446660511 445540293 444726167 443742828 442369030 442136269 444135327
29532 444135327 448226728 452659572 454625565 453931385 452342878 451140162 451467172 453142381
29524 453142381 454751412 455420719 455208200 454099658 452739093 452088477 451736221 450976910 450418840
29515 450418840 450916390 451019535 449025941 446251073 444717159 443657143 441853979 440313896
29507 440313896 439741638 440062083 441913463 444162264 445018823 445522230 447265483 449907210
29499 449907210 451982151 452918397 452855759 451621794 448858894 445067707 441494184 439400077
29491 439400077 439691879 442024268 445192511 448599296 451911631 454286034 455099398 454412360
29483 454412360 452691672 451105258 449815030 448226187 447582557 448970953 451455173 453207644
29475 453207644 452616870 449986507 446893569 444308345 441692442 439832211 439655448 438772337
29467 438772337 436223591 434015602 433804439 435749659 438587374 441143846 443164507 444413722
29459 444413722 445281830 445678016 445343092 444558898 443616631 443819395 445835489 448958628 451438496
29450 451438496 451205459 447404210 441427037 435965772 433106066 433062294 434797858 436835708
29442 436835708 438240538 439257119 440366384 440615614 438673288 436238565 435890191 437756958
29434 437756958 439923068 441219413 441903271 442205090 443156647 445003128 445847570 445731858 446368870
29425 446368870 448078258 450096038 452002602 453405376 453231488 451110355 447944177 444682576
29417 444682576 441863948 439533505 437211374 434966998 432902440 430310455 427781008 426876327
29409 426876327 427492356 428826755 430530318 431956915 432222245 431288766 430952628 432260186
29401 432260186 434623911 436561407 437247089 437338305 437196421 437063394 437005329 437050062 437086886
29392 437086886 437367607 438732657 440792291 442121584 443184617 445127611 446845381 447018134
29384 447018134 446309573 445435327 444935756 445638754 447032969 447687554 447443407 446322472 443628185
29375 443628185 440492692 439269755 441228434 444927224 447613568 448724941 449808159 451397026
29367 451397026 452304059 451292017 448618902 445424886 442354496 439962947 438912968 439480869
29359 439480869 440622443 440975433 440728581 440641750 441801128 444567601 447106374 447767219 447195484
29350 447195484 447558503 449749292 452437358 454306047 454802499 454020582 452874534 451757125
29342 451757125 450094930 448093877 446619138 446157019 447077463 449388132 452264135 454091376
29334 454091376 454278058 453783177 453393034 453914527 455137944 455436971 455118877 456150878 459056428
29325 459056428 462576878 465222916 466682460 467553452 467764264 466327869 464162984 463903663
29317 463903663 466037050 468654532 469428958 467248382 463546659 459629849 454978230 449874484
29309 449874484 445832253 443774420 443679464 445799850 449258703 452556644 454375178 454291228
29301 454291228 453445786 452675641 451587422 450164457 449031918 448110428 447656288 448433738 449524078
29292 449524078 450200105 451073032 451421973 450854105 449718674 448479783 447267795 446641463 446826067
29283 446826067 446510453 445159542 444157333 445046568 447517745 450005722 451563984 452647948
29275 452647948 452908769 451642720 448748877 444860648 442429122 443416846 447682493 452779048
29267 452779048 455439567 455075717 453529255 452314235 451448746 450642079 449541703 447395629
29259 447395629 443643692 438913237 435918363 437075286 441465965 446784186 451237530 453595170
29251 453595170 453266128 450771789 447126600 444219149 443564676 444825687 447077142 449402235
29243 449402235 450459654 449138560 446290347 443550901 441248546 439728169 439946196 441963884
29235 441963884 443958665 444076615 442741557 442054921 443903268 448104728 453427068 458666709
29227 458666709 462332369 463254630 461710905 458641115 454956022 451214496 448103581 445956576
29219 445956576 444280635 443319826 443658395 443611554 441502668 438891696 437545190 437489679 438295309
29210 438295309 439497176 440447345 440741180 440656308 440632357 440369137 439047656 436689381 434904110
29201 434904110 435616589 438808263 442477210 445287061 447819451 450602878 452402521 451890310
29193 451890310 449831145 447062114 444285844 443699024 445529981 446988497 446853426 446689421
29185 446689421 447461453 448978139 449884111 450056353 450733789 451555044 451163716 449273971 446898084
29176 446898084 445224922 445007066 445739535 446576965 447225977 447626745 448433232 450511229 452626523
29167 452626523 453103036 451391903 448651741 447460615 448551184 450721157 452912910 454797041
29159 454797041 456206701 456474896 455551696 453934831 452271562 450633365 448119357 444361214
29151 444361214 440463592 438383080 439253183 442566677 446754873 450243845 452513442 453661324
29143 453661324 453664247 452202374 449984872 448763044 449246932 449984670 449435423 448621705 449802056
29134 449802056 453178247 456248717 456918786 455898683 454389630 452731482 451223939 450384567
29126 450384567 450787867 452125200 453051911 453192376 453390422 453891821 453617707 451908912 449076504
29117 449076504 445375547 442336919 441123578 440879003 440121027 438017466 435164098 433287288
29109 433287288 433326570 435386131 438053285 439715546 440459722 441475804 444266554 448698217
29101 448698217 452375173 453549439 453372951 453284369 452881745 451592417 449454183 446743982
29093 446743982 443769075 441839954 442142875 443079728 442539308 440835087 439369013 438237143
29085 438237143 436683126 434265300 431953729 431124794 431579415 431772040 430915399 429780192
29077 429780192 430241685 432721571 435561737 438222659 440775866 442958768 444877665 446585041
29069 446585041 447223418 445564295 441164138 435617449 432364035 432618303 434602944 437377373
29061 437377373 440807066 444298513 446781505 447727688 448217344 449786331 452575585 454905577
29053 454905577 456031059 457366722 459254082 459446235 456675553 453130032 451279298 450884353
29045 450884353 450535286 448653576 444951886 440915456 437437006 434596283 433465575 434922298
29037 434922298 437930248 440243404 439651293 436725507 434474893 434049963 434287623 434496142
29029 434496142 435079849 436174278 437765988 439828151 441447340 441165764 439063010 437024288
29021 437024288 435974946 435603508 436049733 437780556 440346347 442734873 444314939 444891244
29013 444891244 444651526 443992892 442859446 441260929 439580165 437993091 437230049 438145285
29005 438145285 440528360 443057985 443342441 440681930 437888694 437861735 440297229 443053928
28997 443053928 444688244 445001210 444134151 442281328 440565993 439905277 440767791 443370128
28989 443370128 447407715 452252304 456935267 459844823 459605263 456734101 453424836 451354579
28981 451354579 451170693 452226309 452833628 452746549 452594688 452868113 454587831 458443350 462612448
28972 462612448 464997219 464889099 461868183 456413079 449970492 444102438 440477938 439672533
28964 439672533 440927960 442970132 445540956 448817540 452033196 454115144 454258436 452987117
28956 452987117 451971714 452282987 453293077 453490655 452453866 451114046 450365421 450321158 450848020
28947 450848020 451232123 450938293 451153524 452034896 452745708 452967747 452502420 451653187 450121618
28938 450121618 447104055 443235052 439384570 435439895 431121159 427657699 426666786 427584628
28930 427584628 429396981 431167182 432445258 433778473 435488094 437726644 439447940 439401494
28922 439401494 438394544 438046268 437852010 437831573 438616034 438738694 437280822 435511630 435037272
28913 435037272 436304871 438411906 440639213 442962810 444814979 445710952 445232497 443888610
28905 443888610 443214320 444244248 446795217 450167770 452938353 453810782 451868480 447815278
28897 447815278 443672988 441674535 442446312 443944715 444862924 445729069 446716012 446707308 444562251
28888 444562251 440998661 437686106 436153671 436511377 437214257 437808046 439042047 441319563
28880 441319563 444062157 446288737 446035833 442970932 440366749 440835949 443830458 447123415
28872 447123415 449144101 450632396 451722025 450923439 448842842 447375062 447060349 448170948
28864 448170948 450337335 452980855 455518307 456638917 455324874 452581320 450172981 449021423
28856 449021423 449496389 451005559 453057893 455517469 457807184 458615725 457473396 455275693
28848 455275693 452823339 450098211 447153803 445335900 445797592 447599289 448911336 448836766
28840 448836766 448288027 448355184 447391127 443712154 439167582 436830726 436864453 436852787 435556071
28831 435556071 434129803 434727352 437899262 441222532 442274222 441927339 441579568 441507816 442544673
28822 442544673 445077358 447989224 449882569 450399232 450218488 449989380 450239996 450460391 449825717
28813 449825717 447967750 444980300 441989076 439824027 439335537 440571351 442607302 444696783
28805 444696783 446615710 447681976 447596535 447513246 448726363 450759268 451832345 451090406 449330539
28796 449330539 447330257 444771973 442672847 442608930 444146099 445917323 447136701 448157142
28788 448157142 449666327 452077947 454255548 455389923 455901704 455067239 451707750 446671658
28780 446671658 442588544 440902939 440717758 440418477 440863025 443013740 446206741 449823482
28772 449823482 453160410 455792308 457988049 458998841 457691352 453995714 449825166 447771027
28764 447771027 447625026 448197896 448365800 447780708 447310053 447708712 448829261 449964471 450361191
28755 450361191 449204493 446645391 444037929 441465864 438529244 435767574 433940067 433294669
28747 433294669 433892436 435022921 435489332 435485767 435544316 435598693 435472446 434570405 432704447
28738 432704447 431284765 431632141 432954211 434376753 436276055 438286047 440273020 441807128
28730 441807128 441462669 438628051 434901287 432656103 432359129 431690773 428922941 425657017
28722 425657017 424207932 424575581 425629984 427166451 430244182 435009526 439646577 442236289
28714 442236289 442966942 443340321 443694468 443447029 442635782 441716027 440101509 437496842 434567806
28705 434567806 432015405 431518486 433625424 436063240 436448483 434391471 431803593 431147375
28697 431147375 433149097 436194848 438575084 439849836 439660032 438978595 439865366 442147522
28689 442147522 444283612 445918709 447606734 449441820 450533932 449670681 447212553 444790263
28681 444790263 443264517 442632450 442700694 444152599 447543581 451972458 455353283 455841362
28673 455841362 453297450 449406977 445622289 442336031 439213664 436562666 435294969 435155802
28665 435155802 435552623 436607095 437548317 436862704 435033242 434516345 436704839 440594940
28657 440594940 444610299 447794768 449896216 450799049 449767636 446245666 441291743 437252036
28649 437252036 435210450 434577586 434572399 434222791 433430432 433295853 434706074 437660118 440883154
28640 440883154 442876599 443458842 443534794 443657105 443793739 443638091 443428967 444056822 444823288
28631 444823288 444498996 443223805 441791547 440039622 437287706 433871892 430669277 428613642
28623 428613642 427660607 426895299 426799197 428073863 429879416 432086230 435760036 440585699
28615 440585699 445361275 448703022 448683826 445006281 439514036 433942670 429671610 427769951
28607 427769951 428756410 431413028 433111301 432751549 431732060 431106156 430599551 430337365 431489179
28598 431489179 434561261 438633935 442805324 445883314 446606211 445048714 442333489 439771066
28590 439771066 437938528 436096791 434342980 433199381 432218707 432240839 434644087 438642387
28582 438642387 442102458 443463228 442418166 440009851 438158683 437627872 438115519 439889802
28574 439889802 443007775 445980672 446731221 445728468 444552409 443232537 441537563 439718521
28566 439718521 438434848 437735915 437518646 437956410 439359292 441073858 441897944 442583034 444033966
28557 444033966 446716251 450534756 453254148 452154738 447710134 442837780 439438317 437617312
28549 437617312 436803823 436511394 435544687 433115521 430809493 430374823 431400023 433267851
28541 433267851 435228155 436984604 438972541 441011938 442555966 444610527 448471115 452871420
28533 452871420 455961874 457478986 458039650 457824413 456810110 454435810 450729817 446791997
28525 446791997 443968768 442750468 443138521 444349690 444923594 444579342 443497663 441666451
28517 441666451 440365712 440190304 439902877 438543533 436346973 434088240 432758800 432155644
28509 432155644 431294594 430706943 431535094 432973585 433936694 435058185 436971285 439855074
28501 439855074 443042593 445773780 447873365 448740374 447836102 444978898 440839558 436021561
28493 436021561 430271949 424718828 421488831 420848897 421475243 421994916 421968469 422463726 424323788
28484 424323788 427347770 431383838 435157569 436974003 437252664 437434496 437605976 436729534
28476 436729534 434885643 433300528 432500804 432092120 431731663 431552337 431627870 432007712 432632880
28467 432632880 433443542 434897307 437597404 443054721 450469762 456138290 459241359 462084332
28459 462084332 465046985 466293202 464794166 461084771 456237178 452040725 449997647 449908636
28451 449908636 450278135 449980328 449115004 448214130 448120100 449330573 451172880 452446380 452774353
28442 452774353 452321206 451074142 449210139 446620860 443657778 441332546 439221377 436675670
28434 436675670 433890337 431971405 432030250 433800884 436193847 438565639 440936442 443167669
28426 443167669 445562553 448208412 449791024 448971029 445955615 442593736 440317883 438861642
28418 438861642 439000916 440843253 442619345 443452401 443813203 444437193 445817926 448037787
28410 448037787 451273159 455982458 461591764 466340722 468629057 468431480 467106692 465160982
28402 465160982 462199416 458026666 451874628 443519262 435298464 430055965 428582928 429903992
28394 429903992 431806517 433031243 434329745 436751745 440005851 442875003 444952917 446584899
28386 446584899 448133356 450166206 453536034 457464838 459538950 458480215 455876422 453876640
28378 453876640 452179871 450435855 449572020 449749119 449843351 448519602 446701896 446117700 446657617
28369 446657617 447239847 447578371 448316051 449718955 450788185 450167419 448768356 448761330 449957380
28360 449957380 449632305 447518008 445545721 443941311 442262991 440561947 438994501 437628652
28352 437628652 436435263 435808761 436198291 437257007 438923046 441173118 444113052 447447542
28344 447447542 449168322 447931824 444998846 442295666 440515579 439389256 438534146 437464456
28336 437464456 436055257 434773716 433639025 433275597 434661176 436943797 438516106 438584467
28328 438584467 437165669 436127279 437273432 439363262 440544729 440098358 438430549 435561310
28320 435561310 431638727 427721487 424805738 423772302 425018810 427745646 430901845 433845428
28312 433845428 435528646 435217925 433989687 433135790 433034516 434029829 435423153 436362106 436910975
28303 436910975 437616991 438513263 439286499 439916375 441078657 443054241 444575964 444215588 442280102
28294 442280102 440889184 441685119 444811759 448982310 452840788 455656815 457230701 457527255
28286 457527255 456929191 455634817 453654825 451125736 447777898 444452280 442712533 442031428
28278 442031428 441379481 441586717 443106394 445719921 448870971 451779941 454279843 455959321
28270 455959321 455933375 454516716 452868486 451594581 450713115 450490376 450458059 449905423 448920980
28261 448920980 447616175 446253949 444995867 443171554 440857285 438877657 437280260 436122078
28253 436122078 436157970 437435122 438143618 436966107 435289943 434850586 436075715 437768288
28245 437768288 438671682 438053779 435778658 433050165 431359863 431369553 433025674 435892966 438602600
28236 438602600 440114484 441011926 441382306 441139647 441638049 443187754 445368797 448139392
28228 448139392 450275286 450706789 449974842 449264678 448924428 448149370 446416127 443687875 440649951
28219 440649951 438282787 436855229 437019594 438789075 440870112 442631399 444076903 444381431
28211 444381431 442417219 439259517 437132235 436803078 437606532 439467197 441876014 443091417
28203 443091417 442399023 441150669 441025583 442872049 446313031 449622193 451384179 451933933
28195 451933933 451241496 448651377 444491797 440719507 438987430 438390562 437725846 437344872
28187 437344872 437601723 438089146 438553399 439116613 440810446 443661843 446391385 448159510
28179 448159510 449329823 450923892 452785091 453354666 452289912 450690585 449189256 447730458
28171 447730458 446459353 445970524 446420672 447418166 448156401 448175219 447643209 446844148 446481721
28162 446481721 447278229 449096634 451225281 453370280 454321095 452638720 449629305 447821752
28154 447821752 448004331 449122151 450167274 450778991 450557840 449304145 447082310 444108777
28146 444108777 441380136 439917808 440072588 440866563 441280091 441861876 443705570 446560587
28138 446560587 449591085 451973363 453200842 453554731 453840119 454807457 456652251 458136896
28130 458136896 458173762 457137749 455948743 454500006 452207152 449487419 446723468 443727227
28122 443727227 440964513 439740344 440090144 441562912 443557373 444859097 444590418 443327450
28114 443327450 441613139 438829555 434877289 431129096 428644271 427913696 430089237 434985878
28106 434985878 439771965 442169490 442647258 442312435 441726248 441664711 442724219 444614933 446124385
28097 446124385 446632305 446216329 445706703 445409084 445221089 445602015 446816569 448548462 450384829
28088 450384829 451960664 452298047 449908791 445124733 439866579 435563674 433090579 432434662
28080 432434662 432574801 432999079 434315783 436434494 438776752 440892680 441822264 441402203
28072 441402203 440887183 441122677 442136479 444291138 447199209 448853456 447562494 444536699
28064 444536699 442980894 443322195 443581572 443144691 442448933 441054712 439187342 437257799
28056 437257799 435044896 432664874 430939562 430278081 430521188 431223676 431946358 433188521
28048 433188521 435576796 439466651 444132959 448235950 451315192 454252868 456989165 458113934
28040 458113934 457368934 455552723 454002766 453949169 454589100 453863735 450945509 447284606 444644845
28031 444644845 443272222 442976645 443198523 442937643 442010681 441310353 441519263 441402453 439794764
28022 439794764 437658352 437491996 440301633 445064153 450608279 455395608 458161280 458227997
28014 458227997 456432373 455726860 457253783 458259052 456931605 454994110 454019923 453397424
28006 453397424 451553310 448974348 447889078 448493426 449595838 450479988 450831568 449992300
27998 449992300 448456979 447617720 446752184 444911090 442658226 441428423 441817592 442795305
27990 442795305 443338046 443398648 442917960 442199726 441929554 442483630 443901044 444670810 443529539
27981 443529539 441228872 439692988 439555911 439625626 439698725 440455982 441989257 443510862 444244411
27972 444244411 445240189 446466713 446296286 445190623 444709100 445680059 447563242 449330012
27964 449330012 450732594 451616236 451909257 451526504 450670474 449992810 449303737 447634091 444690651
27955 444690651 442077570 440489951 439025613 437144063 434334501 431375446 430479154 432563801
27947 432563801 436320025 439678542 441539984 442439005 443303018 444525579 446535591 449221076
27939 449221076 451852413 453857250 455196922 455511925 453557510 449873445 445573089 441591210
27931 441591210 439274368 439570525 440789175 441075520 441659811 444246504 447495955 448894528
27923 448894528 448365036 446336977 443026294 440007895 438658672 438598187 439436879 440653113
27915 440653113 442143374 443974986 445155845 445307804 446053320 447848651 448808642 447980179
27907 447980179 445922276 444244950 444114103 445164786 445960742 445505925 444178805 442990089
27899 442990089 443132610 445042968 447655711 449500093 450215287 449507097 447194023 445026542
27891 445026542 444658238 446140606 447612133 446658599 443381219 438506419 433033202 429144961
27883 429144961 428285140 429344070 430926045 432869639 434943603 436510629 436620288 435473679
27875 435473679 434519792 434807946 436027596 437339228 438320997 438238609 437056578 436269002 436525487
27866 436525487 437036562 437040455 436852455 437103839 437756756 438382942 438389922 437160384 434879338
27857 434879338 432489534 430884244 429566940 427819461 426519606 426676232 428212579 430270442
27849 430270442 431915889 432865241 433908599 435718333 438013566 440705634 443118753 443287920
27841 443287920 440550287 436254230 432415950 430145232 429456044 429871382 431040937 433260601
27833 433260601 436645522 440572148 443934702 445132523 443199644 440082025 438460342 438360968
27825 438360968 438190238 437400560 435892765 433847333 431222090 428470299 426646531 425904781
27817 425904781 425838602 426670716 428067829 428652658 428552907 429405640 431344814 432942764 433786375
27808 433786375 434385834 435105991 436056423 438315570 442850250 448440107 453275616 456621457
27800 456621457 457626248 456514421 455123041 454998429 456278136 456836113 455199832 452033894
27792 452033894 448175459 444450742 441549556 439028309 437445286 437705497 439315828 441299257
27784 441299257 442650923 443523534 445510385 448828086 451031635 450988767 450050632 448608424
27776 448608424 445991552 442599591 439669953 437189921 434581417 432907779 432741846 433770842
27768 433770842 434875899 434664965 434037850 434462549 435856133 437678863 440129169 442441558
27760 442441558 442565902 440484200 438061284 437003376 437530329 438567932 439523962 440516082
27752 440516082 441945454 443612825 444200945 442907819 440244529 437294299 435019123 434014677
27744 434014677 433917771 434366738 435649338 437637368 439806664 442004826 444540590 447028611
27736 447028611 447851977 446857947 445193281 443263676 440857318 438016769 435752205 434992576
27728 434992576 434943005 434204955 433028050 432909893 434554685 437049807 439392546 442086184
27720 442086184 445074045 446463682 446210662 446323372 447017418 446577760 444348826 441055145
27712 441055145 437414399 433848071 431776469 432404836 434782720 437322513 439056642 439813140
27704 439813140 440324207 441083088 441291033 440770589 440175741 439404547 438732653 438805984 439199982
27695 439199982 438591990 436689561 434717765 434365733 436267324 439688803 442913661 445054526
27687 445054526 446479854 447305448 446950289 445115513 442261232 439658397 438560787 439174986
27679 439174986 441082297 443235812 444818345 445900789 446257278 445868450 445213106 443788966
27671 443788966 441175513 439163366 439003629 440032458 441136525 441274700 440376691 438478399
$$ [...]
##END NTUPLES=NMR SPECTRUM
##END=
