##TITLE=C13_DE-44EA3_D2O_R
 D2O, 22300sc

 23.7.2024
##JCAMPDX= 6.0         $$ Bruker NMR JCAMP-DX V2.0
##DATA TYPE= NMR SPECTRUM
##DATA CLASS= NTUPLES
##ORIGIN= UXNMR, Bruker Analytische Messtechnik GmbH
##OWNER= root
$$ XWIN-NMR		Version 3.5
$$ Wed Jul 24 13:39:56 2024 Russian Standard Time (UT+4h)  she@DPX200
##.OBSERVE FREQUENCY= 50.327896
##.OBSERVE NUCLEUS= ^13C
##.ACQUISITION MODE= SIMULTANEOUS
##.ACQUISITION SCHEME= undefined
##.AVERAGES= 22306
##.DIGITISER RES= 17
##SPECTROMETER/DATA SYSTEM= spect
##.PULSE SEQUENCE= zgpg30
##.SOLVENT NAME= D2O
##.SHIFT REFERENCE= (INTERNAL, D2O, 0, 222.565)
##AUDIT TRAIL= $$ (NUMBER, WHEN, WHO, WHERE, WHAT)
$$ ##TITLE= Audit trail, XWIN-NMR		Version 3.5
$$ ##JCAMPDX= 5.01
$$ ##ORIGIN= Bruker BioSpin GmbH
$$ ##OWNER= she
$$ F:/spectra/data/she/nmr/c13/1/pdata/1/auditp.txt
$$ ##AUDIT TRAIL=  $$ (NUMBER, WHEN, WHO, WHERE, WHAT)
(   1,<2024-07-24 13:35:48.65 +0400>,<she>,<DPX200>,
      <created by zg, POWCHK disabled, PULCHK disabled
       terminated by command 'halt'
       configuration hash MD5:
       00 E9 B6 7A A2 85 ED C7 34 08 36 98 17 FE 4E 26
       data hash MD5: 32K
       92 15 28 AC DE 0C BC 95 52 B3 48 CE 78 82 AF 64>)
(   2,<2024-07-24 13:36:07.57 +0400>,<she>,<DPX200>,
      <Start of raw data processing
       efp BC_mod = 2 LB = 2 FT_mod = 6 PKNL = 1 PHC0 = -545.7234 PHC1 = 40.18845 SI = 32K 
       data hash MD5: 32K
       9A CA 20 0E C3 4B 15 A3 20 5F 7D BE CB B6 9E 92>)
(   3,<2024-07-24 13:36:14.64 +0400>,<she>,<DPX200>,
      <abs ABSG = 5 
       data hash MD5: 32K
       6C 90 2D FA 47 FD C2 82 5B 1E 8A 52 30 D1 2D 52>)
(   4,<2024-07-24 13:37:18.75 +0400>,<she>,<DPX200>,
      <pk PHC0 = -14.6872 PHC1 = 81.4 
       data hash MD5: 32K
       FB AD 8F C3 DC D0 48 D7 9D 47 CB DA 78 44 59 87>)
(   5,<2024-07-24 13:37:22.75 +0400>,<she>,<DPX200>,
      <abs ABSG = 5 
       data hash MD5: 32K
       1C 2B AC D3 90 A1 3A 86 1E AF B8 AF 45 8A 5C 74>)
(   6,<2024-07-24 13:39:17.57 +0400>,<she>,<DPX200>,
      <pk PHC0 = 42.31989 PHC1 = -142.5999 
       data hash MD5: 32K
       20 A5 8A D5 2E 4C 28 15 C0 42 87 FE A3 CC A0 9B>)
(   7,<2024-07-24 13:39:21.75 +0400>,<she>,<DPX200>,
      <abs ABSG = 5 
       data hash MD5: 32K
       87 16 18 93 0A B9 5C D7 AC 43 68 59 2A F1 5E 27>)
$$ ##END=
$$ 
$$ hash MD5
$$ 3C 6A 61 A4 99 0A 36 02 EB 41 E7 77 E8 7E 1E F0
##$RELAX= 
##$RELAX= 
##$RELAX= 
##$RELAX= 
##$RELAX= 
##$RELAX= 
##$RELAX= 
##$RELAX= 
$$ Bruker specific parameters
$$ --------------------------
##$DU= <F:/spectra>
##$EXPNO= 1
##$NAME= <c13>
##$PROCNO= 1
##$TYPE= <nmr>
##$USER= <she>
##$AMP= (0..31)
100 100 100 100 100 100 100 100 100 100 100 100 100 100 100 100 100 100 
100 100 100 100 100 100 100 100 100 100 100 100 100 100 
##$AQSEQ= 0
##$AQ_mod= 1
##$AUNM= <au_zg>
##$AUTOPOS= <>
##$BF1= 50.322709
##$BF2= 200.13
##$BF3= 50.322709
##$BF4= 500.13
##$BF5= 500.13
##$BF6= 500.13
##$BF7= 500.13
##$BF8= 500.13
##$BYTORDA= 1
##$CFDGTYP= 0
##$CFRGTYP= 5
##$CHEMSTR= <none>
$$ [...]
##$SUBNAM4= <"">
##$SUBNAM5= <"">
##$SUBNAM6= <"">
##$SUBNAM7= <"">
##$SUBNAM8= <"">
##$SUBNAM9= <"">
##$SW= 239.972175391363
##$SWIBOX= (0..15)
0 1 3 0 0 0 0 0 0 0 0 0 0 0 0 0 
##$SW_h= 12077.2946859903
##$TD= 32768
##$TD0= 1
##$TE= 0
##$TE2= 300
##$TE3= 300
##$TEG= 300
##$TL= (0..7)
120 120 120 120 120 120 120 120 
##$TP= (0..7)
150 150 150 150 150 150 150 150 
##$TP07= 0
##$TPNAME0= <>
##$TPNAME1= <>
##$TPNAME2= <>
##$TPNAME3= <>
##$TPNAME4= <>
##$TPNAME5= <>
##$TPNAME6= <>
##$TPNAME7= <>
##$TPOAL= (0..7)
0.5 0.5 0.5 0.5 0.5 0.5 0.5 0.5 
##$TPOFFS= (0..7)
0 0 0 0 0 0 0 0 
##$TUNHIN= 0
##$TUNHOUT= 0
##$TUNXOUT= 0
##$USERA1= <user>
##$USERA2= <user>
##$USERA3= <user>
##$USERA4= <user>
##$USERA5= <user>
##$V9= 5
##$VALIST= <valist>
##$VCLIST= <CCCCCCCCCCCCCCC>
##$VD= 0
##$VDLIST= <DDDDDDDDDDDDDDD>
##$VPLIST= <PPPPPPPPPPPPPPP>
##$VTLIST= <TTTTTTTTTTTTTTT>
##$WBST= 1024
##$WBSW= 4
##$XGAIN= (0..3)
0 0 0 0 
##$XL= 0
##$YL= 0
##$YMAX_a= 34130713
##$YMIN_a= -116968913
##$ZGOPTNS= <>
##$ZL1= 120
##$ZL2= 120
##$ZL3= 120
##$ZL4= 120
##$ABSF1= 222.5654
##$ABSF2= -17.4314
##$ABSG= 5
##$ABSL= 3
##$ALPHA= 0
##$AQORDER= 0
##$ASSFAC= 0
##$ASSFACI= 0
##$ASSFACX= 0
##$ASSWID= 0
##$AUNMP= <proc_1d>
##$AZFE= 0.1
##$AZFW= 0.5
##$BCFW= 0
##$BC_mod= 2
##$BYTORDP= 0
##$COROFFS= 0
##$CY= -3
##$DATMOD= 1
##$DC= 0
##$DFILT= <>
##$DTYPP= 0
##$F1P= 0
##$F2P= 0
##$FCOR= 0.5
##$FTSIZE= 32768
##$FT_mod= 6
##$GAMMA= 0
##$GB= 0
##$INTBC= 1
##$INTSCL= 4.134877e-10
##$ISEN= 128
##$LB= 2
##$LEV0= 0
##$LPBIN= 0
##$MAXI= 10000
##$MC2= 0
##$MEAN= 0
##$ME_mod= 0
##$MI= 0.1934396
##$NCOEF= 0
##$NC_proc= -2
##$NLEV= 6
##$NOISF1= 120.0001
##$NOISF2= 80.00006
##$NSP= 0
##$NTH_PI= 0
##$NZP= 0
##$OFFSET= 222.5654
##$PC= 1.4
##$PHC0= -518.0907
##$PHC1= -21.0114
##$PH_mod= 1
##$PKNL= yes
##$PPARMOD= 0
##$PSCAL= 0
##$PSIGN= 0
##$REVERSE= no
##$SF= 50.3227345484362
##$SI= 32768
##$SIGF1= 140
##$SIGF2= 120
##$SINO= 11.81781
##$SIOLD= 32768
##$SREGLST= <13C.CDCl3>
##$SSB= 0
##$STSI= 32768
##$STSR= 0
##$SW_p= 12077.2946859903
##$SYMM= 0
##$S_DEV= 0
##$TDeff= 32768
##$TDoff= 0
##$TI= <>
##$TILT= no
##$TM1= 0
##$TM2= 0
##$TOPLEV= 0
##$USERP1= <user>
##$USERP2= <user>
##$USERP3= <user>
##$USERP4= <user>
##$USERP5= <user>
##$WDW= 1
##$XDIM= 32768
##$YMAX_p= 111132258
##$YMIN_p= -123391039
$$ End of Bruker specific parameters
$$ ---------------------------------
##NTUPLES= NMR SPECTRUM
##VAR_NAME=  FREQUENCY,     SPECTRUM/REAL,   SPECTRUM/IMAG
##SYMBOL=    X,             R,               I
##VAR_TYPE=  INDEPENDENT,   DEPENDENT,       DEPENDENT
##VAR_FORM=  AFFN,          ASDF,            ASDF
##VAR_DIM=   32768,         32768,           32768
##UNITS=     HZ,            ARBITRARY UNITS, ARBITRARY UNITS
##FACTOR=    0.368581032318806, 1,           1
##FIRST=     11200.0995020947, 0,            0
##LAST=      -877.195183895579, 0,           0
##MIN=       -877.195183895579, -123391039,  0
##MAX=       11200.0995020947, 111132258,    0
$$ Real data points
##PAGE= N=1
##DATA TABLE= (X++(R..R)), XYDATA
$$ [...]
##PAGE= N=2
##DATA TABLE= (X++(I..I)), XYDATA
28433C03622165p54254P67139J666007J353871Q13734N64793j45848j114347r75805
$$ 303622165 302867911 303635050 305301057 306654928 307468662 308033455 307887607 306773260 305797455
28424C05797455L91091J272050N33515l03010n31900n91936l83654K76736O18005
$$ 305797455 306188546 307460596 307994111 307691101 307159201 306567265 306183611 306460347 307078352
28415C07078352J21511o56866j587946k328053k372338j569801P7777J779434
$$ 307078352 307199863 306542997 304955051 302626998 300254660 298684859 298762636 300542070
28407C00542070K133791J116090j84791J87376K086190K739261J950474J283901
$$ 300542070 302675861 303791951 303607160 303794536 305880726 308619987 310570461 311854362
28399C11854362P55401L19564L8428j190325k566119k152422j168555j587646
$$ 311854362 312609763 312929327 312967755 311777430 309211311 307058889 305890334 304302688
28391C04302688k281987k014703j547064j189885l2134J876067K881766K273065
$$ 304302688 302020701 300005998 298458934 297269049 297236915 299112982 301994748 304267813
28383C04267813J044261P1010p48301q62113k89962M15535M00823l55111j038014
$$ 304267813 305312074 305383084 304634783 303772670 303482708 303898243 304299066 303943955 302905941
28374C02905941k102241l314690l299006k443001j547149j045075j030490n59423
$$ 302905941 300803700 297489010 294190004 291747003 290199854 289154779 288124289 287564866
28366B87564866K40099O51357K11728o26507m08635J113854K601015K437298R80689
$$ 287564866 287804965 288456322 288668050 288041543 287632908 288746762 291347777 293785075 294765764
28357B94765764l96254j97477J417277K679786K870149K652314K413673J520024
$$ 294765764 294369510 294172033 295589310 298269096 301139245 303791559 306205232 307725256
28349C07725256N04319J48609N94287K033606K571675R44080j126943k089571
$$ 307725256 308229575 308378184 308972471 311006077 313577752 314521832 313394889 311305318
28341C11305318k124501k222045j953686j413645j326046r76050j67184K40610
$$ 311305318 309180817 306958772 305005086 303591441 302265395 301289345 301122161 301362771
28333C01362771M14071J122117J849055J142313r54766k394755k256645j927862
$$ 301362771 301776842 302898959 304748014 305890327 304935561 302540806 300284161 298356299
28325B98356299k492723k656922j760677k46638J484748L453301M870821M921297
$$ 298356299 295863576 293206654 291445977 291199339 292684087 296137388 301008209 305929506
28317C05929506M112055K610280N65277o53259q72318j045460j830246k501396
$$ 305929506 310041561 312651841 313217118 312563859 311691541 310646081 308815835 306314439
28309C06314439k711140k538146k053588j206167M10239J767845O09251k009518
$$ 306314439 303603299 301065153 299011565 297805398 298215637 299983482 300592733 298583215
28301B98583215l006108k199908J6904K374301K846603J830515J052938O27332
$$ 298583215 295577107 293377199 293394103 295768404 298615007 300445522 301498460 302125792
28293C02125792L7227l63263r57906k624666l876350l265194j637951j58156J319511
$$ 302125792 302163019 301799756 300841850 298217184 294340834 291075640 289437689 289279533 290599044
28284B90599044J866761J169906L60849J097563K485009K903302K747931L454630
$$ 290599044 292465805 293635711 293996560 295094123 297579132 300482434 303230365 306684995
28276C06684995M048066L028402P56355j487779k390075j783824m9707Q71707
$$ 306684995 310733061 313761463 314517818 313030039 310639964 308856140 308806433 309678140
28268C09678140N8306j413361j969412j062666J67065O73965R07754Q08912l57807
$$ 309678140 309736446 308323085 306353673 305291007 305458072 306132037 307039791 307848703 307490896
28259C07490896j812754j742859j96856O11789K30670o94742j631404j107511
$$ 307490896 305678142 303935283 303738427 304350216 304580886 303886144 302254740 301147229
28251C01147229P44079K000231J095892j034924k408012k749315j853651r40908
$$ 301147229 301891308 303891539 304987431 303952507 301544495 298795180 296941529 296000621
28243B96000621k44044J718825L360804K749335K021204J945211J080620k11638
$$ 296000621 295756577 297475402 300836206 303585541 305606745 307551956 308632576 308420938
28235C08420938n60624j19075L68615R76344J408033J456513J215675O72514r65737
$$ 308420938 307860314 307741239 308109854 309086198 310494231 311950744 313166419 313838933 312873196
28226C12873196k641807k014527q2788O78060O3530r70523j431481j256899j201808
$$ 312873196 310231389 308216862 308134074 308812134 308875664 307905141 306473660 305216761 304014953
28217C04014953r38934j67010K75168Q03303J527635J740222J218479P00901Q79912
$$ 304014953 303076019 302909009 303184177 303987480 305515115 307255337 308473816 309174717 310054629
28208C10054629J035151J90964q95584j246969p59579N55557J403061N82794j157019
$$ 310054629 311089780 311280744 310385160 309138191 308378612 308934169 310337230 310920024 309763005
28199C09763005j487356q15969q98099j621984k539917k151402J14764K275265
$$ 309763005 308275649 307459680 306561581 304939597 302399680 300248278 300363042 302638307
28191C02638307J914095M8034r94490j319739j491903j188433j042961j232326
$$ 302638307 304552402 304600436 303605946 302286207 300794304 299605871 298562910 297330584
28183B97330584n26525Q82826J888434J549815L4666r65573n83674M18148J118532
$$ 297330584 296804059 297686885 299575319 301125134 301159800 300194227 299610553 300028701 301147233
28174C01147233J321952J195205J319278J839391K305490J736330M85069O3940
$$ 301147233 302469185 303664390 304983668 306823059 309128549 310864879 311349948 311413888
28166C11413888N5586o63861j575210k109624j999447q80536K19241n08488k094769
$$ 311413888 311469474 310805613 309230403 307120779 305121332 304240796 304460037 303951549 301856780
28157C01856780k860469k618732j124190P16709J210716P60407N18157O15888
$$ 301856780 298996311 296377579 295253389 295970098 297180814 297941221 298459378 299075266
28149B99075266J143245J183620J058592J610256J391284J45448o44691r35421
$$ 299075266 300218511 301402131 302460723 304070979 305462263 305607711 304963020 304027599
28141C04027599r64767q53949j194640j320470q14169l80914p29069j186176q51318
$$ 304027599 303062832 302208883 301014243 299693773 298879604 298498690 297769621 296583445 295732127
28132B95732127K3857J185472K145557K546722K636463J420932q22884k037128
$$ 295732127 295755984 296941456 299087013 301633735 304270198 305691130 304868246 302831118
28124C02831118k137789j987769j474855l98765J144650K501005K397430J289165
$$ 302831118 300693329 298705560 297230705 296831940 297976590 300477595 302875025 304164190
28116C04164190J225703K252289K676015J785934k91113k695044l397320k282214
$$ 304164190 305389893 307642182 310318197 312104131 311813018 309117974 305720654 303438440
28108C03438440p70792P79889J578431J089374Q40930J508614J347319O07274
$$ 303438440 302667648 303447537 305025968 306115342 306956272 308464886 309812205 310419479
28100C10419479J69178l28246n08413L43461J530784J520052n49274k716523k303927
$$ 310419479 310588657 310260411 309751998 310095459 311626243 313146295 312597021 309880498 307576571
28091C07576571q58297j034199j772450p25971J213592K283781K509778K131544
$$ 307576571 306718274 305684075 303911625 303185654 304399246 306683027 309192805 311324349
28083C11324349R23149o42300j233181j199097j063641o46473k93491k30768o18807
$$ 311324349 312247498 311605198 310372017 309172920 308109279 307462806 307169315 306938547 306319740
28074C06319740j341205j776295j268570k03457O75378J046615Q33413R05541
$$ 306319740 304978535 303202240 301933670 301730213 302405591 303452206 304285619 305191160
28066C05191160J034098K39976j019320j403754p12674k1056k4670n27022r11489
$$ 305191160 306225258 306465234 305445914 304042160 303329486 303308430 303283760 302756738 301845249
28057C01845249l97125P87867J697102K644026L752989L689269L215791K628402
$$ 301845249 301448124 302235991 303933093 306577119 310330108 314019377 317235168 319863570
28049C19863570J653087M15698j085397k507668l886133m843434m340208k726300
$$ 319863570 321516657 321932355 320846958 318339290 314453157 309609723 305269515 302543215
28041C02543215r32380N90096R35108M90413N49893O63844j85187o85900o37946
$$ 302543215 301610835 302200931 303136039 303626452 304176345 304840189 304655002 303969102 303331156
28032C03331156o49614K12357J401198J159664O07674J286098J352812Q73163
$$ 303331156 302681542 302893899 304295097 305454761 306062435 307348533 308701345 309574508
28024C09574508N51682J09102j45033j17689J33142M47345N23141q4272j139569
$$ 309574508 310126190 310235292 310090259 309972570 310105712 310553057 311076198 310991926 309852357
28015C09852357r86511Q09192K824274K531418Q57744Q70676J632972J797580
$$ 309852357 308865846 309675038 312499312 315030730 315888474 316759150 318392122 320189702
28007C20189702J285368k55186j871635k459421k839661k929012j723049L55712
$$ 320189702 321475070 321219884 319348249 316888828 314049167 311120155 309397106 309752818
27999C09752818J891976J176851m20004j162520k180847k493040j001171J033437
$$ 309752818 311644794 312821645 312401641 311239121 309058274 306565234 305564063 306597500
27991C06597500K289501K722948J999713k59975k665368l378258k626207j796608
$$ 306597500 308887001 311609949 313609662 313349687 310684319 307306061 304679854 302883246
27983C02883246j216250o33359K39225P99118R00716J060861J108094O54269n79410
$$ 302883246 301666996 301033637 301272862 302071980 302972696 304033557 305141651 305795920 305216510
27974C05216510j856566k185270r57423O50136J260806J286697J023045M03872
$$ 305216510 303359944 301174674 300217251 300867387 302128193 303414890 304437935 304841807
27966C04841807J54782j1672j054733k388091k495992r99485J90805L73451N24776
$$ 304841807 304996589 304984917 303930184 301542093 299046101 298046616 298237421 298610872 299135648
27957B99135648K77262M70362J321435J388085J154158J769637J754652Q8444
$$ 299135648 299412910 299883272 301204707 302592792 303746950 305516587 307271239 307359683
27949C07359683k319722l967643l848355j531372J867823M222906M016711J954531
$$ 307359683 305039961 301072318 297223963 295692591 297560414 301783320 305800031 307754562
27941C07754562N57451M75245j28600j273470j793091j593000j197332j241972
$$ 307754562 308312013 308787258 308658658 307385188 305592097 303999097 302801765 301559793
27933C01559793n45977R07283J761297K019105K247437K258396J634128Q16890
$$ 301559793 301013816 301921099 303682396 305701501 307948938 310207334 311841462 312658352
27925C12658352k22142j571790k799395l819934m070994k536075l87130Q59064
$$ 312658352 312436210 310864420 308065025 304245091 300174097 297638022 297250892 298109956
27917B98109956J535440J440912M39608j22583r39J01660J60426L68350N97083
$$ 298109956 299645396 301086308 301525916 301403333 301402394 301504054 301664480 302032830 302629913
27908C02629913K95826p23966j798529j735328o71803J180361K943512K716286
$$ 302629913 302925739 302201773 300403244 298667916 297996113 299176474 302119986 304836272
27900C04836272M52286j482958j616623j83204J881871L130452K089424n6157
$$ 304836272 305288558 303805600 302188977 302005773 303887644 307018096 309107520 309051363
27892C09051363j385174r88586N70785J620008K025632K550863L401481L457439
$$ 309051363 307666189 306677603 307248388 308868396 310894028 313444891 316846372 320303811
27884C20303811J896955n53355k520537k857898j853058K1555J222982R51801
$$ 320303811 322200766 321647411 319126874 316268976 314415918 314437473 315660455 316612256
27876C16612256K59190j81556p6614J68725L32528M5492p57418j641383j824339
$$ 316612256 316871446 316689890 316613276 316782001 317114529 317160021 316402603 314761220 312936881
27867C12936881j204536o52749n07382O05897J747084O90950j704322l314671
$$ 312936881 311732345 311079596 310572214 311178111 312925195 313616145 311911823 308597152
27859C08597152m005014l857173k272156K29091K090564K961805K427327J133071
$$ 308597152 304592138 300734965 298462809 298691900 300782464 303744269 306171596 307304667
27851C07304667J11109l92384n74544r84423j939093k729247k153311n27275J169540
$$ 307304667 307415776 307023392 306448848 305464425 303525332 300796085 298642774 298115499 299285039
27842B99285039R95410L21556J753865L697990M283742K841072M9723k504022
$$ 299285039 300280449 300602005 302355870 306053860 310337602 313178674 313228397 310724375
27834C10724375l975390m048109k492402k70437J352398J969577J439451N77222
$$ 310724375 306748985 302700876 300208474 299938037 301290435 303260012 304699463 305276685
27826C05276685N99178J213125J731049K082586J547987M12273J78460P94305
$$ 305276685 305875863 307088988 308820037 310902623 312450610 312862883 313041343 313835648
27818C13835648M72991j157697j800871r79423o14667j152503j509300p69772
$$ 313835648 314308639 313150942 311350071 310370648 309755981 308603478 307094178 306324406
27810C06324406J188716L308333M249624L938948L238884K191083K49040j698050
$$ 306324406 307513122 310821455 315071079 319010027 322248911 324439994 324689034 322990984
27802C22990984l214434l938714l571908l167520l047528j897091P3237Q48576
$$ 322990984 319776550 315837836 312265928 309098408 306050880 304153789 304227026 305075602
27794C05075602M48968J99359l83640j155206m85096J310456J811868J804590
$$ 305075602 305524570 305723929 305340289 304185083 303699987 305010443 306822311 308626901
27786C08626901K830357L882389L154783Q51107q08310j488437j247008j007954
$$ 308626901 311457258 315339647 318494430 319345537 318537227 317048790 315801782 314793828
27778C14793828j462433j655833j113730j26382r3082n69108m13390k48286q8199
$$ 314793828 313331395 311675562 310561832 310435450 310342368 309773260 309359870 309111584 309023385
27769C09023385M23536O65579P70946O82581O10781L89740j28660m18190m79081
$$ 309023385 309446921 310112500 310883446 311566027 312176808 312566548 312437888 312019698 311540617
27760C11540617o49099j073763o78499O83001J569393J126786Q1964o27220n80747
$$ 311540617 310891518 309817755 309139256 309822257 311391650 312518436 312600400 311973180 311392433
27751C11392433J254154L301507L145764J523148p31476k868666l428527k588373
$$ 311392433 312646587 315948094 319093858 320617006 319885530 317016864 313588337 310999964
27743C10999964j811245q49839Q23699J854717J526235K19190j311083k249078
$$ 310999964 309188719 308338880 309162579 311017296 312543531 312762721 311451638 309202560
27735C09202560k701111k556373k185258j192814L09606J402036L131239M297432
$$ 309202560 306501449 303945076 301759818 300567004 300876610 302278646 305409885 309707317
27727C09707317L294953J788765J005199O34849L50219K06188k45881l51703P26043
$$ 309707317 313002270 314791035 315796234 316431083 316781302 316987490 316741609 316389906 317115949
27718C17115949J432219J244928J160637M13588r42012j229936q14728j249358
$$ 317115949 318548168 319793096 320953733 321367321 320425309 319195373 318380645 317131287
27710C17131287j789911o15805P66747L58566l21411J82091J077250J421191J356245
$$ 317131287 315341376 314725571 315492318 315850884 315529473 315711564 316788814 318210005 319566250
27701C19566250J733621K191183J952414N28725k019335l878528m022352m003118
$$ 319566250 321299871 323491054 325443468 325972193 323952858 320074330 316051978 312048860
27693C12048860m567623m638858l678446k037948L62239L456328N083997L805055
$$ 312048860 307481237 302842379 299163933 297125985 297488224 300944552 306028549 309833604
27685C09833604J428810N08441J560805K554221K273680J236468J65311p24252
$$ 309833604 311262414 311770855 313331660 315885881 318159561 319396029 319561340 318837088
27677C18837088j121506o62621j186719k521025k474486k63903J678713J422699
$$ 318837088 317715582 317052961 315866242 313345217 310870731 310606828 312285541 313708240
27669C13708240O65531R21390J907900K297524J350502P26730L98736j279423
$$ 313708240 314373771 315295161 317203061 319500585 320851087 321577817 321976553 320697130
27661C20697130l227271m311481l867001k167728n4067K529821M919675N616045
$$ 320697130 317469859 313158378 309291377 307123649 307069582 309599403 314519078 320135123
27653C20135123M886150L706227J664867r65679l185586l821093k563701j562899
$$ 320135123 325021273 328727500 330392367 329426688 326241102 322420009 319856308 318293409
27645C18293409k224270l098093k302305L5814J756609J588964N84410n17157
$$ 318293409 316069139 312971046 310668741 310704555 312461164 314050128 314634538 314117381
27637C14117381j359307j473830j249219j114584q21112M37796K012698K267230
$$ 314117381 312758074 311284244 310035025 308920441 308099329 308537125 310549823 312817053
27629C12817053J417296J44105r18136j642868j353932R71448L934744N048767
$$ 312817053 314234349 314378454 313460318 311817450 310463518 311434966 315369710 320418477
27621C20418477L829620J247966m43076j115536k197432l040721l069559l147709
$$ 320418477 324248097 325496063 325052987 323937451 321740019 318699298 315629739 312482030
27613C12482030l105899k697831j991220l52517J190054K115782K269529R18787
$$ 312482030 309376131 306678300 304687080 304334563 305524617 307640399 309909928 310828715
27605C10828715q49611j633603j870838k407363k373026j077198R64745K332219
$$ 310828715 309979104 308345501 306474663 304067300 301694274 300617076 301581821 303914040
27597C03914040K007191J649462J753364J133275j25579j657871k377760j375150
$$ 303914040 305921231 307570693 309324057 310457332 310331753 308673882 306296122 304920972
27589C04920972m8830O21766L06487n21255q71210r76338o83509K59185R20714
$$ 304920972 304872142 305493908 305800395 305279140 304407930 303431592 302748083 303007268 303927982
27580C03927982J311983J783974J690108K40808j822395k580305r55578J773585
$$ 303927982 305239965 307023939 308714047 308954855 307132460 304552155 303596577 305370162
27572C05370162K796710J637283M53487O93452J481530J146937K35282O146k529
$$ 305370162 308166872 309804155 310257642 310951094 312432624 313579561 313814843 313820989 313818460
27563C13818460k58888m42310m66296j57609k81274r40412j198027r70857n23512
$$ 313818460 313559572 313117262 312650966 312493357 312212083 311271671 310073644 309102787 308579275
27554C08579275M81986J552950K076774K142340J822718R17312p0324p06528j565003
$$ 308579275 309061261 310614211 312690985 314833325 316656043 317573355 317503031 316796503 315231500
27545C15231500j915146j789014j644041r23879j33806m99908q81128j9655Q71706
$$ 315231500 313316354 311527340 309883299 308959420 308825614 308325706 307444578 307424923 308296629
27536C08296629L99203r64703j615557r91717K09020O64943J043850K231246K913707
$$ 308296629 308695832 307731129 306115572 305123855 305332875 305997818 307041668 309272914 312186621
27527C12186621K679386K964331K940501K141168J268375O63724O21462L80641
$$ 312186621 314866007 317830338 320770839 322912007 324180382 324844106 325465568 325846209
27519C25846209k4393m20631j091093p47280Q87948J901699J213197J60936k83670
$$ 325846209 325821816 325401185 324310092 323562812 324450760 326352459 327565656 327726592 327442922
27510C27442922l79233q16266j605933j894643j781356j666075j086222j98351
$$ 327442922 327063689 326247423 324641490 322746847 320965491 319299416 318213194 318014843
27502C18014843j42693j131261k281164k086010k15794J069821J07245j443753
$$ 318014843 317872150 316740889 314459725 312373715 312157921 313227742 313334987 311891234
27494C11891234j950352j744239k017295k527987k154609K46737L149353M146723
$$ 311891234 309940882 308196643 306179348 303651361 301496752 301743489 304892842 309039565
27486C09039565K947663J406993J165621R37325M72329P19270J508980J277103
$$ 309039565 311987228 313394221 314559842 315497167 315969496 316688766 318197746 319474849
27478C19474849o97754l262559m140808k956201j754818j375966o03311J026264
$$ 319474849 318777095 315514536 311373728 308417527 306662709 305286743 304683432 305709696
27470C05709696K061819J918458J157642Q56056J309524K02491k663953m057011
$$ 305709696 307771515 309689973 310847615 311703671 313013195 313215686 310551733 306494722
27462C06494722l010216j716186j397335n64335J776570M506765M914993L214352
$$ 306494722 303484506 301768320 300370985 299806650 301583220 306089985 311004978 314219330
27454C14219330J224230k27793o00524o77610j310157k100561j496978L58488
$$ 314219330 315443560 315215767 314615243 313937633 312627476 310526915 309029937 309388425
27446C09388425J251140J040038O45180N03136N98675M69308K96409L79470N31637
$$ 309388425 310639565 311679603 312324783 312827919 313426594 313895902 314192311 314571781 315103418
27437C15103418J92016j93434j70051k34978q24026j924822l322598l987819l199072
$$ 315103418 315295434 315102000 314931949 314696971 313872945 311948123 308625525 304637706 301438634
27428C01438634j172429R67884J415459J547415K957755M363324M054920K002430
$$ 301438634 300266205 301234089 302649548 304196963 307154718 311518042 315572962 317575392
27420C17575392n44783j702600j345654j072687p42267n6592N88595L71583j109689
$$ 317575392 317030609 315328009 313982355 312909668 312167401 312110809 312699404 313070987 311961298
27411C11961298k684664l674135l333206j729909M84067L441644N247470L516021
$$ 311961298 309276634 305602499 302269293 300539384 301023451 304465095 309712565 313228586
27403C13228586O90738l33675l90221q62520j751131k507994k668911j892211
$$ 313228586 313919324 313585649 313195428 312332908 310581777 308073783 305404872 303512661
27395C03512661j029625P2270J658885K150634O53199j453613k006963r31370
$$ 303512661 302483036 302555306 304214191 306364825 307018024 305564411 303557448 302626078
27387C02626078Q1318P80662J537468R49568J9575J069463K936242L409477K259720
$$ 302626078 302707396 303488058 305025526 305975094 305994669 307064132 310000374 313409851 315669571
27378C15669571Q37769n3813l72168N40174J598472J116466j26313j041103j500953
$$ 315669571 316507340 316453527 316081359 316621533 318220005 319336471 319210158 318169055 316668102
27369C16668102j733136j971454k107103k578172k626090j272702K74161R89168
$$ 316668102 314934966 312963512 310856409 308278237 305652147 304379445 304653606 305642774
27361C05642774J225004J480274J353285J515279K393144L061213K656896J847876
$$ 305642774 306867778 308348052 309701337 311216616 313609760 316670973 319327869 321175745
27353C21175745J292278L85461q83978j275004p70689j8475M90672l80132k949530
$$ 321175745 322468023 322853484 321969506 320694502 319923813 319905338 320396010 320015878 317066348
27344C17066348m486771l051111r02878O90629K024765K426561J299928j26046
$$ 317066348 312579577 309528466 308625588 309316217 311340982 313767543 315067471 314941425
27336C14941425n36850j85762O9139L6885Q19153K623458L857007K581093p42143
$$ 314941425 314404575 314218813 314287952 314324837 315143990 317767448 321624455 324205548 323463405
27327C23463405l044945k692889j227512r4929O97870J234420J209431O57549
$$ 323463405 320418460 317725571 316498059 316403130 317101000 318335420 319544851 320202400
27319C20202400L65286N57424K63912j040045j238327k48389J48639K29528J50500
$$ 320202400 320567686 321125110 321389022 320348977 319110650 318862261 319010900 319240428 319390928
27310C19390928n52884p77129j76604m26960j752015k477568k085741j250645
$$ 319390928 318838044 318060915 317884311 317457351 315705336 313227768 311142027 309891382
27302C09891382R0400J887153L686997M434034L597160J607757j151203k855761
$$ 309891382 309981782 311868935 315555932 319989966 323587126 325194883 324043680 321187919
27294C21187919k099081n15664j04724o69451j117574j645581k374990k128275
$$ 321187919 319088838 318573174 318468450 317798999 316681425 315035844 312660854 310532579
27286C10532579m02675J500486J920843J447861J930380L059047L013728J350397
$$ 310532579 310129904 311630390 313551233 314999094 316929474 319988521 323002249 324352646
27278C24352646j42463j690775l523006l657862k179336r96365n22107M40056
$$ 324352646 324210183 322519408 318996402 315338540 313159204 312162839 311640732 312080788
27270C12080788J495091J908277J347260K78924o15630k099224l677024m544082
$$ 312080788 313575879 315484156 316831416 317110340 316494710 314395486 310718462 306174380
27262C06174380m346016k611349N5930K277308L113418K848400K286214J761658
$$ 306174380 301828364 299217015 299272945 301550253 304663671 307512071 309798285 311559943
27254C11559943J478553J213223j83581k735115m954137n382229k620910J670249
$$ 311559943 313038496 314251719 314068138 311333023 306378886 300996657 298375747 300045996
27246C00045996M288878M405582L673262K591186K09341k856767m242570k695747
$$ 300045996 304334874 308740456 312413718 315004904 315214245 312357478 308114908 305419161
27238C05419161P2823K103147K446609J155550k53487p19484q56503j072889j116926
$$ 305419161 305491984 307595131 310041740 311197290 310943803 310224319 309367816 308294927 307178001
27229C07178001q32847j17652J507015L083606L829549M145765L628609J485579
$$ 307178001 306345154 306227502 307734517 310818123 314647672 318793437 322422046 323907625
27221C23907625m36813l10467m2429q65830k536435l664124k693481M98491M063355
$$ 323907625 323470812 323160345 323117916 322252086 319715651 316051527 313358046 313856537 317919892
27212C17919892M604703K101099j350643m740418n979294m290835k527846j809548
$$ 317919892 322524595 324625694 323275051 318534633 312555339 308264504 305736658 303927110
27204C03927110q28013N31122J672217K585236K693012K258016J910119N93610
$$ 303927110 303099097 303630219 305302436 307887672 310580684 312838700 314748819 315342429
27196C15342429j071520k042442k573406k409607q60847J448627K271492P73127
$$ 315342429 314270909 312228467 309655061 307245454 306384607 307833234 310104726 310877853
27188C10877853j437766k229112j004051R40860J927543K229379K491948J913521
$$ 310877853 309440087 307210975 306206924 307147784 309075327 311304706 313796654 315710175
27180C15710175P01636j58877j417914k578483k428383j521788j089564j646722
$$ 315710175 316411811 316252934 314835020 312256537 309828154 308306366 307216802 305570080
27172C05570080k046148j100563K55875Q96892J329438J965685J768835J312254
$$ 305570080 303523932 302423369 302679244 303576136 304905574 306871259 308640094 309952348
27164C09952348J357433J097419N20419M99739J249713K427789L164201K537541
$$ 309952348 311309781 312407200 312927619 313427358 314677071 317104860 320269061 322806602
27156C22806602j98563l752510n342830m354589k401134o72559R04407K056389
$$ 322806602 322608039 318855529 313512699 309158110 306756976 306084417 306988824 309045213
27148C09045213J959401J163522J008207O25829m67197q34116K39903J382344
$$ 309045213 311004614 312168136 313176343 313802172 313334975 312500859 312740762 314123106
27140C14123106J583189O39793m92928o60911O11444K591926L378885K282141
$$ 314123106 315706295 316346088 315853160 315192249 315803693 318395619 321774504 324056645
27132C24056645J27540j518627j485786q27481q07707l26876J077157J603200
$$ 324056645 324184185 322665558 321179772 320352291 319544584 319217708 320294865 321898065
27124C21898065P66034M57466O31435j28055j453691k739143m543658n918967
$$ 321898065 322664099 323121565 323753000 323624945 322171254 319432111 314888453 308969486
27116C08969486m506174j115544R62454J157758J402940K020732J331602n60138
$$ 308969486 304463312 303347768 304310222 305467980 306870920 308891652 310223254 309663116
27108C09663116j402924p90790L47755O93096M46632K92409J52149m6715k19711
$$ 309663116 308260192 307469402 307817157 308510253 308956885 309249294 309401443 309354728 309135017
27099C09135017N08915J824656K204105J469217J078041J489489K348451L016418
$$ 309135017 309643932 311468588 313672693 315141910 316219951 317709440 320057891 323074309
27091C23074309J832158j100961l206743k606252o89768j33883m42953L90819
$$ 323074309 324906467 323805506 320598763 317992511 317302743 317168860 316725907 317116726
27083C17116726J139045Q47403O11755J160303J708624Q47874o84068j003624
$$ 317116726 318255771 319103174 319714929 320875232 322583856 323431730 322747662 321744038
27075C21744038q48174k080409l920111m658370l702447k034640j452153j772469
$$ 321744038 320895864 318815455 314895344 310236974 306534527 304499887 303047734 301275265
27067C01275265j437964K60307K541294L780656K751818M53682n70914m45161
$$ 301275265 299837301 300097608 302638902 306419558 309171376 309625058 309054144 308608983
27059C08608983N74109J958481J942024R02211n04334j793112j657316k03856
$$ 308608983 309183092 311141573 313083597 313985808 313481474 311688362 310031046 309827190
27051C09827190P61145M75084m08847j119156p53411M32454J137148N90331q53484
$$ 309827190 310588335 311063419 310654572 309535416 308782005 309214459 310351607 310941938 310088454
27042C10088454j802590j769537j145990M44694K170265K476059J811040J480418
$$ 310088454 308285864 306516327 305370337 305815031 307985296 310461355 312272395 313752813
27034C13752813P31247k68691J92129J029556J65439r55253m85868M55989J049661
$$ 313752813 314484060 314215369 314407498 315437054 315602493 314647240 314161372 314617361 315667022
27025C15667022J574902K162819K349856J953244J015481K18919k67140r816J086993
$$ 315667022 317241924 319404743 321754599 323707843 324723324 324942243 324675103 324665287 325752280
27016C25752280J101301l47530j052239p44540N21170J500720M55044j617124
$$ 325752280 326853581 326506051 325453812 324709272 325230442 326731162 327186206 325569082
27008C25569082k666956k343491j586828j433200j868856j455942j93887N93135
$$ 325569082 322902126 320558635 318971807 317538607 315669751 314213809 314019922 314613057
27000C14613057r5621p30021k89056L68640P67404J251444J283252j86573k457398
$$ 314613057 314517436 313787415 313498359 313866999 314634403 315885847 317169099 316982526 314525128
26991C14525128m132849m069570k149755K28467J280327J536249K075334J700041
$$ 314525128 310392279 306322709 304172954 304401421 305681748 307217997 309293331 310993372
26983C10993372L37241n1192M07548M95115L73870O16222J018368J124821Q31100
$$ 310993372 311330613 311279421 311686969 312182084 312555954 313172176 314190544 315315365 316146465
26974C16146465n1071j009505k094476k908051k434170j385994p29447r9869J341349
$$ 316146465 316095394 315085889 312991413 310083362 307649192 306263198 305533751 305433882 306775231
26965C06775231K362677K240096K663334L090027J968169K19787k85151j16932
$$ 306775231 309137908 311378004 314041338 317131365 319099534 319319321 319034170 318917238
26957C18917238l01393m85525K3138R20433K116720L573679M105842K708359j051007
$$ 318917238 318615845 318130320 318153458 319073891 321190611 324764290 328870132 331578491 330527484
26948C30527484n135463o406059m869434k710936n79831J233221K748777L232169
$$ 330527484 325392021 318985962 314116528 311405592 310825761 312058982 314807759 318039928
26940C18039928L226477K957975J275949j326543k853636k625965j401564k54774
$$ 318039928 321266405 324224380 325500329 324173786 321320150 318694185 317292621 317037847
26932C17037847N98978J702018J586323Q989p84865m99029k96788P3096n20748
$$ 317037847 317636825 319338843 320925166 320934155 320149290 319650261 319353473 319426569 318905821
26923C18905821j832309k418526k193345j207003K66776J187147J323426J488073
$$ 318905821 317073512 314654986 312461641 311254638 311521414 312708561 314031987 315520060
26915C15520060J682931J091303K47649L885N94870R00653k42403j520332j858508
$$ 315520060 317202991 318294294 318541943 318545828 319140698 320041351 319798948 318278616 316420108
26906C16420108j684565j138011m32643m5267N74392J167792J136223P50347J056643
$$ 316420108 314735543 313597532 313164889 313119622 313694014 314861806 315998029 316748376 317805019
26897C17805019K168932J642881o81809k149848j938115p84019R05560K191834
$$ 317805019 319973951 321616832 320935023 318785175 316847060 316063041 316968601 319160435
26889C19160435K512442J320157j91677j125206j743155j953477j472106q29793
$$ 319160435 321672877 322993034 322801357 321676151 319932996 317979519 316507413 315677620
26881C15677620r15210r09239L87772J715597J873552J714560J558451N10503
$$ 315677620 314762410 313853171 314240943 315956540 317830092 319544652 321103103 321613606
26873C21613606j567942k949984k583154k078023k456653k583941j491598J82907
$$ 321613606 320045664 317095680 314512526 312434503 309977850 307393909 305902311 306085218
26865C06085218J396102K553322L895673M388125L084550R93805q5550k00368
$$ 306085218 307481320 310034642 313930315 318318440 321402990 322396795 322311245 322110877
26857C22110877l97564r62483j762460k472232j981415n9949J088043P09629l2256
$$ 322110877 321713313 320750830 318988370 316516138 314534723 314474774 315562817 316272446 316240190
26848C16240190K68349P98650J58832p69577j272373o64138j16745m71336j195456
$$ 316240190 316508539 317307189 317466021 316696444 315424071 314759933 314643188 314171852 312976396
26839C12976396j472855o19050J000264J940732J380653J55831j107042j810467
$$ 312976396 311503541 310884491 311884755 313825487 315206140 315361971 314254929 312444462
26831C12444462k380691k908851k480054j020233Q29665K129145K361883J835257
$$ 312444462 310063771 307154920 304674866 303654633 304484298 306613443 308975326 310810583
26823C10810583J388830Q28902o8973j57706k62218j322035j728846r11204M55682
$$ 310810583 312199413 313028315 312959342 312801636 312539418 311217383 309488537 308577333 309033015
26814C09033015J747572K057454J186308m41677j753257j811959l97527K025900
$$ 309033015 310780587 312838041 314024349 313582672 311829415 310017456 309619929 311645829
26806C11645829L691931K639817M75581l52688n98510r62508j362187j039158
$$ 311645829 315337760 317977577 318453158 318100470 317501960 316539452 315177265 314138107
26798C14138107P72093K117666K227608J311455N7108q53648k052964l297833
$$ 314138107 314910200 317027866 319255474 320566929 320624037 319770389 317717425 314419592
26790C14419592k829028j824566j639856j270001l48125R4345L07382J281366
$$ 314419592 311590564 309765998 308126142 306856141 306508016 306602361 306909743 308191109
26782C08191109K244558K122286N23711j686302k710096j722028j58652L88182
$$ 308191109 310435667 312557953 313081664 311395362 308685266 306963238 306804586 307192768
26774C07192768n66745j264242m29494L22233J95408n76534j274191J12263K192648
$$ 307192768 306626023 305361781 304932287 305254520 305449928 304873394 303599203 303711466 305904114
26765C05904114K363025J641328J048162J068970J614909K006148J635755K10389
$$ 305904114 308267139 309908467 310956629 312025599 313640508 315646656 317282411 317492800
26757C17492800n83714m090P60879J467511J893931J558091l1430k518478m032749
$$ 317492800 316909086 316904996 317665875 319133386 321027317 322585408 322553978 320035500 316002751
26748C16002751l317418j812931q03168l93197k03164P65388K059104K314571
$$ 316002751 312685333 310872402 310069234 309676037 309472873 310238261 312297365 314611936
26740C14611936R70736m84270o15494K00046J209357J502607O24922m2016R56891
$$ 314611936 315582672 315098402 314482908 314682954 315892311 317394918 318019840 317977824 318934715
26731C18934715K836544L168501J276845o35431r30757q38516r74156q69109k52282
$$ 318934715 321771259 324939760 326216605 325581174 324650417 323811901 322837745 321968636 321716354
26722C21716354K96963M63761J010966J408704M97743p63990r62265o28506l02139
$$ 321716354 322013317 322477078 323488044 324896748 325394491 324630501 323668236 323039730 322737591
26713C22737591L81929J104254J976221K532489K144203J584713J030424k5853
$$ 322737591 323119520 324223774 326199995 328732484 330876687 332461400 333491824 333465971
26705C33465971j282439j531537k966J832733K806667K180307M32272o06045p64399
$$ 333465971 332183532 330651995 330649029 332481762 335288429 337468736 337901008 337294963 336530564
26696C36530564m01199N11923J485372J383448q1736j569137k494369l316850
$$ 336530564 336129365 336641288 338126660 339510108 339428372 337859235 335364866 332048016
26688C32048016l478331l380764l872409m115958k898972r07000O26791K000905
$$ 332048016 328569685 325188921 321316512 317200554 314301582 313394582 314021373 316022278
26680C16022278L465670L492905J667418p54065j579269k45088J072957J932825
$$ 316022278 319487948 322980853 324648271 323894206 322314937 322069849 323142806 325075631
26672C25075631L164338L205059J454061j60455l68531J45794o16567k643142
$$ 325075631 328239969 331445028 332899089 332738634 332370103 332515897 331899330 329256188
26664C29256188m134026m435025l166828m62014J636874J432886p3928l47095
$$ 329256188 325122162 320687137 317520309 317058295 318695169 320128055 320054127 319707032
26656C19707032P23028J292506J658475J709750K50035k346425n198681o953873
$$ 319707032 320430060 321722566 323381041 325090791 325340826 322994401 317795720 310841847
26648C10841847o544614m998512m240762l981915j825921J816922L707072K656654
$$ 310841847 304297233 299298721 295057959 291076044 289250123 291067045 294774117 297430771
26640B97430771M94410k02956L32569J527760L248563M202275L626478K542552
$$ 297430771 297925181 297722225 298054794 299582554 302831117 307033392 310659870 313202422
26632C13202422J799783J474256J460629J473577J302004J015373M7834j274863
$$ 313202422 315002205 316476461 317937090 319410667 320712671 321728044 321775878 320501015
26624C20501015k121393k714284l018297k592477j331827K16165P19457Q80209
$$ 320501015 318379622 315665338 312647041 310054564 308722737 308938902 309658359 310538568
26616C10538568J786822K863648L055144K169776R31381J44234J68147L56739
$$ 310538568 312325390 315189038 318244182 320413958 321345339 321489573 321657720 322014459
26608C22014459M92518N4271j576363k940727l428399k598320m32244J128872
$$ 322014459 322506977 322561248 320984885 318044158 314615759 312017439 311585195 312714067
26600C12714067J965690K150009J827922J222291k93325j543025j704712k215532
$$ 312714067 314679757 316829766 318657688 319879979 319586654 318043629 316338917 314123385
26592C14123385k266298p08062J870714M308076N194112M028085K045770j95259
$$ 314123385 311857087 311149025 313019739 317327815 322521927 326550012 328595782 328400523
26584C28400523j600369j911754k453299k801577j928379j228319j587323j679500
$$ 328400523 326800154 324888400 322435101 319633524 317705145 316476826 314889503 313210003
26576C13210003r60735j45405q8106n06385l76888K68754K78831j01067M45520
$$ 313210003 312249268 312103863 312015757 311509372 311132484 311401238 311680069 311579002 312024522
26567C12024522P44499l64268j144805r30503j024035j264813j109236r96093
$$ 312024522 312769021 312404753 311259948 310329445 309305410 308040597 306931361 305935268
26559C05935268j787965k257205j522035o70123m43091k23304Q78727K500583
$$ 305935268 304147303 301890098 300368063 299697940 299254849 299031545 299910272 302410855
26551C02410855L434106K424901J61412j093912q24571L54676J654641K018515
$$ 302410855 305844961 308269862 308431274 307337362 306512791 306867467 308522108 310540623
26543C10540623J173703k27820j856164l195444l023900j926308n38534J778220
$$ 310540623 311714326 311486506 309630342 306434898 303410998 301484690 300946156 302724376
26535C02724376L988641M711792L886193K467262J457951O85631M03726Q28011
$$ 302724376 306713017 311424809 315311002 317778264 319236215 319921846 320325572 321153583
26527C21153583J201907J171150J520477J914298J520198M69437k49982n87245
$$ 321153583 322355490 323526640 325047117 326961415 328481613 328951050 328701068 328113823
26519C28113823j299816j742346j147707l54609n90420j739772k671093k791656
$$ 328113823 326814007 325071661 323923954 323569345 322978925 321239153 318568060 315776404
26511C15776404k120326l97827J408083J700480Q05628K78069K66193Q65358K186453
$$ 315776404 313656078 313258251 314666334 316366814 317172442 317450511 317716704 318582062 320768515
26502C20768515K852257J972656N61772q3373L77021J844364K986552K335840
$$ 320768515 323620772 325593428 326155200 326071827 326448848 328293212 331279764 333615604
26494C33615604J002411k66184j884604k384556j884761j848283k218504k457693
$$ 333615604 334618015 334351831 332467227 330082671 328197910 326349627 324131123 321673430
26486C21673430j838260o33410k30379l74855m66893q11279r68062j266257k215817
$$ 321673430 319835170 319201760 318971381 318596526 318129633 317318354 316350292 315084035 312868218
26477C12868218k830664k390223p20766R60689J056774J052012K732596M968222
$$ 312868218 310037554 307647331 306926565 307887254 308944028 309996040 312728636 317696858
26469C17696858N991799N456108M050572J589136j062202k050093k747645m154344
$$ 317696858 323688657 329144765 333195337 334784473 333722271 331672178 328924533 324770189
26461C24770189m452222l140653j594034j213071j476824j243593m81494l01088
$$ 324770189 320317967 317177314 315583280 314370209 312893385 311649792 311168298 310867210
26453C10867210j339466k180474j975682r51436N79500Q39390r24568k357815
$$ 310867210 309527744 307347270 305371588 304420152 304999652 305839042 304914474 302556659
26445C02556659j528746L93418J427412J637895J225618M02292N95415J853869
$$ 302556659 301027913 301421331 302848743 304486638 305712256 306114548 306709963 308563832
26437C08563832K957119L122549K454004J809348J928195K620999K945423K390252
$$ 308563832 311520951 314643500 317097504 318906852 320835047 323456046 326401469 328791721
26429C28791721K132963J925484Q89219N16305N69936m44725j548897j704889
$$ 328791721 330924684 332850168 333739387 334255692 334825628 334380903 332832006 331127117
26421C31127117j750240k580845l705599l369495j274887J42639j85409l8233
$$ 331127117 329376877 326796032 323090433 319720938 318446051 318588690 318403281 318365048
26413C18365048O59255M51916m72465j167882j175851k98307P12905N83860J23938
$$ 318365048 319024303 319476219 319003754 317835872 316660021 316361714 317074619 317658479 317782417
26404C17782417M9261J0594m38198j180822j606319j667576k146522k430709j838489
$$ 317782417 317831678 317842272 317404074 316223252 314616933 312949357 310802835 308372126 306533637
26395C06533637j28528K139034L361661L566530L071837K002620N00864J48729
$$ 306533637 306405109 308544143 311905804 315472334 318544171 320546791 321047655 321196384
26387C21196384J539518K817914K791348J156233j448751l261703k697856r00122
$$ 321196384 322735902 325553816 328345164 329501397 328052646 324790943 322093087 321192965
26379C21192965J59836J65563q1009P7947M67145Q54820J761491K466850K112253
$$ 321192965 321352801 321518364 321437355 321515302 321982447 322837267 324598758 327065608 329177861
26370C29177861J701852J302361l18653k304719k036212L11905J643898R61278
$$ 329177861 330879713 332182074 331863421 329558702 327522490 327834395 329478293 330439571
26362C30439571m82282j568076j091490Q2944N24125O47941J073502J883236K137368
$$ 330439571 329957289 328389213 327297723 327380667 327904792 328552733 329626235 331509471 333646839
26353C33646839J649380J452880K011988K649691J213394k081784m526781n683074
$$ 333646839 335296219 336749099 338761087 341410778 342624172 340542388 336015607 330332533
26345C30332533o582779o989041o772774n633326k446567J066060J657846N10488
$$ 330332533 323749754 316760713 309987939 304354613 301908046 302974106 304631952 305142440
26337C05142440O12795J729050K431035K765402L347715L862906L727785K353851
$$ 305142440 305755235 307484285 309915320 312680722 316028437 319891343 323619128 325972979
26329C25972979L59037j709138l708697m926641m663292l699589k615704j902811
$$ 325972979 326332016 324622878 320914181 315987540 311324248 307624659 305008955 303106144
26321C03106144j779847j654865q21177K64406N35473O37394J324334J568387
$$ 303106144 301326297 299671432 298850255 299114661 299650134 300287528 301611862 303180249
26313C03180249R15267Q99607J178443R59838N99803K31305K1514m20641j306657
$$ 303180249 304095516 304995123 306173566 307133404 307733207 307964512 307986026 307565385 306258728
26304C06258728j623063j249837n68188K42622J78815l84883k89178J52975k90458
$$ 306258728 304635665 303385828 302817640 303060262 303239077 302854194 302565016 302717991 302427533
26295C02427533j180240j074191l04003J034754K745907L249572K980904L520109
$$ 302427533 301247293 300173102 299869099 300903853 303649760 306899332 309880236 313400345
26287C13400345M732199M510383J675117j692807k995401k674749k362722j789921
$$ 313400345 318132544 322642927 324318044 322625237 319629836 316955087 314592365 312802444
26279C12802444N8836K589330L750809K228179j219970m288418n259094l907884
$$ 312802444 312861280 315450610 319201419 321429598 320209628 315921210 310662116 306754232
26271C06754232j694114O6601J028342K327988L323665K827473J171248k31194
$$ 306754232 305060118 305126719 306155061 308483049 311806714 314634187 315805435 315574241
26263C15574241o98982j234016k270383k570238j395975N1480J438909K342084
$$ 315574241 314875259 313641243 311370860 308800622 307404647 307456127 308895036 311237120
26255C11237120K368947K553981K351051J344642J455655K674928L024116K155781
$$ 311237120 313606067 316160048 318511099 319855741 321311396 323986324 327010440 329166221
26247C29166221R7205k463335l933001m171480k635603k71666P45084L69319l82310
$$ 329166221 329263426 326800091 322867090 318695610 316060007 315788341 316533425 316902744 316520434
26238C16520434j185390k118542j772911l45617N51084N08837m76286j310496
$$ 316520434 315335044 313216502 311443591 311097974 311649058 312157895 311681609 310371113
26230C10371113j592123j909228j981967j514015n74061J258840L164307M168162
$$ 310371113 308778990 306869762 304887795 303373780 302799719 304058559 307222866 311391028
26222C11391028M645854M419341L692861K427956O99501n78150r77741j174018
$$ 311391028 316036882 320456223 324149084 326577040 327276541 326698391 325720650 324546632
26214C24546632j861550k349814k353013j652577O11683K638642K477717J072770
$$ 324546632 322685082 320335268 317982255 316329678 316941361 319580003 322057720 323130490
26206C23130490K77894O37093K87302j680894l263165m264254m998932l930762
$$ 323130490 323408384 324045477 324332779 322651885 319388720 315124466 310125534 306194772
26198C06194772j968624o90170L30897J203956J993498K201429J317399L13400
$$ 306194772 304226148 303535978 303866875 305070831 307064329 309265758 310583157 310896557
26190C10896557M29452J920216L739158M220774L335277J606322K14194j372626
$$ 310896557 311326009 313246225 316985383 321206157 324541434 326147756 326361950 324989324
26182C24989324k776656k179661k37053J513548K178079J130270q3626K3166Q71247
$$ 324989324 322212668 320033007 319795954 321309502 323487581 324617851 324534225 324557391 325428638
26173C25428638J598232J994262J325709m88587k005871k209969j887665k211041
$$ 325428638 327026870 329021132 330346841 329858254 327852383 325642414 323754749 321543708
26165C21543708k257429j862184j298578k49450P69104P65354l17303r63635j053697
$$ 321543708 319286279 317424095 316125517 315876067 316645171 317410525 317093222 316129587 315075890
26156C15075890j315094n96794P82961J624217J891369J302882N15964O70369
$$ 315075890 313760796 313164002 313946963 315571180 317462549 318765431 319281395 319951764
26148C19951764J563179K045531Q53125P3842J87740L0070p97985k036897j808026
$$ 319951764 321514943 323560474 324413599 324487441 324675181 324705251 323907266 321870369 320062343
26139C20062343L53436K425624K917090J744912l20727j888282j536222l06376
$$ 320062343 320415779 322841403 325758493 327503405 327182678 325294396 323758174 323451798
26131C23451798K64255N52499J722780L263022M036349L446791J719836M21018
$$ 323451798 323716053 324268552 325991332 329254354 333290703 336737494 338457330 338878348
26123C38878348J61624J79322n87189k169147l658764m433126n200558n932516
$$ 338878348 339039972 339219294 338632105 336462958 332804194 328371068 323170510 317237994
26115C17237994o126709n766308m481024k564308j022292k27850r9838p87974
$$ 317237994 311111285 305344977 300863953 298299645 297277353 297049503 296949665 296161691
26107B96161691j889016j918534j139035m18810R48614J891053J483131M2772
$$ 296161691 294272675 292354141 291215106 290796296 291744910 293635963 295119094 295161866
26099B95161866j276708k094773k773972k687293j765605o45916O47470J906657
$$ 295161866 293885158 291790385 289016413 286329120 284563515 283917599 284565069 286471726
26091B86471726K157877J008526K41830O20181N23675k78412k21726N25802M43734
$$ 286471726 288629603 289638129 289879959 290500140 291023815 290745403 290523677 291049479 291493213
26082B91493213m42067q13560m75226K72339J741437L159708L017967K614623
$$ 291493213 291051146 290237586 289762360 290034699 291776136 294935844 297953811 300568434
26074C00568434K629928J987242J177424O47871J08628m47502q94354j245205
$$ 300568434 303198362 305185604 306363028 307010899 307119527 306672025 305777671 304532466
26066C04532466m40712O76858O53828o4750l06825p81008k940655m724873m013659
$$ 304532466 304091754 304768612 305422440 305357690 305050865 304269857 301329202 296604329 292590670
26057B92590670j629121J204039L200783L374517K285559J537616J086189L12888
$$ 292590670 290961549 292165588 295366371 298740888 301026447 302564063 303650252 303963140
26049C03963140m66461l42866M14648N25187j61713o78428m53294J57156P09588
$$ 303963140 303496679 303153813 303568461 304093648 303931935 303253507 302800213 302957369 303666957
26040C03666957J244118J845880K148445K229227J939856J266381O96573l28553
$$ 303666957 304911075 306756955 308905400 311134627 313074483 314340864 315037437 314708884
26032C14708884j813946k739489l046679k505666r15203P46889J445051J772877
$$ 314708884 312894938 310155449 307108770 304603104 303687901 304434790 305879841 307652718
26024C07652718K146725K438931K447778J560656P10148K41827q11210k030882
$$ 307652718 309799443 312238374 314686152 316246808 316956956 317198783 316387573 314356691
26016C14356691k225121j968817j703282r70906m17748k62251j02893J08037q4279
$$ 314356691 312131570 310162753 308459471 307488565 307070817 306808566 306705673 306813710 306729431
26007C06729431o43683p98964p83894l58645J88864K03506J55364O15511J919001
$$ 306729431 306085748 305286784 304502890 304144245 304333109 304536615 304691979 305307490 307226491
25998C07226491K889595K557529J378225L99160K90570M05535o43679k322795
$$ 307226491 310116086 312673615 314051840 314451000 314741570 315147105 314503426 312180631
25990C12180631l193497k810315j977918j748207j333746k23677j6108m48983
$$ 312180631 308987134 306176819 304198901 302450694 301116948 300893271 300877163 300428180
25982C00428180L411R70854J859767K396178J979332P24486k69862k71486K31131
$$ 300428180 300431591 301402445 303262212 305658390 307637722 308362208 308092346 307820860 308051991
25973C08051991R3671j007150k604630l425621k131933k50928K4581m59433M50991
$$ 308051991 308145662 307138512 304533882 301108261 298976328 298725400 298749981 298290548 298741539
25964B98741539J876980K764510L081255J997574r4255k143291k187004m1656
$$ 298741539 300618519 303383029 306464284 308461858 308367603 306224312 304037308 303995652
25956C03995652R39685L12931j38877p25883j659693j824549k6953K249923K929098
$$ 303995652 304935337 305248268 305109391 304383508 302723815 300899266 300872313 303122236 306051334
25947C06051334K523388J866674R84054O23677N86627k39716j511211k602699
$$ 306051334 308574722 310441396 311425450 312049127 312635754 312396038 310884827 308282128
25939C08282128l246052l037179k284423r72618N32619J387805J278257L14566
$$ 308282128 305036076 301998897 299714474 298741856 299274475 300662280 301940537 302255103
25931C02255103n36015j259383k800306l739842l299226k045480j52534J606144
$$ 302255103 301719088 300459705 297659399 293919557 290620331 288574851 288422317 290028461
25923B90028461K622566K929494L321961M113581M336969L364450K686156K105484
$$ 290028461 292651027 295580521 298902482 303016063 307353032 310717482 313403638 315509122
25915C15509122N86207j285271k147894j832320j760678j452718o32894j82988
$$ 315509122 316095329 314810058 312662164 310829844 309069166 307616448 306983554 306800566
25907C06800566K95166J177119J714484J302002P95897M46298J17335m09142o03929
$$ 306800566 307095732 308272851 309987335 311289337 312085234 312531532 312648867 312239725 311635796
25898C11635796q743J079698K364051K155100n8321k461731l507317l715435l169796
$$ 311635796 311627053 312706751 315070802 317225902 317167581 314705850 311198533 307483098 304313302
25889C04313302j525577L82883K248641L582738K832851R49701K49154J389990
$$ 304313302 302787725 303170608 305419249 309001987 311834838 312784539 313033693 314423683
25881C14423683L373529M270211K496845j016311l478954l744220l137213j867093
$$ 314423683 317797212 322067423 324564268 323547957 320069003 316324783 313187570 311320477
25873C11320477L24351K141654K915280K983307K460482N66810k049259l324486
$$ 311320477 311644828 313786482 316701762 319685069 322145551 322712361 320663102 317338616
25865C17338616k789341j376478M95160J566357J036119J17248R8489L47036L08373
$$ 317338616 314549275 313172797 313667957 315234314 316270433 316387681 316486170 316833206 317141579
25856C17141579j2920m82870o83182j021527j507054j519425j163215j181838
$$ 317141579 317128659 316645789 315962607 314941080 313434026 311914601 310751386 309569548
25848C09569548r80789l11229k02896n16637J30316J593971K241166J825547J345698
$$ 309569548 308588759 308277530 308074634 307557997 307688313 309282284 311523450 313348997 314694695
25839C14694695J204682N50461n11941q78671j656317k296914k195721j429737
$$ 314694695 315899377 316449838 315937897 315059226 313402909 311105995 308910274 307480537
25831C07480537j41333R00291J277214R03054M45194m1176l40418P46583K022594
$$ 307480537 307339204 308239495 309516709 310419763 310864957 310823781 310483363 311229946 313252540
25822C13252540K567888K321249R30299o11671q77908j130898j523574j076890
$$ 313252540 315820428 318141677 319071976 318460305 317582397 316451499 314927925 313851035
25814C13851035k92271L70109L80418l45029j135209j796007k129578j719316
$$ 313851035 313558764 313928873 314309291 313964262 312829053 311033046 308903468 307184152
25806C07184152j111742j91156Q25202J102480O32881Q894k19142o08905j155697
$$ 307184152 306072410 305881254 306706456 307808936 308441817 308450711 308231569 307622664 306466967
25797C06466967j557153k332594l203102k604950k64970K549552M836376N221674
$$ 306466967 304909814 302577220 299374118 296769168 296504198 299053750 303890126 309111800
25789C09111800M065867K756642J733318Q49837O66790O30954R40731K277581
$$ 309111800 313177667 315934309 317667627 318517464 319184254 319815208 320755939 323033520
25781C23033520K984608K765087K549835K212564J460059j74712k277378l772362
$$ 323033520 326018128 328783215 331333050 333545614 335005673 334830961 332553583 328781221
25773C28781221m600612m634804l376964j702053r74921j055254o93678m07127
$$ 328781221 324180609 319545805 316168841 314466788 313491867 312436613 311742935 311335808
25765C11335808j132006k646825l935818l635880k517149j339754k67574J40209
$$ 311335808 310203802 307556977 303621159 299985279 297468130 296128376 295860802 296001011
25757B96001011J496405L856267N114358M896896M153049L179168J684836j55012
$$ 296001011 297497416 301353683 306468041 311364937 315517986 318697154 320381990 320226978
25749C20226978j940565l112943k497609r50883L00828l796k215048l433151k608343
$$ 320226978 318286413 315173470 312675861 311724978 312025806 312022010 309806962 306373811 303765468
25740C03765468j333414J07863J239759J324716P77559L58194J79772n79207k382393
$$ 303765468 302432054 302539917 303779676 305104392 305881951 306240145 306419917 305840710 303458317
25731C03458317l661616l212141k699412k390089j307127M20303J918391K027269
$$ 303458317 299796701 296584560 293885148 291495059 290187932 290608235 292526626 294553895
25723B94553895J364320R95181Q67292J175770K368439M081182M560948L241520
$$ 294553895 295918215 296913396 297780688 298956458 301324897 305406079 309967027 313208547
25715C13208547R06468j418272k480358k830041k808707k000613r02657K59490
$$ 313208547 314115015 312696743 310216385 307386344 304577637 302577024 301674367 301933857
25707C01933857J672739K804467L419020L413158K588650R23946r73459k239408
$$ 301933857 303606596 306411063 309830083 313243241 315831891 316755837 315782378 313542970
25699C13542970k583464k217696j955251j424922q38175r28997q61905k82206
$$ 313542970 310959506 308741810 306786559 305361637 304523462 303594465 302732560 302450354
25691C02450354K90699J037347K254244K639372J700675K40236m25160P55050
$$ 302450354 302741053 303778400 306032644 308672016 310372691 310612927 310187767 310942817
25683C10942817K697116L205305J917402R54613P76800Q07521J277807J682820
$$ 310942817 313639933 316845238 318762640 319717253 320494053 321301574 322579381 324262201
25675C24262201M93361k218674m369364m582037k792409k15967K135143M220097
$$ 324262201 324755562 322536888 318167524 313585487 310793078 310577111 312712254 316932351
25667C16932351M980634L439562N58186j745550j933955o90308o01258j696618
$$ 316932351 321912985 325352547 325910733 324165183 322231228 321540920 320939662 319243044
25659C19243044k190280j525899j19614J047279J355271J442544J518524J084940
$$ 319243044 317052764 315526865 315407251 316454530 317809801 319252345 320770869 321855809
25651C21855809l07242k162164l970892n288091m828718k684564n48305M02458
$$ 321855809 321548567 319386403 315415511 310127420 305298702 302614138 302065833 302468291
25643C02468291M94610K36929k61129o36825j047978j135575J71204J595399J615040
$$ 302468291 302962901 303199830 302938701 302301876 301253898 300118323 300289527 301884926 303499966
25634C03499966J586364K324903K832592J730484j69017j74638J193759J553879
$$ 303499966 305086330 307411233 310243825 311974309 311805292 311630654 312824413 314378292
25626C14378292J164969J399576J002570q08723k275574l166250l444812k762962
$$ 314378292 315543261 316942837 317945407 317136684 314861110 311694860 308250048 305487086
25618C05487086j658976K52276K103452K806524K450248J097400q12544j600778
$$ 305487086 303828110 304080386 306183838 308990362 311440610 312538010 311725466 310124688
25610C10124688j090261j085126j478334j600330j689219j420020m78337Q69065
$$ 310124688 309034427 307949301 306470967 304870637 303181418 301761398 301283061 302152126
25602C02152126J775662K527983L535567L612421K617496J756123J045553l34032
$$ 302152126 303927788 306455771 309991338 313603759 316221255 317977378 319022931 318688899
25594C18688899k122780l355522l429457k474034j116215J52289J128661K164531
$$ 318688899 316566119 313210597 309781140 307307106 306190891 306343180 307471841 309636372
25586C09636372K579476J554129O61039J243128K106658J157934j083928l102657
$$ 309636372 312215848 313769977 314431016 315674144 317780802 318938736 317854808 314752151
25578C14752151l591078j610829N70138O53228o07348j200000r77669j195372
$$ 314752151 311161073 309550244 310120382 310773610 310166262 308966262 307988593 306793221
25570C06793221j338374k94015J513587K695963J664538p43171k057377q65125
$$ 306793221 305454847 305160832 306674419 309370382 311034920 310291749 308234372 307369247
25562C07369247J535518K347365J094689l10949j013542j523719j403646P69189
$$ 307369247 308904765 311252130 312346819 312035870 311022328 309498609 308094963 308864152
25554C08864152L263740K985794N77229j137216j298967p96051l28003j1639L08425
$$ 308864152 312127892 315113686 315690915 314553699 313254732 312458681 312130678 312119039 312427464
25545C12427464L31574k18758k65484j4790o75055j286807j102526r47393j536282
$$ 312427464 312759038 312540280 312274796 312260006 311584951 310298144 309195618 308248225 306711943
25536C06711943k210495k656341k941728j730851J063342L285469L588063K431490
$$ 306711943 304501448 301845107 298903379 297172528 298235870 301521339 305109402 307540892
25528C07540892O62002j401065l569380m493558l276205j256686O23285K617274
$$ 307540892 308202894 306801829 303232449 298738891 295462686 294206000 294829285 297446559
25520B97446559L757571L394228K863098K358128J476072J037871J483743J158281
$$ 297446559 301204130 304598358 307461456 309819584 311295656 312333527 313817270 314975551
25512C14975551P8546k34354j28346l0754J10295j65377j017265j575548j651060
$$ 314975551 315054097 314819743 314691397 314660643 314770938 314605561 313588296 312012748 310361688
25503C10361688j681938j800188k245768k107754j022503P4782K87667K66397
$$ 310361688 308679750 306879562 304633794 302526040 301503537 301578319 301865986 302132383
25495C02132383J155003K268039K383183J948971K617243L503421K498428K92002
$$ 302132383 303287386 305555425 307938608 309887579 312504822 316008243 318506671 318798673
25487C18798673j087441j160008r44559m28014N84613R77124O60380N12102P95473
$$ 318798673 317711232 316551224 315606665 315178651 315763264 316740388 317400768 317912870 318708343
25478C18708343J458865J680027J057374K2646n71476P515K29392r15410k523504
$$ 318708343 320167208 321847235 322904609 322927255 322355779 322363294 322592686 321677276 319153772
25469C19153772k746829j960890o52745J022154K074884L057404L740740K994168
$$ 319153772 316406943 314446053 313793308 314815462 316890346 319947750 323688490 326682658
25461C26682658O84882k375130m861288n328362l970532k491359k078428j442847
$$ 326682658 327367540 324992410 320131122 314802760 310832228 308340869 306262441 304819594
25453C04819594J75239J307874J058715k1804j978887l968852m375688l026111
$$ 304819594 304994833 306302707 307361422 307339618 305360731 301391879 297016191 293990080
25445B93990080j284479l50674j075495k697627k046374O54865K834453L311020
$$ 293990080 292705601 292354927 291279432 288581805 286535431 287190296 290024749 293335769
25437B93335769K369269J069618N71418J153854J835744K280254K946737L241620
$$ 293335769 295705038 296774656 297346074 298499928 300335672 302615926 305562663 308804283
25429C08804283K790079K427745J155975j122516j826497n24409N25329K9030
$$ 308804283 311594362 314022107 315178082 314055566 312229069 311704660 312229989 312259019
25421C12259019j115163o96491J83975r25876k298815k083676j083289M18749
$$ 312259019 311143856 310447365 310631340 309705464 307406649 305322973 304239684 304658433
25413C04658433K113650K893878K980985K597714J254840m48031j804401j968462
$$ 304658433 306772083 309665961 312646946 315244660 316499500 316051469 314247068 312278606
25405C12278606J94378K624160K433003R12817N50208R71492Q49099O10458Q3450
$$ 312278606 312472984 315097144 317530147 318442964 318993172 319964664 320813763 321424221 321507671
25396C21507671j300454k318159j973806r87869p57347j296030j573342j052611
$$ 321507671 320207217 317889058 315915252 314927383 314170036 312874006 311300664 310248053
25388C10248053n79257j436236k316959j743127n86858J87219R24319J116271
$$ 310248053 309668796 308232560 305915601 304172474 303585616 303772835 304697154 305813425
25380C05813425O73837J06845l50107m52767J91688M75356m20547j153871k32378
$$ 305813425 306487262 306594107 306244000 305791233 305982921 306458277 306037730 304883859 304651481
25371C04651481J398917K020856J193158J76886L0328q7486m7905J187265K188623
$$ 304651481 306050398 308071254 309264412 309441298 309471626 309384140 309336235 310523500 312712123
25362C12712123J513614N48611j09604p97733l54840J13402n16096r90377q51239
$$ 312712123 314225737 314774348 314664744 313867011 313512171 313625573 313109477 312119100 311267861
25353C11267861q3569R28231K029302K700401K554549K201556K047669J020582
$$ 311267861 311184292 312112523 314141825 316842226 319396775 321598331 323646000 324666582
25345C24666582r19938k115019k084199k313821k321600j001693M47115P3461
$$ 324666582 323746644 321631625 319547426 317233605 314912005 313910312 314357427 314430888
25337C14430888k234502m905731o435221o263489m692011j738181J572667L512089
$$ 314430888 312196386 307290655 300855434 294591945 289899934 288161753 289734420 293246509
25329B93246509M568164N225968M435823J960137m37903j637715j671310j049994
$$ 293246509 297814673 303040641 307476464 309436601 308998698 307360983 305689673 304639679
25321C04639679p52428j633730k984255k911858j170330J051738K961797M482739
$$ 304639679 303887251 302253521 299269266 296357408 295187078 296238816 299200613 303683352
25313C03683352M750555L509127J940741P66528L75006J074404J765737Q11436
$$ 303683352 308433907 311943034 313883775 314650303 315025309 316099713 317865450 318676886
25305C18676886j464972l069455k509594m11029R69392L9250j785382k307811
$$ 318676886 317211914 314142459 311632865 311221836 312191228 312230478 310445096 308137285
25297C08137285j412408K27322J849752K725835K459610J815964J241788J45907
$$ 308137285 306724877 306952199 308801951 311527786 313987396 315803360 317045148 317191055
25289C17191055j143474j826361j745580r99667k28901j5518n91346p38179N30798
$$ 317191055 316047581 314221220 312475640 311475973 311247072 311231554 310640208 309902029 310432827
25280C10432827K098001K423920J494351P68183j08503j074161p24025J16057
$$ 310432827 312530828 314954748 316449099 317217282 317108779 316034618 315310593 315426650
25272C15426650n40103k262685k661268j416214o37408n24617l04888m85524j211159
$$ 315426650 314886547 312623862 309962594 308546380 307908972 307384355 307079467 306593943 305382784
25263C05382784j455620r61349p47167l54156Q77968J922147K558412L671361
$$ 305382784 303927164 302965815 302218648 301864492 302742460 304664607 307223019 310894380
25255C10894380M626886L978239K191326O10511l49786j050496j859761l037959
$$ 310894380 315521266 319499505 321690831 322301342 321951556 320901060 319041299 316003340
25247C16003340m168481l140508k85350J114501R3052j385486j455387r24195
$$ 316003340 311834859 308694351 308409001 309523502 309616554 308231068 306775681 305851486
25239C05851486q08131m65495L33717O91667N93240M85413L18174M68322J670290
$$ 305851486 305043355 304577860 304911577 305603244 306196484 306681897 307000071 307468393 309138683
25230C09138683L020645K059902l19701j035604o49636m05604J67995J352384
$$ 309138683 312159328 314219230 313899529 312863925 312214289 311808685 311976680 313329064
25222C13329064K479405K133741L08589j345425j938793j885881j361121l36738
$$ 313329064 315808469 317942210 318250799 316905374 314966581 313080700 311719579 311382841
25214C11382841L99321R22025J696348K281648K646412K382031J342678K82686
$$ 311382841 311782162 312704187 314400535 316682183 319328595 321710626 323053304 323335990
25206C23335990L787L13550O34140M31732n98656j736712k566687l367673l687656
$$ 323335990 323339777 323653327 324287467 324719199 324120543 322383831 319817144 316449471 312761815
25197C12761815k858496j246660o0807P71827J325932J284687P40476K32877L6674
$$ 312761815 309903319 308656659 308595852 309367679 310693611 311978298 312718774 312951651 312988325
25188C12988325q47505j902725j908130j524904j014009K37897J480028J387578
$$ 312988325 312140820 310238095 308329965 306805061 305791052 306028949 307508977 308896555
25180C08896555j91309k032352l502371l180330j178089O42959K304682M331309
$$ 308896555 308705246 306672894 303170523 299990193 298812104 299455063 301759745 306091054
25172C06091054M715066L199076J811387N63428j059077k252058j896412r78704
$$ 306091054 310806120 314005196 315816583 316380011 315320934 313068876 311172464 310193760
25164C10193760o97509l73875j67552p91936j301256j697193j940040j179176
$$ 310193760 309496251 309122376 308954824 308162888 306861632 305164439 303224399 302045223
25156C02045223J38148Q99766k36674j862605j645892n18690L76685J137649J308700
$$ 302045223 302183371 303083137 302846463 300983858 299337966 298819276 299195961 300333610 301642310
25147C01642310J135996J840896L738532N285949N491753M779322L158201Q69179
$$ 301642310 302778306 304619202 308357734 313643683 319135436 323914758 327072959 327942138
25139C27942138j248974k786680l519825l634393l772278l347817k877700k930767
$$ 327942138 326693164 323906484 320386659 316752266 312979988 309632171 306754471 303823704
25131C03823704j952238j01746J785098K928942J622380r53255k113385j187921
$$ 303823704 301871466 301769720 303554818 306483760 308106140 307152885 305039500 303851579
25123C03851579J39647Q59691J107233J136446J109403L64408r71707j909122
$$ 303851579 303991226 304850917 305958150 307094596 308203999 308568407 307596700 305687578
25115C05687578j731791j017109n43865m01820j43336l660j482250l357197l036845
$$ 305687578 303955787 302938678 302394813 301992993 301849657 301845997 300363747 297006550 293969705
25106B93969705r35241Q74649J528576J789897J966267K468413M164513O138943
$$ 293969705 293034464 293909113 295437689 297227586 299193853 301662266 305826779 311965722
25098C11965722N075139R10328k602125l463852k978507k872015k777293j822325
$$ 311965722 317040861 317951189 315349064 311885212 308906705 306034690 303257397 301435072
25090C01435072l34602J465514K844968K166099j33605j352953m54113J317282
$$ 301435072 301100470 302565984 305410952 307577051 307443446 306090493 305636380 306953662
25082C06953662K849191L514397K843783J359463L19479m91427j715922k829019
$$ 306953662 309802853 313317250 316161033 317520496 317839975 317348548 315632626 312803607
25074C12803607j974086M08077J884687J636014L27441n14193p41278r38636j270010
$$ 312803607 310829521 311237598 313122285 314758299 315085740 314571547 313830269 312891633 311621623
25065C11621623j294166l92779J100760K020154J451544o5286r71940j181115
$$ 311621623 310327457 309934678 311035438 313055592 314507136 314441850 313469910 312288795
25057C12288795j804776k096244j605164r17272J2019O66246J55072j195918j598041
$$ 312288795 310484019 308387775 306782611 305865339 305877358 306543604 306698676 305502758 303904717
25048C03904717q79651M02942J492846P14000j591369k583631j438516N64628
$$ 303904717 303025066 303428008 304920854 305634854 304043485 301459854 300021338 300585966
25040C00585966K518214K621493N66420j266899j867840j605580o86298J21231
$$ 300585966 303104180 305725673 306292093 305025194 303157354 301551774 300865476 300986707
25032C00986707J076662J669910J078572J114716K218600K969078L013348K561812
$$ 300986707 302063369 303733279 304811851 305926567 308145167 311114245 314127593 316689405
25024C16689405J764464k52239k080728j871842n01882N01593J074354J831817
$$ 316689405 318453869 318201630 316120902 314249060 313747178 314248771 315323125 317154942
25016C17154942J746778R54396J113276J346277L13198j483877k920243l160835
$$ 317154942 318901720 319856116 320969392 322315669 322628867 321144990 318224747 315063912
25008C15063912j964885q84753j24201P25331J602716K036296J805147K041696
$$ 315063912 313099027 312214274 312090073 312815404 314418120 316454416 318259563 320301259
25000C20301259K343670J403819p41032k396231j551329Q95759K337320K358618
$$ 320301259 322644929 324048748 323307716 320911485 319360156 320255915 322593235 324951853
24992C24951853R13968j036422j452376o17655m00160j634265k988730l087173
$$ 324951853 325865821 324829399 323377023 322759368 322359208 320724943 317736213 314649040
24984C14649040k339129j886893j785787j425895m77460N54781J463643J693544
$$ 314649040 312309911 310423018 308637231 307211336 306733876 307288657 308752300 310445844
24976C10445844J550862J263542P67088l1362r49461j455583j208997l93759m65495
$$ 310445844 311996706 313260248 314027336 313995974 313046513 311590930 310381933 309988174 309522679
24967C09522679j346396j446987k56605J888450L311744K736998J115172k94250
$$ 309522679 308176283 306729296 306472691 308361141 311672885 314409883 315525055 315230805
24959C15230805p38971k53990J12746n51595j131343j451645k412037l306918
$$ 315230805 314491834 314237844 314350590 313798995 312667652 311216007 308803970 305497052
24951C05497052l031658j784794n22281K19077O04756J185578K062457K363187
$$ 305497052 302465394 300680600 300158319 300377396 300982152 302167730 304230187 306593374
24943C06593374J624261L72528m99396j072755r64776N9592O87194k7109j415125
$$ 306593374 308217635 308590163 308090767 307018012 306053236 306112828 306800022 306772913 305357788
24934C05357788k272086k092005p98447R68908J615265J683979J050038l48360
$$ 305357788 303085702 300993697 300195250 301164158 302779423 304463402 305513440 305165080
24926C05165080r95780j15277J290227K541627L123773K367611J287478P33197
$$ 305165080 304169300 304054023 305344250 307885877 311009650 313377261 314664739 315397936
24918C15397936N2595n11645q56621j735948k414565j498971J39669J240205J956647
$$ 315397936 315450531 314938886 314082265 312346317 309931752 308432781 308572450 309812655 311769302
24909C11769302J918127M51538j528420k220961j470195j99266J77159o13688
$$ 311769302 313687429 314138967 312610547 310389586 308919391 308720125 308897284 308283596
24901C08283596r13469q1036L1979j506934l225292m357187m543018l619869j663824
$$ 308283596 307370127 307289091 307321070 305814136 302588844 298231657 293688639 290068770 288404946
24892B88404946J044120K612697K491792K048161K434874L735461M588045L313794
$$ 288404946 289449066 292061763 294553555 296601716 299036590 302772051 307360096 310673890
24884C10673890M40902j788323k058089j614261j772644j649839n18945J102294
$$ 310673890 311114792 309326469 307268380 305654119 303881475 302231636 301712691 302814985
24876C02814985K571256K655380Q23261j994061l758761k981413k65233J911131
$$ 302814985 305386241 308041621 308864882 306870821 303112060 300130647 299865414 301776545
24868C01776545K495762J667724k48817j236389p88148O2512J137428J445595
$$ 301776545 304272307 305940031 305691214 304454825 303666677 303729189 304866617 306312212
24860C06312212N73001o56846j091153j397J072372J297126Q99780N23487J038239
$$ 306312212 306885213 306228367 305137214 305135817 306208189 307505315 308405095 308928582 309966821
24851C09966821J732053J909936J244113K5278j401357k433379k531962j682309
$$ 309966821 311698874 313608810 314852923 314878201 313476844 311043465 308511503 306829194
24843C06829194k80298P93102L20204j790150l175890k666153j345920p4421J278809
$$ 306829194 306548896 307341998 307662202 305872052 302696162 300030009 298684089 298609668 299888477
24834B99888477K053230J790872J769272K073022J298954k97269o46215P89347
$$ 299888477 301941707 303732579 305501851 307574873 308873827 308576558 307930343 308719690
24826C08719690J761145Q87497j089044k495909k165818j072662l43212k99459
$$ 308719690 310480835 311368332 310279288 307783379 305617561 304544899 304201687 303902228
24818C03902228l33901n6944j04273k80774M2742Q06866J700571J512231M13494
$$ 303902228 303568327 303511383 303407110 303126336 303169078 303975944 305676515 307188746 307602240
24809C07602240j53826j12940M789k96831l19038L24731J217897J602321J634230
$$ 307602240 307448414 307335474 307340263 307043432 306724394 307049125 308267022 309869343 311503573
24800C11503573K155821K270630J467559J101178J545689J322098p13723l446377
$$ 311503573 313659394 315930024 317397583 318498761 320044450 321366548 320652825 317206448
24792C17206448n034179m608761k619983l69783J851474L316964L036949J212395
$$ 317206448 312172269 307563508 304943525 304573742 306425216 309742180 312779129 313991524
24784C13991524n67659q11085M26071J250892L41492q26020j606838k360832k719777
$$ 313991524 313423865 312612780 313038851 314289743 314631235 313805215 312198377 309837545 307117768
24775C07117768k185584j085942J80401L76540k03838N32816K337231L740729
$$ 307117768 304932184 303846242 304026643 304403183 304199345 304732161 307069392 310810121
24767C10810121L117236J116742n80400k016151k424261j293012k01404n83571
$$ 310810121 313927357 315044099 314463699 312447548 310023287 308730275 308528871 307945300
24759C07945300k210914l345935k934043j152117R12461J849693N56748j613873
$$ 307945300 305734386 302388451 299454408 298302291 299214752 301064445 301621193 300007320
24751C00007320k436336k026539j680386j240813k71764K25839k18255n54595
$$ 300007320 297570984 295544445 293864059 292623246 292351482 292577321 292359066 291804471
24743B91804471O65444L224377M456875L406715J955721K051249K275616P75088
$$ 291804471 292469915 295694292 300151167 303557882 305513603 307564852 309840468 310615556
24735C10615556j085863j725733j093816Q24318K402753K382590J928065J002667
$$ 310615556 309529693 307803960 306710144 307534462 309937215 312319805 314247870 315250537
24727C15250537j002530l724398m873853k821681K72189K067810K543808J563104
$$ 315250537 314248007 310523609 305649756 302828075 303100264 305168074 307711882 309274986
24719C09274986K39302n4157L5066k73684o66845j169079j412282q08584O22788
$$ 309274986 309514288 309460131 309495197 309221513 308554668 307385589 305973307 305164723 305787511
24710C05787511J571549J037318q52915k672479l315815k467848k90568J786246
$$ 305787511 307359060 308396378 307543463 304870984 301555169 299087321 298796753 300582999
24702C00582999K688800K264537J109430o2012j108264j774784j303611k69469
$$ 300582999 303271799 305536336 306645766 306583754 305475490 303700706 302397095 302127626
24694C02127626N80877N78664j77068k83460K46117O60144J663557K914403L042329
$$ 302127626 302708503 303287167 303110099 302826639 303072756 303732900 305396457 308310860 311353189
24685C11353189K022159Q91265l67784j608686j404498l4117J237406J932065
$$ 311353189 313375348 314266613 313898829 312290143 310885645 310851528 312088934 314020999
24677C14020999K125226J153219q24534j661783p41442J235312L236103L620375
$$ 314020999 316146225 317299444 316474910 314813127 314071685 315306997 318543100 322163475
24669C22163475K286535J010501Q08674M63529n09996j025481j018614j589467
$$ 322163475 324450010 325460511 326269185 326732714 326222718 325197237 324178623 322589156
24661C22589156k641480k858204k241916j486331q8036J503362R02627j247627
$$ 322589156 319947676 317089472 314847556 313361225 313273189 314776551 315679178 314431551
24653C14431551j717560r48204k76612K69537r26126l931524n083420l635678
$$ 314431551 312713991 311765787 311489175 311758712 310832586 306901062 301817642 298181964
24645B98181964k115198q26471O30498J430510J670934J701246J534875J158436
$$ 298181964 296066766 295240295 295870793 297301303 298972237 300673483 302208358 303366794
24637C03366794R9382j043837j360784j484284j707660j738266j009604M54685
$$ 303366794 303466176 302422339 301061555 299577271 297869611 296131345 295121741 295576426
24629B95576426J920371K396018K012415K190119L211362M171342M177932L658311
$$ 295576426 297496797 299892815 301905230 304095349 307306711 311478053 315655985 319314296
24621C19314296L229517L551445L517135K370292R41143O1540M2766K64195l05407
$$ 319314296 322543813 326095258 329612393 331982685 332923828 332985368 333028134 333292329 332986922
24612C32986922k204184m144574m769145m126161k997334j479908k37397j86965
$$ 332986922 330782738 326638164 321869019 317742858 314745524 313265616 313028219 312841254
24604C12841254o49689m54556j26626K63663O30517r4012n84163k96192j273081
$$ 312841254 312191565 311737009 311610383 311874046 312504563 312410551 311826388 311530196 310257115
24595C10257115l417183m677055m587796l730903k094348M30184K742939L021717
$$ 310257115 306839932 302162877 297575081 293844178 291749830 292180014 294922953 297944670
24587B97944670J828893L10818l72533J2374K93978N04061J073461J338858J692426
$$ 297944670 299773563 300084381 299711848 299724222 300018200 300522261 301595722 302934580 304627006
24578C04627006K150550K046128J944038K137718J934449J130326L53809m66334
$$ 304627006 306777556 308823684 310767722 312905440 314839889 315970215 316324024 315857690
24570C15857690j245697j294816p51957j07861K28169L45550M05623M83693M91292
$$ 315857690 314611993 313317177 312565220 312457359 312685528 313031078 313436701 313920394 314411686
24561C14411686O13738P8442j155009j703133j096817K58972J445592L234187
$$ 314411686 315025424 315103866 313948857 312245724 311148907 311407879 312853471 316087658
24553C16087658N769476O441067M344800J175192k657712n989394p070966n283512
$$ 316087658 321857134 328298201 332643001 333818193 331160481 325171087 318100121 312816609
24545C12816609j746821J087404J488132j31642j292466r52605K90583J014520
$$ 312816609 311069788 312157192 313645324 313513682 312221216 311268611 311559194 312573714
24537C12573714L86643l26197m03087j18063L01233k33441j738410k836119j852186
$$ 312573714 312960357 312634160 312231073 312113010 312414243 312180802 310442392 307606273 305754087
24528C05754087K58096J865537K659347L031826L304123L255056L123834K329855
$$ 305754087 306012183 307877720 310537067 313568893 316873016 320128072 323251906 325581761
24520C25581761N38263j754013l605312m119118l142772j450981n4091O86510
$$ 325581761 326120024 324366011 320760699 316641581 313498809 312047828 311993737 312680247
24512C12680247R22855R71707J134414M09785j621659l530699l965640k540609
$$ 312680247 313603102 314574809 315709223 316119008 314497349 310966650 307001010 304460401
24504C04460401m76060Q00689N43278o33916j534958j882831j224337J26507J636880
$$ 304460401 303984341 304785030 305328308 304694392 303159434 301276603 300052266 300178773 301815653
24495C01815653K923279L289016K402744J296506P72466R32393N31225q21548
$$ 301815653 304738932 308027948 310430692 311727198 312499664 313432057 313963282 313141734
24487C13141734q38426N78413J543086J523449P87123k6511o10001q21410j92121
$$ 313141734 312303308 312881721 314424807 315948256 316735379 316708868 316098867 315277457 315085336
24478C15085336P48504J211100Q11778o8304o91675j158465k215368l209870k675205
$$ 315085336 315833840 317044940 317856718 317788414 317096739 315938274 313722906 310513036 307837831
24469C07837831j421671j010561j311306j697433j646945l64394K011253L564392
$$ 307837831 306416160 305405599 304094293 302396860 300749915 300385521 302396774 305961166
24461C05961166L713067L464537K411009Q27118k69832m02005K40633J189114
$$ 305961166 309674233 313138770 315549779 316376897 316107065 315705060 315945693 317134807
24453C17134807Q59627l04278j25213J058602J147442Q7738j039491j719761j015091
$$ 317134807 317994434 317690156 317564943 318623545 319770987 319858725 318819234 317099473 316084382
24444C16084382N93984J914357K183091J396636R6539j194187k083100k844385
$$ 316084382 316678366 318592723 320775814 322172450 322268989 321074802 318991702 316147317
24436C16147317k948248j907717K21652K799255M465205L963430K221424O95082
$$ 316147317 313199069 311291352 311513004 314312259 318777464 322740894 324962318 325657400
24428C25657400L3160N67049N81496p56237j745465j485720j141791j558726j730417
$$ 325657400 325690560 326257609 326839105 326082868 324337403 322851683 321709892 320151166 318420749
24419C18420749j867096k797886l714885l313733j276222J316012L030678L434162
$$ 318420749 316553653 313755767 310040882 306727149 305450927 306766939 309797617 313231779
24411C13231779K821189J288203n62655j368148j190770j173540j285702j160945
$$ 313231779 316052968 317341171 316778516 315410368 314219598 313046058 311760356 310599411
24403C10599411j028944j012855j119952j463357k067095l337963m307754l616320
$$ 310599411 309570467 308557612 307437660 305974303 303907208 300569245 296261491 292645171
24395B92645171k246530n83593K142329L135322J806217Q84064J457329K205220
$$ 292645171 290398641 289815048 291957377 295092699 296898916 297782980 299240309 301445529
24387C01445529K051121J421550J484464J952574J382938J92999n26350j445238
$$ 301445529 303496650 304918200 306402664 308355238 309738176 309931175 309404825 307959587
24379C07959587k406489j464668L86751R48919J51166n52512M36331K350285K775652
$$ 307959587 305553098 304088430 304475181 305424100 305575266 305022754 305459085 307809370 310585022
24370C10585022R32457j392324j920173q17473J50117Q01524Q73555l95106j961879
$$ 310585022 311517479 310125155 308204982 307387509 307537626 308339150 309212705 308817599 306855720
24361C06855720k671682j203410J947161L659711L215312K139240K092534K545008
$$ 306855720 304184038 302980628 304927789 308587500 311802812 313942052 316034586 318579594
24353C18579594K378262J610761N49715J06800L76023N20630J188017K900323
$$ 318579594 320957856 322568617 323118332 323225132 323601155 324121785 325309802 328210125
24345C28210125K965304L60704k323104l199813l001473k913949l513639m073172
$$ 328210125 331175429 331536133 329213029 326013216 323011743 320097794 316584155 312510983
24337C12510983l746922k732444k191168k312677k004743r71541M0283J361707
$$ 312510983 308764061 306031617 303840449 301527772 299523029 298551488 298591771 299953478
24329B99953478L130185M448764L085554J72941r37589k82424Q37484J734517
$$ 299953478 303083663 307532427 310617981 310790922 309853333 309570909 310408393 312142910
24321C12142910J793805J510491O50208j150695k952262l796660l514730j848878
$$ 312142910 313936715 315447206 316097414 314946719 311994457 308197797 304683067 302834189
24313C02834189N95661K295006J929316J64982q58841o81799o90727q80057p31281
$$ 302834189 303429850 305724856 307654172 307819154 306960313 306278514 305587787 304707730 303976449
24304C03976449k33828N59648Q21469J26273o09957k7593R94888K93545j027358
$$ 303976449 303742621 304302269 305123738 305250011 304640054 304612461 305607349 305900894 304873536
24295C04873536j137663l44744P84493J986437K184717R93936n70696r13146m22284
$$ 304873536 303735873 303391129 304175622 306162059 308346776 309340712 308770016 307856870 307434586
24286C07434586n72624j279808j636825j624432j486381l80862J312288J634688
$$ 307434586 306861962 305582154 303945329 302320897 300834516 300453654 301765942 303400630
24278C03400630J031612J487437J798519J623740J294093M93348l3824K17315
$$ 303400630 304432242 305919679 307718198 309341938 310636031 311129379 311095555 311312870
24270C11312870M41858o578k98198M87378J716889K311719R33548r24946j002293
$$ 311312870 311754728 311748150 311449952 311937330 313654219 315965938 316899486 315974540 314972247
24261C14972247m59825j064699k141365k383535j848836o38344O61318J477044
$$ 314972247 314512422 313447723 311306358 308922823 307073987 306435643 307096961 308574005
24253C08574005J372718l30592j898780j558047J38722J607518J534450p8889
$$ 308574005 309946723 309616131 307717351 306159304 306298026 307905544 309439994 309361105
24245C09361105j172963p11104l3498O6627N7580L00396K85044q3334l59132n09966
$$ 309361105 308188142 307477038 307443540 307510167 307567747 307868143 308153187 308069853 307710721 307200755
24235C07200755o71058j061867j300982o54114M17633N87174N32077P97749J467122
$$ 307200755 306529697 305467830 304166848 303512734 303930367 304517541 305049618 305847367 307314489
24226C07314489J999827J080704n45885j078351l19241L00218o0225j231869k058289
$$ 307314489 309314316 310395020 309849135 308770784 308451543 308751761 308691536 307459667 305401378
24217C05401378j824513j335863j567498j413000Q49856L880925M780114K795731
$$ 305401378 303576865 302241002 300673504 299260504 300110360 303991285 308771399 311567130
24209C11567130J49638r35076j018166j120549j474959k639351l110548k433787
$$ 311567130 311716768 310781692 309763526 308642977 307168018 304528667 301418119 298984332
24201B98984332j158273L42027J375689J774364J220316J048693J839438J940889
$$ 298984332 297826059 298168086 299543775 301318139 302538455 303587148 305426586 307367475
24193C07367475J062813k77263j397001j580304j337914j37012J367000J118815
$$ 307367475 308430288 308153025 306756024 305175720 303837806 303700794 305067794 306186609
24185C06186609K46669J37542N9144r66857j862885j977724j686284m32108J471979
$$ 306186609 306433278 306570820 306629964 305663107 303800222 301822498 300136214 299704106 301176085
24176C01176085J887805K34843k035032k611531q14448J652554M365797O326918
$$ 301176085 303063890 303298733 301263701 298652170 297837722 299490276 303856073 310182991
24168C10182991N556618K059316j780403l580163m396586m772380l728157j578680
$$ 310182991 315739609 317798925 316018522 312438359 308041773 303269393 299541236 297962556
24160B97962556K48011J456495K152051K367218K899907L865685L881944K872789
$$ 297962556 298210567 299667062 301819113 304186331 307086238 310951923 314833867 317706656
24152C17706656J807903J498729J001603k72736j236941j150968q80034j199934
$$ 317706656 319514559 321013288 322014891 321742155 320505214 319354246 318474212 317274278
24144C17274278j286303p47135L8481L03074j96990j495130k856436l765106l208680
$$ 317274278 315987975 315240840 315279321 315582395 315385405 313890275 311033839 307268733 304060053
24135C04060053j700341p62011P1306J356420J237975p66289k446927k114873
$$ 304060053 302359712 301597701 301669007 303025427 304263402 303497113 301050186 298935313
24127B98935313J62187K304324L146558L057289K616991K436808K365483J739439
$$ 298935313 299097500 301401824 304548382 307605671 310222662 312659470 315024953 316764392
24119C16764392J053985J108318N56645j544707k799459k036586j378062j641055
$$ 316764392 317818377 318926695 319483340 317938633 315139174 313102588 311724526 310083471
24111C10083471k055552j854577r71646K82691J141614J260830J564320J498394
$$ 310083471 308027919 306173342 305201696 305484387 306626001 307886831 309451151 310949545
24103C10949545P32016k65666q21715K86511J817782K117236J907435J492301
$$ 310949545 311681561 311415895 310594180 310880691 312698473 314815709 316723144 318215445
24095C18215445N76624j61486p24027r72784r78945k051281l967636m721196l936197
$$ 318215445 318792069 318630583 317906556 316933772 315954827 313903546 309935910 305214714 301278517
24086C01278517l071614j846143R28516L594620M063047L013617K082626J060969
$$ 301278517 298206903 296360760 297289276 300883896 304946943 307960560 310043186 311104155
24078C11104155n24985j231902m94013J005223K240812K757579J885361M5594
$$ 311104155 310579170 309347268 308853255 309858478 312099290 314856869 316742230 316787824
24070C16787824n6711J905262L055935K106378J52339k148946m090734m775788
$$ 316787824 316731113 318636375 321692310 323798688 323951027 321802081 317711347 312935559
24062C12935559n145085m912847l117102o68605J292119K512731L129570K785336
$$ 312935559 307790474 302877627 299760525 299091920 300384039 302896770 306026340 308811676
24054C08811676J315604k59038r21450l98469L82870P71321J38765j483868k462156
$$ 308811676 310127280 309868242 308946792 308548323 308931193 309702514 309841279 308357411 305895255
24045C05895255k846033k308782N4817K559371L364644K623011R60665o54694
$$ 305895255 303049222 300740440 300795257 303354628 306719272 309342283 310302948 309648254
24037C09648254j180915q18856m7370N56125N33429N52939J089673J850373J839230
$$ 309648254 308467339 307648483 307601113 308157238 308690667 309243606 310333279 312183652 314022882
24028C14022882J241331J776180L236914K663135K18134j295158j699540j949163
$$ 314022882 315264213 317040393 320277307 322940442 323158576 321863418 320163878 318214715
24020C18214715k055522k110383k362822k536137j854261m01145L10583n72595
$$ 318214715 316159193 314048810 311685988 309149851 307295590 306894445 307205028 306632433
24012C06632433j444015j197410r01302j305396j235012P83247L752829M715044
$$ 306632433 305188418 303991008 303089706 301784310 300549298 301332545 305085374 309800418
24004C09800418L595394K387950N22007k204711l472302k690625j189584p7268
$$ 309800418 313395812 315783762 316305769 314101058 310628756 307938131 306748547 306671279
23996C06671279R68633K340215L426071L211071K150420K67209k144607l614314
$$ 306671279 307639912 309980127 313406198 316617269 318767689 319034898 316890291 313275977
23988C13275977l273522q23514K200221L312242K267931J041378J215642J313167
$$ 313275977 310002455 309178941 311379162 314691404 316959335 318000713 319216355 320529522
23980C20529522l96140k256169k354460j549629j530488j454893p74884p91579
$$ 320529522 320133382 317877213 315522753 313973124 312442636 310987743 310212859 309421280
23972C09421280j139412p48210j75229K38194J346019J372485J43239k86086k29295
$$ 309421280 308281868 307533658 307358429 307596623 308942642 310315127 310458366 310172280 309942985
23963C09942985j085050j743338r85296K47353J053857O87963q01005k443046
$$ 309942985 308857935 307114597 306129301 306376654 307430511 308118474 307317469 304874423
23955C04874423l030695j765887k52665m12543j736043k116610p35600N32702
$$ 304874423 301843728 300077841 299825176 299412633 297676590 295559980 294824380 295357082
23947B95357082N75563R14623K449782L177934K168590R93145M60410K37246M4180
$$ 295357082 295932645 296847268 299297050 302474984 304643574 305636719 306097129 306334375 306378555
23938C06378555m08809o37074n85570j529J400713K322714K056744J500684J204931
$$ 306378555 305969746 305332672 304747102 304745573 306146286 308469000 310525744 312026428 313231359
23929C13231359J056076J257863J365854P31507m4431o77541m31949Q68904J723832
$$ 313231359 314287435 315545298 316911152 317642659 317598228 316920687 316488738 317357642 319081474
23920C19081474J822732J366629L03035n88065j434222k097494j356809J31830
$$ 319081474 320904206 322270835 322573870 321985805 320551583 318454089 317097280 317229110
23912C17229110O95849j00204j058306j719555k448377k320266r49328O84440
$$ 317229110 317924959 317824755 316766449 315046894 312598517 310278251 309328923 310013363
23904C10013363R88259L64698L02951K11611K1249p6690j67385K40579J052237
$$ 310013363 311001622 311366320 311669271 311880882 311902131 311825441 311658056 311898635 312950872
23895C12950872J258512K94669m02606o94953r58981j198798j201296j242093
$$ 312950872 314209384 314504053 314101447 313406494 312447513 311248715 310047419 308805326
23887C08805326r97128r28511j198945m41044J144882J893392J347770L72490
$$ 308805326 307808198 306879687 305680742 305239698 306384580 308277972 309625742 309998232
23879C09998232n91798n6100J873422K933947J969258J93667j164801j475392
$$ 309998232 309406434 309350334 311223756 314157703 316126961 316320628 315155827 313680435
23871C13680435j218667j630328k604828l068282k166983k82475J013808O68339
$$ 313680435 312461768 310831440 308226612 305158330 302991347 302708872 303722680 304391019
23863C04391019k18393m82938l67656M29705J482368J405616l60158k507846l328840
$$ 304391019 304172626 303689688 303322032 303751737 305234105 306639721 306279563 303771717 300442877
23854C00442877k824185j815876p30880M49620J012011J416999K106627J653366
$$ 300442877 297618692 295802816 295071936 295521556 296533567 297950566 300057193 301710559
23846C01710559m23437k588267l094705j521133L00567J678569L463843M138157
$$ 301710559 301287122 298698855 295604150 294083017 294383584 296062153 299525996 303664153
23838C03664153K528328n7877k332332l750765m318895m382003l269264j645412
$$ 303664153 306192481 306134604 303802272 300051507 295732612 291350609 288081345 286435933
23830B86435933n27713L70110J597342L036143M096292L961523K055304Q00303
$$ 286435933 285908220 286278330 287875672 290911815 295008107 298969630 301024934 301825237
23822C01825237J486955J866903N30330n14730l14675q92467k272060k867128
$$ 301825237 303312192 305179095 305709425 305194695 304880020 303987553 301715493 298848365
23814B98848365k729612k153460m40434J687251K321161J296280N39886P45022
$$ 298848365 296118753 293965293 293524859 295212110 297533271 298829551 299369437 300114459
$$ [...]
##END NTUPLES=NMR SPECTRUM
##END=
