##TITLE=C13_DE-43EA_D2O
 D2O, 22000 sc

 16.7.2024
##JCAMPDX= 6.0         $$ Bruker NMR JCAMP-DX V2.0
##DATA TYPE= NMR SPECTRUM
##DATA CLASS= NTUPLES
##ORIGIN= UXNMR, Bruker Analytische Messtechnik GmbH
##OWNER= root
$$ XWIN-NMR		Version 3.5
$$ Wed Jul 17 13:39:08 2024 Russian Standard Time (UT+4h)  she@DPX200
##.OBSERVE FREQUENCY= 50.327896
##.OBSERVE NUCLEUS= ^13C
##.ACQUISITION MODE= SIMULTANEOUS
##.ACQUISITION SCHEME= undefined
##.AVERAGES= 22401
##.DIGITISER RES= 17
##SPECTROMETER/DATA SYSTEM= spect
##.PULSE SEQUENCE= zgpg30
##.SOLVENT NAME= D2O
##.SHIFT REFERENCE= (INTERNAL, D2O, 0, 222.565)
##AUDIT TRAIL= $$ (NUMBER, WHEN, WHO, WHERE, WHAT)
$$ ##TITLE= Audit trail, XWIN-NMR		Version 3.5
$$ ##JCAMPDX= 5.01
$$ ##ORIGIN= Bruker BioSpin GmbH
$$ ##OWNER= she
$$ F:/spectra/data/she/nmr/c13/1/pdata/1/auditp.txt
$$ ##AUDIT TRAIL=  $$ (NUMBER, WHEN, WHO, WHERE, WHAT)
(   1,<2024-07-17 13:37:21.59 +0400>,<she>,<DPX200>,
      <created by zg, POWCHK disabled, PULCHK disabled
       terminated by command 'halt'
       configuration hash MD5:
       00 E9 B6 7A A2 85 ED C7 34 08 36 98 17 FE 4E 26
       data hash MD5: 32K
       62 3A 0F 00 87 60 9E A5 45 41 DC EA 57 D9 EB C5>)
(   2,<2024-07-17 13:37:27.82 +0400>,<she>,<DPX200>,
      <Start of raw data processing
       efp BC_mod = 2 LB = 2 FT_mod = 6 PKNL = 1 PHC0 = -539.8534 PHC1 = 25.58845 SI = 32K 
       data hash MD5: 32K
       FE E4 F1 F7 6A BC 04 FF 59 64 7D 69 C9 FD E5 13>)
(   3,<2024-07-17 13:37:35.43 +0400>,<she>,<DPX200>,
      <abs ABSG = 5 
       data hash MD5: 32K
       9A 41 D3 45 07 00 17 DF A7 57 3F 9C F1 D3 B9 BE>)
(   4,<2024-07-17 13:38:01.18 +0400>,<she>,<DPX200>,
      <pk PHC0 = -5.701343 PHC1 = 2 
       data hash MD5: 32K
       BC 17 9F 9F 3A 86 10 FF 25 23 51 6A F7 D9 78 A3>)
(   5,<2024-07-17 13:38:04.54 +0400>,<she>,<DPX200>,
      <abs ABSG = 5 
       data hash MD5: 32K
       93 B3 B3 BD 7E 7D CF 8E B5 E1 AF 6E 9D 66 03 2D>)
$$ ##END=
$$ 
$$ hash MD5
$$ 97 F1 5B 6F FD C1 C7 8F 89 35 59 CF 8D 24 EF 41
##$RELAX= 
##$RELAX= 
##$RELAX= 
##$RELAX= 
##$RELAX= 
##$RELAX= 
##$RELAX= 
##$RELAX= 
$$ Bruker specific parameters
$$ --------------------------
##$DU= <F:/spectra>
##$EXPNO= 1
##$NAME= <c13>
##$PROCNO= 1
##$TYPE= <nmr>
##$USER= <she>
##$AMP= (0..31)
100 100 100 100 100 100 100 100 100 100 100 100 100 100 100 100 100 100 
100 100 100 100 100 100 100 100 100 100 100 100 100 100 
##$AQSEQ= 0
##$AQ_mod= 1
##$AUNM= <au_zg>
##$AUTOPOS= <>
##$BF1= 50.322709
##$BF2= 200.13
##$BF3= 50.322709
##$BF4= 500.13
##$BF5= 500.13
##$BF6= 500.13
##$BF7= 500.13
##$BF8= 500.13
##$BYTORDA= 1
##$CFDGTYP= 0
##$CFRGTYP= 5
##$CHEMSTR= <none>
##$CNST= (0..31)
1 1 145 1 1 1 1 1 1 1 1 1 1 1 1 1 1 1 1 1 1 1 1 1 1 1 1 1 1 1 1 1 
##$CPDPRG= <waltz16>
##$CPDPRG1= <>
##$CPDPRG2= <waltz16>
##$CPDPRG3= <>
##$CPDPRG4= <mlev>
##$CPDPRG5= <mlev>
##$CPDPRG6= <mlev>
##$CPDPRG7= <mlev>
##$CPDPRG8= <mlev>
##$CPDPRGB= <>
##$CPDPRGT= <>
##$D= (0..31)
$$ [...]
##$SUBNAM4= <"">
##$SUBNAM5= <"">
##$SUBNAM6= <"">
##$SUBNAM7= <"">
##$SUBNAM8= <"">
##$SUBNAM9= <"">
##$SW= 239.972175391363
##$SWIBOX= (0..15)
0 1 3 0 0 0 0 0 0 0 0 0 0 0 0 0 
##$SW_h= 12077.2946859903
##$TD= 32768
##$TD0= 1
##$TE= 0
##$TE2= 300
##$TE3= 300
##$TEG= 300
##$TL= (0..7)
120 120 120 120 120 120 120 120 
##$TP= (0..7)
150 150 150 150 150 150 150 150 
##$TP07= 0
##$TPNAME0= <>
##$TPNAME1= <>
##$TPNAME2= <>
##$TPNAME3= <>
##$TPNAME4= <>
##$TPNAME5= <>
##$TPNAME6= <>
##$TPNAME7= <>
##$TPOAL= (0..7)
0.5 0.5 0.5 0.5 0.5 0.5 0.5 0.5 
##$TPOFFS= (0..7)
0 0 0 0 0 0 0 0 
##$TUNHIN= 0
##$TUNHOUT= 0
##$TUNXOUT= 0
##$USERA1= <user>
##$USERA2= <user>
##$USERA3= <user>
##$USERA4= <user>
##$USERA5= <user>
##$V9= 5
##$VALIST= <valist>
##$VCLIST= <CCCCCCCCCCCCCCC>
##$VD= 0
##$VDLIST= <DDDDDDDDDDDDDDD>
##$VPLIST= <PPPPPPPPPPPPPPP>
##$VTLIST= <TTTTTTTTTTTTTTT>
##$WBST= 1024
##$WBSW= 4
##$XGAIN= (0..3)
0 0 0 0 
##$XL= 0
##$YL= 0
##$YMAX_a= 33500805
##$YMIN_a= -112620482
##$ZGOPTNS= <>
##$ZL1= 120
##$ZL2= 120
##$ZL3= 120
##$ZL4= 120
##$ABSF1= 222.5654
##$ABSF2= -17.4314
##$ABSG= 5
##$ABSL= 3
##$ALPHA= 0
##$AQORDER= 0
##$ASSFAC= 0
##$ASSFACI= 0
##$ASSFACX= 0
##$ASSWID= 0
##$AUNMP= <proc_1d>
##$AZFE= 0.1
##$AZFW= 0.5
##$BCFW= 0
##$BC_mod= 2
##$BYTORDP= 0
##$COROFFS= 0
##$CY= -3
##$DATMOD= 1
##$DC= 0
##$DFILT= <>
##$DTYPP= 0
##$F1P= 0
##$F2P= 0
##$FCOR= 0.5
##$FTSIZE= 32768
##$FT_mod= 6
##$GAMMA= 0
##$GB= 0
##$INTBC= 1
##$INTSCL= 4.134877e-10
##$ISEN= 128
##$LB= 2
##$LEV0= 0
##$LPBIN= 0
##$MAXI= 10000
##$MC2= 0
##$MEAN= 0
##$ME_mod= 0
##$MI= 0.1934396
##$NCOEF= 0
##$NC_proc= 0
##$NLEV= 6
##$NOISF1= 120.0001
##$NOISF2= 80.00006
##$NSP= 0
##$NTH_PI= 0
##$NZP= 0
##$OFFSET= 222.5654
##$PC= 1.4
##$PHC0= -545.5547
##$PHC1= 27.58845
##$PH_mod= 1
##$PKNL= yes
##$PPARMOD= 0
##$PSCAL= 0
##$PSIGN= 0
##$REVERSE= no
##$SF= 50.3227345484362
##$SI= 32768
##$SIGF1= 140
##$SIGF2= 120
##$SINO= 11.81781
##$SIOLD= 32768
##$SREGLST= <13C.CDCl3>
##$SSB= 0
##$STSI= 32768
##$STSR= 0
##$SW_p= 12077.2946859903
##$SYMM= 0
##$S_DEV= 0
##$TDeff= 32768
##$TDoff= 0
##$TI= <>
##$TILT= no
##$TM1= 0
##$TM2= 0
##$TOPLEV= 0
##$USERP1= <user>
##$USERP2= <user>
##$USERP3= <user>
##$USERP4= <user>
##$USERP5= <user>
##$WDW= 1
##$XDIM= 32768
##$YMAX_p= 317651007
##$YMIN_p= -69351006
$$ End of Bruker specific parameters
$$ ---------------------------------
##NTUPLES= NMR SPECTRUM
##VAR_NAME=  FREQUENCY,     SPECTRUM/REAL,   SPECTRUM/IMAG
##SYMBOL=    X,             R,               I
##VAR_TYPE=  INDEPENDENT,   DEPENDENT,       DEPENDENT
##VAR_FORM=  AFFN,          ASDF,            ASDF
##VAR_DIM=   32768,         32768,           32768
##UNITS=     HZ,            ARBITRARY UNITS, ARBITRARY UNITS
##FACTOR=    0.368581032318806, 1,           1
##FIRST=     11200.0995020947, 0,            0
##LAST=      -877.195183895579, 0,           0
##MIN=       -877.195183895579, -69351006,   0
##MAX=       11200.0995020947, 317651007,    0
$$ Real data points
##PAGE= N=1
##DATA TABLE= (X++(R..R)), XYDATA
$$ [...]
22774a848962n56045q86161r50780p66129m12417Q7541O14279Q24880M90221n1716
$$ -1848962 -2405007 -3291168 -4241948 -5008077 -5420494 -5332953 -4718674 -3893794 -3403573 -3455289
22764c455289p6638K61636K54137M5723o1333j6270m890j21835n1954L75644Q81648
$$ -3455289 -3531927 -3270291 -3016154 -2970431 -3031764 -3048034 -3052924 -3174759 -3226713 -2851069 -1969421
22753a969421J008818Q53004P02150O25628N17473L09121k7365k00925n7490J28971
$$ -1969421 -960603 -107599 594551 1220179 1737652 2046773 2019408 1818483 1760993 1889964
22743A889964K91413K60015N7992k51442o25521o97645n00648l73946l34540k56280
$$ 1889964 2181377 2441392 2499384 2247942 1622421 924776 424128 50182 -284358 -540638
22733e40638j54148j90303l64011l55874k0723M75039P15554O01123L77541P3994
$$ -540638 -694786 -885089 -1249100 -1604974 -1625697 -1150658 -435104 166019 543560 617554
22723F17554j6145J42633J67741N3789p6758j45436j80382j60951l1346K7343
$$ 617554 601409 744042 911783 965572 888814 743378 562996 402045 370699 398042
22713C98042J1987K8469N4057L5485J14510K13059J54556J08739L17973N05002
$$ 398042 410029 438498 492555 528040 642550 855609 1010165 1118904 1436877 1941879
22703A941879M53273J67626k22946n00064n47577m87903n39546o39258m23600
$$ 1941879 2395152 2562778 2339832 1839768 1292191 804288 264742 -374516 -798116
22694g98116j27742k0476N2333P3564L20496P15063O56349K43495m77J67555N30383
$$ -798116 -925858 -946334 -894001 -820437 -499941 215122 871471 1114966 1114489 1282044 1812427
22683A812427N98370N38334P46243R24594P52687L49171j49921n80319p68571
$$ 1812427 2410797 2949131 3695374 4619968 5372655 5721826 5571905 4991586 4223015
22674D223015p40035p68481q88753r64541p94140k86957J31673R9118k79955o91253
$$ 4223015 3482980 2714499 1825746 861205 67065 -219892 -88219 10899 -269056 -960309
22664i60309r50233q96233n54184j12224L22371O67130Q45677R98285J145452
$$ -960309 -1910542 -2806775 -3360959 -3473183 -3150812 -2483682 -1638005 -639720 505732
22655E05732R71365N53417J878n82697r05972r06320o09855l35638m30377o55630
$$ 505732 1477097 2030514 2032392 1449695 543723 -362597 -972452 -1308090 -1738467 -2394097
22645b394097q00881o91572j07686M92046Q05531J004211Q43821K40868k65751
$$ -2394097 -3194978 -3886550 -3994236 -3502190 -2696659 -1692448 -848627 -607759 -873510
22636h73510m85861n54825m44303p4039N09893Q91473Q33809N23609J18227k61684
$$ -873510 -1359371 -1914196 -2358499 -2432538 -1922645 -1031172 -197363 326246 444473 182789
22626A82789l11281J33653P88138J192855R44551L04169k64109o94739q68458
$$ 182789 -128492 5161 793299 1986154 2930705 3234874 2970765 2276026 1407568
22617A407568p54491o72843o61785m55719q3506J92283J75453J5656j4668J50963
$$ 1407568 653077 -19766 -681551 -1137270 -1220776 -1028493 -853040 -837384 -852052 -701089
22607g01089L12939L06212R0227l36840n54635m06858k65702j89778l6034J61783
$$ -701089 -388150 -81938 8289 -328551 -883186 -1290044 -1555746 -1745524 -1781558 -1619775
22597a619775J67627r8933m43779n60525l01339J31331M82029N15289K58539O3559
$$ -1619775 -1452148 -1551081 -1994860 -2555385 -2856724 -2725393 -2243364 -1728075 -1469536 -1405977
22587a405977P6078M6544k3349J52138M64150N47466L93663k9573n21917k80655
$$ -1405977 -1329899 -1283355 -1306704 -1154566 -690416 -142950 250713 221140 -300777 -581432
22577e81432M38125Q01067O38973J55733k73642l35904k45201l65184l93711j22029
$$ -581432 -143307 657760 1296733 1452466 1178824 842920 597719 232535 -161176 -283205
22567b83205J52519L82998M26570K22511J7431q5779j1934J21858J75329J16549
$$ -283205 -130686 252312 678882 901393 918824 833045 821111 942969 1118298 1234847
22557A234847j31470l72368j61141J99730J21722o5448J55029M09752K38684p7590
$$ 1234847 1103377 731009 569868 769598 891320 825872 980901 1390653 1629337 1551747
22547A551747k61328m55470n90751l86611R735J60368P0505l002p7925k10000
$$ 1551747 1290419 834949 244198 -142413 -132678 27690 98195 95193 17268 -192732
22537a92732o4770K44600L44992L27183K25407p0522m57321n68546j25688N14426
$$ -192732 -257502 -12902 332090 659273 884680 814158 356837 -211709 -337397 177029
22527A77029Q08075L68541m07316o81545n00393m74321m52119j53301J06846Q2018
$$ 177029 985104 1353645 946329 264784 -235609 -709930 -1162049 -1315350 -1208504 -1126486
22517a126486j32201l42205m11756l10986J0755L63133N84065O65825P39062P95231
$$ -1126486 -1258687 -1600892 -2012648 -2323634 -2312879 -1949746 -1365681 -699856 39206 834437
22507H34437O24111M19307K45319O3931r4485m27806q47434r21918m85674K8611
$$ 834437 1458548 1877855 2123174 2187105 2092620 1664814 817380 -104538 -590212 -561601
22497e61601J16285j28650m11954n23525k67528J58532L23065K36653J33472r6149
$$ -561601 -445316 -573966 -985920 -1509445 -1776973 -1618441 -1295376 -1058723 -925251 -1021400
22487a021400l92303m35302l51546j28970J02262M3353k44440m88485m21803j06554
$$ -1021400 -1413703 -1849005 -2200551 -2329521 -2227259 -2183906 -2428346 -2916831 -3338634 -3445188
22477c445188j3526j95061k34417m2833J19791K4425k05749j28056K23336M33257
$$ -3445188 -3458714 -3653775 -3888192 -3931025 -3811234 -3786809 -3992558 -4120614 -3897278 -3464021
22467c464021L28160L84138O99677O24432K74824J44560Q3650N0191J95671L62516
$$ -3464021 -3135861 -2751723 -2052046 -1427614 -1152790 -1008230 -924580 -874389 -678718 -316202
22457c16202K08320l8953p6324J00177K96091L30150K91802J34209j54485n05244
$$ -316202 -107882 -146835 -223159 -122982 173109 503259 795061 929270 774785 269541
22447B69541p40152n70952j90600p6744j43917P2910M17491L29436R7016O3176
$$ 269541 -470611 -1041563 -1232163 -1308907 -1452824 -1379914 -962423 -632987 -535971 -472795
22437d72795l7691j09647J6778J88473J79518J37129P0670j94956l49976r9064
$$ -472795 -510486 -620133 -603355 -414882 -235364 -98235 -27565 -222521 -572497 -671561
22427f71561K23636K05474L9636R436o977l0800R6491K67417R9737l79799o74396
$$ -671561 -447925 -242451 -202815 -193379 -200356 -231156 -134665 132752 232489 -147310 -821706
22416h21706p67080q13762m17320M12867R17453N02683l09170p32800n83375j53678
$$ -821706 -1588786 -2402548 -2819868 -2407001 -1489548 -986865 -1296035 -2028835 -2612210 -2765888
22406b765888R6313J80375J49381n3878R9555N46793O60130M54503K03739L6942
$$ -2765888 -2669575 -2489200 -2339819 -2393697 -2294142 -1747349 -1087219 -632716 -428977 -392035
22396c92035J66364L71582L86699J92815j09338l79597n51289l61433l2400J3820
$$ -392035 -225671 145911 532610 725425 616087 236490 -314799 -676232 -708632 -694812
22386f94812j01566k18007k07117o3328m105j55867k99054k64668j49690N7186
$$ -694812 -796378 -1014385 -1221502 -1284830 -1288935 -1444802 -1743856 -2008524 -2158214 -2101028
22376b101028K83153M59559O48105O87039N20375J97420l85713p73325p05567
$$ -2101028 -1817875 -1358316 -710211 -23172 497203 694623 308910 -464415 -1169982
22367a169982n76713m75690k62170p9547K17643P45434Q58057L79631l4484k41412
$$ -1169982 -1746695 -2222385 -2484555 -2564102 -2346459 -1601025 -742968 -363337 -397821 -639233
22357f39233l74374n47571m50667M3845K86842J43500r3219l98207n41804n02035
$$ -639233 -1013607 -1561178 -2011845 -1968000 -1681158 -1537658 -1630877 -2029084 -2570888 -3072923
22347c072923l10966R8681M47074N72301N65561N81341O09118L69703j15857l54904
$$ -3072923 -3383889 -3285208 -2838134 -2265833 -1700272 -1118931 -509813 -140110 -255967 -610871
22337f10871k37641N1287L19525L21335p3321m70609m14094J01342N27635K75408
$$ -610871 -848512 -797225 -477700 -156365 -229686 -700295 -1114389 -1013047 -485412 -210004
22327b10004n57014r76485m27746M99711R88158P17915J53764l17567m36279m01181
$$ -210004 -767018 -1743503 -2171249 -1671538 -683380 34535 188299 -129268 -565547 -966728
22317i66728l36158M64M73327P74221P82010N27280J33617k10086l95711l76497
$$ -966728 -1302886 -1302422 -829095 -54874 727136 1254416 1388033 1177947 782236 405739
22307D05739k20854p4234l701j00306j38522j73253k70186l03104k60030j80449
$$ 405739 184885 110651 106950 6644 -131878 -305131 -575317 -878421 -1138451 -1318900
22297a318900P3456M22100L81232P3443m4488J73497M38119J40448n17521q14574
$$ -1318900 -1245444 -823344 -442112 -368669 -413157 -239660 198459 338907 -178614 -993188
22287i93188o10387k13309j3447p9185j56894j47958k13343l77662l19327Q2214
$$ -993188 -1603575 -1816884 -1830331 -1909516 -2066410 -2214368 -2427711 -2805373 -3124700 -3042486
22277c042486M91464O13042N53092M24038K99304L49389M64728M29714J94260
$$ -3042486 -2551022 -1937980 -1384888 -960850 -661546 -312157 152571 582285 776545
22268G76545K8370Q2903J73971J08890p9027l54527p15753j003872r47095o78215
$$ 776545 804915 887818 1061789 1170679 1091652 737125 21372 -982500 -1929595 -2607810
22258b607810l77530J7467J95387J56183J39169K26956K72253L03202L05403K04974
$$ -2607810 -2985340 -2967873 -2772486 -2616303 -2477134 -2250178 -1977925 -1674723 -1369320 -1164346
22248a164346K78145M44363K28476l56170r12536j024270o37029q1255N31047
$$ -1164346 -886201 -441838 -213362 -569532 -1482068 -2506338 -3143367 -3224622 -2693575
22239b693575R04034P29178K05319n2223R5171J96501R6859K11850N63395P20389
$$ -2693575 -1789541 -1060363 -855044 -907267 -812096 -615595 -518736 -306886 256509 976898
22229I76898O68795N53560L81644J53717j07855l77814p90273j132753j052316
$$ 976898 1645693 2199253 2580897 2734614 2626759 2248945 1458672 325919 -726397
22220g26397p17177m02105j59744L969R3934J78648L12718M48221K12738l28195
$$ -726397 -1443574 -1845679 -2005423 -2001454 -1907520 -1728872 -1416154 -967933 -755195 -1083390
22210a083390m32921o2092K7302k33674m03756n16952p91403j093592r92098m40831
$$ -1083390 -1516311 -1578403 -1551101 -1784775 -2188531 -2705483 -3496886 -4590478 -5582576 -6023407
22200f023407J01016M63578P59033R84342J087552Q16012L61454j1107l10195
$$ -6023407 -5922391 -5458813 -4699780 -3715438 -2627886 -1811874 -1450420 -1461527 -1771722
22191a771722m81136m47062j52023J6213k34033m36880m20096m23206j63005J90186
$$ -1771722 -2252858 -2699920 -2851943 -2835730 -3069763 -3506643 -3926739 -4349945 -4512950 -4322764
22181d322764J61552M4283J79845N04066P49624O39205J48626k70169m40519m45401
$$ -4322764 -4161212 -4116929 -3937084 -3433018 -2683394 -2044189 -1895563 -2165732 -2606251 -3051652
22171c051652k78763L4992K38735K90240N53421Q81468O43752j30722n14474l10257
$$ -3051652 -3330415 -3295423 -3056688 -2766448 -2213027 -1331559 -687807 -818529 -1333003 -1643260
22161a643260o308J49994J14165K17173M07447L54211L27981M81359N39746M61978
$$ -1643260 -1649568 -1499574 -1385409 -1168236 -760789 -406578 -78597 402762 942508 1404486
22151A404486M53565N51209N87198M58003J11224j67418r2250j54218m62813n31092
$$ 1404486 1858051 2409260 2996458 3454461 3565685 3398267 3306017 3151799 2688986 2157894
22141B157894k92219j24849k97539o84831r28010j042478j124710j072209o68838
$$ 2157894 1865675 1740826 1443287 758456 -169554 -1212032 -2336742 -3408951 -4077789
22132d077789J76880R90838J118856O57576J68963q4362n3141J30074J30242j81466
$$ -4077789 -3900909 -2910071 -1791215 -1133639 -964676 -1049038 -1102179 -972105 -841863 -1023329
22122a023329m76133n26854m83254m71318l26539Q4383L88894L14567K10853K79338
$$ -1023329 -1499462 -2026316 -2509570 -2980888 -3307427 -3223044 -2834150 -2519583 -2308730 -2029392
22112b029392M70861Q24295J036600Q70825N42395K85969J05710j02175j88702
$$ -2029392 -1558531 -734236 302364 1173189 1715584 2001553 2107263 2005088 1816386
22103A816386j50916j45424q6691J73057L27369J80143p5942k62808m19624n35823
$$ 1816386 1665470 1520046 1433355 1606412 1933781 2113924 2037982 1775174 1355550 819727
22093H19727n80819n47451l62940j92735j24777K8331K97771L33258O4027k17823
$$ 819727 238908 -308543 -671483 -864218 -988995 -960664 -662893 -329635 -265608 -483431
22083d83431m87807m32044m8351J88381L87158M66781K07352l6764o8591M0584
$$ -483431 -971238 -1403282 -1451633 -1263252 -876094 -409313 -201961 -238725 -307316 -266732
22073b66732J34340J39554J24068O8897L8373m8791j34809o4867K9714J13539
$$ -266732 -132392 7162 131230 200127 238500 189709 54900 -9967 19747 133286
22063A33286L97098P35197Q28660O08741L10740R9062j40193l29060k09017O9189
$$ 133286 530384 1265581 2094241 2702982 3013722 3112784 2972591 2643531 2434514 2503703
22053B503703K43719K39595R5118j16005l10905l83845j97118J11021J52900p3532
$$ 2503703 2747422 2987017 3082135 2966130 2655225 2271380 2074262 2185283 2338183 2264651
22043B264651k40935m10023n89006n57387m50741n43602n00607j81292R9977K48611
$$ 2264651 2023716 1613693 1024687 467300 16559 -527043 -1027650 -1208942 -1108965 -860354
22033h60354L16653L33274K68981K8587l85886p70362p10382p0570M66183M68981
$$ -860354 -543701 -210427 58554 87141 -298745 -1069107 -1779489 -1850059 -1383876 -914895
22023i14895L18168K84409K62399K93806L74774L35889J51789N1447N1793r1033
$$ -914895 -596727 -312318 -49919 243887 618661 954550 1106339 1157786 1209579 1118546
22013A118546j37644J20267L50026J52747k14447m77206n32820k89881R8255L98243
$$ 1118546 980902 1101169 1451195 1603942 1389495 912289 379469 89588 187843 586086
22003E86086M35020L87079L18077j3701m44981o07791q24517j108806j097879
$$ 586086 1021106 1408185 1726262 1712561 1267580 659789 -164728 -1273534 -2371413
21994b371413p00556J5496P95650J077387Q68054M74798Q0212r8779M6170L68236
$$ -2371413 -3071969 -3056473 -2260823 -1183436 -315382 159416 239628 140849 187019 555255
21984E55255M11901O4730l41027m71282k93599q2488j18852k41745o4255J43416
$$ 555255 967156 1031886 690859 219577 -74022 -156510 -275362 -517107 -581362 -437946
21974d37946J51883K6431j95197j39167J78925L79471M17882M16194L51348L07522
$$ -437946 -286063 -259632 -454829 -593996 -415071 -35600 382282 798476 1149824 1457346
21964A457346L79523M45454M29326L34718K92830M19192N58549L93401R192m00667
$$ 1457346 1836869 2282323 2711649 3046367 3339197 3758389 4316938 4710339 4719531 4318864
21954D318864p22092q14889q73379j019086q91529m34663o2328O6035K16227M45569
$$ 4318864 3596772 2781883 1908504 889418 -2111 -436774 -499102 -433067 -216840 228729
21944B28729L65243M2845M8256L49832N34737N21877K24577k60212o14103o29271
$$ 228729 593972 636817 685073 1034905 1569642 2091519 2316096 2055884 1441781 812510
21934H12510k53978J318k9796J64414O25361Q14471N73488K6002n47932p50977
$$ 812510 558532 559850 530054 694468 1319829 2134300 2707788 2733790 2185858 1434881
21924A434881m83481j72167k07497l26949j98659m2070j02627n3794L02303M20284
$$ 1434881 951400 779233 571736 244787 46128 4058 -98569 -152363 149940 570224
21914E70224J1156l62763k18447J66309K45914J02854P1142J92792L33087L75242
$$ 570224 581380 218617 170 166479 412393 515247 586389 779181 1112268 1487510
21904A487510K02731j17664k79542j24948N4848K03973M77605O53252O59336N71769
$$ 1487510 1690241 1572577 1293035 1168087 1222935 1426908 1904513 2557765 3217101 3788870
21894C788870K98144j17953k10547j84428n49925q94042q52708n03340k25738
$$ 3788870 4087014 3969061 3758514 3574086 3024161 2130119 1277411 774071 548333
21885E48333l52972n68474m95328l59776l66391l25234l47243m41336k03960M16179
$$ 548333 195361 -373113 -868441 -1228217 -1594608 -1919842 -2267085 -2708421 -2912381 -2496202
21875b496202R81718J034322P23811N80211N44111L57699L3603j84540k33819
$$ -2496202 -1514484 -480162 243649 823860 1367971 1725670 1759273 1574733 1340914
21866A340914k27890l50688n24894l50893L7819J61640J38877K66076K98089Q4646
$$ 1340914 1113024 762336 237442 -113451 -75632 86008 224885 490961 789050 873696
21856H73696P3985J75267M0476n7482l4617j14364m17505m62118j62242q9986
$$ 873696 947681 1122948 1163424 1105942 1071325 956961 539456 77338 -84904 -174890
21846a74890k43139l15780n74608q36813m42684K14835L91519L24605L88349L79652
$$ -174890 -418029 -733809 -1308417 -2145230 -2587914 -2373079 -1981560 -1656955 -1268606 -888954
21836h88954J69808J18468J52362o7952j06272L04994N42998O45718P84977O27714
$$ -888954 -719146 -600678 -448316 -516268 -622540 -317546 225452 871170 1656147 2283861
21826B283861L03738J40403R2712J6352j11935k74103n09955o60344n37841j57729
$$ 2283861 2587599 2728002 2820714 2837066 2725131 2451028 1941073 1280729 742888 585159
21816E85159P4816n4050k04749k60559k40781j87136k25039k57582k40789r1741
$$ 585159 659975 605925 401176 140617 -100164 -287300 -512339 -769921 -1010710 -1102451
21806a102451J90417M00806N21811M80544J94305o9813j07961j44934j57323l5047
$$ -1102451 -912034 -511228 10583 491127 685432 615619 507658 362724 205401 170354
21796A70354M8867O0900k9594j69819J3853L51151L82993L08863L22548K21441
$$ 170354 219221 280121 250527 80708 94561 445712 828705 1137568 1460116 1681557
21786A681557j75709p78794j181756j093602n14882K65458P93297P72475K51630
$$ 1681557 1505848 727054 -454702 -1548304 -2063186 -1797728 -1004431 -231956 19674
21777A9674j46181J01239O94712R13701N89954L27625L64718K80668j12692l77572
$$ 19674 -126507 -25268 669444 1583145 2173099 2500724 2865442 3146110 3033418 2655846
21767B655846l91432m30643n96956n27334j92101l1228k4282r2940j37451j10810
$$ 2655846 2264414 1833771 1236815 709481 517380 486152 461870 368930 231479 120669
21757A20669j05020L795K60860M08972K77098J18742r963k47654m86144l82652
$$ 120669 15649 19444 280304 689276 966374 1085116 1075153 827499 341355 -41297
21747d1297j2922M08653N43435K77646m3986j42684j23198l283K76322N51527
$$ -41297 -54219 354434 897869 1175515 1131529 988845 865647 862364 1138686 1690213
21737A690213M67144M2321j92573j52582m2743j06753l93363p07626o48192k54338
$$ 1690213 2157357 2199678 2007105 1854523 1811780 1705027 1311664 604038 -44154 -298492
21727b98492N8956J19064J39180L14197M41410L37681O8676k39848l73911l43003
$$ -298492 -239536 -120472 18708 332905 774315 1111996 1180672 940824 566913 223910
21717B23910l79709m78050l04894K33799P00755Q07733N08070j30227o50864p80892
$$ 223910 -155799 -633849 -938743 -704944 -4189 803544 1311614 1181387 530523 -250369
21707b50369n20069p4323K41322L70385M36917L02475r3713l27058k18659J8686
$$ -250369 -770438 -844761 -603439 -233054 203863 506338 412625 85567 -133092 -114406
21697a14406J74358J91696k370k70017j66372q8214l05268k66945J32560N53328
$$ -114406 59952 251648 249278 -20739 -187111 -275325 -580593 -847538 -714978 -161650
21687a61650P77246O24831J78941j72312o4600K09561K2021l61933m67008j74805
$$ -161650 615596 1240427 1419368 1247056 1182456 1392017 1414038 1052105 585097 410292
21677D10292K65055K74041O6894Q4245P2442j13523r7691J54942L09403K35127
$$ 410292 675347 949388 1016282 1100527 1172969 1059446 961755 1116697 1426100 1661227
21667A661227M4497r9143o4188J78541L47235L43820M06588L60115O4794j29586
$$ 1661227 1705724 1606581 1542393 1720934 2068169 2411989 2818577 3178692 3243486 3113900
21657C113900j5809K40238L21330K12488j31014n25402o58530o30957o57494n81753
$$ 3113900 3098091 3338329 3659659 3872147 3741133 3215731 2557201 1926244 1268750 686997
21647F86997j64975M16913O96689N64872L08070J32500r8393m42512n36572l04568
$$ 686997 522022 938935 1635624 2200496 2508566 2641066 2542673 2100161 1563589 1259021
21637A259021M7099L50813N21777M26854j90535q18860q54345o47996k32525M18612
$$ 1259021 1306120 1656933 2178710 2605564 2415029 1596169 741824 93828 -138697 279915
21627B79915O88824L83460j3151k22581j31093Q1846L441j23547m5120m44j75072
$$ 279915 968739 1352199 1339048 1116467 985374 1067220 1070661 947114 901994 901550 726478
21616G26478m99464n29104j85922R4469m3130k79107k26782o6381K47k34367n84619
$$ 726478 227014 -302090 -488012 -393543 -436673 -715780 -942562 -1008943 -1008696 -1243063 -1827682
21605a827682n88192l54545k26373j94919P1912M67758M67695J06196j31561j07394
$$ -1827682 -2415874 -2770419 -2996792 -3191711 -3119799 -2652041 -2184346 -2078150 -2209711 -2317105
21595b317105m2053L4296P3597r0949k77772k99312j65068J17259L63797M73490
$$ -2317105 -2359158 -2324862 -2251265 -2342214 -2619986 -2919298 -3084366 -2967107 -2603310 -2129820
21585b129820M79722M93819N09482L39765j57668o05443o07517l60570j36554
$$ -2129820 -1650098 -1156279 -646797 -307032 -464700 -1070143 -1677660 -2038230 -2174784
21576b174784Q9716K45904K18016K18473L18798L68608L27126J43351k45719o92966
$$ -2174784 -2085068 -1839164 -1621148 -1402675 -1083877 -715269 -388143 -244792 -490511 -1183477
21566a183477o55119k33065j5632k1176L6706K32666L45089K81555K13695M02518
$$ -1183477 -1838596 -2071661 -2087293 -2108469 -2071763 -1839097 -1494008 -1212453 -998758 -596240
21556e96240M69318J44476J5940K62342L39480J5228l00725l58986l15527m40733
$$ -596240 -126922 17554 33494 295836 635316 650544 349819 -9167 -324694 -765427
21546g65427n00594j03172L51774N81295N85442L07119o263P6610K75814J63362
$$ -765427 -1266021 -1369193 -1017419 -436124 149318 456437 450174 526784 802598 965960
21536I65960j05178k60962k39309O994L58700M46279K02241q0347K7478J79468
$$ 965960 860782 599820 360511 367505 726205 1172484 1374725 1294378 1321856 1501324
21526A501324q990l20468m04330k80271M2547N18867P80127N79366P912o57632
$$ 1501324 1492334 1171866 767536 487265 529812 1048679 1828806 2408172 2416084 1758452
21516A758452r41605m66283N06278J008971N78830j31288m62818m65169m12670
$$ 1758452 816847 350564 856842 1865813 2444643 2313355 1850537 1385368 972698
21507I72698m68967o36763n53288j65587J39947J24210j30743l85665m14207n6220
$$ 972698 503731 -133032 -686320 -851907 -711960 -587750 -718493 -1104158 -1518365 -1574585
21497a574585M65103R48568J305243J421577J107604L55460j41363k19109l43896
$$ -1574585 -1109482 -160914 1144329 2565906 3673510 4028970 3887607 3668498 3324602
21488C324602l51272k88759l72370l25595p2445N3788p2871j38696j23044j65228
$$ 3324602 2973330 2684571 2312201 1986606 1914161 1967949 1895078 1756382 1633338 1468110
21478A468110j28847K8497P3881k51961o71387q39302q41177n88098q4060L11285
$$ 1468110 1339263 1367760 1441641 1189680 518293 -321009 -1162186 -1750284 -1834344 -1523059
21468a523059L94281L52518L18575K68152K37798L51215N41285M75688J35048
$$ -1523059 -1128778 -776260 -457685 -189533 48265 399480 940765 1416453 1551501
21459A551501k35119m76634n71375n60314n01154n58612n97645l40509j02026
$$ 1551501 1316382 839748 268373 -291941 -793095 -1351707 -1949352 -2289861 -2391887
21450b391887j76340l02087j55338K70925O02337O17496M38546L50928M27458
$$ -2391887 -2568227 -2870314 -3025652 -2754727 -2152390 -1534894 -1096348 -745420 -317962
21441c17962N92466Q90742J070215Q99588N37714K11223j28786n27308o13464
$$ -317962 274504 1165246 2235461 3135049 3672763 3883986 3755200 3227892 2614428
21432B614428l73908l80063o06584q23513r18452o35733j62626J17386K00126
$$ 2614428 2240520 1860457 1253873 430360 -488092 -1123825 -1286451 -1169065 -968939
21423i68939O0751k53131k30941Q4355K92856M00870N27253N27902K52527k23474
$$ -968939 -908188 -1161319 -1392260 -1307905 -1015049 -614179 -86926 440976 693503 470029
21413D70029n53384n25639m77858n27537l79183j80813J1258K29726K45625J30464
$$ 470029 -83355 -608994 -1086852 -1614389 -1993572 -2174385 -2163127 -1933401 -1687776 -1557312
21403a557312K30098M55213M24321J70474j40504m09729n84694o96180l98301
$$ -1557312 -1327214 -872001 -447680 -277206 -417710 -827439 -1412133 -2108313 -2506614
21394b506614J42092N66183P45380Q01537O72071L63418N0605j75235j35333J99720
$$ -2506614 -2364522 -1798339 -1052959 -251422 420649 784067 834672 659437 524104 723824
21384G23824M76959M55309J81152l3128K7366J55811J44183j54211l58523k53003
$$ 723824 1200783 1656092 1837244 1804116 1831482 1987293 2131476 1977265 1618742 1365739
21374A365739k35027m17083m56284k77712j64949l44023o33690o12191l46992
$$ 1365739 1130712 713629 257345 -20367 -185316 -529339 -1163029 -1775220 -2122212
21365b122212r8024K1721O5134J45621L26931M84996L28434r700k54064j76341
$$ -2122212 -2220236 -2198515 -2133381 -1987760 -1660829 -1175833 -847399 -857099 -1111163 -1287504
21355a287504L01484Q36209R24692M46717l60523q65564p93827l87494n6555q6086
$$ -1287504 -986020 -149811 774881 1221598 861075 -4489 -798316 -1185810 -1242365 -1328451
21345a328451k59511k47520j24557o283K79351N89379O60810N59025N13564M41011
$$ -1328451 -1587962 -1835482 -1960039 -1966322 -1686971 -1097592 -436782 122243 635807 1076818
21335A076818M5229m60792n56558k39311J94044L68161M50545P52753P96376M32748
$$ 1076818 1122047 661255 104697 -134614 59430 427591 878136 1630889 2427265 2860013
21325B860013L04726L84191L5472m74489o76102o27452p42382r88364q96689m86274
$$ 2860013 3164739 3548930 3584402 3109913 2433811 1806359 1063977 75613 -821076 -1307350
21315a307350K9176M63458N53218L60344K84807L08829K75473N3546m00303p84045
$$ -1307350 -1278174 -814716 -261498 98846 383653 692482 967955 1021501 621198 -162847
21305a62847q52130p78458p61542m37814K51195O11645M81981M44314M09814K97887
$$ -162847 -1014977 -1793435 -2554977 -2992791 -2741596 -2129951 -1647970 -1203656 -793842 -495955
21295d95955L87535L31873p7709l25733l78938l45860j03250L31612N62277L76110
$$ -495955 -108420 223453 145744 -179989 -558927 -904787 -1008037 -676425 -114148 261962
21285B61962J19548j48816m52691o28019o50305k71773L78959O80695N06273K06865
$$ 261962 381510 232694 -219997 -848016 -1498321 -1770094 -1391135 -710440 -204167 2698
21275B698J02868K14305L54111J75466q9657o3903Q1755J24111Q1196K22094N62051
$$ 2698 105566 319871 673982 849448 759791 695888 777643 901754 982950 1205044 1767095
21264A767095P40858L57660l46328o78859n23486j01712K79832J8215o84669j010423
$$ 1767095 2507953 2865613 2519285 1840426 1316940 1215228 1495060 1513275 828606 -181817
21254a81817q83354o81145l61576Q1229L95745O07843P20383N70230M4170m46513
$$ -181817 -1065171 -1746316 -2107892 -2026663 -1630918 -1023075 -302692 267538 311708 -134805
21244a34805m84418l15937j22393J57276K21977l4255n0264K56931L89886L13860
$$ -134805 -619223 -935160 -1057553 -900277 -678300 -712555 -762819 -505888 -116002 197858
21234A97858M08721N12975L06485j92015o45179p86877p27903o89551n93009k24257
$$ 197858 606579 1119554 1426039 1234024 588845 -198032 -925935 -1615486 -2208495 -2432752
21224b432752L82491Q78785J071772R54685O71670M66420K32249M6981N5171J09048
$$ -2432752 -2050261 -1171476 -99704 854981 1526651 1993071 2225320 2272301 2327472 2436520
21214B436520J59419K15091K68803J22710p3809K9039N8904l40019p67439n58242
$$ 2436520 2595939 2811030 3079833 3202543 3128734 3157773 3216677 2876658 2109219 1550977
21204A550977n3099K1074q3645m5331J413J67474L30380L05389J84490j3879l92665
$$ 1550977 1497878 1518952 1435307 1389976 1391389 1558863 1889243 2194632 2379122 2365243 1972578
21193A972578o85601n29806k9597K93340L54553N85115Q97138P78307L58832k438
$$ 1972578 1286977 757171 727574 1020914 1375467 1960582 2857720 3636027 3994859 3992421
21183C992421j03090J01478L82787M61544L25172K36215L9837m40693q52143q05306
$$ 3992421 3889331 3990809 4373596 4835140 5160312 5396527 5436364 4995671 4143528 3338222
21173C338222m57074j90995r5113k07012o22362r35372p36593k31824L48864Q97536
$$ 3338222 2881148 2690153 2595040 2388028 1765666 830294 93701 -138123 210741 1108277
21163A108277J086210P30858J61513j74837j99116k98319o27548q45777p72727
$$ 1108277 2194487 2925345 3086858 2912021 2712905 2414586 1787038 941261 168534
21154A68534o19055n59983l89668j65464k04625l86003l89901n7669L07628L74959
$$ 168534 -450521 -1010504 -1400172 -1565636 -1770261 -2156264 -2546165 -2603834 -2296206 -1921247
21144a921247L02101K67554M36433P13560O40120J86548k04340l40745l91637
$$ -1921247 -1619146 -1351592 -915159 -201599 438521 625069 420729 79984 -311653
21135c11653l05118J5937L15384M39029L77413M5192l71435n98385n62919j52070
$$ -311653 -616771 -600834 -285450 153579 530992 576184 204749 -393636 -956555 -1108625
21125a108625L50687M08530J43461k48R1209J50528R825n1831O2484L1928k70526
$$ -1108625 -757938 -349408 -205947 -206195 -114986 35542 45367 -6464 56020 87948 -182578
21114a82578n21625l39723J83144O68471Q63220N68695N9890j81652k71837l38204
$$ -182578 -704203 -1043926 -860782 -192311 670909 1239604 1299494 1117842 846005 507801
21104E07801j15698L65658O41719M25179J85697R9612p0460l27229o09435p66604
$$ 507801 392103 757761 1399480 1824659 2010356 2109968 2039508 1712279 1102844 336240
21094C36240p47485m76334j59811P4247M13222N05860L28524M13060L58739r8010
$$ 336240 -411245 -887579 -1047390 -973143 -559921 -54061 274463 687523 1046262 948252
21084I48252m20057l09659o0672K16946M78642K86546k92329n71352j45024N62508
$$ 948252 528195 218536 157864 374810 853452 1139998 847669 276317 131293 693801
21074F93801Q27604K71856m41457o28823m42505j97044Q2171L06314K12286m2380
$$ 693801 1521405 1793261 1351804 722981 280476 83432 165603 471917 684203 641823
21064F41823j03659P2269N4664j75830k51189j77480k60040l32453j96426n4307
$$ 641823 538164 610433 665097 489267 238078 60598 -199442 -531895 -728321 -782628
21054g82628q1991j45467m0146K15047N19802N38142L80848K57622R1832N6900
$$ -782628 -864619 -1010086 -1050232 -835185 -315383 222759 603607 861229 953061 1009961
21044A009961K19334M15227O17253N51615K16943k614l23844n88037l20442K32373
$$ 1009961 1229295 1644522 2261775 2813390 3030333 3027719 2703875 2115838 1795396 2027769
21034B027769O76354O89501P6667q02495j335166j328242q70476k53755J78084
$$ 2027769 2704123 3393624 3470291 2667796 1332630 4388 -866088 -1119843 -941759
21025i41759N25533P31352M71396K34533L94895M17070J90236j9422r7695p6550
$$ -941759 -416226 315126 786522 1021055 1415950 1833020 2023256 2003834 1906139 1829589
21015A829589K0958j9586m25058p38180n59352j60363K57932O66854Q35418O39487
$$ 1829589 1850547 1830961 1405903 667723 108371 -51992 205940 872794 1708212 2347699
21005B347699L77013J10290k54014m44791l75418k20055O160K80424N60032O81306
$$ 2347699 2724712 2835002 2580988 2136197 1760779 1540724 1546884 1827308 2387340 3068646
20995C068646O95827P31945M54557m8196j46509L91480J063977J177734P65615
$$ 3068646 3764473 4496418 4950975 4902779 4756270 5147750 6211727 7389461 8155076
20986H155076M50927N41956O60609M15616m1860m37794n21672m42568m76669n27389
$$ 8155076 8606003 9147959 9808568 10224184 10182324 9744530 9222858 8780290 8303621 7776232
20976G776232q08629j334587j507163j235655q91936n87922k26583p6072k60628
$$ 7776232 6967603 5633016 4125853 2890198 1998262 1410340 1183757 1107685 847057
20967H47057l47566j27618J53026J36134L2471K14216N92578J035566J248879
$$ 847057 499491 371873 524899 661033 693504 907720 1500298 2535864 3784743
20958C784743R52423K22607n19914p12477m80907m47924o49482p52423p10213
$$ 3784743 4737166 4959773 4439859 3727382 3246475 2798551 2149069 1396646 686433
20949F86433m73519j67169P0048M12290O08843L50641q400r3729O1682J73227
$$ 686433 212914 45745 115793 528083 1136926 1487567 1479167 1385438 1447120 1620347
20939A620347n0904l87739n43674o10469n34259q8428N44225P19379K13096k28746
$$ 1620347 1569443 1181704 638030 27561 -506698 -595126 -50901 668478 881574 652828
20929F52828o7391K57869K43256N4925n0675n4385j46769l87779k76830J53136
$$ 652828 585437 843306 1086562 1141487 1090812 1036427 889658 501879 225049 378185
20919C78185M30173L50713J05512m386j02453j24689m2280J1775K2082l8345j70811
$$ 378185 808358 1159071 1264583 1260197 1157744 1033055 990775 1002550 1024632 986287 815476
20908H15476j57786q0283j47801m1053K38269L36112K99006J94238J61992M9831
$$ 815476 657690 577407 429606 388553 626822 962934 1261940 1456178 1618170 1668001
20898A668001k33833l94782l39185k1795L85825M96787M26703M63553L53088O451
$$ 1668001 1434168 1039386 700201 678406 1064231 1561018 1987721 2451274 2804362 2810813
20888B810813j65992j65801k09616k81997l74290n88995p82998o69895m32499
$$ 2810813 2644821 2479020 2269404 1987407 1613117 1024122 241124 -428771 -861270
20879h61270j64835K04303O12194O36697L67520K12801R7561l3851J13638O69500
$$ -861270 -1026105 -821802 -209608 427089 794609 1007410 1104971 1071120 1184758 1854258
20869A854258J283048J734573J903183J812335J792371K161303K835767L402429
$$ 1854258 3137306 4871879 6775062 8587397 10379768 12541071 15376838 18779267
20861A8779267L925014M662165O126454Q200151R637455R324678O956457L134426
$$ 18779267 22704281 27366446 33492900 41693051 51330506 60655184 67611641 70746067
20853G0746067k387142q166196j0826745j0222513q371216o619052n029645l560115
$$ 70746067 68358925 60192729 49365984 39143471 30772255 24153203 19123558 15563443
20845A5563443k567577k027338j716081j617836j758105j840109j473327r03002
$$ 15563443 12995866 10968528 9252447 7634611 5876506 4036397 2563070 1660068
20837A660068n20847m30278k05280L66029R05391J101199Q93283M69638M1036
$$ 1660068 1139221 708943 503663 869692 1775083 2876282 3769565 4239203 4280239
20828D280239l60713m69583l03663k91327l86880l17805k2895K35983L79995K24623
$$ 4280239 3919526 3449943 3146280 2854953 2468073 2150268 2127373 2363356 2743351 2967974
20818B967974k60612o08249m84118l8110K85373R9297j00856k6418J07969J88172
$$ 2967974 2707362 2099113 1614995 1576885 1862258 1961555 1860699 1834281 1942250 2130422
20808B130422K51129L45863J95233k19232o89104q70675m86516j3546n0912l15822
$$ 2130422 2381551 2727414 2922647 2703415 2014311 1143636 657120 643574 592662 276840
20798B76840n51738o45880m84515j52812L84163J084227J329138Q20396N7532
$$ 276840 -274898 -920778 -1405293 -1558105 -1173942 -89715 1239423 2059819 2117351
20789B117351k91178j31915K5918O7117p9311m27318n01848l08552j56416p5982
$$ 2117351 1826173 1694258 1720176 1787293 1707982 1280664 778816 470264 313848 237866
20779B37866m5632Q9290K53271J32096j75K7280K0909K8678P8512J95687J30656
$$ 237866 192234 281524 534795 666891 666716 693996 714905 743583 822095 1017782 1148438
20768A148438k03423m88567n40731m64017m16140l05437N6873N01137Q00732P50553
$$ 1148438 945015 456448 -84283 -548300 -964440 -1269877 -1213004 -711867 88865 839418
20758H39418L89773K949j58673j80060j95548j93966j12387K2703L42722P36520
$$ 839418 1229191 1232140 1073467 893407 697859 503893 391506 414209 756931 1493451
20748A493451Q03262M45387p6320l77552m32913m83655m81843l55689l20581m13563
$$ 1493451 2296713 2742100 2665780 2288228 1855315 1371660 889817 534128 213547 -200016
20738b00016n20729m14807J8974L02647K03438M8061N3591P8525l2109l01834
$$ -200016 -720745 -1135552 -1116578 -813931 -610493 -562432 -508841 -430316 -462425 -764259
20728g64259n99610m61701P0788L56006K17096L783j14224j46776j98897j73411
$$ -764259 -1363869 -1825570 -1754782 -1398776 -1181680 -1177897 -1292121 -1438897 -1637794 -1811205
20718a811205j182O4990l3715k7231J00010J95105J85234K58622M48567K23161
$$ -1811205 -1812387 -1747397 -1781112 -1808343 -1708333 -1513228 -1327994 -1069372 -620805 -397644
20708c97644j13360J19637O47734Q65000O82087K97367j14305n37545p62420m74277
$$ -397644 -511004 -391367 256367 1121367 1803454 2100821 1986516 1448971 686551 212274
20698B12274N0861K84294K12285K48495M88809P57375P39683L74206N186k40693
$$ 212274 263135 547429 759714 1008209 1497018 2254393 2994076 3368282 3373468 3132775
20688C132775l75023l36745j92277j92848n02081q58850r67380o26789P399M98362
$$ 3132775 2757752 2421007 2228730 2035882 1533801 674951 -292429 -919218 -911819 -413457
20678d13457O97790P06241N78390M35577K44605q8790k97470k94391l56080m42219
$$ -413457 284333 990574 1568964 2004541 2249146 2160356 1862886 1568495 1212415 770196
20668G70196l45185j90644n7812n07o7195j10126P1064M31598P78922R70446Q73178
$$ 770196 425011 234367 176555 176048 108853 -1273 69791 501389 1280311 2250757 3123935
20657C123935M39989k31233q20938j228640j367489j095904o64580k41267J53723
$$ 3123935 3563924 3332691 2511753 1283113 -84376 -1180280 -1844860 -2086127 -1932404
20648a932404N05862O85165N96975O11171Q02117P38497N20145K96572Q8611o2438
$$ -1932404 -1426542 -741377 -144402 466769 1268886 2007383 2527528 2824100 2912711 2850273
20638B850273k04960l16573k74001O9848L26598J85473k85721r20384j184516
$$ 2850273 2645313 2328740 2054739 2124587 2451185 2636658 2350937 1430553 246037
20629B46037j056296q68449n94340m08344k53466j1023J52323K23831K74313L39838
$$ 246037 -810259 -1678708 -2273048 -2681392 -2934858 -2945881 -2793558 -2569727 -2295414 -1955576
20619a955576K27908j06828l40797j63799K53171N14120M18770J56800p0171k63534
$$ -1955576 -1727668 -1834496 -2175293 -2339092 -2085921 -1571801 -1153031 -996231 -1066402 -1329936
20609a329936k89384j96502k37550m98162r05868j110522q93120m00783K54781
$$ -1329936 -1619320 -1815822 -2053372 -2551534 -3457402 -4567924 -5461044 -5861827 -5607046
20600e607046Q30455Q98981N26527M61978Q90016J227234J057679N84388J19413
$$ -5607046 -4776591 -3877610 -3351083 -2889105 -1999089 -771855 285824 870212 989625
20591I89625o4068K43180O96121Q09967P11305P51642O30514J77177j25341l32527
$$ 989625 925557 1168737 1864858 2674825 3386130 4137772 4768286 4945463 4820122 4487595
20581D487595p60087j116591r60933o47389m06977N6080M73284L53605j19613
$$ 4487595 3727508 2610917 1649984 1002595 595618 651698 1124982 1478587 1358974
20572A358974n02151n52216l43534o5921Q0762j25818n19546o47862k38415M21446
$$ 1358974 856823 304607 -38927 -104848 -24086 -149904 -669450 -1317312 -1555727 -1134281
20562a134281Q43876O98889K51212L5082Q139r5627l13086l18143j15276m3245
$$ -1134281 -290405 408484 659696 694778 702917 607290 294204 -23939 -139215 -182460
20552a82460k71377o19719o69548m06849j62260l9895J80772N28922O72042M52269
$$ -182460 -453837 -1073556 -1743104 -2149953 -2312213 -2352108 -2171336 -1642414 -970372 -518103
20542e18103K91061K24546J76227J08802m308q7151j40551l3369J40654J38015
$$ -518103 -227042 -2496 173731 282533 278225 191074 50523 17154 157808 295823
20532B95823K1882k45411o75470p29705l62958O8472K96285K06592J0057k55173
$$ 295823 317705 72294 -603176 -1332881 -1695839 -1627367 -1331082 -1124490 -1114433 -1369606
20522a369606m71357m70809m89619n46691m22971k6408M65935P91823P99847N13447
$$ -1369606 -1840963 -2311772 -2801391 -3348082 -3771053 -3797461 -3331526 -2539703 -1739856 -1226409
20512a226409J66092O992M24567R92547Q19573J87339k49094m25143m75732n42514
$$ -1226409 -1060317 -1053325 -628758 363789 1183362 1370701 1121607 696464 220732 -321782
20502c21782m74801k37270j60608j85455k49599l42021k43258j18466J857K28038
$$ -321782 -796583 -1033853 -1194461 -1379916 -1629515 -1971536 -2214794 -2333260 -2331403 -2103365
20492b103365N14241Q09436J008852R61536P58729L82135k14590n61156n75200
$$ -2103365 -1589124 -779688 229164 1190700 1949429 2331564 2116974 1555818 980618
20483I80618l99081j82496k38916m06514l35154j24379J25431L96717M36432J29467
$$ 980618 581537 399041 160125 -246389 -581543 -705922 -580491 -183774 252658 382125
20473C82125j24716j94837L0503L97464L89251K65858J40385n4641j65563l05912
$$ 382125 257409 62572 93075 490539 879790 1145648 1286033 1231392 1065829 759917
20463G59917l99748m12288n00700m65675o2984N42549R44106R30496O41488J66783
$$ 759917 360169 -52119 -552819 -1018494 -1081478 -538929 405177 1335673 1977161 2143944
20453B143944k42953l81017m64453o48513p49802p46045l20857M20152Q05242
$$ 2143944 1900991 1519974 1055521 407008 -342794 -1088839 -1409696 -989544 -184302
20444a84302P06996M32143J86770j95117n29510n59276l03675J41298M10552M96942
$$ -184302 522694 954837 1141607 946490 416980 -142296 -445971 -304673 105879 602821
20434F02821N88739M40178R5841j80984l04689l48094l28800l14039k63017j54747
$$ 602821 1191560 1631738 1727579 1546595 1241906 893812 565012 250973 -12044 -166791
20424a66791r8680J24673M33142L51472J61059K93251M48440L46510J44021j3822
$$ -166791 -265471 -140798 292344 643816 804875 1098126 1546566 1893076 2037097 2023275
20414B023275k34093m96824o16484o01345m93588l04082j7528L46883O97511P97336
$$ 2023275 1789182 1292358 675874 74529 -419059 -723141 -740669 -393786 303725 1101061
20404A101061O36113N93962M50645n5909o05685q41285p63932m84118j83564j19957
$$ 1101061 1737174 2331136 2781781 2725872 2120187 1278902 514970 30852 -152712 -272669
20394b72669l18629l77993p5549K74019M36837M45543L12567j91469p34368p38252
$$ -272669 -591298 -969291 -1044840 -770821 -333984 111559 424126 232657 -501711 -1239963
20384a239963j91676K56574J55845M1750K90437M26639J00823k70789k89527q9065
$$ -1239963 -1431639 -1175065 -1019220 -977470 -687033 -260394 -159571 -430360 -719887 -808952
20374h08952R4187N8762j53809k72047k60091j14883K11833L98980K20942L8981
$$ -808952 -714765 -656003 -809812 -1081859 -1341950 -1456833 -1245000 -846020 -625078 -586097
20364e86097q2333l74042n19008l87196j96418q6229j48692l14816l66845j67728
$$ -586097 -668430 -1042472 -1561480 -1948676 -2145094 -2231323 -2380015 -2694831 -3061676 -3229404
20354c229404M5669J67935K39514K98030M33242M79157L56903L39205L75501M61787
$$ -3229404 -3183735 -3015800 -2776286 -2478256 -2045014 -1565857 -1208954 -869749 -494248 -32461
20344c2461P46805R40872N86744M015j14027J92375M50084L44808J11078J9600
$$ -32461 714344 1655216 2241960 2245975 2131948 2324323 2774407 3119215 3230293 3249893
20334C249893P1j950j69287o67738j195793j176370m69842L68093Q90761J020711
$$ 3249893 3249964 3248014 3078727 2410989 1215196 38826 -431016 -62923 827838 1848549
20324A848549R95992Q98992N76425M8001m25192p23841p57518m43797n4196J00394
$$ 1848549 2844541 3743533 4319958 4367959 3942767 3218926 2461408 2017611 1963415 2063809
20314B063809o0115k36969l07192m81576o12468l69161K10781O52000P29141P06108
$$ 2063809 2003694 1766725 1459533 977957 365489 -3672 207109 859109 1588250 2294358
20304B294358O78791L97421j34894n45394n67078k55674j5150j22458k97019l55117
$$ 2294358 2973149 3370570 3235676 2690282 2123204 1867530 1852380 1729922 1432903 1077786
20294A077786m39477n95922p57943o03309j20070L96787O40088P26168P12181
$$ 1077786 638309 42387 -715556 -1318865 -1438935 -1042148 -402060 324108 1036289
20285A036289M02821J0283o7593J43057J76657L6718Q8834K15901J94335L50718
$$ 1036289 1439110 1449393 1381800 1524857 1701514 1738232 1827066 2042967 2237302 2588020
20275B588020N84490O04035K87878k27740l02590J22626N55079P12494M94680
$$ 2588020 3172510 3776545 4064423 3836683 3534093 3656719 4211798 4924292 5418972
20266E418972J06225j86168m83840p17179q26927q35564q66611r62939p98108
$$ 5418972 5525197 5339029 4855189 4138010 3311083 2475519 1608908 645969 -152139
20257a52139m07229m9648K42180M43451L42027J04206q5503k47984j64055K60902
$$ -152139 -559368 -609016 -366836 76615 418642 522848 437345 189361 25306 286208
20247B86208Q10332J017706O36313J78746j273J06621M71952P25457O25512M47968
$$ 286208 1096540 2114246 2750559 2929305 2928032 3034653 3506605 4232062 4857574 5305542
20237E305542L33517K45728J58801O487l83006q00598o43151m638M72946M50416
$$ 5305542 5639059 5884787 6043588 6050075 5667069 4866471 4223320 4218682 4691628 5142044
20227E142044M9625m52939n66472k30177J48641L41842N08628N83417K55820j54578
$$ 5142044 5191669 4738730 4172258 3942081 4090722 4432564 4941192 5524609 5780429 5625851
20217E625851l96739l67924j1870J84058J8391j89398j99355j41789j97803l51718
$$ 5625851 5229112 4861188 4849318 5033376 5051767 4862369 4663014 4521225 4323422 3971704
20207C971704m86656n32314n40254n17908k29777L26726O11662M28887M3516l13930
$$ 3971704 3485048 2952734 2412480 1894572 1664795 1991521 2603183 3032070 3075586 2761656
20197B761656l57595o3634K14905J24214j50232P9873N08879K75783l93036n89384
$$ 2761656 2404061 2340427 2555332 2679546 2529314 2609187 3118066 3393849 3000813 2411429
20187B411429k45025J8041Q189k64898p26239j012597o90130O2030M49329M48582
$$ 2411429 2166404 2184445 2192634 1927736 1201497 188900 -501230 -439200 10129 458711
20177D58711N44108O01394L35665J40723L37752N13333L30612k3226k40641l36606
$$ 458711 1002819 1604213 1939878 2080601 2418353 2931686 3262298 3239072 2998431 2661825
20167B661825j25409K40066L04381K51852N70488R99409J132022J213461J231333
$$ 2661825 2536416 2776482 3080863 3332715 3903203 4902612 6034634 7248095 8479428
20158H479428J130587J121586J448391K234481L375315M568224M981579L617047
$$ 8479428 9610015 10731601 12179992 14414473 17789788 22358012 27339591 30956638
20150C0956638P07471k041847l537706l978487l477286k544689k118637k147544
$$ 30956638 31664109 29622262 26084556 22106069 18628783 16084094 13965457 11817913
20142A1817913j926266j464907j063906p82023p65065q90979p26352l57537l27312
$$ 11817913 9891647 8426740 7362834 6580811 5815746 4924767 4198415 3840878 3513566
20133C513566n86201n68222j96895K93789O31229O31794L94638K4895m23714o95413
$$ 3513566 2927365 2359143 2162248 2456037 3087266 3719060 4113698 4138593 3714879 3019466
20123C019466o47763l53825k40861l67502l81823k63062l02095n88585o14814
$$ 3019466 2371703 2017878 1777017 1409515 1027692 764630 462535 -126050 -740864
20114g40864j62905M44728P92242N67027J10998j16467J04450M82314M90846L13261
$$ -740864 -903769 -459041 333201 900228 1011226 894759 999209 1481523 1972369 2285630
20104B285630j6693l25621j18936K03040J30331r2491k70920m17603l54155K6814
$$ 2285630 2268937 1943316 1824380 2027420 2157751 2065260 1794340 1376737 1022582 1049396
20094A049396L93397L26921N7269j329N2146P0663J3883n4417l2854r2893l56745
$$ 1049396 1442793 1769714 1826983 1825654 1877800 1948463 1962346 1907929 1875075 1782182 1425437
20083A425437n02113k85355N2719K79228K73063j09454o85888r62009p77113k83543
$$ 1425437 923324 637969 690688 969916 1242979 1133525 447637 -514372 -1291485 -1575028
20073a575028L07306N14542K66110O928l1438N3356J90381L14303K64346J45034
$$ -1575028 -1267722 -753180 -487070 -480142 -511580 -458224 -267843 46460 310806 455840
20063D55840J06624J14347J13080J09783K34052M73684O00100O10980O50695O14708
$$ 455840 562464 676811 789891 899674 1133726 1607410 2207510 2818490 3469185 4083893
20053D083893L93868j22473p66635j055481p58957l66700l47665l40528j78510
$$ 4083893 4477761 4355288 3588653 2533172 1774215 1407515 1059850 719322 540812
20044E40812j28237j633L26328N50018O45089O08087K81052L8294l4971k05588
$$ 540812 412575 410942 737270 1287288 1932377 2540464 2821516 2859810 2824839 2619251
20034B619251o06634r76810r69243o03841k40950r1394J80513N79915P74629O87974
$$ 2619251 2012617 1035807 66564 -537277 -778227 -869621 -689108 -109193 665436 1353410
20024A353410M89435L55924L96053K16982j46405k28304k39946k47208l4799L39948
$$ 1353410 1842845 2198769 2594822 2811804 2665399 2437095 2197149 1949941 1915142 2255090
20014B255090N04387M32681M57206O67332P50973N74675J58912k84505k65187
$$ 2255090 2759477 3192158 3649364 4316696 5067669 5642344 5801256 5516751 5251564
20005E251564J34580M70616Q48823J237878J112150N61261L34877N08234M96607
$$ 5251564 5386144 5856760 6705583 7943461 9055611 9616872 9951749 10459983 10956590
19996A0956590J88846j77569l43420k17833k0491q9368m27647m29412j17926j47537
$$ 10956590 11145436 10967867 10624447 10406614 10386123 10296755 9869108 9439696 9321770 9174233
19986I174233l46288l52755k83882p456L67163L20278P1245K504o3358n5136J92803
$$ 9174233 8827945 8475190 8191308 8183852 8551015 8871293 8942538 8945042 8881684 8826548 9019351
19975I019351M97947Q05489J179747J454752J514029J560429J621582J639561
$$ 9019351 9517298 10322787 11502534 12957286 14471315 16031744 17653326 19292887
19967A9292887J696706J913775K202755K317671K535292K974013L309947L751940
$$ 19292887 20989593 22903368 25106123 27423794 29959086 32933099 36243046 39994986
19959C9994986M743964O003578O972463P880319R408379J2168188J6578025K2652156
$$ 39994986 44738950 50742528 57714991 65595310 75003689 87171877 103749902 126402058
19951A26402058K9949788L7737603M4486326M5513715L2006739J554778k9363214
$$ 126402058 156351846 194089449 238575775 284089490 316096229 317651007 288287793
19944B88287793m3492414m2007762l3965822k5109023j7406168j1203252p007122
$$ 288287793 244795379 202787617 168821795 143712772 126306604 115103352 108096230
19937A08096230n619264o219427o545102n599838m024832k215764n8716L000580
$$ 108096230 102476966 96257539 89712437 84112599 80087767 77872003 77813287 80813867
19929H0813867O956010J1021164J4893448J8338801J8978408J2550990j243678
$$ 80813867 87769877 98791041 113684489 132023290 151001698 163552688 162309010
19922A62309010j4738772k0887458k0546512j7591506j4244444j1251926q798629
$$ 162309010 147570238 126682780 106136268 88544762 74300318 63048392 54249763
19915E4249763o879624n356865m254557l536892k891540k335747j732931r18704
$$ 54249763 47370139 42013274 37758717 34221825 31330285 28994538 27261607 26342903
19907B6342903j75203J57834R329n08250r89059r44421l75848L79811J008544
$$ 26342903 26167700 26325534 26334863 25826613 24837554 23893133 23517285 23897096 24905640
19898B4905640J435415J923669K527785L267473M209934N378905O678338Q141198
$$ 24905640 26341055 28264724 30792509 34059982 38269916 43648821 50327159 58468357
19890E8468357J0195641J3305525J7385734K2655478K9553870L7539400M4542693
$$ 58468357 68663998 81969523 99355257 122010735 151564605 189104005 233646698
19883B33646698M5133945L1239443K975411k5711263m1302540m2788061l7173883
$$ 233646698 278780643 310020086 312995497 287284234 245981694 203193633 166019750
19876A66019750l0359126k4414084j9629941j5965507j2903314j0217675q020260
$$ 166019750 135660624 111246540 91616599 75651092 62747778 52530103 44509843
19869D4509843o326843m979083l894211l231798k987990k919328k851365k728713
$$ 44509843 38183000 33203917 29309706 26077908 23089918 20170590 17319225 14590512
19861A4590512k367062j759826j230754q98960o30112l82819l21068m38678m48493
$$ 14590512 12223450 10463624 9232870 8333910 7703798 7320979 6999911 6561233 6112740
19852F112740l27586l17344n18938o71314l43940K84196N19130J80197l79011
$$ 6112740 5785154 5467810 4948872 4277558 3933618 4217814 4736944 4917141 4538130
19843D538130r54549j286140j197663q33210k85088J89295L87567L65155K38856
$$ 4538130 3583581 2297441 1099778 266568 -18520 170775 558342 923497 1162353
19834A162353N8982j25464l14287m51311n14710l65595p575O4626r4552k3424
$$ 1162353 1221335 1095871 781584 330273 -184437 -550032 -557607 -492981 -587533 -610957
19824f10957L00297O12201R72405J465202J913661K081929K007761K104156K185632
$$ -610957 -310660 301541 1273946 2739148 4652809 6734738 8742499 10846655 13032287
19815A3032287J409023k08625j460546j823023j676930j399209j150020j216583
$$ 13032287 14441310 14232685 12772139 10949116 9272186 7872977 6722957 5506374
19807E506374j505033j326827n99325p4520M1466J20901l3449n65469q73108n48670
$$ 5506374 4001341 2674514 2075189 2000669 2042135 2163036 2129587 1564118 691010 142340
19797A42340Q2100L75392K43467J84619J63546r6402l40671j58615L25428N63389
$$ 142340 224440 599832 843299 1027918 1191464 1095062 754391 595776 921204 1484593
19787A484593K93681J34341K52162l2772o46352p97405n65662l99921j44108L62439
$$ 1484593 1778274 1912615 2164777 2132005 1485653 688248 122586 -277335 -421443 -59004
19777e9004Q84339J261785J511079J747245J913037J988883K340715L368945M429316
$$ -59004 825335 2087120 3598199 5345444 7258481 9247364 11588079 14957024 19386340
19768A9386340M446256K867724m4241k575758l626452l558709k993246k380988
$$ 19386340 23832596 26700320 26656079 24080321 20453869 16895160 13901914 11520926
19760A1520926j966816j941210k012236j560945q43838j99188L50849O44178M87744
$$ 11520926 9554110 7612900 5600664 4039719 3195881 2996693 3347542 3991720 4479464
19751D479464J80909Q2329K9156j23135k99396m25343n84774n85425l00779j14955
$$ 4479464 4660373 4742702 4771858 4648723 4349327 3923984 3339210 2753785 2453006 2338051
19741B338051j53464q037J85065J71947J38574K10968M33430N10474L29046J4376
$$ 2338051 2184587 2176550 2361615 2533562 2672136 2883104 3316534 3827008 4156054 4170430
19731D170430l13676m38302k85063L3288K69286M18676O45184J094463J719196
$$ 4170430 3856754 3418452 3133389 3166677 3435963 3854639 4499823 5594286 7313482
19722G313482K251671K266370J515160R8916j302863j916266j643266j230612
$$ 7313482 9565153 11831523 13346683 13445599 12142736 10226470 8583204 7352592
19714G352592j065759p86650m79953l33430j26775Q1980j73280o68506p51954
$$ 7352592 6286833 5500183 5020230 4686800 4560025 4642005 4468725 3800219 3048265
19705C048265m61923k74821m65494p36045p67850o48590l31901l353p413n5492
$$ 3048265 2586342 2311521 1846027 1109982 342132 -306458 -638359 -641712 -649125 -704617
19695g04617o6995K9833L96463O28761L92303l8551n12960p65716n69034j74483
$$ -704617 -771612 -741779 -345316 283445 675748 637197 124237 -641479 -1210513 -1384996
19685a384996K25236M13732L51074K36555J26816J51856K57680K50567J28587
$$ -1384996 -1159760 -746028 -394954 -158399 -31583 120273 377953 628520 757107
19676G57107P2222J06560J2141k34347m60161n33956o63252q96777q17519l99648
$$ 757107 829329 935889 948030 713683 253522 -280434 -943686 -1840463 -2657982 -3057630
19666c057630J20658M93743O11392N92241L48049K16649L18484L01144p4559n39502
$$ -3057630 -2936972 -2443229 -1831837 -1239596 -891547 -674898 -356414 -55270 -129829 -669331
19656f69331n51860n4444M70264P51788O55088L63281L29714K87791j46399n39979
$$ -669331 -1221191 -1275635 -805371 -53583 601505 964786 1294500 1582291 1435892 895913
19646H95913n62531m66059l08424j54774k47882m43178m90342n64167p29850m26550
$$ 895913 333382 -132677 -441101 -595875 -843757 -1286935 -1777277 -2341444 -3071294 -3497844
19636c497844M16751J034897R69683N00301j9175m90470p80706o76853k58096
$$ -3497844 -3081093 -2046196 -1076513 -576212 -595387 -1085857 -1866563 -2543416 -2801512
19627b801512K0290r7538k35370O849L73030N25059L71599k8769m20739n88568
$$ -2801512 -2781222 -2878760 -3114130 -3107281 -2734251 -2209192 -1837593 -1866362 -2287101 -2875669
19617b875669m34897j00375J22974K30853J87294j21474l79736l25052J6603L97145
$$ -2875669 -3310566 -3410941 -3287967 -3057114 -2869820 -2991294 -3371030 -3696082 -3679479 -3282334
19607c282334N40003M68328L17831L49593N60414N35284K93723J88768K74845
$$ -3282334 -2742331 -2274003 -1956172 -1606579 -1046165 -510881 -217158 -28390 246455
19598B46455L7576l91643m19885j26839K19963K36264N681K04455P02173Q09301
$$ 246455 284031 -107612 -527497 -654336 -434373 -198109 -192428 12027 714200 1523501
19588A523501M71932j4063m52171o75914n66360l47079l93909p48333j017906
$$ 1523501 1995433 1981370 1529199 853285 286925 -60154 -454063 -1202396 -2220302
19579b220302p26779L1025N20171N98449P51952Q91667P84555M22151M1236k30404
$$ -2220302 -2947081 -2916056 -2395885 -1797436 -1045484 -153817 630738 1052889 1094125 863721
19569H63721m26170n86528o05465m77685m56778l64140J67628P29286Q15987N26215
$$ 863721 437551 -148977 -754442 -1232127 -1688905 -2053045 -1885417 -1156131 -340144 186071
19559A86071J78421Q5529J34058J77981N9326j77821j61366J37994K98767J96302
$$ 186071 364492 450021 584079 762060 821386 643565 482199 620193 918960 1115262
19549A115262k45416q37702q22321j25574O11794P39192K19804l56256m41404
$$ 1115262 869846 32144 -790177 -915751 -303957 435235 655039 298783 -142621
19540a42621L8546N47760O52569K77617m30839r59066q81443k74861K55938L77283
$$ -142621 -104075 443685 1096254 1373871 943032 -16034 -897477 -1172338 -916400 -539117
19530e39117L46972M36440N21647K62142j82483l78802k81700o8050j9829j90189
$$ -539117 -192145 244295 765942 1028084 845601 466799 185099 117049 97220 -92969
19520i2969k18528j53368k38364l38304j89230O3217Q398j83973j18596J33297
$$ -92969 -311497 -464865 -703229 -1041533 -1230763 -1167546 -1159148 -1343121 -1461717 -1328420
19510a328420K33629K03225R8461p9912l04504n88230o27346m07310l80202m61094
$$ -1328420 -1094791 -891566 -793105 -873017 -1177521 -1765751 -2393097 -2800407 -3180609 -3641703
19500c641703k89859m6383K01439O18540J020065J084724M60703n04276q36648
$$ -3641703 -3931562 -3977945 -3776506 -3157966 -2137901 -1053177 -592474 -1096750 -1933398
19491a933398o09259m50296l14791m1335K10182M40051N47879L31305M7924j32146
$$ -1933398 -2542657 -2992953 -3307744 -3349079 -3138897 -2698846 -2150967 -1819662 -1771738 -1903884
19481a903884j64130j81113n58767r79453p90603K8541P87303Q62433N68867M41003
$$ -1903884 -2068014 -2249127 -2807894 -3787347 -4577950 -4549409 -3762106 -2899673 -2330806 -1889803
19471a889803L77274J86328K47707N74056N35615K7065m20174l99081q8674K02961
$$ -1889803 -1512529 -1326201 -1078494 -504438 31177 58242 -361932 -761013 -849687 -646726
19461f46726K52439J67208P9794M7947J04416K15614M08655M89574K59237j50470
$$ -646726 -394287 -227079 -147285 -99338 5078 220692 629347 1118921 1378158 1227688
19451A227688l84573l29122k94916l69604k98020k0311J03415j12929n85997j023566
$$ 1227688 843115 513993 219077 -150527 -448547 -468858 -365443 -478372 -1064369 -2087935
19441b087935r77171m67427K64224O58516L91737j5543M8130K50305J36578r1020
$$ -2087935 -3065106 -3532533 -3268309 -2609793 -2218056 -2233599 -2185469 -1935164 -1798586 -1889606
19431a889606k97762m24016l86375n3099M49895J109057J633689J522586Q79423
$$ -1889606 -2187368 -2611384 -2997759 -3050858 -2600963 -1491906 141783 1664369 2543792
19422B543792J98331k51431n08353n25919k69874j36456l43765p01197r14837
$$ 2543792 2742123 2490692 1982339 1456420 1186546 1050090 706325 5128 -909709
19413i09709p62318m50445j82214l3783K7280J13833K19170M90559R46755J211567
$$ -909709 -1672027 -2122472 -2304686 -2338469 -2311189 -2197356 -1978186 -1487627 -540872 670695
19403F70695R04470J17948m56581l42745J08396N31621Q77167R91424M82746l60071
$$ 670695 1575165 1693113 1236532 893787 1002183 1533804 2410971 3402395 3885141 3525070
19393C525070r47327j023418q52910q05649p17467m55448l71795m17001k49174
$$ 3525070 2577743 1554325 701415 -104234 -821701 -1277149 -1648944 -2065945 -2315119
19384b315119j23343l12268m97518l43272o486Q8767R2585L88527P84362J025781
$$ -2315119 -2438462 -2750730 -3248248 -3591520 -3598006 -3509239 -3416654 -3028127 -2243765 -1217984
19374a217984R36674O15640J37675m75241q71682q00587n68779m21371j94303
$$ -1217984 -281310 334330 472005 -3236 -874918 -1675505 -2244284 -2665655 -2859958
19365b859958J83711L77440Q3764k00608K7144M75884O31976K34713j36051j7708
$$ -2859958 -2676247 -2298807 -2215043 -2415651 -2388507 -1912623 -1280647 -1045934 -1181985 -1199693
19355a199693L52366P05147Q70907P80083L31945k27334l45315l8656J88219R7933
$$ -1199693 -847327 -142180 728727 1508810 1840755 1613421 1268106 1229450 1417669 1515602
19345A515602k35663n89341p52793o48997k76471J57451O20699J007484R03300
$$ 1515602 1279939 690598 -62195 -711192 -987663 -830212 -209513 797971 1701271
19336A701271L36435j37413l00115k73948k97302n48868r16066j080467r37334
$$ 1701271 2037706 1900293 1600178 1326230 1028928 480060 -436006 -1516473 -2453807
19327b453807m35959K29291N80032O48127O96862O00042K39274j85958l80588
$$ -2453807 -2889766 -2660475 -2080443 -1432316 -735454 -135412 103862 -82096 -462684
19318d62684k09525J93375K56864N0907j37668j73778J51044N48376O75435M62198
$$ -462684 -672209 -478834 -221970 -171063 -308731 -482509 -331465 216911 892346 1354544
19308A354544p246m69013n24895l62253m12159o00554o97507l68198K84344Q54024
$$ 1354544 1347298 878285 353390 -8863 -421022 -1021576 -1719083 -2087281 -1802937 -948913
19298i48913R38788M94370L508j77125j69642l47957m50285p3388J99531M0660
$$ -948913 -10125 484245 487753 310628 140986 -206971 -657256 -730644 -531113 -490453
19288d90453l10857k22245J69484L07523J33369j65108j52084L4768m8131k87254
$$ -490453 -801310 -1023555 -854071 -546548 -413179 -578287 -730371 -695603 -743734 -1030988
19278a030988l95815k34650L5832K71540M65878L10948j32944l09963k18264k68522
$$ -1030988 -1426803 -1661453 -1625621 -1354081 -888203 -577255 -710199 -1020162 -1238426 -1506948
19268a506948m45199l55057J67985N85681N72231L98626L88884N25724N39600
$$ -1506948 -1952147 -2307204 -2139219 -1553538 -981307 -582681 -193797 331927 871527
19259H71527L17553J22273l7030l96954p94621q33269m02828Q5903K45476j9954
$$ 871527 1189080 1311353 1274323 877369 82748 -750521 -1153349 -1067446 -821970 -841924
19249h41924l49994l67258j56002k8247j49449k92360k57735j29944N6060L01619
$$ -841924 -1191918 -1559176 -1715178 -1743425 -1892874 -2185234 -2442969 -2572913 -2516853 -2215234
19239b215234L71030K13335K99239O14350O73760L02065l86836j104736j411550
$$ -2215234 -1844204 -1630869 -1331630 -717280 -43520 258545 -128291 -1233027 -2644577
19230b644577j136824n34482k8577K05972K42320L3972k35095k40981J02476M65463
$$ -2644577 -3781401 -4315883 -4344460 -4138488 -3896168 -3862196 -4097291 -4338272 -4235796 -3770333
19220c770333O42077N08084J12864k8425P3369J45233K19773J21356M7408L15781
$$ -3770333 -3128256 -2620172 -2507308 -2535733 -2462364 -2317131 -2097358 -1976002 -1928594 -1612813
19210a612813N91362M04404n9018l76403m94172m95733k57500J13734M44599M37349
$$ -1612813 -1021451 -617047 -676065 -1052468 -1546640 -2042373 -2299873 -2186139 -1741540 -1304191
19200a304191K34617L34811Q71589J360699J296612P84797M38202K25975j06999
$$ -1304191 -1069574 -734763 136826 1497525 2794137 3578934 4017136 4243111 4136112
19191D136112k92611l26152m68902n66157m02944j24806J77949K76779J63303
$$ 4136112 3843501 3517349 3048447 2482290 2079346 1954540 2132489 2409268 2572571
19182B572571K74112L61240O6160m63962q82064r29498o66633k69004J9761l4153
$$ 2572571 2846683 3207923 3274083 2810121 1928057 998559 331926 62922 82683 48530
19172D8530l36914o37840o47609l24497Q0987K35761J49334N3963p9063l37698
$$ 48530 -288384 -926224 -1573833 -1898330 -1817343 -1581582 -1432248 -1378285 -1457348 -1795046
19162a795046n55139o70669o87818n77824k87067J77133N99556Q20789Q45771
$$ -1795046 -2350185 -3020854 -3708672 -4286496 -4573563 -4396430 -3796874 -2976085 -2130314
19153b130314N72941N5638k81935K1506N99098Q24885N47934J53232K4208K32444
$$ -2130314 -1557373 -1501735 -1783670 -1762164 -1163066 -338181 209753 362985 387193 619637
19143F19637N44991N52523K45503k38155q70337j256878r00481k34123l5719k57389
$$ 619637 1164628 1717151 1962654 1724499 854162 -402716 -1303197 -1537320 -1573039 -1830428
19133a830428l74278l96778m33705l05722j08971K2457J72781J44186j25528l25990
$$ -1830428 -2204706 -2601484 -3035189 -3340911 -3449882 -3427425 -3254644 -3110458 -3235986 -3561976
19123c561976k69752J04203P50510J246666J175864N56690k7650m991L24269L19162
$$ -3561976 -3831728 -3727525 -2977015 -1730349 -554485 2205 -25445 -30436 293833 612995
19113F12995j3955l64167l85534K932L69887L36303L1384j28917m3570j1785j47962
$$ 612995 599040 234873 -150661 -147729 222158 558461 589845 460928 417358 405573 257611
19102B57611k98439l05152k52228k84040k65211K4537M65547O02434M36904M14216
$$ 257611 -40828 -345980 -598208 -882248 -1147459 -1122922 -657375 -54941 381963 796179
19092G96179M76487J56617l86645o24672m43604k08625n4594O0404j13730m99521
$$ 796179 1272666 1429283 1042638 417966 -25638 -234263 -288857 -228453 -342183 -841704
19082h41704p63184p66819m22642J63738P12926Q57502P14623N51319J63847l05348
$$ -841704 -1604888 -2371707 -2794349 -2630611 -1917685 -1060183 -345560 205759 369606 64258
19072F4258m40159j48885K61157N60472O69012N13563j866m72788o45900n59541
$$ 64258 -375901 -524786 -263629 296843 965855 1479418 1477552 1004764 358864 -200677
19062b00677l09002j21784j26694r0872Q2204J30036K4060k63929n08416m58482
$$ -200677 -509679 -631463 -758157 -849029 -766825 -636789 -612729 -876658 -1385074 -1843556
19052a843556k71120j81080k59979l20120l21672k81163p1400L25250M67107K38768
$$ -1843556 -2114676 -2295756 -2555735 -2875855 -3197527 -3478690 -3550090 -3224840 -2757733 -2518965
19042b518965J07067J06002l2260j15613o4938L0670J08816P1527k19814o99385
$$ -2518965 -2411898 -2305896 -2338156 -2453769 -2518707 -2488037 -2379221 -2307694 -2527508 -3226893
19032c226893p39708k36206K53661N62354O28997N25905M32388L27445K79439
$$ -3226893 -3966601 -4202807 -3949146 -3386792 -2757795 -2231890 -1799502 -1472057 -1192618
19023a192618K30981n3808l11865j46985J06944M37937P98985N31542j54565m51887
$$ -1192618 -961637 -1015445 -1327310 -1474295 -1367351 -929414 -130429 401113 246548 -205339
19013b05339l86935k65717r6144O5377L23855O82200P90427L28660l66277q12242
$$ -205339 -592274 -857991 -954135 -888758 -564903 117297 907724 1236384 870107 57865
19003E7865p53334l74746O5971N06144N99892K51891K0432j81545n50003q63622
$$ 57865 -695469 -1070215 -1004244 -498100 101792 353683 374115 192570 -357433 -1221055
18993a221055q88177n23725M4900N14966O68075M69282J02789o9053N8987M23574
$$ -1221055 -2109232 -2632957 -2588057 -2073091 -1405016 -935734 -832945 -901998 -843011 -419437
18983d19437O33997K83655l29543m86055j66940K77208P04469Q69708O39231M3909
$$ -419437 214560 498215 168672 -317383 -484323 -207115 497354 1367062 2006293 2050202
18973B050202o73552r73067o96121l68900l42323k66650M2607M40557N80730M56799
$$ 2050202 1376650 403583 -292538 -661438 -1003761 -1270411 -1227804 -787247 -206517 250282
18963B50282K67782P6281R2396J75056J44328J88507L84671M25088J50984l13240
$$ 250282 518064 594345 686741 861797 1006125 1194632 1579303 2004391 2155375 1842135
18953A842135r06524j288539r86514l07353L5194l4590M608L43723P66777R28415
$$ 1842135 935611 -352928 -1339442 -1646795 -1611601 -1646191 -1641583 -1297860 -531083 397332
18943C97332N52758k02563q49205j020497n45604O4972J15986l27361p44641o25936
$$ 397332 950090 747527 -101678 -1122175 -1667779 -1602807 -1486821 -1814182 -2558823 -3184759
18933c184759l1726M12495M42091L49689K55042K12220K70420J89368j48106m77593
$$ -3184759 -3216485 -2803990 -2361899 -2012210 -1757168 -1544948 -1274528 -1085160 -1233266 -1710859
18923a710859p45713o79134l22161l4580R778j87555j14740L24231O68735N98472
$$ -1710859 -2456572 -3135706 -3457867 -3492447 -3482669 -3670224 -3784964 -3460733 -2791998 -2193526
18913b193526K58337j1289k39604j62084M35997J053763J172730R24212N36445
$$ -2193526 -1935189 -1946478 -2186082 -2348166 -1912169 -858406 314324 1238536 1774981
18904A774981J10119j68786k38207j88845k25876k93182j86609J6849j8054m67640
$$ 1774981 1885100 1716314 1478107 1289262 1063386 770204 583595 600444 582390 114750
18894A14750r38223r08579n39662j86401K33144P82517J257074J358688P51212
$$ 114750 -823473 -1732052 -2271714 -2458115 -2224971 -1442454 -185380 1173308 1924520
18885A924520k96883j018187j114630q63112n42241k74498k49138l44383k14680
$$ 1924520 1627637 609450 -505180 -1368292 -1910533 -2185031 -2434169 -2778552 -2993232
18876b993232K4554J11366r6981j64820J42372L25347J93202P6274J16788L60037
$$ -2993232 -2968678 -2857312 -2954293 -3119113 -2976741 -2651394 -2458192 -2381918 -2265130 -1905093
18866a905093O76383P49382K88163n04648q91702o07993j14769J18760K26372
$$ -1905093 -1228710 -479328 -191165 -695813 -1587515 -2195508 -2310277 -2191517 -1965145
18857a965145K13447L5303n3950J8903Q8762K32913M18264M74123M25248L55787
$$ -1965145 -1751698 -1716395 -1770345 -1751442 -1662680 -1429767 -1011503 -537380 -112132 243655
18847B43655K19225j25510n11403n77501k90250p2079j13281k63309k70528J9427
$$ 243655 462880 337370 -174033 -751534 -1041784 -1113863 -1227144 -1490453 -1760981 -1741554
18837a741554J98978J07572Q1417J38592n5135l83883m28241k96761j28843J25709
$$ -1741554 -1542576 -1435004 -1353587 -1214995 -1270130 -1654013 -2082254 -2379015 -2507858 -2382149
18827b382149L42393K72612K73543M80142O23381N34756J62544j61698l60514
$$ -2382149 -2039756 -1767144 -1493601 -1013459 -390078 144678 307222 145524 -214990
18818b14990k30162K26317M22002L48819K85102J30477j22581m37094m58267r0574
$$ -214990 -445152 -218835 203167 551986 837088 967565 844984 407890 -50377 -140951
18808a40951K83371M05653J76427k70302n02134k98570m4449j2952j79909l66817
$$ -140951 142420 548073 724500 454198 -47936 -346506 -390955 -403907 -583816 -950633
18798i50633m14480m21914l55014k76257k86307k93706r9533J76473K72722M10829
$$ -950633 -1365113 -1787027 -2142041 -2418298 -2704605 -2998311 -3097844 -2921371 -2648649 -2237820
18788b237820O05600O25174M49968L31497R7630j68132k76966m09327l20279J31895
$$ -2237820 -1632220 -1007046 -557078 -225581 -127951 -296083 -573049 -982376 -1302655 -1170760
18778a170760M66911L55931j5346k33328p2419J06351J75039K75398K07033o7022
$$ -1170760 -703849 -347918 -363264 -596592 -669011 -562660 -387621 -112223 94810 27788
18768B7788l21962l91918k05301L6161K02863K17969M1517n183K76845N81487
$$ 27788 -294174 -686092 -891393 -855232 -652369 -434400 -392883 -398066 -121221 460266
18758D60266P49215P54571M66136j31093o53199p19684l04821J34742L33683N44962
$$ 460266 1209481 1964052 2430188 2299095 1645896 926212 621391 756133 1089816 1634778
18748A634778P27273N78022J07954l85457p53253r08189p37607m58155j23894
$$ 1634778 2362051 2940073 3048027 2662570 1909317 1001128 263521 -194634 -318528
18739c18528K61052M07735K35005J02255J19333J10507J74699M29877N47047J38569
$$ -318528 -57476 350259 585264 687519 806852 917359 1092058 1521935 2068982 2207551
18729B207551n89341j041844r46082m11359K50236M82524K31099r9829j75922
$$ 2207551 1618210 576366 -369716 -781075 -530839 -48315 182784 82955 -92967
18720i2967p7823L5951k05133n96940l38406K21384L51093J98687J18114J54024
$$ -92967 -170790 -134839 -339972 -936912 -1275318 -1053934 -702841 -504154 -386040 -232016
18710b32016J21786p1679j91841q1184K53794P09799R48737P92483K51769k80793
$$ -232016 -110230 -181909 -373750 -454934 -201140 508659 1457396 2249879 2501648 2220855
18700B220855m80002n69983o37489o88486n89385k91364M6360K25368K58843L38024
$$ 2220855 1740853 1170870 533381 -155105 -744490 -1035854 -989494 -764126 -505283 -167259
18690a67259K79288J48426J04476R5840Q7833p595j03552r4162p9266j07867q4242
$$ -167259 112029 260455 364931 460771 548604 541009 437457 343295 264029 156162 71920
18679G1920N2158J40422n1779m29562o41487o38856n52257k47986K89394M85106
$$ 71920 124078 264500 212721 -216841 -858328 -1497184 -2049441 -2297427 -2008033 -1522927
18669a522927j7655n62041o52387k96332L50907P31059N05941j3205l20783j67110
$$ -1522927 -1540582 -2102623 -2755010 -3051342 -2700435 -1969376 -1463435 -1476640 -1797423 -1964533
18659a964533m9705k68566m61265l71269j39174n7200p5770J18220K76852J33646
$$ -1964533 -2014238 -2282804 -2744069 -3115338 -3254512 -3311712 -3387482 -3269262 -2992410 -2858764
18649b858764J31172M37701O63437N20305J58536j09365j78343j60315k0118M36662
$$ -2858764 -2727592 -2289891 -1626454 -1106149 -947613 -1056978 -1235321 -1395636 -1415754 -979092
18639i79092Q49655O36284P7477j02482k1671K7954K78839O97489P79175M76262
$$ -979092 -129437 506847 584324 481842 460171 488125 766964 1464453 2243628 2719890
18629B719890J06917k42166m65638n11019n35425n72649n11444k38960k28042
$$ 2719890 2826807 2584641 2119003 1607984 1072559 499910 -11534 -250494 -478536
18620d78536m04664j95486K23276M75523O41427P67338M61691n9389j69674j03341
$$ -478536 -883200 -1078686 -855410 -379887 261540 1028878 1490569 1431180 1261506 1158165
18610A158165k17390k84977j12322P2346K22047L42139J95517k33273m43834m11944
$$ 1158165 940775 655798 543476 615822 837869 1180008 1375525 1142252 698418 286474
18600B86474o00168j021541j151464o47290J9000N34813Q21373O43971K89896
$$ 286474 -313694 -1335235 -2486699 -3133989 -3114989 -2580176 -1758803 -1114832 -824936
18591h24936J34281J32752k4770m01588o01918k29349L77546N86049O58025P37982
$$ -824936 -690655 -557903 -582673 -984261 -1586179 -1815528 -1437982 -851933 -193908 544074
18581E44074M67883j8734l86382n75044n34007l00556K25587O91095P99583N03894
$$ 544074 1011957 993223 606841 31797 -502210 -802766 -577179 113916 913499 1417393
18571A417393J7554j61438j36858q3114j5030r7079j44529Q0257L51597K97230
$$ 1417393 1434947 1273509 1136651 1053537 1038507 941428 796899 877156 1228753 1525983
18561A525983k5607l32709k82521l7293m0108n09748r75348q41521l54104J7473
$$ 1525983 1500376 1167667 885146 847853 807745 297997 -677351 -1518872 -1872976 -1855503
18551a855503K85473L24292P441l54452n56437n48859k79292n5496l3874m3341
$$ -1855503 -1570030 -1245738 -1238297 -1592749 -2149186 -2698045 -2977337 -3032833 -3066707 -3110048
18541c110048k09052k79101J71974P72966R79711O84404K40057j10702m18132
$$ -3110048 -3319100 -3598201 -3426227 -2653261 -1673550 -989146 -749089 -859791 -1277923
18532a277923o82165o80934m01966k08007k50590l11888l24758k95122j61321
$$ -1277923 -1960088 -2641022 -3042988 -3250995 -3501585 -3813473 -4138231 -4433353 -4594674
18523d594674j04574J1198L08387O42448R69502J126329P63903p0959p85398r18142
$$ -4594674 -4699248 -4688050 -4379663 -3737215 -2767713 -1641384 -877481 -948440 -1733838 -2651980
18513b651980o70037o9845P56895J096013O98861J35541q2699J0889O3266j31051
$$ -2651980 -3322017 -3391862 -2634967 -1538954 -840093 -704552 -787251 -776362 -713096 -844147
18503h44147l36521j91896J27842J29733j14642r2120n5121j45088j55209N6454
$$ -844147 -1180668 -1372564 -1244722 -1114989 -1229631 -1321751 -1376872 -1521960 -1677169 -1620715
18493a620715N23037O86891M92110K92152L1139k94918m06300j78552J89072M81727
$$ -1620715 -1097678 -410787 81323 373475 404614 109696 -296604 -475156 -286084 195643
18483A95643O35149L53750j47862j77815L00973O07443L55406k5158j56908p6687
$$ 195643 830792 1184542 1036680 858865 1159838 1767281 2122687 2097529 1940621 1863934
18473A863934M2702P7091j5682k72515n91098q71183j053403q87062l77950K24128
$$ 1863934 1906636 1983727 1968045 1695530 1104432 233249 -820154 -1707216 -2085166 -1861038
18463a861038N80336N43873M35321K20981m2054m1153K35292K48523r8754l81438
$$ -1861038 -1280702 -736829 -301508 -80527 -122581 -163734 71558 320081 221327 -160111
18453a60111m40550k44543M2445J79220J43929P9198J01225O8048j3146l394K04112
$$ -160111 -600661 -845204 -802759 -623539 -479610 -400412 -299187 -231139 -244285 -247679 -43567
18442d3567N05707N20125K50058p6684l35108k38122J56678M05947L61634Q1709
$$ -43567 462140 982265 1232323 1155639 820531 582409 739087 1145034 1506668 1588377
18432A588377j67357j50188K7953J28251j6123l70738o12187n16817j05239L28438
$$ 1588377 1421020 1270832 1298785 1427036 1410913 1040175 427988 -88829 -194068 134370
18422A34370M35119K96175J4236k89851j99210N9026j68669n28144n12626l18148
$$ 134370 569489 865664 879900 590049 390839 449865 281196 -246948 -759574 -1077722
18412a077722j78910q1192J31388N01528O60718N64459M29002J24585n8913L5473
$$ -1077722 -1256632 -1337824 -1206436 -704908 -44190 520269 949271 1073856 1014943 1050416
18402A050416n5658l48565j82060L30433M73115O7925m23528m77798q2544M14230
$$ 1050416 994758 646193 464133 794566 1267681 1335606 912078 434280 351736 765966
18392G65966N52676J79378m16694q58543r19517p00746m22579j46069N66J42306
$$ 765966 1318642 1498020 1081326 222783 -696734 -1397480 -1820059 -1966128 -1965562 -1823256
18382a823256M12805K83594k97552p48791o39075j38883K89651L35236J52923
$$ -1823256 -1410451 -1126857 -1424409 -2173200 -2812275 -2951158 -2661507 -2326271 -2173348
18373b173348R0965J01579J63575K52785J22079j74710l35076k86861j78219k42939
$$ -2173348 -2082383 -1980804 -1817229 -1564444 -1442365 -1617075 -1952151 -2239012 -2417231 -2660170
18363b660170l16732k15836m3761N9157M7072j9852K7854K33687M71636N15249
$$ -2660170 -2976902 -3192738 -3236499 -3177342 -3130270 -3150122 -3122268 -2888581 -2416945 -1901696
18353a901696M29001M39055O21625Q54172Q25090M18851o0874k17651j51020J8832
$$ -1901696 -1472695 -1033640 -412015 442157 1267247 1686098 1625224 1407573 1256553 1275385
18343A275385K1530j03293k24550n57867q39735q34124n85146j07917L74335O79216
$$ 1275385 1296915 1193622 969072 411205 -428530 -1262654 -1847800 -1955717 -1581382 -902166
18333i02166R60118J044730P45956K37902k68426n95329o71789n84739l56547
$$ -902166 57952 1102682 1848638 2086540 1818114 1222785 550996 -33743 -390290
18324c90290n5292R3107o4242k77993j32395K44584L95603K83976K98739M27513
$$ -390290 -445582 -352475 -416717 -694710 -827105 -582521 -186918 97058 395797 823310
18314H23310N64789N92850K94109j72036o26797r02077p93239l24907J37155L66102
$$ 823310 1388099 1980949 2275058 2103022 1476225 574148 -219091 -543998 -406843 -40741
18304d0741N07130M41361l0455n28551o18712m39357k42744K2483K47938M47141
$$ -40741 466389 907750 877295 348744 -269968 -709325 -952069 -929586 -681648 -234507
18294b34507N72908O87663Q03664N97912L44o10901r70085j179552j030188m99054
$$ -234507 338401 1026064 1829728 2427640 2427984 1817083 846998 -332554 -1362742 -1861796
18284a861796P2582N23435Q70544R10463O26450K84966P073J6734J77643K79371
$$ -1861796 -1789214 -1265779 -395235 515228 1141678 1426644 1433717 1450451 1628094 1907465
18274A907465L68539L26163K796l81084m61592m16655n11712n49793k83672N0890
$$ 1907465 2276004 2602167 2604963 2223879 1762287 1345632 833920 284127 455 51345
18264E1345L8406k35697l57071k42540j61557k81820n17255p21886o02150j56079
$$ 51345 89751 -145946 -503017 -745557 -907114 -1188934 -1706189 -2428075 -3030225 -3186304
18254c186304J61034K52111L62871N14370N88010M19111J22393q679n4016k33732
$$ -3186304 -3025270 -2773159 -2410288 -1895918 -1307908 -888797 -766404 -775083 -829099 -1062831
18244a062831o33949j033107r83036l48069O15647J360019J573951J267323P04882
$$ -1062831 -1696780 -2729887 -3712923 -4060992 -3445345 -2085326 -511375 755948 1460830
18235A460830K3550o95714j042039p58443j77773K64940M75468P30711R33455
$$ 1460830 1484380 788666 -253373 -1011816 -1189589 -924649 -449181 281530 1214985
18226A214985Q35133M49527j69483q02048j108413q52506j18793L50868J68915
$$ 1214985 2050118 2499645 2330162 1528114 419701 -432805 -551598 -200730 -31815
18217c1815j30375q6415O8828j86243m07126k46097j11592l2138K27983J31242
$$ -31815 -162190 -248605 -179777 -366020 -773146 -1019243 -1130835 -1162973 -934990 -803748
18207h03748l82685p67243q47593l66573N32902J179038J166242P87383M50801
$$ -803748 -1186433 -1953676 -2801269 -3167842 -2634940 -1455902 -289660 497723 948524
18198I48524K98834J57677j57068m68585l79520L2795M96198P27347M95964M7762
$$ 948524 1247358 1405035 1247967 779382 399862 432657 928855 1656202 2152166 2199928
18188B199928k25441k30056k67144m09685l99596j64022m1332q6505j56231k96046
$$ 2199928 1974487 1744431 1477287 1067602 668006 503984 462652 376147 219916 -76130
18178g6130n26602o01885m75951j90945K30191L51988L9685p4540L67550O68476
$$ -76130 -602732 -1204617 -1680568 -1871513 -1641322 -1289334 -1249649 -1324189 -956639 -288163
18168b88163N16165K14814j64697n83690q46803o92341k49121Q3043K90457M14763
$$ -288163 228002 442816 278119 -305571 -1152374 -1844715 -2093836 -2010793 -1720336 -1305573
18158a305573M07157K29791L1642O0245L21636O31914O99784L29558j18123m17758
$$ -1305573 -898416 -668625 -636983 -576738 -255102 376812 1076596 1406154 1288031 870273
18148H70273o58877o22884k33540K69526N12760O70010P93195O20724L35837J60632
$$ 870273 211396 -411488 -645028 -375502 137258 807268 1600463 2221187 2557024 2717656
18138B717656Q4750J19394K20775k0598n38888p14760l75510M5056J29268j31766
$$ 2717656 2802406 2921800 3142575 3121977 2583089 1868329 1492819 1537875 1667143 1535377
18128A535377l66251n18470o41018m52312k76L70910M73253J89343j1919K15540
$$ 1535377 1169126 650656 9638 -442674 -442950 -72040 401213 590556 578637 794177
18118G94177M11783K67094m1332j39024N3839K76526L41486L56538N23570N98798
$$ 794177 1205960 1473054 1431722 1292698 1346537 1623063 1964549 2321087 2844657 3443455
18108C443455M03262J08002m5084j87652l14229k46666j85749l08739l91907l23918
$$ 3443455 3846717 3954719 3909635 3721983 3407754 3161088 2975339 2666600 2274693 1950775
18098A950775l47977m46030m26541k28962M2381J67244R4802l8273j62204l85948
$$ 1950775 1602798 1156768 730227 501265 543646 710890 805692 767419 605215 219267
18088B19267o74545p25904o15299k00477M98977J037902J072784O87262K86585
$$ 219267 -455278 -1181182 -1796481 -1996958 -1497981 -460079 612705 1299967 1586552
18079A586552J53143J44952K75299M51193K27600k72544p39365r29600p77918
$$ 1586552 1739695 1884647 2159946 2611139 2838739 2566195 1826830 897230 119312
18070A19312m60184k32436j40673m4744j80754k91272L5457M11876L26461j00122
$$ 119312 -340872 -573308 -713981 -758725 -939479 -1230751 -1195294 -783418 -456957 -557079
18060e57079n31756p52395n27992J74624R34116J212391R94798M41683o5167o4903
$$ -557079 -1088835 -1841230 -2369222 -2194598 -1260482 -48091 946707 1388390 1323223 1258320
18050A258320L15992N07428K53379l75337o71746j51429M73007P51325N71911
$$ 1258320 1574312 2081740 2335119 1959782 1288036 1136607 1609614 2360939 2932850
18041B932850M8275l79721o17777p04557m96035p0142L03391M36114K70273K8360
$$ 2932850 2981125 2601404 1983627 1279070 783035 712893 1016284 1452398 1722671 1751031
18031A751031j10330k10710k62983M0533N58689P30287N78388L98248J73509P491
$$ 1751031 1640701 1429991 1167008 1207541 1766230 2496517 3074905 3473153 3646662 3654153
18021C654153o7769l33260p54823r55753r69433q32042m60894k00021k44333l11077
$$ 3654153 3586384 3253124 2498301 1542548 573115 -258927 -719821 -919842 -1164175 -1475252
18011a475252j41790J49945K94005M27148N36901M85301M65126L28729j6608l95572
$$ -1475252 -1617042 -1467097 -1173092 -745944 -209043 276258 741384 1070113 1053505 657933
18001F57933p00659m89999Q9747N20070P71487Q67398P64261M19035M6969l76089
$$ 657933 -42726 -532725 -442978 77092 848579 1715977 2480238 2899273 2946242 2570153
17991B570153q96600r85017o02788k09271j23250k99343n20098n22035k94753
$$ 2570153 1673553 688536 85748 -123523 -246773 -546116 -1066214 -1588249 -1883002
17982a883002m5592J56965O6916k68829m06951r0680L18332M08135L10120K42175
$$ -1883002 -1928594 -1771629 -1704713 -1973542 -2380493 -2471173 -2152841 -1744706 -1434586 -1192411
17972a192411L02493L99774l2092n83237l77638K57811P11171P94819N36611L41292
$$ -1192411 -889918 -490144 -522236 -1105473 -1483111 -1225300 -514129 280690 817301 1158593
17962A158593J56147k87130o00267l83894N7430L69095L66237O0062j66083k93628
$$ 1158593 1314740 1027610 427343 43449 100879 469974 836211 896273 730190 436562
17952D36562l03028Q7664O32795P14352J68187m33234n35924l35109j55209P3016
$$ 436562 133534 221198 853993 1568345 1736532 1303298 767374 432265 277056 350072
17942C50072K98573K99448Q6271k40312o69054j147246j362471j038076m17760
$$ 350072 648645 948093 1034364 794052 124998 -1022248 -2384719 -3422795 -3840555
17933c840555j01394k42801l71055j89268J23105M06726O88753P97416P69455
$$ -3840555 -3941949 -4184750 -4555805 -4745073 -4621968 -4215242 -3526489 -2729073 -1959618
17924a959618O87185N56314L85169L17764N60709Q12719N93125Q8456j69629L760
$$ -1959618 -1272433 -716119 -330950 -13186 547523 1360242 1953367 2041823 1872194 1875954
17914A875954L89748M54174r121n21528p24513o52251k13949J38207R710j71991
$$ 1875954 2265702 2719876 2710755 2189227 1464714 812463 598514 736721 746431 574440
17904E74440k48744k52528j17518J48275L40434M35565K33122k89100p49715r25915
$$ 574440 325696 73168 -44350 103925 444359 879924 1113046 823946 74231 -851684
17894h51684p89146l90488m869K66166M00515K30892O7636K65355O37897Q35325
$$ -851684 -1640830 -2031318 -2036187 -1770021 -1369506 -1138614 -1070978 -805623 -167726 667599
17884F67599O93090L48988L42399N19751L48880J63808K63755K46845j65032o70012
$$ 667599 1360689 1709677 2052076 2571827 2920707 3084515 3348270 3595115 3430083 2760071
17874B760071r93492j058221r44176o48227m53464m04033k36196J10992M17593
$$ 2760071 1766579 708358 -235818 -884045 -1337509 -1741542 -1977738 -1866746 -1449153
17865a449153K88284k10302n65267m32408J22813O17836O57223M50955L30299
$$ -1449153 -1160869 -1371171 -1936438 -2368846 -2246033 -1628197 -970974 -520019 -189720
17856a89720L05627J07003j81151l90481m07622l28864k11181q4061M6218L59959
$$ -189720 115907 222910 41759 -348722 -756344 -1085208 -1296389 -1380450 -1334232 -974273
17846i74273P51522P59169L61167q9633l79512l47136J69141O91756N52347M6033
$$ -974273 -222751 536418 897585 807952 428440 81304 250445 942201 1494548 1540581
17836A540581j99954k43296n26711q34890p75353m84398j70038J32241O1243l49935
$$ 1540581 1340627 1097331 570620 -264270 -1039623 -1524021 -1694059 -1561818 -1500575 -1850510
17826a850510o14894o37254l94674J42174N21951N41148M73838N52275N11986
$$ -1850510 -2465404 -3102658 -3497332 -3355158 -2833207 -2292059 -1818221 -1265946 -753960
17817g53960K56744j22380o04189j020355j116744o69165N001L52017J45957l84797
$$ -753960 -497216 -619596 -1223785 -2244140 -3360884 -4030049 -4025048 -3673031 -3527074 -3911871
17807c911871m97452q2538M43857P97672N89233J91279K79645P36508R18417Q06477
$$ -3911871 -4409323 -4491861 -4048004 -3250332 -2661099 -2469820 -2190175 -1453667 -535250 271227
17797B71227O17779M38554K07483j41246o43134j082639j117043q08738l19632
$$ 271227 889006 1327560 1535043 1393797 750663 -331976 -1449019 -2257757 -2577389
17788b577389K38244O13465O41840L55122j12311k95140r7067N9646J4587j84010
$$ -2577389 -2339145 -1725680 -1083840 -728718 -841029 -1136169 -1233236 -1173590 -1159003 -1343013
17778a343013k75504p5201J63732L30261L87359J69239k4039K1923J86680M71603
$$ -1343013 -1618517 -1693718 -1529986 -1199725 -812366 -643127 -667166 -645243 -458563 13040
17768A3040P82651P80523L60740k03552n44566o05135o82179q24733o07817k51588
$$ 13040 795691 1576214 1936954 1733402 1188836 583701 -98478 -923211 -1531028 -1782616
17758a782616j70066l67210n93100o51261m74612j13457L62504O62983R36086
$$ -1782616 -1952682 -2319892 -2912992 -3564253 -4038865 -4152322 -3789818 -3126835 -2190749
17749b190749J283344J258376Q36484M89494M03722K82240j80434o27600p60687
$$ -2190749 -907405 350971 1187455 1676949 2080671 2362911 2182477 1554877 794190
17740G94190p00738o24482m87193q0297L07003L37713J00877p8823Q1201M35913
$$ 794190 93452 -531030 -1018223 -1098520 -791517 -453804 -352927 -431750 -350549 85364
17730H5364L15650l74302r08194p68001r2473M76479N77626M97615M34305K46960
$$ 85364 401014 26712 -881482 -1649483 -1741956 -1265477 -687851 -190236 244069 491029
17720D91029m6394Q243M28624O94491M20631k63369q51902j053422q37197m13591
$$ 491029 444635 452878 881502 1575993 1996624 1733255 881353 -172069 -1009266 -1422857
17710a422857j81837k80014o15874o91640k41562K64511M75421M86874M20911
$$ -1422857 -1604694 -1884708 -2500582 -3192222 -3433784 -3169273 -2693852 -2206978 -1786067
17701a786067L43430Q4891k19942j37912J57499J94626j19109l49239k99984l970
$$ -1786067 -1442637 -1357746 -1577688 -1715600 -1558101 -1363475 -1482584 -1831823 -2131807 -2135777
17691b135777M64069Q80720J089652J190457R22368K81544j35087j46536j48219
$$ -2135777 -1671708 -790988 298664 1489121 2411489 2693033 2557946 2411410 2263191
17682B263191l25364l65004P5096M86290K86145j78502m71934m41140n2378L87846
$$ 2263191 1937827 1572823 1647919 2134209 2420354 2241852 1769918 1328778 1276400 1664246
17672A664246N69183L80701N6852k63387o48051p46952n82725m92731l88421j43057
$$ 1664246 2233429 2614130 2670982 2407595 1759544 1012592 429867 -62864 -451285 -594342
17662e94342L35406O06792J11475m43442l63315j00695k21113l72414l59496k61768
$$ -594342 -258936 347856 459331 15889 -347426 -448121 -669234 -1041648 -1401144 -1662912
17652a662912M5548J85894O9199p0612l03184k32140K54137O05800N39530K78453
$$ -1662912 -1617364 -1431470 -1362271 -1432883 -1736067 -1968207 -1714070 -1108270 -568740 -290287
17642b90287K08151M31578N08016K10137j71704k88350j81654j94991l21555m05439
$$ -290287 -82136 349442 857458 1067595 895891 607541 425887 230896 -90659 -496098
17632d96098j84464K69769L92374J22812k56506n12574m64334l21410k16374j9107
$$ -496098 -680562 -410793 -18419 104393 -152113 -664687 -1129021 -1450431 -1666805 -1685912
17622a685912L80979P91187Q94420O37835O8820l35636r9901L73141L97090l1558
$$ -1685912 -1304933 -513746 380674 1018509 1087329 751693 651792 1024933 1422023 1390465
17612A390465m83238o52482m14158l3023M6792m7223p7248k18513m39650m70616
$$ 1390465 907227 254745 -159413 -192436 -145644 -192867 -270115 -488628 -928278 -1398894
17602a398894l03920j2834J91015O7436j22278n0198J07671J58372J72251K25204
$$ -1398894 -1702814 -1715648 -1524633 -1457197 -1579475 -1629673 -1522002 -1363630 -1191379 -966175
17592i66175L45136K47265k76957p03774n08765p4895P7152K2830q0245j82299
$$ -966175 -621039 -373774 -650731 -1354505 -1863270 -1938165 -1861013 -1838183 -1918428 -2100727
17582b100727o9519L31440O49086N04189Q4600k28050k12562J59538M92971M13215
$$ -2100727 -2170246 -1838806 -1189720 -685531 -600931 -828981 -1041543 -882005 -389034 24181
17572B4181R9330k03622m12122l21309M643J96720J17303q7051k61881l23183
$$ 24181 123511 -80111 -492233 -813542 -808899 -612179 -494876 -581927 -843808 -1166991
17562a166991j93645M3330J79531L58646P70875J023027Q06273K71186j67744
$$ -1166991 -1360636 -1317306 -1137775 -779129 -8254 1014773 1821046 2092232 1924488
17553A924488l81503n64321o51233n84673m04656k23255m3933J73184N03138O56041
$$ 1924488 1542985 978664 327431 -257242 -661898 -885153 -929086 -755902 -252764 403277
17543D03277M84283K58045R9868j90625m88354l51928J04336K37909q9714m74229
$$ 403277 887560 1145605 1245473 1054848 566494 214566 318902 556811 467097 -7132
17533g132m80112m9906J26218J06900L35221P08571J027039J057769O28717Q0784
$$ -7132 -487244 -537150 -410932 -304032 31189 739760 1766799 2824568 3453285 3534069
17523C534069k75563n35051o31071n26708m10514m48094m93391l51748p8525K77056
$$ 3534069 3258506 2723455 2092384 1565676 1155162 707068 213677 -138071 -216596 60460
17513F0460L14619j30351l21562j11889k9497j96384m14743n05888n34321p58135
$$ 60460 375079 244728 -76834 -188723 -218220 -414604 -829347 -1335235 -1869556 -2627691
17503b627691r22158n67260K6631M65238Q74327J300892J380175R49281L87767
$$ -2627691 -3549849 -4117109 -4090478 -3625240 -2750913 -1450021 -69846 879435 1267202
17494A267202j29297n15114o49674l73535L45770Q34335Q13540N41789L13042
$$ 1267202 1137905 622791 -26883 -400418 -54648 779687 1593227 2135016 2448058
17485B448058K99616K33934o2922m38656n55389n37460o73371o60523l15721K9605
$$ 2448058 2747674 2981608 2918686 2480030 1924641 1387181 713810 53287 -262434 -232829
17475b32829K95889M19692L50369J81869k2347l63777p08902p66665n54724k65124
$$ -232829 63060 482752 833121 1014990 992643 628866 -80036 -846701 -1401425 -1666549
17465a666549q25J63815K58061K80723K41018J30122M729j8133r8313l03966l87456
$$ -1666549 -1667374 -1503559 -1245498 -964775 -723757 -593635 -588906 -607039 -705352 -1009318 -1396774
17454a396774l18807j60026n4228l6444J6263j13083l48225l36201p0729J93881
$$ -1396774 -1715581 -1875607 -1929835 -1966279 -1950016 -2063099 -2411324 -2747525 -2818254 -2624373
17444b624373M23410P22348R12715Q39972P36997N44384L38303M13134M20077
$$ -2624373 -2200963 -1478615 -565900 274072 1011069 1555453 1893756 2306890 2726967
17435B726967m8080n84094p07116n91296o09505p40854p06624n84930m19603j47284
$$ 2726967 2678887 2094793 1387677 796381 186876 -553978 -1260602 -1845532 -2265135 -2412419
17425b412419J19784L79773M17615O1757k27566j14310K82848P96010R99121O30861
$$ -2412419 -2292635 -1912862 -1495247 -1433490 -1661056 -1775366 -1492518 -696508 302613 933474
17415I33474K07627j4773l08437m86294k42444K54554P03669Q13442N05968P4240
$$ 933474 1141101 1126328 817891 331597 89153 343707 1047376 1860818 2366786 2441026
17405B441026p1186J04651K97245K80617o2988o83251j115848j093125p93851
$$ 2441026 2369840 2474491 2771736 3052353 2989365 2306114 1190266 97141 -696710
17396f96710m42192q4218J41639J7173j56080K2976M33643N38333K06182k06380
$$ -696710 -1138902 -1223120 -1081481 -1064308 -1220388 -1197412 -763769 -225436 -19254 -225634
17386b25634m07838l18434n7497P9482r2187p1516N87111J282980J244215N20294
$$ -225634 -633472 -951906 -1009403 -929921 -1022108 -1093624 -506513 776467 2020682 2540976
17376B540976l41482r84015j249269j063424n66357J70338R71354J227516P59758
$$ 2540976 2199494 1215479 -33790 -1097214 -1663571 -1493233 -521879 705637 1465395
17367A465395J09120j28630M4015K04363J86527L3890k84986n86044o90470m78744
$$ 1465395 1574515 1445885 1489900 1694263 1880790 1914680 1629694 1043650 353180 -125564
17357a25564r9134P4442J69985J94877j26675o75240p57405m85843m14148k74072
$$ -125564 -224698 -150256 19729 214606 87931 -587309 -1344714 -1830557 -2244705 -2518777
17347b518777J09100K34030O3167N3088K74203N65591N50062R8781m84643n49738
$$ -2518777 -2409677 -2175647 -2112480 -2059392 -1785189 -1219598 -669536 -570755 -1055398 -1605136
17337a605136p9995J09950o2141j52688k12472k68393j55099q7902j68142j10683
$$ -1605136 -1685131 -1575181 -1637322 -1790010 -2002482 -2270875 -2425974 -2513876 -2682018 -2792701
17327b792701J03553M44394N90063K56171k56713l99166j57440O594j53628m94241
$$ -2792701 -2689148 -2244754 -1654691 -1398520 -1655233 -2054399 -2211839 -2205245 -2358873 -2853114
17317b853114n30320k81575n0552R9161O2829M2378J65894J68154K11221L28873
$$ -2853114 -3383434 -3665009 -3715561 -3616400 -3553571 -3511193 -3345299 -3177145 -2965924 -2637051
17307b637051K78734M0536j47160p8951K10450O33260J033330R28179M19194K69722
$$ -2637051 -2358317 -2317781 -2464941 -2543892 -2333442 -1700182 -666852 261327 680521 950243
17297I50243L80252K26843j62302l12422j55198m1294k17328n28557n81418l87987
$$ 950243 1330495 1557338 1395036 1082614 927416 886122 668794 140237 -441181 -829168
17287h29168k07743j50809k24328j56360l6487K36695P64564R32484M68158k04026
$$ -829168 -1036911 -1187720 -1412048 -1568408 -1604895 -1368200 -603636 328848 797006 592980
17277E92980n43223n80643n30447l86595o5296L66904O99776P70485N23948K22223
$$ 592980 49757 -530886 -1061333 -1447928 -1513224 -1146320 -446544 323941 847889 1070112
17267A070112J06363M9402m6337p6747N3532K07126L17484K96493J81034O6110
$$ 1070112 1176475 1225877 1179540 1102793 1156325 1363451 1680935 1977428 2158462 2224572
17257B224572l0679Q1683J0398m38499n71310k39796O7125L26304L60687L9003
$$ 2224572 2193893 2275576 2285974 1847475 1276165 1036369 1103494 1429798 1790485 1829488
17247A829488l52939m64796j41137M51729Q58810R16203P88001N45479J81508
$$ 1829488 1476549 1011753 870616 1322345 2181155 3097358 3885359 4430838 4612346
17238D612346l15230p33730r55148r69796p18323m06132k65707j67194K1480l4474
$$ 4612346 4297116 3563386 2608238 1638442 920119 513987 248280 81086 102566 68092
17228F8092l18908k56995M42291J113864J064825M58330j33792m27789o25438
$$ 68092 -250816 -507811 -65520 1048344 2113169 2571499 2437707 2009918 1384480
17219A384480p98622o64600l22136l20546m42777l33095q0559K15756L81642K03723
$$ 1384480 585858 -78742 -400878 -721424 -1164201 -1497296 -1577855 -1362099 -980457 -776734
17209g76734j31605j39893M771j21694k26624R8359L67951K59810K92766Q06915
$$ -776734 -908339 -1048232 -1043461 -1165155 -1391779 -1293420 -925469 -665659 -372893 434022
17199D34022J350798J285863O22923j83974n66924m95316m20156l87224k94370
$$ 434022 1784820 3070683 3693606 3509632 2942708 2447392 2027236 1640012 1345642
17190A345642n560J73206r233l28026l37144j46406j35905k63502m10802l41874
$$ 1345642 1340082 1513288 1504055 1176029 838885 692479 556574 293072 -117730 -459604
17180d59604j26368J6329J39703J39807j51771m41914j88119K74617N26433P68065
$$ -459604 -585972 -569643 -429940 -290133 -441904 -883818 -1071937 -797320 -270887 497178
17170D97178R95134J023599N79540l9549m32524p01686r07845p79679l00232J27832
$$ 497178 1492312 2515911 3095451 3055902 2623378 1921692 1013847 234168 -66064 61768
17160F1768L35586K49068J15066J57406J35404j5508k06058n11299p98545n68722
$$ 61768 397354 646422 761488 918894 1054298 1038790 832732 321433 -477112 -1045834
17150a045834o023K98250L56189N45366O36758L55560q7707k98790k77569m45188
$$ -1045834 -1051857 -753607 -397418 147948 784706 1140266 1052559 753769 476200 31012
$$ [...]
##END NTUPLES=NMR SPECTRUM
##END=
