##TITLE=C13_DE-30_DMSO_TFA
 DMSO-d6, 24400sc

 29.7.2024
##JCAMPDX= 6.0         $$ Bruker NMR JCAMP-DX V2.0
##DATA TYPE= NMR SPECTRUM
##DATA CLASS= NTUPLES
##ORIGIN= UXNMR, Bruker Analytische Messtechnik GmbH
##OWNER= root
$$ XWIN-NMR		Version 3.5
$$ Tue Jul 30 15:37:52 2024 Russian Standard Time (UT+4h)  she@DPX200
##.OBSERVE FREQUENCY= 50.327896
##.OBSERVE NUCLEUS= ^13C
##.ACQUISITION MODE= SIMULTANEOUS
##.ACQUISITION SCHEME= undefined
##.AVERAGES= 24401
##.DIGITISER RES= 17
##SPECTROMETER/DATA SYSTEM= spect
##.PULSE SEQUENCE= zgpg30
##.SOLVENT NAME= CDCl3
##.SHIFT REFERENCE= (INTERNAL, CDCl3, 0, 222.565)
##AUDIT TRAIL= $$ (NUMBER, WHEN, WHO, WHERE, WHAT)
$$ ##TITLE= Audit trail, XWIN-NMR		Version 3.5
$$ ##JCAMPDX= 5.01
$$ ##ORIGIN= Bruker BioSpin GmbH
$$ ##OWNER= she
$$ F:/spectra/data/she/nmr/c13/1/pdata/1/auditp.txt
$$ ##AUDIT TRAIL=  $$ (NUMBER, WHEN, WHO, WHERE, WHAT)
(   1,<2024-07-30 15:36:32.70 +0400>,<she>,<DPX200>,
      <created by zg, POWCHK disabled, PULCHK disabled
       terminated by command 'halt'
       configuration hash MD5:
       00 E9 B6 7A A2 85 ED C7 34 08 36 98 17 FE 4E 26
       data hash MD5: 32K
       26 65 C5 87 2F 0C 8D DE A6 DE 4E D8 41 C0 6C 5A>)
(   2,<2024-07-30 15:36:37.62 +0400>,<she>,<DPX200>,
      <Start of raw data processing
       efp BC_mod = 2 LB = 2 FT_mod = 6 PKNL = 1 PHC0 = -536.2982 PHC1 = 26.78855 SI = 32K 
       data hash MD5: 32K
       D9 F0 C1 E1 21 AC 27 A0 7D F7 15 BA A6 44 49 9C>)
(   3,<2024-07-30 15:36:40.71 +0400>,<she>,<DPX200>,
      <abs ABSG = 5 
       data hash MD5: 32K
       E8 33 13 13 DF 5D A9 6D 4E A0 89 46 24 90 5E C9>)
(   4,<2024-07-30 15:37:09.26 +0400>,<she>,<DPX200>,
      <pk PHC0 = 0.8224092 PHC1 = -0.9999964 
       data hash MD5: 32K
       35 A9 84 43 AE A6 C3 D7 AE E6 4E 28 E4 35 8D 3E>)
(   5,<2024-07-30 15:37:12.75 +0400>,<she>,<DPX200>,
      <abs ABSG = 5 
       data hash MD5: 32K
       6C BD BD E5 4E 1C D5 80 63 29 0E 25 15 96 A6 98>)
$$ ##END=
$$ 
$$ hash MD5
$$ C2 1A 52 D2 1F 5F E6 AF 7B FE BF A6 78 61 3B 0B
##$RELAX= 
##$RELAX= 
##$RELAX= 
##$RELAX= 
##$RELAX= 
##$RELAX= 
##$RELAX= 
##$RELAX= 
$$ Bruker specific parameters
$$ --------------------------
##$DU= <F:/spectra>
##$EXPNO= 1
##$NAME= <c13>
##$PROCNO= 1
##$TYPE= <nmr>
##$USER= <she>
##$AMP= (0..31)
100 100 100 100 100 100 100 100 100 100 100 100 100 100 100 100 100 100 
100 100 100 100 100 100 100 100 100 100 100 100 100 100 
##$AQSEQ= 0
##$AQ_mod= 1
##$AUNM= <au_zg>
##$AUTOPOS= <>
##$BF1= 50.322709
##$BF2= 200.13
##$BF3= 50.322709
##$BF4= 500.13
##$BF5= 500.13
##$BF6= 500.13
##$BF7= 500.13
##$BF8= 500.13
##$BYTORDA= 1
##$CFDGTYP= 0
##$CFRGTYP= 5
##$CHEMSTR= <none>
##$CNST= (0..31)
1 1 145 1 1 1 1 1 1 1 1 1 1 1 1 1 1 1 1 1 1 1 1 1 1 1 1 1 1 1 1 1 
##$CPDPRG= <waltz16>
##$CPDPRG1= <>
##$CPDPRG2= <waltz16>
##$CPDPRG3= <>
##$CPDPRG4= <mlev>
##$CPDPRG5= <mlev>
##$CPDPRG6= <mlev>
##$CPDPRG7= <mlev>
##$CPDPRG8= <mlev>
##$CPDPRGB= <>
##$CPDPRGT= <>
##$D= (0..31)
$$ [...]
##$SUBNAM4= <"">
##$SUBNAM5= <"">
##$SUBNAM6= <"">
##$SUBNAM7= <"">
##$SUBNAM8= <"">
##$SUBNAM9= <"">
##$SW= 239.972175391363
##$SWIBOX= (0..15)
0 1 3 0 0 0 0 0 0 0 0 0 0 0 0 0 
##$SW_h= 12077.2946859903
##$TD= 32768
##$TD0= 1
##$TE= 0
##$TE2= 300
##$TE3= 300
##$TEG= 300
##$TL= (0..7)
120 120 120 120 120 120 120 120 
##$TP= (0..7)
150 150 150 150 150 150 150 150 
##$TP07= 0
##$TPNAME0= <>
##$TPNAME1= <>
##$TPNAME2= <>
##$TPNAME3= <>
##$TPNAME4= <>
##$TPNAME5= <>
##$TPNAME6= <>
##$TPNAME7= <>
##$TPOAL= (0..7)
0.5 0.5 0.5 0.5 0.5 0.5 0.5 0.5 
##$TPOFFS= (0..7)
0 0 0 0 0 0 0 0 
##$TUNHIN= 0
##$TUNHOUT= 0
##$TUNXOUT= 0
##$USERA1= <user>
##$USERA2= <user>
##$USERA3= <user>
##$USERA4= <user>
##$USERA5= <user>
##$V9= 5
##$VALIST= <valist>
##$VCLIST= <CCCCCCCCCCCCCCC>
##$VD= 0
##$VDLIST= <DDDDDDDDDDDDDDD>
##$VPLIST= <PPPPPPPPPPPPPPP>
##$VTLIST= <TTTTTTTTTTTTTTT>
##$WBST= 1024
##$WBSW= 4
##$XGAIN= (0..3)
0 0 0 0 
##$XL= 0
##$YL= 0
##$YMAX_a= 72546853
##$YMIN_a= -169836081
##$ZGOPTNS= <>
##$ZL1= 120
##$ZL2= 120
##$ZL3= 120
##$ZL4= 120
##$ABSF1= 222.5654
##$ABSF2= -17.4314
##$ABSG= 5
##$ABSL= 3
##$ALPHA= 0
##$AQORDER= 0
##$ASSFAC= 0
##$ASSFACI= 0
##$ASSFACX= 0
##$ASSWID= 0
##$AUNMP= <proc_1d>
##$AZFE= 0.1
##$AZFW= 0.5
##$BCFW= 0
##$BC_mod= 2
##$BYTORDP= 0
##$COROFFS= 0
##$CY= -3
##$DATMOD= 1
##$DC= 0
##$DFILT= <>
##$DTYPP= 0
##$F1P= 0
##$F2P= 0
##$FCOR= 0.5
##$FTSIZE= 32768
##$FT_mod= 6
##$GAMMA= 0
##$GB= 0
##$INTBC= 1
##$INTSCL= 4.134877e-10
##$ISEN= 128
##$LB= 2
##$LEV0= 0
##$LPBIN= 0
##$MAXI= 10000
##$MC2= 0
##$MEAN= 0
##$ME_mod= 0
##$MI= 0.1934396
##$NCOEF= 0
##$NC_proc= 3
##$NLEV= 6
##$NOISF1= 120.0001
##$NOISF2= 80.00006
##$NSP= 0
##$NTH_PI= 0
##$NZP= 0
##$OFFSET= 222.5654
##$PC= 1.4
##$PHC0= -535.4758
##$PHC1= 25.78855
##$PH_mod= 1
##$PKNL= yes
##$PPARMOD= 0
##$PSCAL= 0
##$PSIGN= 0
##$REVERSE= no
##$SF= 50.3227345484362
##$SI= 32768
##$SIGF1= 140
##$SIGF2= 120
##$SINO= 11.81781
##$SIOLD= 32768
##$SREGLST= <13C.CDCl3>
##$SSB= 0
##$STSI= 32768
##$STSR= 0
##$SW_p= 12077.2946859903
##$SYMM= 0
##$S_DEV= 0
##$TDeff= 32768
##$TDoff= 0
##$TI= <>
##$TILT= no
##$TM1= 0
##$TM2= 0
##$TOPLEV= 0
##$USERP1= <user>
##$USERP2= <user>
##$USERP3= <user>
##$USERP4= <user>
##$USERP5= <user>
##$WDW= 1
##$XDIM= 32768
##$YMAX_p= 303590501
##$YMIN_p= -985276
$$ End of Bruker specific parameters
$$ ---------------------------------
##NTUPLES= NMR SPECTRUM
##VAR_NAME=  FREQUENCY,     SPECTRUM/REAL,   SPECTRUM/IMAG
##SYMBOL=    X,             R,               I
##VAR_TYPE=  INDEPENDENT,   DEPENDENT,       DEPENDENT
##VAR_FORM=  AFFN,          ASDF,            ASDF
##VAR_DIM=   32768,         32768,           32768
##UNITS=     HZ,            ARBITRARY UNITS, ARBITRARY UNITS
##FACTOR=    0.368581032318806, 1,           1
##FIRST=     11200.0995020947, 0,            0
##LAST=      -877.195183895579, 0,           0
##MIN=       -877.195183895579, -985276,     0
##MAX=       11200.0995020947, 303590501,    0
$$ Real data points
##PAGE= N=1
##DATA TABLE= (X++(R..R)), XYDATA
$$ [...]
11037C54661R8473J5864k8434l8309p4696j17912j18133r7104p3491l3155r563
11026a21799j9263l2179l7783l3466j6495J1932L8261M9128M5284K7790J1201
11015g7389Q63m921r574Q407N9404P7656L7284k10R955L0505J2759l3685m1248
11002F9806p590K392J367K5635P9229J13657R2342J5718o9273j11731r6771m3485
10990G1296j792J0827O596Q64L425L049j5J484P716M769m091K0081N3485O2269
10976B39963L6292l8680j39025j75060r4994K5850J01534J05293M7494k9310n7851
10965B1506J2313J08493J04375l381j20736j57446q6221J8657O0881M5228L966
10954G635m8547o7654m3795k981J6171J0710L091K309J6399K9352L9064L9719
$$ y = [354661, 453134, 468998, 440564, 402255, 327559, 209647, 91514, -5590, -79081, -112236, -121799, -141062, -173241, -211024, -244490, -260985, -249053, -210792, -161664, -116380, -88590, -77389, -76526, -81447, -91021, -82614, -23210, 54446, 91730, 91520, 101475, 131980, 144739, 111054, 69806, 62216, 64608, 65975, 91610, 170839, 284496, 376838, 392556, 323283, 211552, 114781, 71296, 69504, 80331, 86927, 87791, 91216, 94265, 94250, 95734, 103450, 108219, 104128, 124209, 177694, 239963, 276255, 237575, 98550, -76510, -171504, -145654, -44120, 61173, 108667, 79357, 21506, 33819, 142312, 246687, 243306, 122570, -34876, -121097, -102440, -41559, 3669, 7635, -40912, -108566, -152361, -155342, -139171, -128461, -125370, -123061, -106662, -77310, -38246, 1473]
10942A473p441m0620k7108q298K3564O2391O6510M1737J5841M607K2837P5158
10930B30651J15224J01661M2244j5347j4132J9647M1349L8002j774m0433n1972
10919D65120o7348p7912q3681j12272j29951j03485o5072m2430k7982j6125j6935
10908b78073k7789k5998J0875L8136K1576k7050p7515r8869j09506r8313j2257
10897f84783Q6269J13580R2280O7431N5523M0358L3079M6614K5625k7335p3883
10886b25242j00903o6404K2000Q2164P6813O6185P9371N7014j525k9956k4077
10875f4560k7816m2177n4797m8588l0234J2313O1252P1257P9036R7598R2894L6717
10863A82895n1091j26786j42581j02458n3253N645O4691J02103Q8723M6435K5357
$$ y = [1473, -5968, -46588, -73696, -81994, -58430, 3961, 70471, 112208, 128049, 132656, 155493, 230651, 345875, 447536, 489780, 474433, 460301, 479948, 521297, 559299, 557525, 517092, 465120, 397772, 319860, 236179, 123907, -6044, -109529, -174601, -217031, -245013, -261138, -278073, -305862, -331860, -320985, -282849, -261273, -288323, -365838, -464707, -574213, -672526, -684783, -598514, -484934, -392654, -325223, -269700, -229342, -196263, -149649, -124024, -151359, -225242, -326145, -392549, -370549, -288385, -211572, -145387, -66016, -9002, -10527, -40483, -64560, -92376, -134553, -189350, -237938, -268172, -255859, -194607, -123350, -44314, 53284, 146178, 182895, 131804, 5018, -137563, -240021, -293274, -287629, -222938, -120835, -32112, 14323, 39680]
10852C9680M1002N7656O2246L7736k7811p8996r4651r2350q5014o2636l7864k5875
10840b66877j7693p196K109M4549O7723L6198J3384O602J7810N1615P6928P4988
10828A00140L6306k0386m4781m8182m7342j5010K1142L3145L5840L9437O3549
10817A53858Q0087N9348J5343n775l459l4817r8242j22800j03746o8446k9745
10806a58394j0017k8314m2414J7333R9439J09240O1909J4738j4880j1583P823
10795D4880O789p204j0859l4585p1226m4933L4857Q6467Q6195M9548K4541J8230
10783A82700p656n1670o8373m0218k7745n1726m1718J0336N9699R7773J12739
10772A74141Q8694L1697m5767j16197j61830j75583j18168k6650L4924M2221J5302
$$ y = [39680, 80682, 138338, 200584, 238320, 210509, 131513, 36862, -55488, -140502, -203138, -241002, -266877, -284570, -291766, -289657, -245108, -177385, -141187, -127803, -121201, -103391, -51776, 25152, 100140, 136446, 116060, 71279, 23097, -24245, -39255, -18113, 15032, 50872, 90309, 153858, 233945, 293293, 308636, 302861, 299402, 264585, 166343, 43543, -60203, -128649, -158394, -168411, -196725, -239139, -221806, -122367, -13127, 48782, 63520, 48640, 37057, 44880, 51669, 44465, 33606, -979, -72205, -117138, -82281, 4186, 90381, 139929, 164470, 182700, 175044, 123374, 55001, 14783, -12962, -64688, -106406, -96070, -36371, 61402, 174141, 262835, 294532, 248765, 132568, -29262, -204845, -323013, -349663, -314739, -272518, -257216]
10761b57216J8296O8667J24223J33470J04550N0286k938o95N0880P5712J2228
10750C77463q3983j11404q2914m1471J0871K0096k0004k6598R706K5121j6954
10739E9929q6723j17026q5415m2492l0611m4074m9037j7736J0839j0473m3109
10728d55928m1573r246K0674K8373M2156O7144J05556J45631J46504R3368L6259
10717A78918M2071O5773N3715J1589l5909m2248J5438P0375Q0053P8551P6131
10706E94457N2718L538l4017o0997p9532n5682l2478m5640n5827l4584k096O920
10694B56780j9441k5581p241k4725m8529j4644J5314j2L46K1593K1328K55k1435
10681A54008k9753r495K4478L8617Q554j8064j1607n736m696j1742k3000l0556
$$ y = [-257216, -238920, -170253, -46030, 87440, 191990, 242276, 239338, 238643, 289523, 365235, 377463, 293480, 182076, 99162, 57691, 68562, 88658, 68654, 42056, 51762, 76883, 59929, -26794, -143820, -229235, -271727, -302338, -346412, -395449, -413185, -402346, -412819, -455928, -497501, -506747, -486073, -457700, -415544, -348400, -242844, -97213, 49291, 142659, 178918, 220989, 286762, 340477, 352066, 316157, 273909, 289347, 359722, 439775, 518326, 594457, 647175, 650713, 616696, 555699, 476167, 420485, 388007, 342367, 286540, 251956, 249860, 256780, 237339, 211758, 204517, 179792, 131263, 116619, 131933, 131921, 132267, 153860, 175188, 175443, 154008, 124255, 114760, 139238, 177855, 186409, 168345, 156738, 151002, 146306, 134564, 111564, 81008]
10669H1008l7870m0898m6553o2915m1777K7899P0364P0258R0277J35219J38477
10658C83489O9474O380L312M2660R0461Q2639L6384k026m7693r2994p8485p428
10646D86173K3888p646o2296j04904j16244r9537p1417o7558q8832j03147p6679
10635b88199l3526l09J3670J4784K5184M6816N7823L9571l620k3584j3726l147
10623a68263J3424J8217j2426o0105r1403o5387Q174O9613J04068J06457O8955
10612h676K0465j2542k4616j745L6108L0841r715n8840q3921m8822L3514P0361
10600e7588K9090k0882l3643j843M0200O2889O8245O0711N0074J8960n7286j07190
10588E1737r4170o8531m1146j0185J3200M7793O6684M1484m421l1838o4638j04873
$$ y = [81008, 43138, 2240, -44313, -107228, -149005, -121106, -50742, 19516, 109793, 245012, 383489, 452963, 459343, 462655, 505315, 595776, 678415, 714799, 712773, 665080, 572086, 493601, 486173, 510061, 502415, 440119, 335215, 218971, 119434, 48017, -19541, -108373, -211520, -288199, -321725, -322034, -308364, -293580, -268396, -221580, -163757, -124186, -127806, -151390, -165116, -168263, -154839, -136622, -149048, -209153, -300556, -365943, -357769, -288156, -184088, -77631, -8676, 11789, -753, -25369, -27114, 8994, 39835, 30120, -28720, -112641, -161463, -127949, -57588, -28498, -49380, -83023, -84866, -44666, 18223, 86468, 147179, 197253, 216213, 158927, 51737, -42433, -110964, -152110, -162295, -149095, -101302, -34618, 6866, 2445, -29393, -94031, -198904]
10576a98904q6899j6257M4169Q2518R2346O0257K9415J4221N393J5906L4460K80
10564G6905o9014j07045p4850N535O6385M6386l5376p3825n1182l3059l9646n1934
10552c40720k9622K8989O8175O8282O0429M9559K4703J3741K8481M1898K4288
10541C8203r746l765J1561J4358J9970L3155L5342j6232j01526j44901j02587
10530b26168l1089J0300L0368M7456M3268J7006J5635L8649M6585J4235m2015
10519c5770p2088o6394k8903N053J3522K3462M9360M9934j3130q8421j09150o8464
10507c40989K5937J38463K11505J99642J38248R3508L7737m9253j01363p3389
10497B80046q385J7841K3250J2088j9135l5378j1728O254j9901m5110l4599r723
$$ y = [-198904, -285803, -302060, -257891, -175373, -83027, -22770, 6645, 20866, 26259, 42165, 76625, 76905, 7891, -99154, -174004, -168469, -102084, -55698, -91074, -164899, -216081, -249140, -288786, -340720, -370342, -341353, -273178, -204896, -144467, -94908, -70205, -56464, -27983, 13915, 38203, 28457, 24692, 36253, 50611, 70581, 103736, 139078, 122846, 21320, -123581, -226168, -257257, -246957, -216589, -169133, -125865, -108859, -93224, -54575, -7990, 6245, -35770, -107858, -174252, -203155, -198102, -184580, -161118, -111758, -61824, -74954, -163375, -272525, -340989, -315052, -176589, 34916, 234558, 372806, 466314, 504051, 454798, 353435, 280046, 271661, 289502, 312752, 324840, 305705, 270327, 258599, 264853, 244952, 199842, 165243, 155520]
10485A55520K300J144M964L6606O0428M0108J3042L524j5445m3824o1941k8427
10473A67999K5742N0410M6008j0645j03776j70512j68041r6741J5779J29346J74442
10462F0011J46104R6750L4166j1526k8187n5298p4095n1174L225N4959P2187M5109
10450B92231J0490Q134J7584J3973j1245n2358p8473n3441q73L4095L4338K584
10438B17039l3987k8530L127J9436j6112j13729j75602j33993l1737M3498K9362
10427b21228j8300L172P0966J03326Q6837M8481K9591L6093L5087k308m3054n7231
10415G1432n6581l6184N6M837n1599q3072o6900m2125j3171L1383P3615Q4313
10403h3996O2109L0053J0543J63M927K4456L2977L5162J0653l9450n3651m4146
$$ y = [155520, 157820, 158964, 163928, 200534, 260962, 301070, 314112, 317636, 302191, 258367, 196426, 167999, 193741, 244151, 290159, 279514, 175738, 5226, -162815, -259556, -243777, -114431, 60011, 206115, 302865, 337031, 325505, 297318, 242020, 167925, 116751, 119976, 174935, 247122, 292231, 302721, 310855, 328439, 342412, 331167, 278809, 200336, 146895, 146022, 180117, 214455, 217039, 183052, 154522, 157649, 177085, 160973, 47244, -128358, -262351, -294088, -250590, -221228, -239528, -236356, -165390, -62064, 24773, 73254, 102845, 138938, 174025, 171717, 128663, 71432, 14851, -21333, -21277, -16440, -68039, -151111, -218011, -260136, -273307, -241924, -168309, -83996, -21887, 8166, 18709, 18872, 23799, 48255, 81232, 116394, 127047, 87597, 33946, -10200]
10391a0200l7218q149M5203N1811J1477k5570l5457r710N177k1011o0404o1191
10379a55242l0237k0317l8395m6068l3900j7023P260P068j5338J3112P0133P8338
10367a80609M5420K2431J6745j683k7570l7447m5694n1683k1975M0600J20565
10356a20900J82786J42779K7963n5755q5072o8772j4420K7870L1896K3669L598
10345I5642k7756m6248n7099m9564p432L4102P4057R5456M8388j8579j8816K9186
10333A51337P0365R2053O8552M625l9460l0279j4566k1708m0791o1795o0214m9051
10321F9068l1847m0203q6832q9279j5463O9403R9969O1918n374m5254n0776m6498
10309a11168m9009l8641o752K372j8897q553L6090N0245J238m4682n8331m2520
$$ y = [-10200, -47418, -55567, -10364, 41447, 52924, 27354, -8103, -17813, -12636, -33647, -94051, -155242, -185479, -205796, -244191, -290259, -324159, -341182, -333922, -326854, -342192, -329080, -258947, -180609, -135189, -112758, -96013, -97696, -125266, -162713, -208407, -260090, -282065, -241465, -120900, 61886, 204665, 232628, 176873, 91801, 23029, 8609, 36479, 68375, 92044, 95642, 67886, 21638, -35461, -85025, -92457, -58355, 15702, 111158, 159546, 140967, 122151, 151337, 221702, 313755, 382307, 386932, 347472, 317193, 302627, 280919, 240128, 178333, 118119, 69068, 37221, -2982, -89814, -179093, -194556, -125153, -25184, 36734, 31360, -13894, -64670, -111168, -160177, -198818, -205570, -203198, -222095, -230648, -194558, -144313, -143075, -187757, -246088, -288608]
10297b88608J393M1981N2023J38o7768n7828J1018P9021J19811J07739O8173M9850
10285A16943K2041k4205n4941p3562q8702q7429o1188m249N7407P6408M5242K2186
10273e4049M5192O6472M1824p096k6590j6432k147j6275m6233o4759p5277q5087
10261b40457q6711p6454m9388k1661n393K1061N0089O3321R2465J32034J35060
10250A3966J03727N6416R698j2244n213J748n272k8353o1092o6989m2308j9283
10238e5199l970L835k3028m7324l3084l1064l5865j7684O552J1211k3913o3080
10226c12613m8893l513J3262J713P711K6141L4335O4502J02922Q9891K6622l5877
10214c3797o5738o2831m2347k4345j4L4804L7308J1697J2638N1265R9217J20251
$$ y = [-288608, -287215, -245234, -193211, -193073, -260841, -318669, -307651, -228630, -108819, -1080, 67093, 116943, 138984, 114779, 59838, -13724, -102426, -189855, -251043, -255292, -197885, -121477, -76235, -54049, -8857, 57615, 99439, 92343, 65753, 49321, 47174, 30899, -15334, -80093, -155370, -240457, -327168, -403622, -453010, -474671, -480064, -459003, -408914, -345593, -253128, -121094, 13966, 117693, 174109, 183807, 171563, 166350, 168098, 162826, 134473, 73381, 6392, -35916, -55199, -59169, -55334, -78362, -125686, -158770, -189834, -225699, -243383, -236831, -225620, -249533, -312613, -361506, -365019, -351757, -350044, -342333, -316192, -281857, -217355, -114433, -24542, 2080, -33797, -99535, -162366, -204713, -229058, -229072, -194268, -156960, -145263, -132625, -81360, 17857, 138108]
10202A38108J07000O1577j3550p6067q6654o3925l3950l2890q3118r6934j3163
10191a93566O8568Q6652P4887M6895L1348L1229K709q488L3101M7987R678k3079
10179B07921k2154l0023n1594n0044n908K6501K0479Q958k0957m5822l1097j2458
10167f198m703n812k4953n8005q0992o5613j0250L5074L1546P257n00L445J1049
10154a68655J1696N804L2621R4067J38037J10167K1830m4894l3111J2505K0753
10143B00820o905k7217j3707l574l8597q3229p3280k8207r799j8957k3553R680
10131a16525O5465Q9214Q7532Q2520P8277L9515m1423q7579o7190l5989m3204
10120E0613p6549q3681j8947Q4568J36301J01612L6967J0482L9434O5867N2257
$$ y = [138108, 245108, 306685, 293135, 217068, 130414, 66489, 32539, -351, -83469, -180403, -193566, -124998, -38346, 36541, 83436, 114784, 146013, 148722, 140234, 173335, 221322, 231000, 207921, 185767, 155744, 104150, 54106, 48198, 74699, 95178, 104136, 83179, 37357, 6260, -6198, -10901, -16713, -41666, -99671, -180663, -246276, -256526, -221452, -189906, -182649, -183149, -179704, -168655, -156959, -151155, -118534, -24467, 113570, 223737, 245567, 200673, 167562, 180067, 200820, 193915, 166698, 152991, 149417, 110820, 27591, -45689, -73896, -83695, -102652, -126205, -116525, -51060, 38154, 125686, 208206, 286483, 325998, 284575, 196996, 129806, 93817, 50613, -25936, -109617, -128564, -43996, 92305, 193917, 230884, 241366, 280800, 346667, 398924]
10109C98924R036m3208o5120l5034k0j2774m5311p9266p2198n506M9437M0696
10097A39656j2170m4500n0604m4483m244K2768l234n7550r7164o8434J4389O9710
10085a35860P9043P0595O8241Q3836O1422J3480j311R77j8707n0420p5144q4962
10073A1190p5073o0404o4388n8089j9654K2347L8440L3607L3627M3624Q1420J22723
10061A09370J20901Q4158M1239l07l1331o1109r3910j18408j11256p5002m9491
10050a85146k8621o21P913l148j977J1112J8546K1182J9426K988k1053m0883l4553
10037b34835M195L6636M2003J2905k9384k9102j0580J68K788j1579j8180j7134
10025b52099k3717k5278r002J4747J3742n935o379K897J249J2276J9182O172k324
$$ y = [398924, 407960, 364752, 299632, 264598, 264578, 251804, 206493, 127227, 55029, 49523, 98960, 139656, 127486, 82986, 32382, -12101, -16345, 6423, 3189, -54361, -151525, -219959, -205570, -135860, -56817, 13778, 82019, 165855, 227277, 240757, 239446, 240423, 221716, 171296, 96152, 11190, -63883, -124287, -188675, -246764, -266418, -244071, -205631, -172024, -138397, -94773, -13353, 109370, 230271, 314429, 355668, 355361, 324030, 262921, 169011, 50603, -60653, -135655, -185146, -213767, -214388, -206475, -209623, -211600, -200488, -181942, -160760, -141334, -138346, -159399, -200282, -234835, -230640, -194004, -152001, -139096, -168480, -197582, -208162, -207994, -205206, -216785, -234965, -252099, -275816, -301094, -310096, -295349, -281607, -287542, -293921, -291024, -289775, -277499, -258317, -252145, -254469]
10012b54469K5757Q1266J23643J25060R5057N2100n365k1229L0854N7142L550
10001C13366p3411j06083p9418l4718n912M840J8714J9646m307k247L0984O4323
9989A45777O1066K3217q75k781K434q256l5611m1674J7265O9999N9302K1757k264
9976C09356J3536M2511R620p0378q7717n3984p8784j18942q0254k3499K793J5090
9964a20652l342k7273j1726M3116P5558M5700l915m0844n5157n0436l9202l2783
9952b20956k1140M2966J08467R2411K2337l9818o3587m2477J18K7214L3965K6693
9940c3807L0554M6803L2318j7368p6044j09732r9996n9297j3073J8183M6788P6506
9928a58165R7108J20360J56512J65886J26100P5922M8040L1625O433p041K6075
$$ y = [-254469, -228712, -147446, -23803, 101257, 196314, 248414, 243049, 221820, 252674, 309816, 313366, 239955, 133872, 54454, 19736, 13824, 18664, 37378, 57024, 52717, 50470, 81454, 145777, 206843, 230060, 229185, 226404, 228838, 220582, 184971, 143297, 160562, 230561, 289863, 311620, 309356, 322892, 365403, 375023, 304645, 216928, 162944, 84160, -34782, -115036, -138535, -135742, -120652, -123994, -151267, -162993, -119877, -44319, 1381, -2534, -43378, -98535, -148971, -188173, -220956, -242096, -199130, -90663, 1748, 24085, -15733, -79320, -121797, -121679, -94465, -60500, -33807, -3253, 43550, 75868, 58500, -17544, -127276, -227272, -286569, -299642, -281459, -234671, -158165, -61057, 59303, 215815, 381701, 507801, 583723, 631763, 663388, 669821, 662780, 688855]
9917F88855O1989K5677n1957q8683o3085k2073m949o638q277m365J214M185J6881
9904E48774M4388M5614j6667r3825j23993j26349j35395j30799j00255j03747
9894a92254j52718j56891o1266M3759O6499L7797K250m5686p3015n2087l601M2126
9882e45087O6576P6819P6924N0009J1167n79K7480M0698J0560j9969k6523l104
9870b35029N511j8440k1862J131J1300L033N703L2601N6226K7406m0850r6973
9858b70243r9460p2773n3948n4165j5961P2849J46830J75869J14809J8540l0901
9847f8554n2918n2185q882L7620K3659j7140r873L0446M0213K8239M9769P2294
9835G2688K7064o0034j09912j06651r3850q8334o7652k9101J21J5204K5751L0230
$$ y = [688855, 750844, 776521, 724564, 635881, 572796, 550723, 545774, 539136, 530859, 526494, 527708, 531893, 548774, 593162, 638776, 622109, 528284, 404291, 277942, 142547, 11748, -88507, -192254, -344972, -501863, -563129, -519370, -452871, -415074, -412824, -458510, -531525, -583612, -587213, -545087, -478511, -401692, -324768, -274759, -263592, -264171, -236691, -195993, -185433, -205402, -231925, -235029, -229518, -247958, -269820, -268689, -257389, -254356, -248653, -216052, -159826, -132420, -173270, -270243, -369703, -442476, -496424, -550589, -566550, -493701, -346871, -171002, -56193, -37653, -68554, -121472, -173657, -182539, -144919, -121260, -138400, -148273, -117827, -77614, -49375, 394, 72688, 99752, 39718, -70194, -176845, -270695, -359029, -426681, -455782, -455661, -440457, -414706, -384476]
9823c84476K6946K5939K9502O653k4243l1728r959M2213Q9790J05997P8364L1339
9811a3663j1599m0571m3933m5883n7856n5317m1721m5085n2582n839P9553J24447
9799b10049J13864O0932n080l4149m1586o1837q5669q7674q9761r9709r4868p2389
9787g07975k9894O0861J50780J79987J71956J60061J30007N1762m1946j02420
9777B3179j03266q5680r5453q2410k4545N2973J02624P6188J4195l5358n2381
9766b09934l7474O385M8544P3832R1116R6931Q0478N1836L0226J7774J340k3479
9754B27575l0254r347p544l4541m1074k0574j6737m1817p1767q0166n5198j2738
9742a94182K2090M4442N8349O2685O0677N2237L9008K9306L6782M2182J8140j6851
$$ y = [-384476, -357530, -331591, -302089, -295436, -319679, -351407, -361366, -319153, -229363, -123366, -45002, -13663, -25262, -65833, -109766, -155649, -213505, -268822, -310543, -355628, -408210, -414049, -334496, -210049, -96185, -35253, -40333, -74482, -116068, -177905, -263574, -351248, -441009, -540718, -635586, -707975, -737869, -677008, -526228, -346241, -174285, -14224, 115783, 167545, 125599, 23179, -80087, -165767, -261220, -343630, -368175, -315202, -212578, -136390, -122195, -157553, -209934, -247408, -241023, -192479, -118647, -27531, 69400, 149878, 201714, 231940, 249714, 251054, 227575, 197321, 187974, 180430, 145889, 104815, 84241, 67504, 25687, -46080, -126246, -181444, -194182, -172092, -127650, -69301, -6616, 54061, 106298, 145306, 174612, 211394, 253576, 271716, 254865]
9730B54865n8400j00660j15826p2573K335L1378o770m5425m0461j9037N992L5702
9718a28880L9807K752n9750r4249n9361k7788l6593k2655J0482K5744L5248N5875
9706b59368O9130P2662Q6420J05951J21830J01643P1695O0653M1921n711q0527
9695C86299j49938j48906p3321r154J5438J9972K5399L9341K9585P951l544K843
9683A41965L4761M7959L6712P840k8012l9254o022M7353N5578k931o1983o1527
9671A72439k6200l341q900l2688n3260o7341n9933j3113K8261K0224j0135l3188
9659h7175l3536l9303n3345l3350P616J2419l3773p4237o9850l9998l7805n0133
9647e32470k4555P718Q499N701L0741P8123R2869L6810k9574m9008j4267O2130
$$ y = [254865, 196465, 95805, -20021, -92594, -90259, -58881, -65651, -111076, -151537, -170574, -164582, -128880, -89073, -86321, -146071, -240320, -299681, -327469, -364062, -386717, -376235, -350491, -315243, -259368, -190238, -117576, -31156, 74795, 196625, 298268, 369963, 430616, 472537, 466826, 386299, 236361, 87455, 14134, 4980, 20418, 40390, 65789, 105130, 134715, 142666, 139122, 141965, 176726, 224685, 261397, 269237, 241225, 201971, 195949, 243302, 298880, 295949, 233966, 172439, 146239, 142898, 133998, 101310, 48050, -19291, -79224, -92337, -64076, -43852, -53987, -87175, -120711, -160014, -213359, -246709, -239093, -226674, -260447, -334684, -404534, -444532, -482337, -532470, -557025, -549307, -540808, -535107, -504366, -426243, -333374, -296564, -326138, -375146, -389413, -327283]
9635c27283J20977J11139P6847M8091J1949l0453n2447j9054L3286N1772N3031
9624G7855K9883r845j0859R483k509l6883m3029k6801l9111o3419m6704j687J3408
9611a50218j468j7275k6775l0053l4095j8326K2894O6934J03249J13367P7392
9600A05626M5093L5201O059l3206p2090r7238r0348o2399j9377L4444P8605P7611
9588G981O4080N9050L8293J7548J2134J227k4034m9121n8483n2127m5519n1651
9576h0622o3365k3004M8015O5663L6392K078j6314l502K2797J5211k9735o8827
9564i5213p7157l9860j2021k3518j8884K7227N1122K2724j7407k9119j5362j4513
9552b41981o943j4980n8481o1506l5873l3853Q949R3327J26718J03708Q5746P6558
$$ y = [-327283, -206306, -95167, -18320, 29771, 41720, 11267, -41180, -60234, -26948, 24824, 77855, 107738, 97893, 87034, 96517, 94008, 57125, 14096, -12705, -51816, -115235, -161939, -163626, -150218, -151686, -168961, -195736, -225789, -259884, -278210, -255316, -188382, -85133, 28234, 105626, 150719, 185920, 191979, 158773, 86683, -10555, -100903, -163302, -182679, -148235, -69630, 7981, 72061, 131111, 169404, 186952, 199086, 200313, 176279, 127158, 68675, 16548, -28971, -80622, -143987, -166991, -118976, -53313, -16921, -14843, -31157, -34659, -11862, 3349, -26386, -95213, -172370, -212230, -224251, -247769, -266653, -239426, -188304, -165580, -182987, -212106, -227468, -241981, -248924, -263904, -322385, -383891, -419764, -453617, -444668, -351341, -224623, -120915, -35169, 41389]
9540D1389N3096j4378q7269j15096j15531r2597m2651j4871o600J6444M0626O0977
9528b76461O4008K1280l7514m9727j3913J1818L91j4671r614J3679M7548O8115
9516a75061O8312M3538K127j5747l1005j05121j67747j13145o900N5017Q7442
9505c58290Q3520M0064R593L517l538j0862j5600k8069l2394Q731P6694J19493
9493a07141J01045K5328l3035m0910k2465J8088O7751O2195M761m6077n8621l7454
9481f6535m823K7944K7219j5075o6289p6553k6824N1702P1589K4677j5045l1451
9469i9464l0641j0473J2985J3166k01n132K7447R7228J13159M9298o424j1188
9457A49760L942O363j6147l9569n538O1293J13647J45546J41376Q6342K4571j2078
$$ y = [41389, 94485, 80107, -7162, -122258, -237789, -330386, -373037, -387908, -394508, -378064, -337438, -276461, -212453, -191173, -228687, -278414, -292327, -280509, -280118, -294789, -304403, -290724, -243176, -175061, -106749, -63211, -61084, -76831, -107836, -212957, -380704, -493849, -500749, -445732, -358290, -274770, -234706, -225113, -221596, -225134, -235996, -251596, -279665, -312059, -303328, -226634, -107141, -6096, 19232, -13803, -54713, -77178, -59090, 8661, 70856, 75617, 29540, -29081, -66535, -71358, -43414, -16195, -31270, -97559, -174112, -200936, -149234, -77645, -52968, -68013, -99464, -130105, -140578, -127593, -114427, -114628, -119760, -92313, 4915, 118074, 167372, 160948, 149760, 153702, 160065, 143918, 104349, 98811, 160104, 273751, 419297, 560673, 647015, 671586, 659508]
9445F59508n8735j22299j52054j23055o1493k953L0440J891m9029m4397J8969
9434I6793P8993J02950R6221P5086O3215O1113M6631L8670N1801M7743J7987k4326
9422G52877m0112j8623J1968L8934J7564l6864m4645J8716Q2103Q8588R5578J47282
9410A113366K12906K44618K33233J79992J14718O5159N155n7216r1821j06293
9400A913817j00979r0284j05357j30141j51902j90875k08216j47682n8419k8987
9390G00975n5592o5433k7736K9861P4463P7332N5808M1156M1323N2350M3579J0572
9378I78658q385P872N6435J33147K06966K46807K66933K63715K31486J64218L0358
9367B578210j39738k64165k81319k37528k01081j63600j35929j29923j17430r6506
$$ y = [659508, 600773, 478474, 326420, 203365, 141872, 138919, 169359, 171250, 122221, 77824, 96793, 175786, 278736, 374957, 450043, 513258, 574371, 621002, 659672, 711473, 759216, 777203, 752877, 712765, 694142, 706110, 745044, 762608, 725744, 681099, 699815, 781918, 870506, 966084, 1113366, 1326272, 1570890, 1804123, 1984115, 2098833, 2163992, 2169147, 2111931, 2020110, 1913817, 1812838, 1722554, 1617197, 1487056, 1335154, 1144279, 936063, 788381, 729962, 700975, 645383, 579950, 552214, 582075, 656538, 733870, 789678, 830834, 872157, 924507, 968086, 978658, 970273, 978145, 1034580, 1167727, 1374693, 1621500, 1888433, 2152148, 2383634, 2547852, 2578210, 2438472, 2174307, 1892988, 1655460, 1454379, 1290779, 1154850, 1024927, 907497, 810991]
9357H10991o8192j6100L0849L1365k3372q2641j21795j22353q1546l4391K890
9346C25705J8368K1806J1923k3525l9987l722M6825K9039l4712q4002j10550j11846
9334D5322o5553K6272Q8609P7857J2503m8362o7038o1028m4798j1897M8392J11725
9322A12004J27873R9487N9353p60o9596r2316q9172q9547m5225J8628M6330N7749
9310A34808M4551j5306o7126o5501n2006o5837q2344p3998m8641l3054k6000l238
9298c53692N8636J37969J78392J57892R9776M1555K83l5537n0882k3559J7351
9287B28184K6390O218j1425J47K9051K6605j7936l3513m437K584j6470k3776j5412
9274A96210q211M584p463n5575p3082n0709m5632m9976l3006j2623N477P857j821
$$ y = [810991, 742799, 726699, 757548, 788913, 765541, 682900, 561105, 438752, 357206, 322815, 325705, 344073, 365879, 377802, 354277, 314290, 310568, 357393, 386432, 351720, 267718, 157168, 45322, -20231, 6041, 94650, 172507, 185010, 136648, 69610, 8582, -36216, -48113, 279, 112004, 239877, 339364, 398717, 397957, 328361, 236045, 146873, 57326, 12101, 30729, 77059, 134808, 179359, 164053, 96927, 31426, -20580, -86417, -168761, -242759, -291400, -324454, -350454, -353692, -295056, -157087, 21305, 179197, 278973, 320528, 320811, 285274, 234392, 210833, 228184, 254574, 260792, 249367, 249514, 278565, 305170, 287234, 253721, 249284, 251868, 235398, 211622, 196210, 187999, 192583, 185120, 129545, 56463, 5754, -39878, -89854, -122860, -135483, -130006, -122149, -123970]
9261a23970j837P648L7236Q3192Q1028L358p4325j02126j11983j12924j01762
9250d16465q2780n0103j1712J5614K6568L8019O8279R3233O9832o603p9482q3787
9238d19387j2732N0900M0560R073J8629O0871O8932K3636r014R547O1723J21627
9226B4365J22835N3786j8307m5078k2993K0497R5803J70222J75557R4817j1173
9215F60331n9041l6205K7905M0602K820k9612n5089q6444j17387j02754k6125
9204B19001L4867R379o2645o1708K3853O4218l149p5775p9227p2095r0449r5818
9192a89548p6947n0032l0794K882N1020P1443N6674M0988L3982J6856O2r391k7131
9179a09936m6227m5051m262O3148J27780J43196J09842N4900m082k1731L827K1367
$$ y = [-123970, -125807, -118159, -80923, 2269, 83297, 86655, 12330, -89796, -201779, -314703, -416465, -499245, -549348, -561060, -545446, -518878, -480859, -412580, -319347, -249515, -256118, -335600, -419387, -432119, -381219, -340659, -331586, -312957, -252086, -183154, -159518, -168532, -158985, -97262, 24365, 147200, 200986, 182679, 137601, 114608, 135105, 230908, 401130, 576687, 671504, 660331, 601290, 565085, 592990, 633592, 636412, 606800, 551711, 465267, 347880, 245126, 219001, 253868, 263247, 200602, 138894, 162747, 226965, 223816, 148041, 68814, -3281, -93730, -189548, -266495, -316527, -347321, -344439, -293419, -221976, -165302, -124314, -90332, -73476, -73414, -82805, -109936, -156163, -201214, -205476, -142328, -14548, 128648, 238490, 293390, 289308, 267577, 271404, 292771]
9167B92771J4255K9102N7566L6040k0433l1597O899N956l7223m6942l7280l6307
9155B32807n5852r5481j10008o4478K4016P6712O5561J5092k7143k9524j285K1059
9143E1476Q71j3777K3140N0578J8804k5821m2515l4644j6063p225P881M6726M9888
9130A09319J2761j6728k8557k7273q995J2351L7295N1567K2138k1220l5107j0310
9118I7241M6269Q2257M2843k5896n2734l3524l4611o2071n9500l1761j3462q596
9106e3545N734K3426L7254L9816q097q3259r4060o7849p6923p2202l0363J2245
9094c67823L5749O7201P5022O0489O2621M7493j4637q1910q5847k6929K1313K1764
9082a85494J3488L2789M0118K6886J7364k5828p5561o9678k1966J8296M6272N8340
$$ y = [292771, 307026, 336128, 393694, 429734, 409301, 377704, 384603, 390559, 353336, 306394, 269114, 232807, 176955, 81474, -28534, -93012, -68996, 7716, 73277, 88369, 61226, 31702, 30417, 51476, 52347, 38570, 61710, 112288, 131092, 105271, 62756, 28112, 12049, 4824, 12705, 59431, 109319, 122080, 105352, 76795, 49522, 40527, 52878, 90173, 141740, 163878, 142658, 107551, 97241, 143510, 225767, 268610, 242714, 189980, 156456, 121845, 59774, 274, -31487, -44949, -53545, -47811, -24385, 12869, 52685, 44588, -38671, -132731, -200580, -277503, -349705, -380068, -367823, -332074, -264873, -189851, -129362, -66741, -19248, -33885, -115795, -201642, -228571, -207258, -185494, -172006, -139217, -99099, -72213, -54849, -80677, -156238, -225916, -247882, -229586, -183314, -124974]
9070a24974N5762M0779M1774N3608K9612r783q655L3990N7985L0660K709J5864
9058B19331L3019K8717L794l1003l6014j1939n715k6766n5746n8478k6501K412
9046C5111O371o604k3786k4633j0428l5444p7897o3504j6194K6381O1129N7481
9034g2017J4714J1071P5983J07207P3868K3261j1841l506J0817l896k1755l3062
9022A70844m1787o0895q2280q6793m2276K1145L9280j378m5637n0698l8639k3968
9010b43082j7057j6584J2094M9088L1563M776L1125N8509M9988K6457R946J8016
8998A4839L7225N0130L2566Q50j8379l3699l8033l3910l2687k1724j9933m2017
8986a04772l9218j3361O835J8287O632k8363p6177q9574l4339L9767P6014O1629
$$ y = [-124974, -69212, -28433, 13341, 66949, 96561, 86778, 78123, 112113, 170098, 200758, 203467, 219331, 252350, 281067, 284861, 253858, 217844, 205905, 200190, 173424, 117678, 59200, 32699, 35111, 41482, 34878, 11092, -13541, -23969, -59413, -137310, -200814, -217008, -190627, -129498, -72017, -57303, -46232, 29751, 136958, 210826, 234087, 222246, 218740, 229557, 225661, 203906, 170844, 129057, 68162, -14118, -100911, -143187, -122042, -82762, -84140, -129777, -180475, -219114, -243082, -260139, -276723, -264629, -215541, -183978, -179202, -148077, -89568, -39580, -13123, -3177, 14839, 52064, 102194, 134760, 135610, 117231, 83532, 45499, 11589, -21098, -42822, -62755, -104772, -143990, -157351, -150516, -132229, -125597, -153960, -230137, -319711, -354050, -314283, -238269, -176640]
8974a76640L3351J8714R840k491Q765M1817O6769R8655J15734N2294n6400j10143
8962A00265p6832j8057M360J5868M675m4111o3796m4004j2788L1346O6847P6574
8950D0347M5627j5180k3688L1088N7201k6749j47875j87192j45282p2862L731
8939d40834N4655O5026L3710l5110o6677k1327L7208P1246R6316P5416K0452l16
8927a10235J7474O3667J06997J14898Q4207L8748L82k8777l1610J1758O5997Q4453
8915D17959M3804j5120l1477Q72K4532r922m7244k0262L2322M6056J5397k8204
8903D28713m5144j7403J3015J5714K0441M5932O4058N2892L7734M3404N3554K0820
8891G33730l9375q1778o7163m0151l7820j9738J547L384O169J3818L6010N9065
$$ y = [-176640, -143289, -124575, -114735, -117226, -108461, -66644, 125, 98780, 214514, 266808, 210408, 100265, 23433, 5376, 9736, 25604, 30279, -13832, -77628, -121632, -134420, -103074, -36227, 40347, 85974, 70794, 47106, 78194, 135395, 108646, -39229, -226421, -371703, -444565, -440834, -386179, -321153, -287443, -322553, -389230, -410557, -373349, -302103, -205787, -130371, -109919, -110235, -92761, -29094, 77903, 192801, 277008, 315756, 316138, 287361, 255751, 267509, 333506, 417959, 461763, 446643, 415166, 416038, 440570, 430648, 383404, 363142, 395464, 441520, 456917, 428713, 383569, 366166, 379181, 394895, 415336, 461268, 525326, 578218, 615952, 659356, 712910, 733730, 694355, 612577, 545414, 505263, 467443, 447705, 449252, 452636, 458805, 472623, 508633, 567698]
8879E67698O3865J01297J67132J77881J34247Q2620L2012o824j5620K4180P5790
8868A404278Q3656M5759J2642Q61l9314j06002j30768r9189o5840p5577j10784
8857I19722j11691q3215o6083n7845l9367j1734N815Q198q659k6640k0284J0939
8845E19156J9567j3383n1175o5099l8155M181L1090M3057L5928J8166j2216m7343
8833D43774m3357j1223J7525L5842M8376O0663P4048O5843L2144j0006m1788l0944
8821F40897L5702R4527R4794M2415j8493l1998q041K8971O0131O2568N0512N5668
8809A107653P2429Q0302O4140N635n5433o2451l4568m3880p0120n0463M450J8935
8797A036629j1021k4665j3630n683L8n77l2998n3271m9934n9963p9928q5965q8442
$$ y = [567698, 631563, 732860, 899992, 1077873, 1212120, 1294740, 1326752, 1319928, 1304308, 1328488, 1404278, 1487934, 1533693, 1546335, 1547196, 1507882, 1401880, 1271112, 1171923, 1106083, 1030506, 919722, 808031, 724816, 658733, 600888, 561521, 549787, 555602, 563800, 555141, 528501, 508217, 519156, 538723, 525340, 474165, 409066, 370911, 375092, 406182, 449239, 485167, 503333, 491117, 443774, 400417, 389194, 406719, 442561, 490937, 551600, 625648, 691491, 723635, 713629, 671841, 640897, 676599, 771126, 865920, 908335, 889842, 857844, 849803, 878774, 938905, 1001473, 1051985, 1107653, 1180082, 1260384, 1324524, 1330159, 1274726, 1212275, 1177707, 1133827, 1063707, 1013244, 1017694, 1036629, 1025608, 1000943, 987313, 981630, 981668, 981091, 948093, 894822, 844888, 784925, 704997, 619032, 530590]
8784E30590r7100q4697m8482o223L0151N6659O6011M0122J985o333R948K9805
8772E22436K4313j4219o3803n8518j8450k8534o7120n5995k5954l4284n4910m1206
8760H3756K4136R9572J31167P8619l835l5915m5049q4097j28327j22913o0537
8749f3423J3480M5701O1637O8543K5322l4027p3457j03096j01756l7262M9067
8738a49271Q0386M2533N62k8355l2881P466M6199N0484J9185j1413J1535L9019
8726G5449L4141M2203N1441L5729K3840K5283J2867k5528o1234p1246o0107k5541
8714E7297K6177N0903J3521j4653J4534O3542Q0019N0420M517m9022q8496p2810
8702A35949m6941n5564n6124j9385K3696L5694L4435O1400R5585N3756m6718j21332
$$ y = [530590, 433490, 348793, 300311, 294088, 324239, 380898, 446909, 487031, 489016, 482683, 492631, 522436, 546749, 532530, 468727, 410209, 391759, 363225, 296105, 240110, 214156, 179872, 124962, 83756, 107892, 207464, 338631, 417250, 413415, 377500, 332451, 248354, 120027, -2886, -63423, -49943, -4242, 57395, 125938, 151260, 117233, 43776, -59320, -161076, -198338, -149271, -68885, -26352, -25790, -54145, -87026, -79560, -33361, 17123, 36308, 24895, 36430, 75449, 109590, 151793, 203234, 238963, 262803, 288086, 300953, 275425, 214191, 142945, 82838, 57297, 83474, 134377, 147898, 133245, 147779, 211321, 291340, 341760, 346277, 297255, 208759, 135949, 89008, 33444, -22680, -42065, -18369, 17325, 51760, 113160, 208745, 262501, 215783, 94451]
8690I4451j33960q8944n185O1672N5326L3387O5543R6407O7003K6973K4037M7375
8678C44085M8145K8436K8039J7617j0846l1524l7797l3411k9769k5989M049M9656
8666C50691N9624M5283L6890K9166o15l1514l4387m6443p1604r7691r2182m4866
8654A02352j2148J962Q303K2942P2329J09604Q6469M1604K3128M8007N2631J7252
8642E74435M173r134m2463m0411r685j905n19J0635L592j7655l4146l6234l0983
8629C69700k4204l696J7824K0413j0998m1498o3400p1240m6962j0997o58j5052
8617A19232j4379L393R110j1296l2334j6809N5879J14032R8401O7190L2212k2913
8605D01718o4694o4025j7429M1863Q0378Q2421N5826N2320Q5308J29713J58541
$$ y = [94451, -39509, -128453, -133638, -71966, -16640, 16747, 82290, 178697, 245700, 272673, 296710, 344085, 392230, 420666, 448705, 466322, 455476, 423952, 386155, 352744, 322975, 296986, 301035, 350691, 410315, 455598, 492488, 521654, 521039, 489525, 455138, 408695, 337091, 239400, 147218, 102352, 90204, 92166, 100469, 123411, 195740, 305344, 391813, 433417, 456545, 504552, 557183, 574435, 578608, 569474, 527011, 486600, 476915, 475010, 474491, 485126, 488718, 471063, 436917, 400683, 369700, 345496, 341800, 359624, 380037, 369039, 327541, 264141, 192901, 145939, 134942, 134284, 119232, 104853, 108246, 117356, 106060, 73726, 56917, 112796, 226828, 325229, 392419, 424631, 401718, 337024, 272999, 255570, 297433, 377811, 460232, 516058, 568378, 653686, 783399, 941940]
8594I41940J37630Q3244N0911K5191q826k7937k8337j6499K959K5607N9037O8028
8582A312948K2489r060j3409l5596p1421r6377q8349n2134l1278l2047l4996o2039
8570H08731o9570j1105K2310M977n813N78K1960K9492n910p1949j06169q4527
8558E33005l5727J3182M4283L2094l1460r5212r1941k8196L9272P0874O6536M1004
8546E57714K2392K2126K8501M7079N2753K5822o752k3819l5042m4114l2574R96
8534F15082k555k7411O454M9909M1473L0887O6409Q6313N6582M9107Q2530J12870
8522A167650J45880J79819J68519R9411J7743l6397p0832r6880j01403p9204n4082
8511A340224p8495j28564j31321q4492n3322p7436q9966n4754p544M2826J03988
$$ y = [941940, 1079570, 1162814, 1213725, 1238916, 1230090, 1202153, 1173816, 1157317, 1160276, 1185883, 1244920, 1312948, 1335437, 1326377, 1312968, 1277372, 1205951, 1109574, 1021225, 969091, 937813, 905766, 870770, 808731, 739161, 728056, 750366, 755343, 749530, 750108, 772068, 801560, 795650, 723701, 617532, 533005, 497278, 510460, 554743, 586837, 555377, 460165, 368224, 340028, 379300, 450174, 516710, 557714, 580106, 602232, 630733, 677812, 730565, 756387, 749635, 725816, 690774, 646660, 614086, 615082, 612527, 585116, 591570, 641479, 682952, 713839, 780248, 866561, 923143, 972250, 1054780, 1167650, 1313530, 1493349, 1661868, 1761279, 1779022, 1742625, 1671793, 1574913, 1473510, 1394306, 1340224, 1261729, 1133165, 1001844, 917352, 864030, 786594, 696628, 641874, 634330, 677156, 781144]
8500G81144J49182J28615L7079p8683j50276j57040j25111p7365k8172L270J0518
8489D93161K4875N3075P3049O7035K7488k9571q9025j11643q8866m9805j6359
8478C53414o879q141j1635J056M0533Q8740J03788N5763J1871J4892L6292O0951
8466G40645O1575L8892L2864M9873N4074K4030l1645o9853q5227r3376n8623j8724
8454F44505q077J3346L9727M6110R827m1146p1580o4038j7366J0556m186m962
8442E52716P336J184q155N560N8399J13990J15577N5748k525l904J0415%M821
8429I11162K8271M7957M1998K0015p28q855j7640n8352j17788j37332r0302l0058
8417E88348K1551P7355J05504Q5117P2371O7639K1296n3292j12720j38048j08983
$$ y = [781144, 930326, 1058941, 1096020, 1017337, 867061, 710021, 584910, 507545, 479373, 482643, 493161, 518036, 571111, 644160, 711195, 738683, 709112, 620087, 508444, 419578, 369773, 353414, 346535, 338394, 326759, 327815, 368348, 457088, 560876, 616639, 628510, 643402, 679694, 740645, 802220, 841112, 873976, 923849, 977923, 1001953, 970308, 900455, 815228, 721852, 663229, 644505, 636428, 649774, 689501, 735611, 745438, 704292, 632712, 568674, 551308, 561864, 557678, 552716, 560052, 561236, 553081, 558641, 617040, 731030, 846607, 902355, 899830, 895926, 906341, 906341, 911162, 939433, 987390, 1029388, 1049403, 1048675, 1039820, 1022180, 963828, 846040, 708708, 618406, 588348, 609899, 687254, 792758, 877875, 950246, 1017885, 1039181, 985889, 873169, 735121, 626138]
8406F26138l5090K6255K7997J3074L1224M7154L1973K1752J8472K5701L8715L9743
8394I13108N8544O8250J6032m4867m0679q529j6072m5419n3266k6447J6203K8088
8382H64946K8369M5098M6481K2755M55j4542m0186k5248J2016P168k3050k8338
8370H95924r969l552R940L3040N0604N4223J2104n8588j03162q8074m2385k4843
8358G25262m2887m9865j6009K5045L8658K8216J0939M114K9527P7297R8625Q8780
8346A017702O4814N3557P7054Q2671L7850Q393O152j9594o8657q4944o2133l6782
8334A076083j7484j4518j5205J6678O5884R9269Q6048N0259K5748Q7m6812r5494
8322A230543r7470p5977m6085j3869r016j0754l24p224l7745m5042k0332K690
$$ y = [626138, 591048, 617303, 645300, 658374, 689598, 736752, 768725, 790477, 808949, 834650, 873365, 913108, 971652, 1039902, 1055934, 1011067, 970388, 961859, 945787, 900368, 847102, 820655, 836858, 864946, 893315, 938413, 984894, 1007649, 1008104, 993562, 953376, 928128, 940144, 947312, 924262, 895924, 885955, 882403, 892343, 925383, 975987, 1030210, 1042314, 983726, 880564, 792490, 750105, 725262, 682375, 632510, 616501, 641546, 680204, 708420, 719359, 723473, 753000, 830297, 928922, 1017702, 1082516, 1136073, 1213127, 1295798, 1333648, 1342041, 1348193, 1328599, 1259942, 1174998, 1112865, 1076083, 1058599, 1044081, 1028876, 1045554, 1111438, 1210707, 1296755, 1347014, 1372762, 1372849, 1326037, 1230543, 1133073, 1057096, 1011011, 997142, 988126, 977372, 977048, 969824, 932079, 887037, 866705, 869395]
8310H69395J6785K5159K1201o555l2367j9353L5472P4212M9838K8344J6664r083
8298A069712j1720J0284N1079P7643N2406r591m9913m4823l799Q6904J32681O7095
8286A427958j310J449N0591J09756J29315P0398J6139J73j2831k460K9432K7980
8274A846590k5243l5377p36p227l2802k2712J131j5016n2246o7242o9795o7436
8262A451889m0512j7332p003N976J5001J6310K0019L0310N0015N9858N7560N1400
8250A693491L8966k124m1219k5568N1403J27696J13073j3098j26466j14820n3253
8239A648081j5556M1161O7814K2250k9467l1240R366N9471R4896J00558R8454
8228B065788J12330J16777J08593R0961L4650l8067p7763p2482k5663M2289O2999
$$ y = [869395, 886180, 911339, 932540, 925985, 893618, 874265, 909737, 983949, 1033787, 1062131, 1078795, 1069712, 1057992, 1068276, 1119355, 1196998, 1249404, 1239813, 1189900, 1145077, 1141278, 1228182, 1360863, 1427958, 1426648, 1428097, 1478688, 1588444, 1717759, 1788157, 1804296, 1804469, 1791638, 1789178, 1818610, 1846590, 1821347, 1785970, 1785234, 1778007, 1745205, 1722493, 1723624, 1708608, 1656362, 1589120, 1519325, 1451889, 1411377, 1394045, 1387042, 1393018, 1408019, 1424329, 1444348, 1474658, 1524673, 1584531, 1642091, 1693491, 1732457, 1730333, 1689114, 1663546, 1714949, 1842645, 1955718, 1942620, 1816154, 1701334, 1648081, 1632525, 1673686, 1741500, 1763750, 1734283, 1703043, 1712409, 1771880, 1866776, 1967334, 2065788, 2178118, 2294895, 2403488, 2494449, 2529099, 2491032, 2413269, 2340787, 2315124, 2357413, 2420412]
8217B420412K6648J962j6873k7357R30L8970M3622J1391M963L1879K9949K468
8205B568964j5611j7881J633M0512O4512N8164M4282N0998O2540L1463j2312o0843
8193B816421j04772r6448n4638j7821K1717N6315N3335L3261K7552M6531P4612
8182B856065P4130M5905M0772O1596N3592k9110j19836j38972r4217k3721K2202
8171B748406J4410Q131L2470M6172O4547R8687J06638Q3889N4403K4978J8454
8160C301185N3301J09464J56156J44030P9725K3524J882J4172K5671K5534J6897
8149C951541m370J315M6324O6383L5047R709J0991J720L821L2234L4167j1735
8137D177147l4820j5437J3339M1934P0589Q4129N8030m297n6944r7487j34930
$$ y = [2420412, 2447060, 2449022, 2432149, 2404792, 2405722, 2444692, 2488314, 2499705, 2504668, 2536547, 2566496, 2568964, 2553353, 2535472, 2537105, 2577617, 2642129, 2700293, 2744575, 2795573, 2858113, 2889576, 2877264, 2816421, 2711649, 2615201, 2560563, 2542742, 2564459, 2620774, 2674109, 2707370, 2734922, 2781453, 2856065, 2930195, 2976100, 3016872, 3078468, 3132060, 3102950, 2983114, 2844142, 2749925, 2726204, 2748406, 2762816, 2770947, 2803417, 2849589, 2914136, 3012823, 3119461, 3203350, 3257753, 3282731, 3301185, 3354486, 3463950, 3620106, 3764136, 3843861, 3867385, 3869267, 3883439, 3909110, 3934644, 3951541, 3947171, 3948486, 3994810, 4061193, 4096240, 4105949, 4116940, 4118660, 4122481, 4154715, 4188882, 4177147, 4142327, 4126890, 4140229, 4182163, 4252752, 4336881, 4394911, 4390614, 4333670, 4236183, 4101253]
8126D101253j38355j20138p9572j8542J8065Q325j3212j2206l886K5278P0475
8115C837485R7430Q1393K7599k4929m1650l2443k7621j0207K2126N1156N7097
8104D037436L4603M83o371L0035O2032P6116R1923J07685Q9720J8094m4127l1737
8092D465892O696J9362L9879Q4371J05060O2109o362m7709n7007m6250k6908j6608
8080D582525j2474K0516O6081O8028N2438O0538Q5470J03884R2872P2935M3098
8069E235911n282k8824j6278k0461m6292m7149k5015n998o74j7464j1331L6374
8057E047517P9760P8887K9802l1279l5627o315K8002Q3743J25192J28620J06575
8046E634877R9718J16261J11048R6267J02393R6278N2640J9063M3107O9918O7620
$$ y = [4101253, 3962898, 3842760, 3763188, 3744646, 3762711, 3771036, 3757824, 3745618, 3741732, 3767010, 3837485, 3934915, 4016308, 4043907, 4018978, 3977328, 3944885, 3917264, 3907057, 3929183, 3980339, 4037436, 4072039, 4072522, 4066151, 4096186, 4158218, 4234334, 4326257, 4433942, 4523662, 4541756, 4497629, 4465892, 4472588, 4491950, 4531829, 4616200, 4721260, 4783369, 4777007, 4729298, 4672291, 4626041, 4599133, 4582525, 4570051, 4590567, 4656648, 4724676, 4777114, 4837652, 4923122, 5027006, 5119878, 5192813, 5235911, 5230629, 5201805, 5185527, 5165066, 5118774, 5071625, 5046610, 5040612, 5039938, 5022474, 5011143, 5047517, 5127277, 5206164, 5235966, 5204687, 5169060, 5162745, 5190747, 5274490, 5399682, 5528302, 5634877, 5734595, 5850856, 5961904, 6058171, 6160564, 6256842, 6309482, 6328545, 6371652, 6441570, 6509190]
8035F509190O1844O2635O9989Q0200P7842M9559L8673P2961J28278J57278J59246
8024G467695J57131J38211J00294P5305O2816L3573j1341l1150J84M4453Q1324
8013H118495J41833K06706K29144K06982J83132J87235K10516K60263L11155L27500
8003A0382961L38447L55496L81410M28068M73838N03667N37842O28684P66481
7994A4796894R12147J087808J297958J483501J613579J755685J956622K191716
7986B7095910K439512K676129K843794K891663K849828K713769K437734K016805
7978D7965144J446002P09837j45350r90341j727151k306676k708613k882930k794580
7969C6565342k538255k237693j936042j628075j314067j013234p48824n32400
$$ y = [6509190, 6571034, 6633669, 6703658, 6783858, 6861700, 6911259, 6949932, 7022893, 7151171, 7308449, 7467695, 7624826, 7763037, 7863331, 7938636, 8001452, 8035025, 8023684, 7992534, 7992718, 8037171, 8118495, 8260328, 8467034, 8696178, 8903160, 9086292, 9273527, 9484043, 9744306, 10055461, 10382961, 10721408, 11076904, 11458314, 11886382, 12360220, 12863887, 13401729, 14030413, 14796894, 15709041, 16796849, 18094807, 19578308, 21191887, 22947572, 24904194, 27095910, 29535422, 32211551, 35055345, 37947008, 40796836, 43510605, 45948339, 47965144, 49411146, 50120983, 49975633, 48985292, 47258141, 44951465, 42242852, 39359922, 36565342, 34027087, 31789394, 29853352, 28225277, 26911210, 25897976, 25149152, 24616752]
7961B4616752l92016l52370l24950k37309j42391n0933L1830M8144L1756L7537
7951B3266050P2626J19986J82900L08118M52649N23716N47794O16119P79752J017386
7941B7887096J275127J523337J768430K030172K319518K644380L071360L618187
7933D6137607M250206M958822N742454O586600P422491Q168256Q715605Q950889
7925A00932930Q811279Q262602P253841N763139L829015J508003j070993l677152
7917A31612664o008778p797009q866620r175193q870907q167233p233450o201484
7909F9291990n199952m291524l483346k814088k290933j870960j517209j214102
7901D6609876r76808p85553o12918m66709l84358l40676k80645j84986o0159J21379
$$ y = [24616752, 24224736, 23872366, 23547416, 23310107, 23167716, 23116783, 23148613, 23196757, 23228513, 23266050, 23338676, 23458662, 23641562, 23949680, 24402329, 24926045, 25473839, 26089958, 26869710, 27887096, 29162223, 30685560, 32453990, 34484162, 36803680, 39448060, 42519420, 46137607, 50387813, 55346635, 61089089, 67675689, 75098180, 83266436, 91982041, 100932930, 109744209, 118006811, 125260652, 131023791, 134852806, 136360809, 135289816, 131612664, 125603886, 117806877, 108940257, 99765064, 90894157, 82726924, 75493474, 69291990, 64092038, 59800514, 56317168, 53503080, 51212147, 49341187, 47823978, 46609876, 45633068, 44847515, 44234597, 43767888, 43383530, 43042854, 42762209, 42577223, 42517064, 42638443]
7891D2638443L77048O56894R07447J150503J431154J749538K056737K361401K719057
7882E6048222L157782L712746M358748N068914N910034O949636Q208398R675835
7874A03090315J1257757J2843645J4387972J5792364J6830605J7294982J7081770
7867B08579410J6085663J4194739J1380390P641568L020843k234369p615916j2435394
7859B38616934j6069951j8172952j8762801j8134917j6692570j4809768j2799449
7852A23174526j0881879r194900p748232o472714n345521m387157l578323k907304
7844G2658496k392415k031981j786482j610933j469383j304279j114224r36340
7836F0012459p75385n70590k88735L4216L53466O65618J010114J397343J795540
$$ y = [42638443, 43015491, 43672385, 44579832, 45730335, 47161489, 48911027, 50967764, 53329165, 56048222, 59206004, 62918750, 67277498, 72346412, 78256446, 85206082, 93414480, 103090315, 114348072, 127191717, 141579689, 157372053, 174202658, 191497640, 208579410, 224665073, 238859812, 250240202, 257881770, 260902613, 258668244, 251052328, 238616934, 222546983, 204374031, 185611230, 167476313, 150783743, 135973975, 123174526, 112292647, 103097747, 95349515, 88876801, 83531280, 79144123, 75565800, 72658496, 70266081, 68234100, 66447618, 64836685, 63367302, 62063023, 60948799, 60012459, 59237074, 58666484, 58377749, 58411965, 58765431, 59431049, 60441163, 61838506, 63634046]
7827F3634046K221084K745207L383702M100772M890789N803926O861142Q072754
7819A01713422R479367J1081591J2830139J4667971J6501150J8154230J9421153
7812B03849023K0074925J9866565J8667924J6437807J3089600Q577439L027218
7805C03590501l173603r441765j5072037j9345579k1840496k2541825k1771781
7798A90403415k0038175j7832751j5519677j3280234j1218857r443254p949855
7791I5120612o674407n604669m708889l932743l267926k746399k387998k148381
7783F3649200j930065j724091j565445j395051j167046q96393n71490j88127J89169
7774E4400661M84505P22188J011373J385388J775725K179217K667469L287606
$$ y = [63634046, 65855130, 68600337, 71984039, 76084811, 80975600, 86779526, 93640668, 101713422, 111192789, 122274380, 135104519, 149772490, 166273640, 184427870, 203849023, 223923948, 243790513, 262458437, 278896244, 291985844, 300563283, 303590501, 300416898, 290975133, 275903096, 256557517, 234717021, 212175196, 190403415, 170365240, 152532489, 137012812, 123732578, 112513721, 103070467, 95120612, 88446205, 82841536, 78132647, 74199904, 70931978, 68185579, 65797581, 63649200, 61719135, 59995044, 58429599, 57034548, 55867502, 54971109, 54399619, 54211492, 54400661, 54885166, 55607354, 56618727, 58004115, 59779840, 61959057, 64626526, 67914132]
7766F7914132M025968M866114N800405O835093P992902R294603J0736378J2290945
7758A29756540J3837823J5212496J6251786J6739601J6526334J5508211J3594557
7751B37427348J0786857P079901K497663k746808q140219j3001282j6703253j8858551
7743A98341656j9477330j8868571j7433404j5575172j3603656j1676697r893796
7736I1813030q348699p068379o027283n178428m445618l809220l265449k818600
7728E0851354k464141k185017j956758j743027j542683j368881j187579r74563
7720C7428705p52863n38778l30781j51055j5J64659L67748O01826Q51213J112008
7710C8752667J410156J775629K180600K615737L117574L721160M414689N151617
$$ y = [67914132, 71940100, 76806214, 82606619, 89441712, 97434614, 106729217, 117465595, 129756540, 143594363, 158806859, 175058645, 191798246, 208324580, 223832791, 237427348, 248214205, 255294106, 257791769, 255044961, 246904742, 233903460, 217200207, 198341656, 178864326, 159995755, 142562351, 126987179, 113383523, 101706826, 91813030, 83464331, 76395952, 70368669, 65190241, 60744623, 56935403, 53669954, 50851354, 48387213, 46202196, 44245438, 42502411, 40959728, 39590847, 38403268, 37428705, 36675842, 36137064, 35806283, 35655228, 35655213, 35819872, 36187620, 36789446, 37640659, 38752667, 40162823, 41938452, 44119052, 46734789, 49852363, 53573523, 57988212, 63139829]
7702F3139829N932681O728362P397507P865474Q106976Q042220P585502O705471
7694A21504022N351162L458197J113247j525756m245821o683707q503940r554481
7686A00912923r858994r558423q830601p912044o982733o101490n283001m529688
7678D1855949l841730l237663k725104k306066j996751j745281j496014j266189
7670B3241151j078784r20291q04691p36154o74780o17091n55922m58148l33895
7661A7061395k41365j76595r0331J5737J08257J55755J85206K39628L21784M38422
7651A8017893N96994P69930R41690J135146J379990J648382J906714K157667K379857
7642C0934263K542480K613365K590827K474040K175397J660737R95725K27885
$$ y = [63139829, 69072510, 75800872, 83198379, 91063853, 99170829, 107213049, 114798551, 121504022, 126855184, 130313381, 131426628, 129900872, 125655051, 118971344, 110467404, 100912923, 91053929, 81495506, 72664905, 64752861, 57770128, 51668638, 46385637, 41855949, 38014219, 34776556, 32051452, 29745386, 27748635, 26003354, 24507340, 23241151, 22162367, 21242076, 20437385, 19701231, 19026451, 18409360, 17853438, 17395290, 17061395, 16820030, 16643435, 16553104, 16568841, 16677098, 16832853, 17018059, 17257687, 17579471, 18017893, 18614887, 19384817, 20326507, 21461653, 22841643, 24490025, 26396739, 28554406, 30934263, 33476743, 36090108, 38680935, 41154975, 43330372, 44991109, 45986834, 46214719]
7634D6214719o15791j458472k203612k773399l123502l256140l172373k924087
7626B6687343k594743k266356j985288j753167j534017j272918j024805q27510
7618A3428539o72592n58967m57979l56896k39583j46104j43336j96946k28406
7609A0427730k33500k03198j27057m9503k4902n9492j22530j92537k38024k43352
7599H933635k21070k17347k66789l28181l37038l08739l01754l17487l16867l06555
7589F011808k95157k71018k34811j91573j75278k00833k09928j68247j18171r8607
7579D048185r7861r4801p3397p8224j29653j60051j17256m7189k6494p4426j22503
7568C026330j21337p9226k7219r146k0445l3076o5348r0969p5755o5280p9650
$$ y = [46214719, 45598928, 44140456, 41936844, 39163445, 36039943, 32783803, 29611430, 26687343, 24092600, 21826244, 19840956, 18087789, 16553772, 15280854, 14256049, 13428539, 12755947, 12196980, 11739001, 11382105, 11142522, 10996418, 10853082, 10656136, 10427730, 10194230, 9991032, 9863975, 9814472, 9789570, 9730078, 9607548, 9415011, 9176987, 8933635, 8712565, 8495218, 8228429, 7900248, 7563210, 7254471, 6952717, 6635230, 6318363, 6011808, 5716651, 5445633, 5210822, 5019249, 4843971, 4643138, 4433210, 4264963, 4146792, 4048185, 3950324, 3855523, 3782126, 3703902, 3574249, 3414198, 3296942, 3249753, 3223259, 3148833, 3026330, 2904993, 2825767, 2798548, 2789402, 2768957, 2735881, 2670533, 2579564, 2503809, 2438529, 2358879]
7557B358879q1826m5755j002K3812L0963J3730m8344j21396j61020j85378j68645
7546A614018p8826K2952Q2042Q0383M7386K8281K7345L4749M1769L8376M6320
7535A984795N5936K6824o076j2345q119r052k15L958m0634r8385r6497j9016O0366
7522A841540P4580L3304l451r820k3059n4073q1630j01756j03645q2738n0823
7511A438429k7565l664R044J1064K1303J6784j839k6423o9883p8564l8522Q573
7499A258737L2845J2535j7317m7038q9265p4836j3218R586O78k9542p4878r8524
7487H69763j03099j00740q6099l3720M9421J08202J22719J30532J23055P1911
7477A151945L993q975J5102K3021L9280M8393L3310J3580k0001l7675p804K5298
$$ y = [2358879, 2277053, 2231298, 2230296, 2254108, 2285071, 2298801, 2250457, 2129061, 1968041, 1782663, 1614018, 1535192, 1558144, 1640186, 1720569, 1767955, 1796236, 1823581, 1858330, 1900099, 1938475, 1984795, 2040731, 2067555, 2061479, 2049134, 2041015, 2031963, 2031748, 2035706, 1995072, 1896687, 1800190, 1781174, 1841540, 1916120, 1949424, 1945973, 1936153, 1913094, 1859021, 1777391, 1675635, 1571990, 1489252, 1438429, 1410864, 1407200, 1416244, 1427308, 1448611, 1465395, 1463556, 1437133, 1367250, 1288686, 1250164, 1258737, 1291582, 1304117, 1286800, 1239762, 1150497, 1075661, 1062443, 1072029, 1072707, 1043165, 968287, 869763, 766664, 665924, 579825, 546105, 595526, 703728, 826447, 956979, 1080034, 1151945, 1155938, 1146963, 1162065, 1185086, 1224366, 1272759, 1306069, 1319649, 1299648, 1261973, 1254169, 1279467]
7465A279467M0865M5815L3671J9221k46l7199n6321k3068J7488J6564k8777m1203
7453A266277L6827R1036N7370J6876K2909M3986N7531M7252N975l0042k9364o517
7441A580116K7728N1301L8521j8345q2186j26163j38134j08084n4847n345J665
7430A166227m637q430r078l306k78j1062n3250r0272p4458k2124J8369J8567J5681
7417I41949L6312N5903P9876Q1735M5393Q587r719l638J1872J6826J184k3679
7405A242601l2017l0758m6884p5850r9479j16404r9462o6449n8189o5443n2639
7394D99027M216P7473J06256P1149l587l8521p103R711j1212n1605q3772n9495
7382E12537M077O1868O8287L4068L2438N9799O5887L3481O533r697o7023j20832
$$ y = [1279467, 1320332, 1366147, 1399818, 1419039, 1418793, 1381594, 1325273, 1302205, 1319693, 1336257, 1307480, 1266277, 1303104, 1394140, 1451510, 1468386, 1491295, 1535281, 1592812, 1640064, 1646039, 1615997, 1586633, 1580116, 1607844, 1659145, 1697666, 1679321, 1597135, 1470972, 1332838, 1224754, 1169907, 1164562, 1166227, 1161590, 1153160, 1144082, 1140776, 1140498, 1129436, 1076186, 985914, 911456, 889332, 907701, 926268, 941949, 978261, 1034164, 1114040, 1195775, 1241168, 1249755, 1240036, 1236398, 1248270, 1265096, 1266280, 1242601, 1210584, 1179826, 1132942, 1057092, 957613, 841209, 741747, 675298, 617109, 551666, 499027, 503243, 580716, 686972, 758121, 754534, 716013, 708910, 718621, 707409, 655804, 572032, 512537, 516614, 578482, 646769, 680837, 713275, 773074, 838961, 872442, 878975, 869278, 802255, 681423]
7370F81423j12208o2736n5706r1439q1611m2369m0348k7998K6844O9205N8468
7359C21525K0933L668J8976L4871K5034r618n5549p8734p3494p7417p7072j6543
7347C6580N5073O5480M6859M9672M3391P280j5271Q668N5728Q1128O5657N161
7335E05406p3156r4889n4361M079M3122L4925J1896J0967K4103L8500M8567L0884
7323E30043j4731n4820n9663p443P0579J08570R6162M6696k541j2854Q429N2616
7311G61043N8282J379k7888J243L891n8217r3231l7043O6759J27642J17274P1342
7299I92476R007m2853o1386l5831P395L6804N1282O4004N7742n473q2346j06061
7287H84760p0810m65L1981N966m2113p6173o7063m4862o4848r9765p4341j7982
$$ y = [681423, 569215, 506479, 450773, 359334, 277723, 235354, 195006, 167008, 193852, 263057, 321525, 342458, 346126, 365102, 399973, 425007, 415389, 359840, 281106, 207612, 130195, 53123, 36580, 91653, 157133, 203992, 253664, 297055, 304335, 289064, 297732, 353460, 434588, 500245, 505406, 432250, 337361, 283000, 287079, 330201, 365126, 377022, 387989, 412092, 450592, 499159, 530043, 515312, 460492, 400829, 393386, 463965, 572535, 668697, 715393, 712852, 699998, 708427, 761043, 819325, 820704, 792816, 794059, 797950, 739733, 646502, 609459, 676218, 803860, 921134, 992476, 1001483, 958630, 897244, 861413, 868808, 905612, 956894, 1020898, 1078640, 1073167, 990821, 884760, 813950, 813485, 845466, 851432, 809319, 733146, 666083, 621221, 556373, 456608, 382267, 364285]
7275C64285j001K301K6312J8600j7450k1339J2779P2850J26886J29411R6854N3109
7263H63597j0907o9944q8616n9241j5867j701j7755l8512o0307p5097m6406M0333
7251D19577J05339Q6407K4844k2371j9948J8794N4163M4115J004m0142p3374o9311
7239E29097n04P6427R8261P7328P4235O7922K862n1677l3554M019J9177K7352
7227H90945Q992k8038l9081l9936m7882m2888l2527k6592k2770l0739l8100k9431
7215E21953k6378k6052q822L4431Q6090J17058R9153N5553K0722j4623l6468k0254
7203H02363J4147K5582k457l7052k3460L3663M2510q557j8412J451j9442n4958
7191G55378p4350q5031j06332j31923j19367o3999p056K3831N0894P2299P5149
$$ y = [364285, 363284, 365585, 391897, 410497, 393047, 371708, 384487, 457337, 584223, 713634, 810488, 863597, 852690, 782746, 694130, 634889, 619022, 617321, 599566, 561054, 500747, 425650, 379244, 419577, 524916, 611323, 636167, 613796, 593848, 612642, 666805, 710920, 711924, 671782, 598408, 529097, 528593, 605020, 703281, 780609, 854844, 922766, 925628, 873951, 840397, 844416, 863593, 890945, 899937, 871899, 832818, 792882, 745000, 702112, 669585, 642993, 620223, 589484, 551384, 521953, 495575, 469523, 460701, 495132, 581222, 698280, 797433, 852986, 873708, 859085, 822617, 802363, 816510, 842092, 839635, 802583, 779123, 812786, 855296, 846739, 828327, 829778, 810336, 755378, 681028, 595997, 489665, 357742, 238375, 174376, 167320, 191151, 242045, 314344, 389493]
7180C89493O4850N5763L0947j5784p0368j16296j26973r4027k0025Q2976J64321
7169C44877J81666J46407Q3281R674n3972r0584j04093q1930o8204j02356j15792
7158A48974p9154m3879k2057Q973K9263K8429N7684J01536J29552J27528Q1020
7147E67869J9875j8708n0275j03099j40497j46899j26672p6109n561M7193O1722
7136B8839M7115K5392O632k451O920J1395N709J1752R343J0027K947j8656l4390
7123A10574m9097j0444P5674J14580R1202N3700P607m6316o6901n2620j9280J2539
7111B21218J3314j0695m0558o2232o6450o1735o3592p0529o0976l5666k0598M421
7099b54078M9565P6742N9538J4590k6639m7534n2176m5169k9725n555M0349P7209
$$ y = [389493, 454343, 510106, 541053, 525269, 454901, 338605, 211632, 117605, 97580, 180556, 344877, 526543, 672950, 756231, 765905, 711933, 621349, 517256, 435326, 367122, 264766, 148974, 69820, 25941, 3884, 12857, 42120, 70549, 128233, 229769, 359321, 486849, 567869, 587744, 569036, 518761, 415662, 275165, 128266, 1594, -74515, -80076, -32883, 28839, 75954, 101346, 107978, 105527, 112447, 123842, 129551, 141303, 150646, 160673, 163620, 144964, 110574, 61477, 51033, 126707, 241287, 332489, 386189, 393796, 347480, 280579, 227959, 208679, 221218, 234532, 223837, 183279, 121047, 54597, -7138, -70730, -141259, -202235, -237901, -258499, -254078, -204513, -127771, -68233, -53643, -80282, -127816, -179992, -225161, -254886, -260441, -220092, -142883]
7087a42883N4088J8809J2066J3582K5744M2517O7777P9704P3814O8493P3214O7993
7075D54918J9976l7260o1809n1780j9707p108k6673m1477l7880k2371k5067m4589
7063I9173m1843j7743p248J8028M8463K0888m6963q1237p0409n3419k9791j0514
7051a72615K751K7627N0231O8648O2259N0526L4912k5117j10220j45817r0924
7040b47739m738K0821l4747r1825o3323K3861O8950O4583M8567P782n0495p1222
7028c29525l0777J8401L6793L9421M0946M7022P1127R8522R9559O0424J1425O289
7016A69627P499k0633l6795r981L0252N6952N8955K8197J851j7015l6858l7514
7004A94537j7301K8964N3257K4755j4378J4133Q3656J27512J24458Q6547L3722
$$ y = [-142883, -88795, -69986, -57920, -44338, -18594, 23923, 91700, 171404, 245218, 313711, 386925, 454918, 474894, 437634, 375825, 324045, 304338, 297230, 270557, 229080, 191200, 168829, 143762, 99173, 57330, 39587, 32339, 50367, 98830, 119718, 72755, -8482, -78891, -132310, -162101, -172615, -169864, -142237, -92006, -23358, 38901, 89427, 124339, 99222, -10998, -156815, -247739, -252477, -231656, -266403, -358228, -421551, -397690, -328740, -264157, -215590, -207808, -258303, -329525, -360302, -341901, -305108, -265687, -224741, -177719, -106592, -8070, 91489, 151913, 163338, 169627, 177126, 156493, 119698, 109717, 139969, 196921, 255876, 284073, 285924, 268909, 232051, 194537, 177236, 206200, 259457, 284212, 269834, 283967, 367623, 495135, 619593, 706140, 739862]
6993G39862l8628j07444j25159j00939p7139p5462m8746J2723N0306N3469M5603
6982C28446L4787K5277j0388p3967j13762j01719n4005P40M5391N8012N6188M7263
6970B42263L7738K7804K0541L4549O6319M7474n766k5440j1374k583k872p883
6958D20770j3956r699k5264k8981J2753N8110P9201Q1402O3466L2081J7220R228
6946F96331k5194o7769q6366n5767r383L526j8686l7026k9725j7397l589K6966
6934C75921N5114O0028M6577K9826L5495L0699n449m2254o1189n5053k8198n394
6922D36123N872J6909J7182J7998L8813M2234K5153J7972R173n571l2717q1463
6910E07678j28162j33628r5811m4571q78l824k3135j0890L2121N8374M4188K9361
$$ y = [739862, 701234, 593790, 468631, 367692, 290553, 215091, 166345, 179068, 229374, 282843, 328446, 363233, 388510, 378122, 304155, 190393, 88674, 34669, 35409, 80800, 138812, 195000, 242263, 280001, 307805, 328346, 362895, 429214, 476688, 470922, 445482, 434108, 431525, 428653, 420770, 406814, 397115, 371851, 342870, 355623, 413733, 492934, 574336, 637802, 669883, 687103, 696331, 671137, 603368, 517002, 461235, 451852, 455378, 436692, 399666, 369941, 352544, 348955, 375921, 431035, 491063, 537640, 567466, 602961, 633660, 628211, 585957, 524768, 469715, 441517, 436123, 441995, 458904, 476086, 494084, 532897, 575131, 600284, 618256, 627429, 621858, 589141, 507678, 379516, 245888, 150077, 105506, 104628, 100804, 77669, 66779, 98900, 157274, 201462, 230823]
6898B30823M2375O4706N6492r348q4229q0505l0449k4897n8842o6950k1068L8802
6886E6910O3677M7318R239j5449m159K2181K6827j204k4795J1131N0396L2251
6874B74323o040n029K5269K4043J3800M1358O9118N9937J9267k0527n7990q4015
6862C53514p6064n1828n2849n5561l7601j4091M1749R3024R6639O6117M148q1239
6850B85958j13500o6679l334M8250P4966P1571O2479N8209M1060o049l5896m9016
6838C68019n2556m9124r2881j33254j07874o0303j9986L7887Q5206Q8939N8734
6827A22807k1654r2139q7806l1733K2577M2013K1418j7680j2821M4958Q4569O2325
6815A36834K9566K4941K6364L2414L1912K032k4500j3677L3720P7947O4084J0844
$$ y = [230823, 273198, 337904, 394396, 385048, 300819, 220314, 189865, 164968, 106126, 39176, 18108, 56910, 120587, 167905, 177144, 161695, 157536, 179717, 206544, 205340, 180545, 191676, 242072, 274323, 268283, 263254, 288523, 312566, 326366, 367724, 436842, 496779, 516046, 495519, 437529, 353514, 277450, 225622, 172773, 117212, 79611, 65520, 107269, 200293, 296932, 363049, 367197, 285958, 172458, 105779, 102445, 150695, 225661, 297232, 359711, 417920, 458980, 452931, 417035, 368019, 315463, 266339, 173458, 40204, -67670, -127973, -147959, -110072, -24866, 64073, 122807, 101153, 9014, -78792, -110525, -87948, -45935, -24517, -42197, -55018, -10060, 74509, 136834, 166400, 191341, 217705, 250119, 282031, 284063, 259563, 245886, 279606, 357553, 421637, 432481]
6803D32481j0407k1079n7157n3415j1649L292j6210l8454m5927m2535k5028N782
6791A19694K0963N57k2350j7649r887l844K6052M6468M1829M2815O3841R0939
6779C99428R3934M0906k4359m2914n4394r3209j01931n4659k3008k0912m438L1810
6767A46254R2814J44763J43425J26460J01600L0431l6960l9993l0175m5327l8004
6756E95288j16L7403J6678n3412r7981r6481n9474j0505L9334P5906P2689M7352
6744E66681O4645J22613J54245J31082R5997R6136J28753J72376J90006J62684
6734A885218J46146J76085K17569K26561K09315J82122J13683m0635k40248l80706
6724B495110m13175l54610k43725j35935o0660k6455l1779m9693n5325l1150J6267
$$ y = [432481, 422074, 400995, 343838, 290423, 278774, 282066, 265856, 227402, 181475, 138940, 113912, 119694, 140657, 141214, 118864, 101215, 91328, 87484, 113536, 160004, 201833, 244648, 308489, 399428, 493362, 534268, 509909, 466995, 412601, 319392, 217461, 162802, 139794, 118882, 114444, 146254, 239068, 383831, 527256, 653716, 755316, 785747, 748787, 708794, 678619, 633292, 595288, 595172, 632575, 649253, 595841, 497860, 401379, 341905, 331400, 370734, 446640, 519329, 566681, 631326, 753939, 908184, 1039266, 1135263, 1231399, 1360152, 1532528, 1722534, 1885218, 2031364, 2207449, 2425018, 2651579, 2860894, 3043016, 3156699, 3116064, 2875816, 2495110, 2081935, 1727325, 1483600, 1347665, 1287005, 1260550, 1228771, 1179078, 1123753, 1092603, 1108870]
6713A108870M7005N2350M0951M0150M3296K8839M2659R3842J21485R4800M6428
6702A760675L0407Q2784J55182J81270J67173J30995J01510R9872R5222Q3558
6692B888648Q7598J22854J88274K56045L30171M05228M34010M37816M46653M16746
6682F014043L63327L15128K56561J48108n56j60397l21494m28679m52338m39889
6672E293814m77103n58509n64682m49707l11033k15612j76285j77105k05102k26774
6662A931902j83506j11310p9656p9793q2606q1542r1158q7027n4879l0935n383
6651A044107L5411O0520L8989j7153p0972p6579l9712j9426l3237o1521p0295
6640G90132m5123n071J3758J2390J5154J5181j5167m1243j8303K8120N4527L8934
$$ y = [1108870, 1155875, 1208225, 1249176, 1289326, 1332622, 1361461, 1404120, 1497962, 1619447, 1714247, 1760675, 1791082, 1873866, 2029048, 2210318, 2377491, 2508486, 2609996, 2709868, 2805090, 2888648, 2976246, 3099100, 3287374, 3543419, 3873590, 4278818, 4712828, 5150644, 5597297, 6014043, 6377370, 6692498, 6949059, 7097167, 7096611, 6936214, 6614720, 6186041, 5733703, 5293814, 4816711, 4258202, 3693520, 3243813, 2932780, 2717168, 2540883, 2363778, 2158676, 1931902, 1748396, 1637086, 1557430, 1477637, 1395031, 1313489, 1222331, 1135304, 1080425, 1049490, 1044107, 1079518, 1140038, 1179027, 1161874, 1090902, 1014323, 974611, 955185, 921948, 860427, 790132, 745009, 739938, 753696, 766086, 781240, 796421, 781254, 740011, 721708, 749828, 804355, 843289]
6628H43289l698m3773p4319r8388j07849n9829O894K5519K7062L2877L1610J0147
6616E89542j2755l9282q9282j31408j28863p8794k4872J7009P2838J14712Q9644
6605C78489M3445o520n7731j00086j13106p4724k4944j1871l5851o3483p1185
6594a37567l8691J3362O1737J03290J31276J15994N5224j3684n5491n3225l2198
6583A50027j7765Q296M2097L9668K4084j76l3469n2305k9251K6833N3273N0646
6571B61958K2978q754j0695J8039P2727J15230R7013L3783l4811p2773p4574p6889
6559C43232r5065j15247j15461r3925n4820J380O2618J23285J65692J37735M0569
6548C99993k5789m9155q2989j05905q1155m3568m2619n4626k1646N3775J04516
$$ y = [843289, 839591, 795818, 721499, 623111, 515262, 455433, 462327, 487846, 514908, 547785, 579395, 589542, 576787, 537505, 448223, 316815, 187952, 109158, 84286, 101295, 174133, 288845, 378489, 421934, 415414, 357683, 257597, 144491, 69767, 44823, 32952, -2899, -66382, -137567, -176258, -162896, -101159, 2131, 133407, 249401, 304625, 290941, 235450, 182225, 150027, 132262, 140558, 182655, 222323, 246407, 246231, 212762, 160457, 131206, 158039, 211312, 261958, 284936, 276182, 265487, 283526, 356253, 471483, 568496, 602279, 567468, 494695, 420121, 343232, 248167, 132920, 17459, -76466, -131286, -129906, -67288, 55997, 221689, 359424, 399993, 374204, 325049, 242060, 136155, 55000, 11432, -31187, -85813, -107459, -53684, 50832]
6537E0832J02199Q2949O8713L6643j9904k9894J3063N8193Q7755Q4075M6276j2577
6525E68323o6946p7199m9661l8126m1423l1786J667M058m0710q0462q7357m3587
6513A6791K8317P5713Q7946O8151L5947L2799N4470M2131k3392p1541o3488k5788
6501B58056J3643R927o0384j09215q7500j4000P5521J03857L2624n7757r8350
6490F6422p3113m543M1135N5309M8376K5213L228P893J9711J6419J4478J1209
6478B31737j2942l9531k2253J0359N33j2036p478n374o208j5215n755L6137P6694
6465B28668P7835L4426Q144L9922O2611M8567L0357J8943J2668k372k4769k3067
6453E11933j4027j1550k0311k6982l7684m9710m1771m5959n7010l2102K0119N1391
$$ y = [50832, 153031, 235980, 304693, 341336, 321432, 291538, 304601, 362794, 450549, 534624, 580900, 568323, 501377, 424178, 374517, 336391, 294968, 263182, 264849, 268907, 228197, 147735, 60378, 16791, 45108, 120821, 208767, 276918, 312865, 345664, 400134, 442265, 418873, 347332, 283844, 258056, 271699, 281626, 221242, 112027, 24527, 10527, 86048, 189905, 222529, 164772, 66422, -6691, -11234, 29901, 85210, 133586, 158799, 162027, 169920, 189631, 206050, 220528, 231737, 218795, 179264, 157011, 167370, 167903, 155867, 148389, 143015, 136807, 121592, 115837, 151974, 228668, 306503, 340929, 349073, 388995, 451606, 500173, 530530, 549473, 562141, 559769, 535000, 511933, 497906, 486356, 466045, 439063, 401379, 351669, 309898, 263939, 206929, 174827, 194946, 246337]
6441B46337K6202m9394r6229q1279l0459K9285P3983P7084M3941J2233j2756k2076
6429B16872j212l99j2030M116J8266J0565q253j8552j6249j4842o116J5803L3016
6416B20985M0796M8354L5696k050m4839q1529q2397m7454J1674O2034M2480r924
6404A93826j3365L801K6272O7354R5609N6245k6581n7374j7999K8287N3164N8853
6392D68092J5760n8627q0562l1269K6180M6079M3981L7643J6174k7716n5783j8306
6380C81646M1774L8852k2611o6025n6226m1614m8663m1250k3843k0755j9982k833
6368A18470K4553M4522M6414M0009M7563P5859R3828O7299K0881k775j6488l1580
6356E28555n2668q2320q6402m9761j1525j2962k0686M418O0723J04558J13758
$$ y = [246337, 272539, 223145, 126916, 45637, 15178, 44463, 118446, 195530, 239471, 251704, 238948, 216872, 215660, 215261, 203231, 207347, 225613, 236178, 227925, 209373, 193124, 178282, 172166, 187969, 220985, 261781, 310135, 345831, 343781, 298942, 217413, 135016, 87562, 99236, 161270, 203750, 193826, 180461, 184262, 210534, 277888, 373497, 429742, 403161, 345787, 327788, 356075, 409239, 468092, 483852, 425225, 344663, 313394, 339574, 385653, 429634, 467277, 483451, 455735, 399952, 381646, 423420, 462272, 439661, 373636, 317410, 275796, 227133, 185883, 162040, 141285, 121303, 118470, 143023, 187545, 233959, 273968, 321531, 397390, 491218, 558517, 579398, 576623, 560135, 528555, 475887, 393567, 307165, 257404, 245879, 232917, 212231, 216649, 277372, 381930, 495688]
6345D95688J00639P3625N9671O5478O4224L6239j551k1812j6293O009L1239K7785
6333I20941L065j7708l123L3520N9630P0488O3935N2270M8259Q2246J28533J29337
6321A571393Q9894M4289N1456J15480J64178J82801J85170J86971J78094J55645
6311B925371J34991Q6244J093q1776j30518j28041r3529l9347L826m811l6624
6300B636879m0325p082L2241N0449P9521R7988N8026o237l9726m208Q2134J35719
6288C075379Q9879J0209m5382q9780j10159p9814m9720m2889k8438n987J5715
6277B739013K3920L879k934K6313M4033J6281l4294n0830j9975N928k1498q7788
6265B642048j61183j93600j56253j11919j12220j29226q7284J0224P1199P2145
$$ y = [495688, 596327, 669952, 729623, 795101, 859325, 895564, 894013, 872201, 855908, 861917, 893156, 920941, 924006, 906298, 903175, 936695, 996325, 1066813, 1130748, 1183018, 1231277, 1313523, 1442056, 1571393, 1661287, 1705576, 1757032, 1872512, 2036690, 2219491, 2404661, 2591632, 2769726, 2925371, 3060362, 3146606, 3147699, 3065923, 2935405, 2807364, 2713835, 2674488, 2678314, 2673503, 2636879, 2596554, 2589472, 2621713, 2672162, 2751683, 2849671, 2907697, 2901460, 2861734, 2857526, 2939660, 3075379, 3165258, 3175467, 3130085, 3040305, 2930146, 2850332, 2800612, 2757723, 2729285, 2723298, 2739013, 2762933, 2766812, 2763878, 2790191, 2834224, 2850505, 2816211, 2765381, 2745406, 2751334, 2729836, 2642048, 2480865, 2287265, 2131012, 2019093, 1906873, 1777647, 1690363, 1700587, 1771786, 1843931]
6255A843931N0689N4051J05984J43058J20278P3745K8566k0671o9881j08106j28509
6244B093135j49159j86917k06897j73358j17969p6087m4478m4684q4368j06305
6234I02913p5045l8611j0725K2757M5413N7266L8510p109l8452m5393k6213l16
6222H24995k798K176M0372P7572R3450O3050j4253q4556j34637j52687j08377
6211F04307o4757o9542p1163n9948o4220m5800J9316Q9402J17070Q1945J0172
6200E46782n2301q0172p3945n9457m5554j0488M3532Q0927O5926L8736M0565N1542
6188E46093O5905R7842J48309J80326J74527J09481J5051p5603j61663k10362
6178H89906j83421j02430j6903N1124Q0323Q5452P8461J1994r1731j48855j38557
$$ y = [1843931, 1894620, 1948671, 2054655, 2197713, 2317991, 2391736, 2420302, 2399631, 2329750, 2221644, 2093135, 1943976, 1757059, 1550162, 1376804, 1258835, 1182748, 1138270, 1093586, 1009218, 902913, 827868, 789257, 778532, 801289, 846702, 903968, 942478, 935369, 896917, 851524, 825311, 824995, 822197, 824373, 864745, 942317, 1035767, 1098817, 1084564, 1000008, 865371, 712684, 604307, 539550, 470008, 398845, 338897, 274677, 228877, 248193, 337595, 454665, 536610, 546782, 494481, 414309, 340364, 280907, 235353, 224865, 268397, 349324, 415250, 453986, 494551, 546093, 611998, 709840, 858149, 1038475, 1213002, 1322483, 1337534, 1261931, 1100268, 889906, 706485, 604055, 587152, 638276, 718599, 804051, 882512, 894506, 802775, 653920, 515363]
6167E15363r6181p3304p4232m9208O122L8555L5269K2414Q835P349K5456N7249
6155D23687R6633J16320O0872k0914l8332j0707P005j6302m9964n2329l8197k1595
6143D56177K0743Q1089J04689R3591J02950J21901J16462J00615O2862N786l6706
6132A230159k3499L4045Q0264J03139R6197P2057Q9654J59093K42274L22384L96690
6121B802457M19146L76019L50124L62376L36310K44576J50230R9929L1744q5424
6111E087487k04606k86157l24530l49513l56946l34168l02583k66742j93138j17689
6101B351415q5184o3033l4044l4016n5422o8537n7028l1453j4485k9291q1218
6090A797704j34287j27268q1665o7083r4473j07675q7829p1710p3284o5941j5003
$$ y = [515363, 419182, 345878, 271646, 222438, 228560, 267115, 302384, 324798, 333633, 340982, 366438, 423687, 520320, 636640, 697512, 676598, 638266, 627559, 634564, 618262, 568298, 515969, 477772, 456177, 476920, 558009, 662698, 756289, 859239, 981140, 1097602, 1198217, 1261079, 1266865, 1230159, 1206660, 1240705, 1320969, 1424108, 1520305, 1592362, 1682016, 1841109, 2083383, 2405767, 2802457, 3221603, 3597622, 3947746, 4310122, 4646432, 4891008, 5041238, 5141167, 5172911, 5087487, 4882881, 4596724, 4272194, 3922681, 3565735, 3231567, 2928984, 2662242, 2469104, 2351415, 2266231, 2203198, 2169154, 2135138, 2079716, 2011179, 1954151, 1922698, 1908213, 1878922, 1797704, 1663417, 1536149, 1454484, 1387401, 1292928, 1185253, 1097424, 1025714, 952430, 886489, 871486]
6079H71486O4531J38049J65373J41858J11387J03169J05218R0508N4516Q855n1874
6068A803076r1543q1157n8472k7586K2226K8322j0833k0222j3404l3446m0297
6057A476664P124N5257L9592j2940l9753l6832j4274K987n166o4617j52385j86108
6045A069549j34368l4422M5634N9445J6893m1176q1048q0428m6622j4370P383
6034G66470J6496K34j4603j0472k537L240N391k282o014N896J5283K890o840o731
6020G66421r757o965l511J020J3710J7650R718q693k4730l2003n3193o2248m1568
6007E65851r837J2464J5780J8086K1509N9555J28584J48359Q5180Q090l0772l6745
5995I86104l3264l5701m0801l7730j2789M7065R0014O7353K7842K3359l176p7423
$$ y = [871486, 936017, 1074066, 1239439, 1381297, 1492684, 1595853, 1701071, 1791579, 1846095, 1854950, 1803076, 1711533, 1630376, 1571904, 1544318, 1566544, 1594866, 1584033, 1563811, 1550407, 1516961, 1476664, 1483788, 1539045, 1578637, 1565697, 1525944, 1489112, 1474838, 1477825, 1472659, 1408042, 1255657, 1069549, 935181, 900759, 946393, 1005838, 1022731, 981555, 900507, 820079, 773457, 759087, 766470, 782966, 783200, 768597, 758125, 755588, 758828, 764219, 761937, 755923, 761819, 777102, 779992, 773152, 766421, 756664, 749699, 746188, 747208, 760918, 778568, 788286, 779593, 754863, 722860, 669667, 607419, 565851, 556014, 568478, 584258, 602344, 623853, 683408, 811992, 960351, 1045531, 1053621, 1022849, 986104, 952840, 917139, 876338, 838608, 825819, 872884, 962898, 1030251, 1058093, 1081452, 1078276, 1000853]
5983A000853j22899r7337n9420p8030j09776j01718q0148p2757n4766j7567R457
5972B15892J6574J8287K1858J593o5741j24664j32028j00709n6789K721Q2477
5961a20529J39037J38869J00205M9525P704l1171o2231r3461j05294q2328n9874
5950a19548m5930k7833J8596Q7628J12348R9239O1483l976o2423n7999q254J8016
5938G1347J1373J085J003j9031n5151o0873k5479J9495O7809J07159Q3284K2083
5926B24104p882m2661q8135r7793p5368n4540j4331L9575N2684J7108l1104n3181
5914a31524o2539p6415p1320m7077m829P3321J45052J23212L5827k7803n8478
5903a02573o4392l4005m01J6037K2879L3109L8195J1695j3916P562N1143O4142
$$ y = [1000853, 877954, 780617, 721197, 643167, 533391, 431673, 351525, 278768, 224002, 206435, 215892, 232466, 250753, 272611, 274204, 208463, 83799, -48229, -148938, -205727, -203006, -120529, 18508, 157377, 257582, 307107, 314811, 283640, 221409, 127948, 22654, -59674, -119548, -165478, -193311, -174715, -87087, 25261, 124500, 185983, 182007, 119584, 61585, 53331, 71347, 82720, 83805, 84808, 65777, 10626, -50247, -75726, -56231, 11578, 118737, 202021, 224104, 216222, 173561, 85426, -12367, -87735, -142275, -156606, -117031, -64347, -47239, -78343, -131524, -194063, -270478, -341798, -388875, -393704, -320383, -175331, -52119, -16292, -44095, -102573, -166965, -200970, -201371, -185334, -162455, -129346, -91151, -79456, -93372, -85810, -34667, 29475]
5891B9475K0780l4889j9994M9852Q1795O5557L6448m428m7037p5835o8316k7142
5879F266J4338K2324M068l7851p1398k5884K7664n345n0603k2405L0419M8979
5867e9428K5091j1206j0140L8787P8457M8704j1719m0710k231P7423Q3637J7891
5855B34556k6206m7534m1304j1011J4408J9386l142j0846l728P086L2371M5362
5843B09398K3049N549l422j5828j1430J7560M6385L8544o598n9476r0998p8670
5831G4063m6090k9383j7567p036N856M2423Q0632O6570K194n4929p5750p2956
5819c1973m4653J4552P7976J10410P4458J384l0496k6749j7382k2119m9716p8384
5807b2692o1824k2808j2962l9474p3029n5731Q706N6942M3110j2507m7133l2717
$$ y = [29475, 50255, 15366, -4628, 45224, 127019, 192576, 229024, 224596, 177559, 101724, 33408, 6266, 20604, 42928, 46996, 9145, -62253, -88137, -60473, -65818, -116421, -138826, -108407, -59428, -34337, -45543, -55683, -16896, 61561, 110265, 98546, 57836, 55605, 133028, 216665, 234556, 208350, 160816, 119512, 108501, 122909, 142295, 139153, 128307, 124579, 131665, 164036, 209398, 232447, 237996, 234574, 218746, 207316, 224876, 271261, 309805, 303207, 243731, 152733, 74063, 27973, -1410, -18977, -26013, -20157, 22266, 102898, 169468, 171662, 116733, 40983, -31973, -76626, -62074, 15902, 126312, 200770, 202154, 171658, 144909, 127527, 105408, 55692, -22692, -84516, -107324, -120286, -159760, -232789, -288520, -279814, -222872, -179762, -192269, -239402, -272119]
5795b72119P744N1662O1532L9662N1581Q3381P9359M7506O37l8450j3898O7977
5783A66574J21554R2886J8109l2240l0469p373n165k5520l7019p455M6110O7059
5771C67051J7815o4459j25313j36771q1915J259N6222O5731N5631N0295N0802
5760B56348N0627N6724N0113p740o5721n7558j8357J657q38n821q516j2678l5997
5747B02243n5918m2713j632K5009k706l7220j2188L8348N9805O5640O9199M8249
5735C56116j2287r4209j48187j27277n5298j4344j8607j7897k581L1209Q2577
5724b0785J24417J18013O5943n740n3386n1603j8066J1931K8856L9976M2512L549
5712B85617p0946j15202j04907o9380n3151p0425p5924m5560q821Q55k2030m6028
$$ y = [-272119, -264375, -212713, -151181, -111519, -59938, 23443, 102802, 150308, 150945, 112495, 98597, 166574, 288128, 381014, 399123, 366883, 336414, 329041, 323876, 298356, 261337, 253882, 299992, 367051, 384866, 320407, 195094, 58323, -23592, -22333, 33889, 99620, 155251, 205546, 256348, 306975, 363699, 413812, 406072, 340351, 282793, 264436, 266093, 265255, 259434, 250918, 238240, 202243, 146325, 103612, 101980, 126989, 124283, 87063, 74875, 113223, 173028, 238668, 307867, 356116, 343829, 249620, 101433, -25844, -81142, -95486, -114093, -131990, -134571, -103362, -20785, 103632, 221645, 287588, 281848, 228462, 176859, 158793, 170724, 199580, 239556, 282068, 285617, 214671, 99469, -5438, -74818, -127969, -198394, -274318, -319878, -328699, -327844, -349874, -395902]
5700c95902l3054J7954Q6222J38080J25067P1538J8662j2486k5522l5708l7252
5689h2401m0852m3348j1252M5412Q6584Q8937N0744n858m9056o1409n6734m2868
5677a22101k9890k6943j4413J2725K6670O951K793Q125j552M5970J32919J33275
5665A74529M8371m1982r0295r9676r2078o5419l3998j9859k6240m1050j3749L9816
5653b61630Q0924Q2858L6816J134J106J549k6957m9970n7489n5910l3640p466
5641b88675N19Q613J720j6775k798K9387L8563K6610L1729N1923N0681L7670N6512
5628B5679R3549R7452N5124J8033K6969L0291J950m342K1352J6265N973L935l9980
5615C52250j01257j22572r4621n1002l0264m3430k6064K645j5286n6684q6906
$$ y = [-395902, -428956, -411002, -324780, -186700, -61633, 9905, 28567, 16081, -9441, -45149, -82401, -123253, -166601, -177853, -132441, -45857, 43080, 93824, 87966, 38910, -22499, -79233, -122101, -151991, -178934, -193347, -180622, -153952, -147001, -144208, -136083, -137635, -91665, 41254, 174529, 222900, 180918, 90623, -9053, -101131, -166550, -200548, -220407, -246647, -287697, -301446, -261630, -180706, -97848, -61032, -59898, -58792, -57243, -84200, -134170, -191659, -247569, -281209, -288675, -288156, -279543, -277823, -294598, -297396, -268009, -229446, -202836, -171107, -119184, -68503, -30833, 25679, 119228, 216680, 271804, 289837, 316806, 347097, 349047, 344705, 366057, 382322, 388295, 392230, 352250, 250993, 128421, 33800, -17202, -47466, -90896, -116960, -114315, -129601, -186285, -273191]
5604b73191q9137p0902m0321K071L7895M1539N62m3031m7549j1471K6032M4698
5592d22805O1735R0705J09872J04814Q2449L8868k4289o2229m7056R889M9475
5581h572K8640j1532r422K9833M7556K7630J5411N9835J18401J02195J6610l6861
5569C79724o3815j01846r0777k9647q263k0977l0661k5640P22L5632L1629j7373
5557E8708o3037p7754n6015k2601q595l1778l9174k113N0435J23098J55282P8883
5545A65339l3995q5752p6523m1688r913M737J5558K5194J6798j7138n2539n1147
5533a41069k0218p53j8254n6973p6485o9840l0016L9773J19092J72951J80152
5522I8360J59339J15657K9716n6764j00115j06701n5589J6008L9184L0933O624
$$ y = [-273191, -362328, -433230, -473551, -471480, -433585, -392046, -391484, -434515, -482064, -493535, -467503, -422805, -361070, -270365, -160493, -55679, 26770, 65638, 41349, -20880, -67936, -58047, -8572, 20068, 8536, -886, 28947, 76503, 104133, 119544, 179379, 297780, 399975, 416585, 379724, 315909, 214063, 123286, 93639, 85376, 64399, 33738, 8098, 8820, 44452, 76081, 58708, -4329, -82083, -138098, -160699, -169294, -201072, -240246, -242359, -191924, -68826, 86456, 165339, 131344, 45592, -30931, -72619, -82532, -77795, -62237, -37043, -20245, -37383, -89922, -141069, -161287, -162040, -180294, -237267, -313752, -383592, -413608, -373835, -254743, -81792, 98360, 257699, 373356, 403072, 346308, 246193, 139492, 83903, 99911, 139095, 170028, 176652]
5511A76652l7588p5790p9071n2803k6415J0501N6052J10630J18024N4820j7143
5500B37869m4258j7247O207l2968q7295p1383k8241k8737o2057o3663j8869J7979
5488a92663M3606N3561K8085P897J8576K9836o058n3802n7218j9973K285j6317
5476a62185k9767j8986P90L642M416K5443N9654Q1299R0832Q4379O4071M1143
5464B44731R091k6717m0898k5344q712K1296M5886J1650l3352l1909j8907m6801
5452A00014q2623n3414M9425J44274J45734Q6710L2562j1870n2807o9360n6484
5441B32161l7682l4915l8613m4047n9748p4729r2537j14819j06454o1348k8743
5430d61474k9526l4827j7004K3292Q4869J32564J28721O4479m3941j27449j24157
$$ y = [176652, 139064, 63274, -15797, -68600, -95015, -84514, -28462, 82168, 200192, 255012, 237869, 193611, 176364, 182571, 149603, 62308, -9075, -37316, -66053, -128110, -191773, -210642, -192663, -149057, -95496, -67411, -59514, -40938, -11102, -17160, -70962, -128180, -148153, -145868, -162185, -191952, -210938, -210148, -206506, -202090, -176647, -116993, -35694, 55138, 139517, 203588, 244731, 253822, 227105, 186207, 160863, 152151, 173447, 219333, 230983, 197631, 165722, 146815, 100014, 17391, -36023, 13402, 157676, 303410, 390120, 422682, 410812, 358005, 288645, 232161, 194479, 159564, 120951, 76904, 17156, -57573, -150110, -264929, -371383, -432731, -461474, -491000, -525827, -542831, -519539, -434670, -302106, -173385, -108906, -152847, -280296, -404453]
5419d04453o1987L8677J34439J56485J32954J16857R0928J3422q1337j14298q5109
5408f3422m7193j7547J172j6192o3451r9698q2747k1041J3852q81N446M1808M9123
5395c00771K1610q714p842N228j9162k4460L9838R4536R2725O8449M0575k461
5383d49k3734K132J5697r044l6643m4182m6172l6248j9168j6613j0327K4013P1707
5370a29031J02765Q5904K2770k6004k8471o27j273k7486m8964m0011J6747R5489
5358B1808J18838O3271p213o7675j14160j09623p7863m2194n656P332l662l6712
5346b53509q7192j01470m7195M3050Q8419Q4172P0277N0593K4882R406q788k3879
5334a51234R777M8967K5488m5673r6695p9690j7763K5210M1077O5281O1478J2963
$$ y = [-404453, -466440, -427763, -293324, -136839, -3885, 112972, 203900, 217322, 135985, 21687, -63422, -110615, -128162, -126990, -143182, -206633, -306331, -389078, -410119, -396267, -397148, -391702, -349894, -300771, -279161, -287875, -295717, -290489, -309651, -334111, -294273, -199737, -107012, -38563, 2012, -449, -24183, -22051, -6354, -15398, -52041, -96223, -142395, -178643, -197811, -214424, -224751, -200738, -129031, -26266, 59638, 82408, 56404, 27933, 27306, 26033, -1453, -50417, -90428, -73681, 21808, 140646, 203917, 196704, 129029, 14869, -94754, -172617, -214811, -220467, -213135, -216797, -253509, -340701, -442171, -489366, -446316, -357897, -273725, -203448, -152855, -127973, -118567, -127355, -151234, -141457, -92490, -67002, -112675, -209370, -289060, -306823, -281613, -240536, -175255, -113777, -100814]
5322a00814k5492l4167j5706L3501Q2620O6994j0534o4795o3200l3600k3512l0231
5310b18936N707P0826R9148P7932J9849k7008k8367j3991K379K713q927k2275
5298d0950m0331n5491n8936l3184J7192O2087O2832J7807j7489j1108j0j3915
5286a11496J2362P7816J01126N0464j2108m4427p2753q1638o3347n3199n8001
5275b55201n5732k1210M6423R1841P1339K7982J5933N1543R6530J14690J21469
5264C05607Q6917k571p8337j09254j19618j18523j16580j00776l6664J6698N813
5253b67288o4087j25191j36784j05646l3596P885n424p482K3274P2673J16162
5242e25504J17920R2007M1724o336j1502K1697M8094L5498J3226k5K197R213j3113
$$ y = [-100814, -126306, -160473, -176179, -142678, -60058, 6936, -3598, -68393, -131593, -165193, -188705, -218936, -213229, -142403, -43255, 34677, 54526, 27518, -849, -14840, -12461, -9748, -18675, -40950, -81281, -136772, -195708, -228892, -211700, -149613, -86781, -68974, -86463, -97571, -97581, -111496, -99134, -21318, 79808, 130272, 118164, 73737, 984, -80654, -144001, -197200, -255201, -310933, -332143, -285720, -193879, -122540, -94558, -78625, -27082, 69448, 184138, 305607, 392524, 389953, 311616, 202362, 82744, -35779, -152359, -253135, -289799, -273101, -267288, -331375, -456566, -593350, -698996, -732592, -724707, -730131, -737613, -714339, -641666, -525504, -407584, -315577, -273853, -280189, -291691, -269994, -221900, -186402, -173176, -173201, -171004, -161791, -174904]
5229a74904l2935j0319K2792N9597R2644Q2007L1353j8810l4235l1318k1396Q676
5217b6848L4342J7952j1260o830K1895M1395L5757J2106j5494m6213o8224m3259
5205e4681j0888l889J2223K6529J8676J1058J3964J2071J0881K1054K9715J9200
5193A05913J4282J0349n417j0129J493J210l4085r1616j08363q0896o2596p2769
5181c32624p7010l5006N432L3894N0856L4706r987j4803L8622Q2195Q2907N5108
5169h5710J9835J581O37j9907m7452n5369m5809j9384N404n368n7910p4388j0798
5156c94638N5895M5769l154k9160k8706j9992j6261k5942l1659j6683P66J4728
5144d49037J8674R782N918J4992O3589J17874J19844R4987Q2225P3964N5166J9298
$$ y = [-174904, -207839, -218158, -195366, -135769, -43125, 38882, 70235, 51425, 17190, -14128, -35524, -26848, 7494, 25446, 14186, 7356, 29251, 70646, 106403, 118509, 103015, 56802, -11422, -54681, -65569, -69458, -57235, -30706, -12030, -972, 12992, 25063, 35944, 56998, 86713, 105913, 120195, 130544, 125127, 114998, 116491, 117701, 83616, -8000, -116363, -197259, -259855, -332624, -409634, -444640, -439208, -405314, -354458, -319752, -329739, -344542, -305920, -223725, -140818, -85710, -65875, -64294, -63657, -83564, -131016, -186385, -232194, -251578, -246174, -251542, -309452, -383840, -394638, -338743, -292974, -296128, -325288, -353994, -373986, -390247, -416189, -447848, -464531, -463765, -449037, -430363, -420581, -414663, -399671, -336082, -218208, -98364, -3377, 78848, 152812, 207978, 227276]
5132B27276j8539k6711r551k043k6891o3986p8212p4079o9676o2439l7736J0638
5120b31949N7961N8541L0769M9384Q7207O0777q818n3557p9022j02317r1032m2054
5108b64110j6251o161L7235J02249J11933M8429j835k8752m4531k4351J7858L9304
5096b8983K916o7362j08560q6177p794P8380R6664O8673M2401J5672j6868m9628
5084f0666o9071n2736p363K0391K1996J9906L1464N6320O3792M8393M7863N6032
5072A76321M5837J6347k7744o0256m7517k1750j9046l3156m3946l2756j3731j1767
5060g3164k3490m8661n3670l5480l8965l7757j5385J0423M5181P4071R1182J06734
5048A019Q0045J2694m1198o4587p3954r0588j13308j13324r7565q6561p1196l7204
$$ y = [227276, 208737, 182026, 172475, 170432, 143541, 79555, 1343, -72736, -142412, -204851, -242587, -231949, -173988, -115447, -84678, -35294, 51913, 112690, 103872, 50315, -28707, -131024, -222056, -264110, -280361, -286522, -249287, -147038, -35105, 13324, 11489, -17263, -61794, -86145, -68287, -28983, -26067, -93429, -201989, -288166, -295960, -217580, -120916, -52243, -9842, 5830, -11038, -60666, -129737, -182473, -189836, -169445, -147449, -127543, -96079, -39759, 24033, 72426, 120289, 176321, 222158, 238505, 210761, 150505, 102988, 81238, 62192, 29036, -14910, -47666, -61397, -73164, -96654, -145315, -198985, -234465, -273430, -311187, -326572, -316149, -270968, -196897, -105715, 1019, 81064, 93758, 52560, -12027, -85981, -176569, -289877, -403201, -500766, -587327, -658523, -695727]
5036f95727l036J9329J5886K9256Q6863J55388J97530J85033J13721K8063k2117
5025A10189k9445m1404q9093r5870m3205O644L6576M1052L0349K4662J2848M166
5013c2531J877j611L1707N7779K6458j7930m8324o2079q1423j11581j18095n6191
5001d11944K5934L2557j3154m3761m3517j4728L1646Q7073J09344R3752Q5029
4990f1769Q6545P8053M5414j4009q8073j10598n1527J1093K5730J7867j1221l2641
4978a05136k6457q341j3224n7194n9920J2704R0426J38448J48985J27412J07176
4967C54879P8766K6421j3780l9113p0319r9188j05457r2112n6552p536R24k3808
4955d6875k3989j0345o256K0262N8800R4506J07304Q5264N3269K2664q766L073
$$ y = [-695727, -698763, -679434, -663548, -634292, -547429, -392041, -194511, -9478, 104243, 132306, 110189, 80744, 39340, -49753, -145623, -188828, -182184, -145608, -104556, -74207, -49545, -36697, -32531, -30654, -32265, -558, 57221, 83679, 65749, 17425, -44654, -126077, -237658, -355753, -411944, -386010, -353453, -366607, -410368, -453885, -468613, -436967, -349894, -240550, -146798, -61769, 24776, 102829, 148243, 134234, 46161, -64437, -115964, -104871, -79141, -61274, -72495, -105136, -131593, -139934, -153158, -210352, -270272, -257568, -167142, -28694, 120291, 247703, 354879, 433645, 460066, 446286, 407173, 336854, 237666, 132209, 40097, -16455, -23991, -23067, -46875, -70864, -81209, -87465, -67203, -8403, 86103, 193407, 278671, 331940, 354604, 345838, 348911]
4943C48911N4567Q7305M9790m6145j40659j77838j36147l9039N9811J13484J06610
4932B80650M9253k7389q1644r0569r5250r1737l6452L729k4864p0455q7864o8535
4920c41127p107O1275P3301N1880L8472M6945P4756R9001Q2579J3759n0305n6677
4908H6752l8088k0424k0146l0632r933J9677K0488j1898o3124q5525m0806K6957
4896a66702O5488O1868K5541l0823m8418m4246o9866r0064r1412p3555k8382N4599
4884d35972J55329K08413J75053Q0810J241k4761j831N2880O8387J5206k6064
4873B68691k70L7249J7493m3369j00794j24841j25358j13516p4293j4796J9816
4862b53988R886N904L4310O2498P1403N4897N570m0781n8755m0148J5927O8399
$$ y = [348911, 403478, 490783, 540573, 494428, 353769, 175931, 39784, 745, 60556, 174040, 280650, 329903, 302514, 220870, 130301, 35051, -56686, -93138, -89409, -114273, -184728, -272592, -341127, -348234, -286959, -213658, -161778, -123306, -76361, -1605, 97396, 179975, 193734, 143429, 86752, 48664, 28240, 8094, -22538, -32471, -12794, 7694, -4204, -67328, -152853, -193659, -166702, -101214, -39346, -13805, -44628, -93046, -137292, -207158, -297222, -388634, -462189, -490571, -435972, -280643, -72230, 102823, 183633, 184874, 160113, 158282, 211162, 279549, 294755, 268691, 268421, 305670, 323163, 279794, 179000, 54159, -71199, -184715, -259008, -273804, -253988, -244102, -238198, -203888, -141390, -69987, -15090, -9520, -50301, -109056, -149204, -133277, -64878]
4850f4878N5789M41m6994o6042o7217n2123k7876k040K0339K2203p58j9834l5443
4837b84433m6429m9278m5666m1372m0783r689M1922P8317J03282J16308J06684
4826g1137R0863O9333L6932R869j9272n7962o9025m8672l7480l8266j7049R054
4814a42812K8416M2614M1893J1437m3297p0996l6269K3104L7308J1284J2583N3852
4802c0883R8958R5542K8419o6223j34977j54224j20687n7771o168K1084M3280
4791b83650O5655O3325J1872l5875n5394m4268k1476m0791o6094o3834k8339R821
4779d89048K2320K5359J4158J6578O1680Q4243O9972N3240K9825r234l7938k6427
4767a85272J5535L0201n388m4610l8727J8471P1708P6721N8000M6481L0428j5566
$$ y = [-64878, -9089, -8648, -55642, -121684, -188901, -241024, -268900, -270940, -250601, -228398, -229156, -248990, -284433, -330862, -380140, -425806, -467178, -507961, -517650, -475728, -397411, -294129, -177821, -71137, 19726, 89059, 125991, 135860, 116588, 58626, -10399, -59071, -96551, -134817, -151866, -142812, -114396, -71782, -29889, -18452, -61749, -132745, -169014, -145910, -108602, -97318, -84735, -30883, 68075, 163617, 192036, 125813, -9164, -163388, -284075, -341846, -348014, -326930, -283650, -217995, -154670, -142798, -178673, -234067, -278335, -299811, -340602, -406696, -470530, -498869, -489048, -466728, -441369, -427211, -410633, -348953, -264710, -194738, -141498, -111673, -120907, -158845, -185272, -169737, -139536, -144924, -189534, -228261, -209790, -138082, -61361, -3361, 43120, 73548, 57982]
4755E7982o8179j08807j04366m1235J9194J6839j1426k0947l0963m4454n5936
4744c92298o3160m1059J1441N0892O2677M9377M3841L4663K3671n20n6627r1671
4732c68773q3808m4416j0915K007j2682n4923o2099j448P5485J04013Q9542P9781
4720b88236J13277J38936J08900N8963l996n9867p6216r9690j26627j22974p5649
4709d33179K663O8879R3078O8205K9692o082l9136m4207K852O1598Q2977P8109
4697c4551N3198J0464k5720j1241N1071Q3155K2964p3953j01187n5770p951J3487
4685g6034K5571Q917j2610K0862Q7080J31721J42419J23973O3189r950m6596o6803
4673C91739r3276r0773m3137K1432M4210J9294l0124o9219n5876j9220o307j9612
$$ y = [57982, -10197, -119004, -223370, -264605, -245411, -228572, -239998, -260945, -291908, -336362, -392298, -455458, -496517, -485076, -434184, -371507, -322130, -278289, -243626, -219955, -220475, -277102, -368773, -452581, -496997, -507912, -505905, -518587, -573510, -635609, -637057, -561572, -457559, -368017, -288236, -174959, -36023, 72877, 131840, 127844, 67977, -8239, -107929, -234556, -357530, -433179, -430516, -361637, -268559, -200354, -170662, -176744, -215880, -260087, -257235, -195637, -112660, -34551, 18647, 29111, 3391, -7850, 43221, 126376, 149340, 75387, -25800, -81570, -89521, -76034, -50463, -41546, -54156, -33294, 53786, 185507, 327926, 451899, 515088, 505138, 458542, 391739, 298463, 207690, 164553, 185985, 230195, 249489, 219365, 150146, 94270, 75050, 68743, 49131]
4661D9131k4351m368L4323Q5051J25642R9731M8970M1515M0068N363j3614k6584
4649D60877m5907o4091r0046r7474p2970l4567p743p965k0978l9211m1952k0770
4637h2797L286K9074L7855K8841k681n6548j01429j23110p2436O0332J56748J58375
4625C5510J11780M6915j4553o0185q8904q8533m7725j420K0474L2416N7682R8246
4613A01703J10043P6028L7977L6684M1694J9417l3029p2349p0839l6291r232m0085
4601A61721q0731o1845l7546l7288n832L2801L7095K6634M3521Q6798J17908Q7157
4589C70393n075q6451j16273j15511j02328p4766l2573q298r040o780K7253M7645
$$ y = [49131, 24780, 20412, 54735, 139786, 265428, 365159, 414129, 455644, 495712, 501075, 487461, 460877, 414970, 350879, 260833, 163359, 90389, 55822, 48079, 40114, 19136, -20075, -62027, -82797, -79511, -50437, -12582, 16259, 13578, -42970, -144399, -267509, -339945, -279613, -122865, 35510, 147290, 194205, 179652, 119467, 30563, -57970, -105695, -107115, -86641, -54225, 3457, 101703, 211746, 287774, 325751, 362435, 404129, 423546, 390517, 318168, 247329, 211038, 201806, 161721, 80990, 19145, -18401, -55689, -61521, -28720, 8375, 35009, 78530, 165328, 283236, 370393, 365318, 278867, 162594, 47083, -55245, -130011, -162584, -170882, -179922, -186702, -159449, -111804]
$$ [...]
##END NTUPLES=NMR SPECTRUM
##END=
