##TITLE=C13_DE-30H_kHCl
 D2O, 22300sc

 9.10.2024
##JCAMPDX= 6.0         $$ Bruker NMR JCAMP-DX V2.0
##DATA TYPE= NMR SPECTRUM
##DATA CLASS= NTUPLES
##ORIGIN= UXNMR, Bruker Analytische Messtechnik GmbH
##OWNER= root
$$ XWIN-NMR		Version 3.5
$$ Thu Oct 10 13:35:02 2024 Russian Standard Time (UT+4h)  she@DPX200
##.OBSERVE FREQUENCY= 50.327896
##.OBSERVE NUCLEUS= ^13C
##.ACQUISITION MODE= SIMULTANEOUS
##.ACQUISITION SCHEME= undefined
##.AVERAGES= 18500
##.DIGITISER RES= 17
##SPECTROMETER/DATA SYSTEM= spect
##.PULSE SEQUENCE= zgpg30
##.SOLVENT NAME= CDCl3
##.SHIFT REFERENCE= (INTERNAL, CDCl3, 0, 222.565)
##AUDIT TRAIL= $$ (NUMBER, WHEN, WHO, WHERE, WHAT)
$$ ##TITLE= Audit trail, XWIN-NMR		Version 3.5
$$ ##JCAMPDX= 5.01
$$ ##ORIGIN= Bruker BioSpin GmbH
$$ ##OWNER= she
$$ F:/spectra/data/she/nmr/c13/1/pdata/1/auditp.txt
$$ ##AUDIT TRAIL=  $$ (NUMBER, WHEN, WHO, WHERE, WHAT)
(   1,<2024-10-10 10:20:08.39 +0400>,<she>,<DPX200>,
      <created by zg, POWCHK disabled, PULCHK disabled
       terminated by command 'halt'
       configuration hash MD5:
       00 E9 B6 7A A2 85 ED C7 34 08 36 98 17 FE 4E 26
       data hash MD5: 32K
       43 CB 9D A8 52 69 A4 2E F4 57 45 49 8E D6 14 78>)
(   2,<2024-10-10 10:20:13.65 +0400>,<she>,<DPX200>,
      <Start of raw data processing
       efp BC_mod = 2 LB = 2 FT_mod = 6 PKNL = 1 PHC0 = -533.0439 PHC1 = 32.0982 SI = 32K 
       data hash MD5: 32K
       B1 3C 77 56 B8 2B C7 0D 93 86 9D 9E DE 6A C6 44>)
(   3,<2024-10-10 10:20:16.29 +0400>,<she>,<DPX200>,
      <apk 
       data hash MD5: 32K
       BB E8 7E 61 B9 25 AC E2 66 14 B1 E1 DD 18 D3 03>)
(   4,<2024-10-10 10:20:18.65 +0400>,<she>,<DPX200>,
      <abs n ABSG = 5 
       data hash MD5: 32K
       B6 C9 CE B9 05 7C 07 38 EC DB 1F 37 C3 F6 56 E5>)
(   5,<2024-10-10 13:33:32.04 +0400>,<she>,<DPX200>,
      <pk PHC0 = 18.29064 PHC1 = -24.20001 
       data hash MD5: 32K
       9F BE F6 8D 40 3E 12 EE 49 17 58 48 72 49 AA FE>)
(   6,<2024-10-10 13:33:36.32 +0400>,<she>,<DPX200>,
      <abs ABSG = 5 
       data hash MD5: 32K
       C1 72 EE 89 D0 99 B7 5C 71 71 82 E9 B5 E1 08 B6>)
(   7,<2024-10-10 13:34:22.76 +0400>,<she>,<DPX200>,
      <pk PHC0 = -10.01117 PHC1 = 15.8 
       data hash MD5: 32K
       EA 19 6C 05 3F 26 5B 10 FB 5D 1C 4C 74 B8 C1 30>)
(   8,<2024-10-10 13:34:26.73 +0400>,<she>,<DPX200>,
      <abs ABSG = 5 
       data hash MD5: 32K
       90 70 11 05 4A F2 E8 46 2F A2 B6 81 9E BF 54 D3>)
$$ ##END=
$$ 
$$ hash MD5
$$ 51 3D 6D 7D 59 81 B1 39 0D B3 5F 9C 28 B3 7C 35
##$RELAX= 
##$RELAX= 
##$RELAX= 
##$RELAX= 
##$RELAX= 
##$RELAX= 
##$RELAX= 
##$RELAX= 
$$ Bruker specific parameters
$$ --------------------------
##$DU= <F:/spectra>
##$EXPNO= 1
##$NAME= <c13>
##$PROCNO= 1
##$TYPE= <nmr>
##$USER= <she>
##$AMP= (0..31)
100 100 100 100 100 100 100 100 100 100 100 100 100 100 100 100 100 100 
100 100 100 100 100 100 100 100 100 100 100 100 100 100 
##$AQSEQ= 0
##$AQ_mod= 1
##$AUNM= <au_zg>
##$AUTOPOS= <>
##$BF1= 50.322709
##$BF2= 200.13
$$ [...]
##$SUBNAM4= <"">
##$SUBNAM5= <"">
##$SUBNAM6= <"">
##$SUBNAM7= <"">
##$SUBNAM8= <"">
##$SUBNAM9= <"">
##$SW= 239.972175391363
##$SWIBOX= (0..15)
0 1 3 0 0 0 0 0 0 0 0 0 0 0 0 0 
##$SW_h= 12077.2946859903
##$TD= 32768
##$TD0= 1
##$TE= 0
##$TE2= 300
##$TE3= 300
##$TEG= 300
##$TL= (0..7)
120 120 120 120 120 120 120 120 
##$TP= (0..7)
150 150 150 150 150 150 150 150 
##$TP07= 0
##$TPNAME0= <>
##$TPNAME1= <>
##$TPNAME2= <>
##$TPNAME3= <>
##$TPNAME4= <>
##$TPNAME5= <>
##$TPNAME6= <>
##$TPNAME7= <>
##$TPOAL= (0..7)
0.5 0.5 0.5 0.5 0.5 0.5 0.5 0.5 
##$TPOFFS= (0..7)
0 0 0 0 0 0 0 0 
##$TUNHIN= 0
##$TUNHOUT= 0
##$TUNXOUT= 0
##$USERA1= <user>
##$USERA2= <user>
##$USERA3= <user>
##$USERA4= <user>
##$USERA5= <user>
##$V9= 5
##$VALIST= <valist>
##$VCLIST= <CCCCCCCCCCCCCCC>
##$VD= 0
##$VDLIST= <DDDDDDDDDDDDDDD>
##$VPLIST= <PPPPPPPPPPPPPPP>
##$VTLIST= <TTTTTTTTTTTTTTT>
##$WBST= 1024
##$WBSW= 4
##$XGAIN= (0..3)
0 0 0 0 
##$XL= 0
##$YL= 0
##$YMAX_a= 96024381
##$YMIN_a= -53096817
##$ZGOPTNS= <>
##$ZL1= 120
##$ZL2= 120
##$ZL3= 120
##$ZL4= 120
##$ABSF1= 222.5654
##$ABSF2= -17.4314
##$ABSG= 5
##$ABSL= 3
##$ALPHA= 0
##$AQORDER= 0
##$ASSFAC= 0
##$ASSFACI= 0
##$ASSFACX= 0
##$ASSWID= 0
##$AUNMP= <proc_1d>
##$AZFE= 0.1
##$AZFW= 0.5
##$BCFW= 0
##$BC_mod= 2
##$BYTORDP= 0
##$COROFFS= 0
##$CY= -3
##$DATMOD= 1
##$DC= 0
##$DFILT= <>
##$DTYPP= 0
##$F1P= 0
##$F2P= 0
##$FCOR= 0.5
##$FTSIZE= 32768
##$FT_mod= 6
##$GAMMA= 0
##$GB= 0
##$INTBC= 1
##$INTSCL= 4.134877e-10
##$ISEN= 128
##$LB= 2
##$LEV0= 0
##$LPBIN= 0
##$MAXI= 10000
##$MC2= 0
##$MEAN= 0
##$ME_mod= 0
##$MI= 0.1934396
##$NCOEF= 0
##$NC_proc= -2
##$NLEV= 6
##$NOISF1= 120.0001
##$NOISF2= 80.00006
##$NSP= 0
##$NTH_PI= 0
##$NZP= 0
##$OFFSET= 222.5654
##$PC= 1.4
##$PHC0= -555.7195
##$PHC1= 40.10799
##$PH_mod= 1
##$PKNL= yes
##$PPARMOD= 0
##$PSCAL= 0
##$PSIGN= 0
##$REVERSE= no
##$SF= 50.3227345484362
##$SI= 32768
##$SIGF1= 140
##$SIGF2= 120
##$SINO= 11.81781
##$SIOLD= 32768
##$SREGLST= <13C.CDCl3>
##$SSB= 0
##$STSI= 32768
##$STSR= 0
##$SW_p= 12077.2946859903
##$SYMM= 0
##$S_DEV= 0
##$TDeff= 32768
##$TDoff= 0
##$TI= <>
##$TILT= no
##$TM1= 0
##$TM2= 0
##$TOPLEV= 0
##$USERP1= <user>
##$USERP2= <user>
##$USERP3= <user>
##$USERP4= <user>
##$USERP5= <user>
##$WDW= 1
##$XDIM= 32768
##$YMAX_p= 435793570
##$YMIN_p= -24843293
$$ End of Bruker specific parameters
$$ ---------------------------------
##NTUPLES= NMR SPECTRUM
##VAR_NAME=  FREQUENCY,     SPECTRUM/REAL,   SPECTRUM/IMAG
##SYMBOL=    X,             R,               I
##VAR_TYPE=  INDEPENDENT,   DEPENDENT,       DEPENDENT
##VAR_FORM=  AFFN,          ASDF,            ASDF
##VAR_DIM=   32768,         32768,           32768
##UNITS=     HZ,            ARBITRARY UNITS, ARBITRARY UNITS
##FACTOR=    0.368581032318806, 1,           1
##FIRST=     11200.0995020947, 0,            0
##LAST=      -877.195183895579, 0,           0
##MIN=       -877.195183895579, -24843293,   0
##MAX=       11200.0995020947, 435793570,    0
$$ Real data points
##PAGE= N=1
##DATA TABLE= (X++(R..R)), XYDATA
$$ [...]
##PAGE= N=2
##DATA TABLE= (X++(I..I)), XYDATA
$$ plain form
6341 268918042 270282641 272698334 275508046 278556996 281752621 284764229 287459371 289840850
6333 289840850 291846430 293104234 293261950 292505040 291088682 288851046 285311236 281568292
6325 281568292 279601900 280107944 282370308 285048185 287528230 289996025 292500951 294173579
6317 294173579 295111696 296656151 299131352 301919634 304785897 308085784 312510845 317166622
6309 317166622 320010758 320619455 319991239 318633429 316928408 316287152 318181496 322621438
6301 322621438 327509331 331012509 332860632 333763009 334871599 336576533 338354943 339438248
6293 339438248 339309891 338030008 336486762 335719474 335113591 332723398 326995950 317943966
6285 317943966 308084320 299650493 293009067 288084958 284364522 280982656 277281029 272151502
$$ packed form
6341B68918042J364599K415693K809712L048950L195625L011608K695142K381479
6333B89840850K005580J257804J57716p56910j416358k237636l539810l742944
6325B81568292j966392N06044K262364K677877K480045K467795K504926J672628
6317B94173579R38117J544455K475201K788282K866263L299887M425061M655777
6309C17166622K844136O08697o28216j357810j705021o41256J894344M439942
6301C22621438M887893L503178J848123R02377J108590J704934J778410J083305
6293C39438248j28357j279883j543246p67288o05883k390193n727448r051984
6285C17943966r859646q433827o641426m924109l720436l381866l701627n129527
$$ plain form
6277 272151502 264359489 253864203 240953379 226646575 213392494 203170038 196710411
6270 196710411 193939832 193659643 194544349 196012483 198578502 202530700 206705473 209887117
6262 209887117 212166541 214166406 215946990 218003229 221000854 223727678 224899324 225238964
6254 225238964 225788077 226305552 226425854 226917737 229022107 232595231 236711615 240685784 243489725
6245 243489725 244470343 244459168 244147957 244117658 244512372 244413697 244447437 245796234 248774383 252416950
6235 252416950 255559643 258019584 259724677 260748351 261839045 262759126 263079151 263800602
6227 263800602 265728678 268075686 269685335 270594558 271722579 273688767 276103887 278142264
6219 278142264 279165888 279644468 280847571 282468316 283973011 286122379 289047285 291908057
$$ packed form
6277B72151502p792013j0495286j2910824j4306804j3254081j0222456o459627
6270A96710411k770579k80189Q84706J468134K566019L952198M174773L181644
6262B09887117K279424J999865J780584K056239K997625K726824J171646L39640
6254B25238964N49113N17475J20302M91883K104370L573124M116384L974169K803941
6245B43489725R80618j1175l11211l0299L94714r8675L3740J348797K978149L642567
6235B52416950L142693K459941J705093J023674J090694R20081L20025P21451
6227B63800602J928076K347008J609649R09223J128021J966188K415120K038377
6219B78142264J023624M78580J203103J620745J504695K149368K924906K860772
$$ plain form
6211 291908057 292747008 291226633 289632522 290143938 293634006 299483273 305021440 308220775
6203 308220775 309346178 309474910 310353940 313202888 316620161 318284631 317430290 315619047
6195 315619047 315338328 316836139 319350021 323418016 328762900 334591646 340322262 345313789
6187 345313789 348780792 350698189 352160858 354808918 359818695 366272523 372631253 377934578
6179 377934578 382698959 388038861 393364571 396753592 396361894 390669337 378423297 359875431
6171 359875431 337877202 314880498 290796847 265678613 241683529 221651725 207473948
6164 207473948 199687711 197566948 199383473 203311055 207734701 211611397 215111909 219531402
6156 219531402 225637737 232103495 238034046 244570677 252494041 261093507 269212665 276354887
$$ packed form
6211B91908057Q38951j520375j594111N11416L490068N849267N538167L199335
6203C08220775J125403J28732Q79030K848948L417273J664470q54341j811243
6195C15619047k80719J497811K513882M067995N344884N828746N730616M991527
6187C45313789L467003J917397J462669K648060N009777O453828O358730N303325
6179C77934578M764381N339902N325710L389021l91698n692557j2246040j8547866
6171C59875431k1998229k2996704k4083651k5118234k3995084k0031804j4177777
6164B07473948p786237k120763J816525L927582M423646L876696L500512M419493
6156B19531402O106335O465758N930551O536631P923364Q599466Q119158P142222
$$ plain form
6148 276354887 282426320 287415733 292005151 296400444 300056930 302702155 304236561 304788205
6140 304788205 303369832 298094770 287856473 272458028 252578912 230495894 208937452
6133 208937452 189605028 172867820 158353736 146681097 139338682 137064226 139108704
6126 139108704 143120797 146265602 147717346 148930110 150917636 152727101 152759004 150853541
6118 150853541 148003465 146110300 146499393 148879737 152554515 157919993 164921691 171460221
6110 171460221 175636370 177841594 179316130 180906643 182939316 184586724 185268287 185022867
6102 185022867 183413828 180614045 177374350 174958258 174210668 174946056 176481524 178651829
6094 178651829 182149211 187220727 193219549 199534786 205729337 210950214 214533029 216856897
$$ packed form
6148B76354887O071433M989413M589418M395293L656486K645225J534406N51644
6140C04788205j418373n275062j0238297j5398445j9879116k2083018k1558442
6133B08937452j9332424j6737208j4514084j1672639p342415k274456K044478
6126A39108704M012093L144805J451744J212764J987526J809465L1903j905463
6118A50853541k850076j893165L89093K380344L674778N365478P001698O538530
6110A71460221M176149K205224J474536J590513K032673J647408O81563k45420
6102A85022867j609039k799783l239695k416092p47590P35388J535468K170305
6094A78651829L497382N071516N998822O315237O194551N220877L582815K323868
$$ plain form
6086 216856897 218228897 219121671 220476375 221610581 221780218 222249552 224163339 227294498
6078 227294498 230988654 234356613 236838433 238049862 237539841 235553031 233994004 233952418
6070 233952418 234612430 234925145 234581463 234143831 234611592 236849057 240797580 245577205 249712027
6061 249712027 251629028 250896371 248954018 247386647 246688955 247481868 250533977 255673690
6053 255673690 261560476 266988261 271260662 274321163 276273754 277502345 278885989 281021149
6045 281021149 283563162 285949494 288666437 291495328 292965349 292900101 292047574 290998294
6037 290998294 289690673 287113750 281689384 272366440 260676485 249134653 239558907 233655745
6029 233655745 231491332 231258962 230693445 228097855 223110673 215762579 205377644 192057177
$$ packed form
6086B16856897J372000Q92774J354704J134206J69637M69334J913787L131159
6078B27294498L694156L367959K481820J211429n10021j986810j559027m1586
6070B33952418O60012L12715l43682m37632M67761K237465L948523M779625M134822
6061B49712027J917001p32657j942353j567371o97692P92913L052109N139713
6053B55673690N886786N427785M272401L060501J952591J228591J383644K135160
6045B81021149K542013K386332K716943K828891J470021o5248q52527j049280
6037B90998294j307621k576923n424366r322944j1689955j1541832r575746n903162
6029B33655745k164413k32370n65517k595590m987182p348094j0384935j3320467
$$ plain form
6021 192057177 177870766 165620893 157032290 152196643 150530407 151291792 152940610 153358930
6013 153358930 151287887 146708697 141006956 135751124 131562361 128494326 126435646 126001373
6005 126001373 127429626 129972586 133715566 139285035 146702320 154760992 161434576 165377696
5997 165377696 167361314 168977047 170867452 172904696 175284151 178232347 181078945 183211644
5989 183211644 184114864 183868003 183909703 184820650 185983656 187142044 187929061 188458004 189308063
5980 189308063 190948386 193567180 196553343 198841238 200485117 201702248 201510482 199188662
5972 199188662 194809830 188576378 180966304 173228372 167167455 163545509 161484604 160206022
5964 160206022 160256025 162088059 165294102 169373197 172886695 174358745 175034332 177150573
$$ packed form
6021A92057177j4186411j2249873q588603m835647j666236P61385J648818M18320
6013A53358930k071043m579190n701741n255832m188763l068035k058680m34273
6005A26001373J428253K542960L742980N569469P417285Q058672O673584L943120
5997A65377696J983618J615733J890405K037244K379455K948196K846598K132699
5989A83211644R03220k46861M1700R10947J163006J158388P87017N28943Q50059
5980A89308063J640323K618794K986163K287895J643879J217131j91766k321820
5972A99188662m378832o233452p610074p737932o060917l621946k060905j278582
5964A60206022N0003J832034L206043M079095L513498J472050O75587K116241
$$ plain form
5956 177150573 180397764 182862235 183799368 183579594 182513850 181642096 181677456 182234328 183262482
5947 183262482 183980381 182716992 179495567 176119717 173872546 172451159 171475431 170573173
5939 170573173 169287878 168303728 169070476 171771135 175058087 178007686 181202099 184968069
5931 184968069 187506652 187337238 185318500 182695244 180187256 178575555 179217568 181854060
5923 181854060 184042209 184658291 184721455 184945757 185257482 185976984 188084094 191495653 194560249
5914 194560249 195986058 195554906 193680388 191152240 189665161 189986381 191466770 193657261
5906 193657261 195006232 194718130 193877500 192947361 191576980 189374532 186757137 184499041
5898 184499041 183049692 182521153 183195420 184796894 186454117 187757455 188993353 190396490
$$ packed form
5956A77150573L247191K464471R37133k19774j065744q71754L5360N56872J028154
5947A83262482P17899j263389l221425l375850k247171j421387r75728r02258
5939A70573173j285295r84150P66748K700659L286952K949599L194413L765970
5931A84968069K538583j69414k018738k623256k507988j611701O42013K636492
5923A81854060K188149O16082O3164K24302L11725P19502K107110L411559L064596
5914A94560249J425809m31152j874518k528148j487079L21220J480389K190491
5906A93657261J348971k88102q40630r30139j370381k202448k617395k258096
5898A84499041j449349n28539O74267J601474J657223J303338J235898J403137
$$ plain form
5890 190396490 192268082 194455820 196468346 198528390 200257325 201342293 202115193 202890976
5882 202890976 203526060 203118126 201050510 198050384 195704878 194525460 193911204 193210452 192564694
5873 192564694 192836169 193941580 194366121 193437421 192280646 192107378 192782894 193487076 194283963
5864 194283963 196130192 198842028 201294595 202757049 203210044 202864707 201873170 200894313 200530265
5855 200530265 200985050 202333593 203970084 204656786 204171860 203787718 204087589 204433323 204351687
5846 204351687 203895852 203335845 203231637 203750889 204394758 205109073 205911869 207062798 208576653
5837 208576653 210421431 212350372 213424733 213619786 214749483 217733538 220893086 222561107
5829 222561107 222241862 219758326 216198407 213075063 210611719 208528736 207057967 206708997
$$ packed form
5890A90396490J871592K187738K012526K060044J728935J084968P72900P75783
5882B02890976O35084m07934k067616l000126k345506j179418o14256p00752o45758
5873A92564694K71475J105411M24541r28700j156775j73268O75516P04182P96887
5864A94283963J846229K711836K452567J462454M52995l45337r91537r78857l64048
5855B00530265M54785J348543J636491O86702m84926l84142K99871L45734q1636
5846B04351687m55835n60007j04208N19252O43869P14315Q02796J150929J513855
5837B08576653J844778J928941J074361J95053J129697K984055L159548J668021
5829B22561107l19245k483536l559919l123344k463344k082983j470769l48970
$$ plain form
5821 206708997 208138661 211283980 214325983 215655999 215739662 215466457 215375208 215690799 215849748
5812 215849748 215291655 213536997 211243122 209829534 209339885 209393684 210417970 212553725 215276556
5803 215276556 217056656 217080918 216349420 215757843 214780047 213012091 210923522 208921986 207695993
5794 207695993 207128762 206553659 206469562 207432802 209100923 211097611 212710680 212976115 212261071
5785 212261071 211759036 212037064 212396337 212479355 213593548 215603476 216435548 216021425 215184370
5776 215184370 213962504 212790579 211824013 210742741 210156697 211404023 214262589 216670848
5768 216670848 218060397 219934892 222681700 225424764 227559594 228639705 228741820 228440638
5760 228440638 227640506 226662926 226533872 226952192 226614972 225431444 224541367 224823316 225451053
$$ packed form
5821B06708997J429664L145319L042003J330016Q3663k73205r1249L15591J58949
5812B15849748n58093j754658k293875j413588m89649N3799J024286K135755K722831
5803B15276556J780100K4262p31498n91577r77796j767956k088569k001536j225993
5794B07695993n67231n75103q4097R63240J668121J996688J613069K65435p15044
5785B12261071n02035K78028L59273Q3018J114193K009928Q32072m14123q37055
5776B15184370j221866j171925r66566j081272n86044J247326K858566K408259
5768B16670848J389549J874495K746808K743064K134830J080111J02115l01182
5760B28440638q00132r77580j29054M18320l37220j183528q90077K81949O27737
$$ plain form
5751 225451053 225478331 225458537 225825451 226280317 226845245 227427474 227461955 226733836 225540782 224193786
5741 224193786 222785092 221590465 221130591 221142177 220822376 219971223 219163605 218628413 217744929
5732 217744929 215582240 212258175 208989518 206929807 206471740 207701899 209656249 210055818
5724 210055818 208547987 206510774 204454547 202958663 203285963 205755048 208681561 209824255
5716 209824255 209441530 209781048 211613934 214219945 216479250 217250277 216784223 216799982 218614790
5707 218614790 221388810 223590613 224309603 223749845 222587387 221941604 222153256 221915966 220488261
5698 220488261 218319495 216494686 216455086 218673059 221871571 224546513 226165082 226688097
5690 226688097 226358799 225652585 225765270 227239289 229435816 230857040 230080045 227254376 223597889
$$ packed form
5751B25451053K7278j9794L66914M54866N64928N82229L4481p28119j193054j346996
5741B24193786j408694j194627m59874J1586l19801q51153q07618n35192q83484
5732B17744929k162689l324065l268657k059711m58067J230159J954350L99569
5724B10055818j507831k037213k056227j495884L27300K469085K926513J142694
5716B09824255l82725L39518J832886K606011K259305P71027m66054J5759J814808
5707B18614790K774020K201803P18990n59758j162458o45783K11652k37290j427705
5698B20488261k168766j824809l9600K217973L198512K674942J618569N23015
5690B26688097l29298p06214J12685J474019K196527J421224p76995k825669l656487
$$ plain form
5681 223597889 220836067 219716395 219839570 220585228 221443798 221823830 222042800 223145996 225082440
5672 225082440 227187399 228503680 228986004 229153073 229144107 228904750 227859028 226053918 224294458
5663 224294458 222450682 219937283 217436193 215555937 214139764 212858656 211276713 209596354
5655 209596354 208582216 208953432 210500490 212060023 212910702 212635046 211521149 211179975 212923115
5646 212923115 215576886 216839995 216910482 216955542 217096488 217863926 219765587 222714759 226337007
5637 226337007 229911486 232660571 234527555 235460326 235102468 233365529 230461993 227335671
5629 227335671 225220439 224943975 226401225 228492597 230708283 232879888 234045069 232683659
5621 232683659 228980919 224855241 221608678 220263010 220892061 222071378 223049089 224581220
$$ packed form
5681B23597889k761822j119672J23175P45658Q58570L80032K18970J103196J936444
5672B25082440K104959J316281M82324J67069q966k39357j045722j805110j759460
5663B24294458j843776k513399k501090j880256j416173j281108j581943j680359
5655B09596354j014138L71216J547058J559533Q50679k75656j113897l41174J743140
5646B12923115K653771J263109P0487M5060J40946P67438J901661K949172L622248
5637B26337007L574479K749085J866984R32771l57858j736939k903536l126322
5629B27335671k115232k76464J457250K091372K215686K171605J165181j361410
5621B32683659l702740m125678l246563j345668O29051J179317R77711J532131
$$ plain form
5613 224581220 227390941 230839882 232335088 230848330 228399022 226519250 225838990 226626586
5605 226626586 228535028 230799896 232984493 234615943 235172597 234205195 232209909 230767377
5597 230767377 231004205 232822071 235646394 238394618 239588262 239619168 240209156 241323880 241027867
5588 241027867 239182294 237797994 237346792 237068156 236755352 235968641 234453032 233011192 232774830
5579 232774830 233231555 232500626 230018331 226543686 222682689 219329809 217318101 216117192
5571 216117192 215225791 214756998 215211797 216152300 216798540 217274665 217650217 217963278 218214871
5562 218214871 219032759 220963914 222683885 223199698 223078421 222388414 221837443 222544478 223628698
5553 223628698 224039772 224072339 223981333 224227576 225409916 227144184 228207491 227567701 225565942
$$ packed form
5613B24581220K809721L448941J495206j486758k449308j879772o80260P87596
5605B26626586J908442K264868K184597J631450N56654r67402j995286j442532
5597B30767377K36828J817866K824323K748224J193644L0906N89988J114724k96013
5588B41027867j845573j384300m51202k78636l12804p86711j515609j441840k36362
5579B32774830M56725p30929k482295l474645l860997l352880k011708j200909
5571B16117192q91401m68793M54799R40503O46240M76125L75552L13061K51593
5562B18214871Q17888J931155J719971N15813j21277o90007n50971P07035J084220
5553B23628698M11074L2567r1006K46243J182340J734268J063307o39790k001759
$$ plain form
5544 225565942 223581345 222556415 222193491 222015460 222241767 223583026 226163862 229160095
5536 229160095 231796124 233471113 234311736 234631258 233529958 231034980 229437939 230127909
5528 230127909 231840478 232460743 231062770 228290044 225751128 223702076 221204613 218366282
5520 218366282 216839949 217126886 218142678 219142717 219785354 219266697 217099912 214227467
5512 214227467 212423321 212949955 215783489 219828213 223936676 226934420 228189534 227764687
5504 227764687 226556703 225190825 224162172 223670643 223349793 223888392 226344585 230013349
5496 230013349 232732900 233840174 234044414 233949667 233537348 232432123 231258728 230228010 229653087
5487 229653087 230845631 233454514 236526170 239326740 240319238 238571665 235782134 233859530
$$ packed form
5544B25565942j984597j024930l62924j78031K26307J341259K580836K996233
5536B29160095K636029J674989Q40623L19522j101300k494978j597041O89970
5528B30127909J712569O20265j397973k772726k538916k049052k497463k838331
5520B18366282j526333K86937J015792J000039O42637n18657k166785k872445
5512B14227467j804146N26634K833534M044724M108463K997744J255114m24847
5504B27764687j207984j365878j028653m91529l20850N38599K456193L668764
5496B30013349K719551J107274K04240r4747m12319j105225j173395j030718n74923
5487B29653087J192544K608883L071656K800570R92498j747573k789531j922604
$$ plain form
5479 233859530 233803081 236284946 240108794 242735285 242901236 241466853 239041422 236005059
5471 236005059 233520893 232078460 231068952 229525717 227913379 227070999 226992427 227260028 227340102
5462 227340102 227312025 227759417 228689890 230109459 232958391 236975073 240312310 241495922 240345285
5453 240345285 237956487 235333205 232680254 230426711 229097254 229032793 230657682 233054017
5445 233054017 233953820 233286224 232495100 232346349 232895203 233443938 233539916 232767777 232253331
5436 232253331 233212210 234658755 235910859 237076666 237889978 237507714 236129646 235010433
5428 235010433 234693757 234847987 235174290 235706436 236199276 236783542 238135513 238950036 237466589
5419 237466589 234608829 232585875 232133061 232980239 234698826 236000914 235996939 235599704 235891439
$$ packed form
5479B33859530n6449K481865L823848K626491J65951j434383k425431l036363
5471B36005059k484166j442433j009508j543235j612338q42380p8572K67601Q0074
5462B27340102k8077M47392R30473J419569K848932M016682L337237J183612j150637
5453B40345285k388798k623282k652951k253543j329457o4461J624889K396335
5445B33054017Q99803o67596p91124j48751N48854N48735R5978p72139n14446
5436B32253331R58879J446545J252104J165807Q13312l82264j378068j119213
5428B35010433l16676J54230L26303N32146M92840N84266J351971Q14523j483447
5419B37466589k857760k022954m52814Q47178J718587J302088l975l97235K91735
$$ plain form
5410 235891439 237127779 238340766 238461767 238071596 237568260 236970254 237110195 237663111 237489008
5401 237489008 236442372 234471456 231842157 229152553 226608654 224541135 224010695 225227267
5393 225227267 226973755 227582864 226462837 224459642 222296548 220017976 218735160 219712834
5385 219712834 222028851 224180561 226486192 229344687 232273105 234807111 236402568 237050573
5377 237050573 237683186 238760363 239461777 238553960 235832345 232237633 229356492 229350478 232540659
5368 232540659 236165927 237932937 238358660 238495779 238905271 239975384 241221787 241949830 241929441
5359 241929441 241096627 239709586 238223382 237039146 235511946 232862066 229880688 228302650
5351 228302650 228522950 228220172 226307290 224768599 225010545 225778119 225910006 225607304 225730772
$$ packed form
5410B35891439J236340J212987J21001l90171n03336n98006J39941N52916j74103
5401B37489008j046636j970916k629299k689604k543899k067519n30440J216572
5393B25227267J746488O09109j120027k003195k163094k278572j282816R77674
5385B19712834K316017K151710K305631K858495K928418K534006J595457O48005
5377B37050573O32613J077177P01414r07817k721615l594712k881141o014L190181
5368B32540659L625268J767010M25723J37119M09492J070113J246403P28043k0389
5359B41929441q32814j387041j486204j184236j527200k649880k981378j578038
5351B28302650K20300l02778j912882j538691K41946P67574J31887l02702J23468
$$ plain form
5342 225730772 227245556 229811211 231943068 233285610 234606170 236449345 238779389 240755050
5334 240755050 242516505 244582114 246135242 246224048 245113647 243303641 240930278 238796937
5326 238796937 237142298 236010032 235571670 235169742 234182292 232509383 231026664 230895813 232369052
5317 232369052 234761353 236524338 236946614 236553299 235482530 234025108 232969280 231473995
5309 231473995 228738724 226735227 227170992 229088175 230713626 230869128 230181218 230340634 231365987
5300 231365987 232136141 231890105 230646228 228857475 227238749 226412583 225976429 225334942 224893769
5291 224893769 224878166 224991281 225423871 225804189 225177705 224026868 222999164 221747754 220049295
5282 220049295 218359261 217272566 217272968 218140537 219261232 220607305 222037646 223800688 225938403
$$ packed form
5342B25730772J514784K565655K131857J342542J320560J843175K330044J975661
5334B40755050J761455K065609J553128Q8806j110401j810006k373363k133341
5326B38796937j654639j132266m38362m01928r87450j672909j482719j30851J473239
5317B32369052K392301J762985M22276l93315j070769j457422j055828j495285
5309B31473995k735271k003497M35765J917183J625451J55502o87910J59416J025353
5300B31365987P70154k46036j243877j788753j618726q26166m36154o41487m41173
5291B24893769j5603J13115M32590L80318o26484j150837j027704j251410j698459
5282B20049295j690034j086695M02Q67569J120695J346073J430341J763042K137715
$$ plain form
5273 225938403 228909950 232795416 236164051 238149340 238991524 239156966 238674037 237529256
5265 237529256 237231720 238904772 241570412 243354958 243503143 243090401 242787320 242404650 241997774
5256 241997774 241524375 241001083 240299377 239653749 240100377 241282701 242266279 243506585 245196597
5247 245196597 246310143 246478640 245942913 244890329 243700510 242890291 241634743 239538245
5239 239538245 237821878 236995543 237107794 237627224 237652074 237669110 239047046 241977289 245113027
5230 245113027 247285771 247475283 244886299 240999041 238683138 238876197 239621772 239125383 237593706
5221 237593706 235556242 233457487 232875279 234597425 236945525 237856481 236945806 235577617
5213 235577617 234396197 232313110 229615147 228180033 228808336 230907875 232726983 233439736
$$ packed form
5273B25938403K971547L885466L368635J985289Q42184J65442m82929j144781
5265B37529256k97536J673052K665640J784546J48185m12742l03081l82670m06876
5256B41997774m73399n23292p01706o45628M46628J182324R83578J240306J690012
5247B45196597J113546J68497n35727j052584j189819q10219j255548k096498
5239B39538245j716367q26335J12251N19430K4850J7036J377936K930243L135738
5230B45113027K172744J89512k588984l887258k315903J93059P45575m96389j531677
5221B37593706k037464k098755n82208J722146K348100R10956r10675j368189
5213B35577617j181420k083087k697963j435114O28303K099539J819108P12753
$$ plain form
5205 233439736 233971862 234505334 234593289 234124611 232648575 230431085 228701593 228303226 228515908
5196 228515908 228044266 227726393 228650830 230063752 231890165 234300474 236157885 237117424 238077597
5187 238077597 238228423 236446726 234127709 232251714 230965877 230666376 230720006 229756926 227915084
5178 227915084 226723351 226900727 228417735 230886916 233344147 234646242 234076125 232359333
5170 232359333 231103539 230661511 229976671 228670141 227734781 227988100 229636172 232251609 234462145
5161 234462145 235307588 235673662 236030588 235377237 233676285 231955815 230811228 230951101 232729558
5152 232729558 235331672 237214720 238141257 238971884 239702011 240252472 240545539 240552092 240685360
5143 240685360 240645659 239692725 238236864 237130939 236059444 234824021 234377137 235106672 236156078
$$ packed form
5205B33439736N32126N33472Q7955m68678j476036k217490j729492l98367K12682
5196B28515908m71642l17873R24437J412922J826413K410309J857411R59539R60173
5187B38077597J50826j781697k319017j875995j285837k99501N3630r63080j841842
5178B27915084j191733J77376J517008K469181K457231J302095n70117j716792
5170B32359333j255794m42028o84840j306530r35360K53319J648072K615437K210536
5161B34462145Q45443L66074L56926o53351j700952j720470j144587J39873J778457
5152B32729558K602114J883048R26537Q30627P30127N50461K93067O553J33268
5143B40685360l9701r52934j455861j105925j071495j235423m46884P29535J049406
$$ plain form
5134 236156078 236668478 236685681 236227854 235334116 234920149 235436846 236162772 236622864 237283863
5125 237283863 238250729 238732033 238298558 237245432 236544346 236381186 236250696 236292289 236765568
5116 236765568 237911207 239811308 242666441 246175246 248674061 248773907 247414654 246034986
5108 246034986 244698677 242631042 239915160 237910476 237217336 236886260 236338018 235447521 234067575
5099 234067575 233066147 233268009 234412369 235691414 236646189 237353141 237955319 238494108 238572040
5090 238572040 238455822 238350563 238345463 238986077 240448271 241777333 242591525 243112642 243333501
5081 243333501 243344990 243510775 244072146 244457750 244224974 243500854 242845453 242172588 240722813
5072 240722813 238349612 235942533 234710683 235059741 236432770 238250842 240091873 241990606
$$ packed form
5134B36156078N12400J7203m57827q93738m13967N16697P25926M60092O60999
5125B37283863R66866M81304m33475j053126p01086j63160j30490M1593M73279
5116B36765568J145639J900101K855133L508805K498815R9846j359253j379668
5108B46034986j336309k067635k715882k004684o93140l31076n48242q90497j379946
5099B34067575j001428K01862J144360J279045R54775P06952O02178N38789P7932
5090B38572040j16218j05259n100O40614J462194J329062Q14192N21117K20859
5081B43333501J1489J65785N61371L85604k32776p24120o55401o72865j449775
5072B40722813k373201k407079j231850L49058J373029J818072J841031J898733
$$ plain form
5064 241990606 243404750 243623813 243390425 243559817 244161191 243659305 240905024 237537454 235411114
5055 235411114 234981920 235531959 236139440 236767938 237416423 237695431 237500650 236994511 236509933
5046 236509933 236516523 237696591 240150565 242392141 243572177 244185682 244126162 243487205 242228165
5037 242228165 240030014 237892371 237204073 238615765 241883238 246004610 249230964 250320741
5029 250320741 250315675 251014910 251915579 251817895 250641086 248533355 246626812 245700286 245392987
5020 245392987 245719777 246086531 245120682 242864449 240316075 238250447 236816672 235805935
5012 235805935 235116797 233951117 232089018 230751210 230458742 230068140 228210652 224854116
5004 224854116 221210289 218927510 218914351 220118440 221087743 221321480 221620227 222628120 223888749
$$ packed form
5064B41990606J414144K19063k33388J69392O01374n01886k754281l367570k126340
5055B35411114m29194N50039O07481O28498O48485K79008j94781n06139m84578
5046B36509933O590J180068K453974K241576J180036O13505n9520o38957j259040
5037B42228165k198151k137643o88298J411692L267473M121372L226354J089777
5029B50320741n066O99235R00669r7684j176809k107731j906543r26526l07299
5020B45392987L26790L66754r65849k256233k548374k065628j433775j010737
5012B35805935o89138j165680j862099j337808k92468l90602j857488l356536
5004B24854116l643827k282779j3159J204089R69303K33737K98747J007893J260629
$$ plain form
4995 223888749 224625828 225037260 225970206 227699870 230339593 233580377 236971742 240536337
4987 240536337 243748714 245367894 245378232 244692660 244139708 244507741 244762594 244235836 243906786
4978 243906786 243198762 241168919 238970004 238068093 237898526 237467489 237392157 237772090 238070908
4969 238070908 238806977 239731220 240259805 240824933 241911671 243583474 245526571 246614518 246443956
4960 246443956 245435563 244602235 244449255 244690336 245020086 244798632 243001621 240454479 239416177
4951 239416177 240216999 241413784 242219742 243156101 244480582 245796816 246667610 246483590 245098262
4942 245098262 243191561 242198022 243077511 245039138 247433645 250278611 253055478 255086459
4934 255086459 255449716 253556935 250297025 247090629 244601829 242920274 241998522 241659714
$$ packed form
4995B23888749P37079M11432R32946J729664K639723L240784L391365L564595
4987B40536337L212377J619180J0338o85572n52952L68033K54853n26758l29050
4978B43906786p08024k029843k198915r01911j69567m31037p5332L79933K98818
4969B38070908P36069R24243N28585N65128J086738J671803J943097J087947j70562
4960B46443956j008393q33328j52980K41081L29750k21454j797011k547142j038302
4951B39416177Q00822J196785Q05958R36359J324481J316234Q70794j84020j385328
4942B45098262j906701r93539Q79489J961627K394507K844966K776867K030981
4934B55086459L63257j892781l259910l206396k488800j681555r21752l38808
$$ plain form
4926 241659714 241401864 240980142 240816388 241753406 243970679 246741691 248678859 249094406 247951342
4917 247951342 246111999 245533170 246123438 246130713 245682810 245744102 246670368 248887789 252803086
4908 252803086 257533210 261738308 264660238 265352706 264102480 262407430 261375475 260912813
4900 260912813 259812163 257625021 255275430 253234636 251311238 249466982 248287697 247650623
4892 247650623 247224996 247390251 247890186 248297472 248753074 248649132 247092666 244996150 244048685
4883 244048685 244649993 245153964 244284161 243037360 242502646 242237916 241541498 240195299 239014008
4874 239014008 238765172 239314842 240849678 242728090 243176272 241106433 237617065 234844835
4866 234844835 233588019 233690585 235273259 238009778 240844478 243346805 245738730 247765328
$$ packed form
4926B41659714k57850m21722j63754R37018K217273K771012J937168M15547j143064
4917B47951342j839343n78829N90268P275m47903O1292R26266K217421L915297
4908B52803086M730124M205098K921930O92468j250226j695050j031955m62662
4900B60912813j100650k187142k349591k040794j923398j844256j179285o37074
4892B47650623m25627J65255M99935M07286M55602j03942j556466k096516r47465
4883B44048685O01308N03971q69803j246801n34714k64730o96418j346199j181291
4874B39014008k48836N49670J534836J878412M48182k069839l489368k772230
4866B34844835j256816J02566J582674K736519K834700K502327K391925K026598
$$ plain form
4858 247765328 248519110 247973968 247828286 248926951 250636465 252343382 253956109 254863964 254500073
4849 254500073 253486295 252252532 250877466 249807031 249523722 250759082 253892473 258486228
4841 258486228 262913289 265459446 264740288 260819009 256245409 253508153 252268735 251118562
4833 251118562 250257849 250197624 251099373 253426068 256628560 259089170 259740311 258476323 255640319
4824 255640319 251402120 246377640 243010857 243689525 246995794 250168413 252176392 253451958
4816 253451958 254316220 255153422 256377091 257835328 259105077 259696627 259334192 258826213 258585094
4807 258585094 258286729 256929367 254448283 252186704 251774040 254174571 257707859 259787753
4799 259787753 259272125 256246738 251578722 247417993 245501251 245608603 246738704 248279293
$$ packed form
4858B47765328P53782n45142j45682J098665J709514J706917J612727R07855l63891
4849B54500073j013778j233763j375066j070435k83309J235360L133391M593755
4841B58486228M427061K546157p19158l921279m573600k737256j239418j150173
4833B51118562q60713o0225R01749K326695L202492K460610O51141j263988k836004
4824B55640319m238199n024480l366783O78668L306269L172619K007979J275566
4816B53451958Q64262Q37202J223669J458237J269749N91550l62435n07979k41119
4807B58585094k98365j357362k481084k261579m12664K400531L533288K079894
4799B59787753n15628l025387m668016m160729j916742J07352J130101J540589
$$ plain form
4791 248279293 249667899 250600299 251037988 251147096 251594362 252778467 254070865 254841648 255063507
4782 255063507 255249909 256264406 257299549 256688413 253471612 248000751 241627701 235220253
4774 235220253 229195922 223751002 219075059 216457094 216804309 218847655 220902158 222430139
4766 222430139 224061382 226285485 228182370 229691497 232270981 235456404 237516456 238141927
4758 238141927 237620767 236358779 235047057 234663325 236322361 239461678 242025888 242428343
4750 242428343 240267601 236559882 233410049 232050756 232702922 234952323 237580725 239533877
4742 239533877 240453548 240938035 241715731 242963993 244077918 244403498 244557394 244750105 244510625
4733 244510625 243778111 242735201 241643124 240799841 239959400 238977164 238245715 237423279 235946261
$$ packed form
4791B48279293J388606R32400M37689J09108M47266J184105J292398P70783K21859
4782B55063507J86402J014497J035143o11136l216801n470861o373050o407448
4774B35220253o024331n444920m675943k617965L47215K043346K054503J527981
4766B22430139J631243K224103J896885J509127K579484L185423K060052O25471
4758B38141927n21160j261988j311722l83732J659036L139317K564210M02455
4750B42428343k160742l707719l149833j359293O52166K249401K628402J953152
4742B39533877R19671M84487P77696J248262J113925L25580J53896J92711k39480
4733B44510625p32514j042910j092077q43283q40441r82236p31449q22436j477018
$$ plain form
4724 235946261 234325450 233467569 233912290 235185911 236609898 238397302 240277902 240931902
4716 240931902 240107934 238997183 239272385 241445102 244183183 246312854 247982956 248872508
4708 248872508 247498734 243623489 239334447 236251924 235362046 237456381 241338200 244836240
4700 244836240 247080030 248298914 248429223 247368477 245615484 244361760 243624094 242213454
4692 242213454 240551680 239685432 240166404 241937014 244864799 248141332 251029523 252598354
4684 252598354 251824213 249097499 246552745 245782902 246114618 246371162 246312215 246680213 247820119
4675 247820119 249004372 249730612 251099314 253363372 255188157 256413524 256709697 255681084
4667 255681084 255047115 255568796 255667508 253802722 250408545 247299605 245527170 244970138 245285574
$$ packed form
4724B35946261j620811q57881M44721J273621J423987J787404J880600O54000
4716B40931902q23968j110751K75202K172717K738081K129671J670102Q89552
4708B48872508j373774l875245m289042l082523q89878K094335L881819L498040
4700B44836240K243790J218884J30309j060746j752993j253724p37666j410640
4692B42213454j661774q66248M80972J770610K927785L276533K888191J568831
4684B52598354p74141k726714k544754p69843L31716K56544n8947L67998J139906
4675B47820119J184253P26240J368702K264058J824785J225367K96173j028613
4667B55681084o33969N21681R8712j864786l394177l108940j772435n57032L15436
$$ plain form
4658 245285574 246278152 247569405 248495941 248491956 248026552 247596637 246387268 244793314 244382750
4649 244382750 244754959 244624124 243297474 240960076 239166369 239010871 240212700 241877587
4641 241877587 244231958 247993769 252104387 255451318 257949461 258580583 256603050 253124374
4633 253124374 249051947 244757708 241360818 240598310 242999629 246421431 248407396 249065214
4625 249065214 249271598 248199433 245873163 244240445 243969700 244303851 245150030 246209644 246935093
4616 246935093 246958981 246043801 244698195 242960359 240566453 238259453 237445799 238505185 240506307
4607 240506307 242410506 243389028 242791649 240686952 238949188 239215099 239835525 238748609 235976770
4598 235976770 232689149 230846233 231243692 232525885 233234413 233343765 233236753 233491870 234746266
$$ packed form
4658B45285574R92578J291253R26536l985m65404m29915j209369j593954m10564
4649B44382750L72209j30835j326650k337398j793707j55498J201829J664887
4641B41877587K354371L761811M110618L346931K498143O31122j977533l478676
4633B53124374m072427m294239l396890p62508K401319L421802J985965O57818
4625B49065214K06384j072165k326270j632718k70745L34151Q46179J059614P25449
4616B46935093K3888r15180j345606j737836k393906k307000q13654J059386K001122
4607B40506307J904199R78522n97379k104697j737764K65911O20426j086916k771839
4598B35976770l287621j842916L97459J282193P08528J09352j07012K55117J254396
$$ plain form
4589 234746266 236525559 238454641 240688897 242847914 244167185 244195935 244007875 244628266 246314455
4580 246314455 248546346 250011277 250348655 250294171 250279368 250495340 251047127 251379503 250986128
4571 250986128 249750808 248077113 246415457 245048233 244607025 244807147 244523064 243699191 242336255
4562 242336255 239891113 237097797 235093716 233880945 233751736 234886638 236930249 239574007
4554 239574007 242181455 243728420 243331587 241274701 238827043 237696366 238820308 241571067
4546 241571067 244797592 248070665 250859669 252817529 254456253 255994721 256757082 256393201
4538 256393201 255889000 256244317 257383583 258697164 259754780 261160832 262960387 263343599
4530 263343599 261561231 258421557 255268577 252938587 250476188 247637047 245806991 245002301
$$ packed form
4589B34746266J779293J929082K234256K159017J319271K8750j88060O20391J686189
4580B46314455K231891J464931L37378n4484j4803K15972N51787L32376l93375
4571B50986128j235320j673695j661656j367224m41208K00122k84083q23873j362936
4562B42336255k445142k793316k004081j212771j29209J134902K043611K643758
4554B39574007K607448J546965l96833k056886k447658j130677J123942K750759
4546B41571067L226525L273073K789004J957860J638724J538468P62361l63881
4538B56393201n04201L55317J139266J313581J057616J406052J799555L83212
4530B63343599j782368l139674l152980k329990k462399k839141j830056q04690
$$ plain form
4522 245002301 243785650 241832700 240399103 240817992 242426389 243777527 245268288 247592380
4514 247592380 250130862 251988860 252932431 253556683 254457394 255373511 256068849 256546828 256335090
4505 256335090 255114216 252952025 250753448 250438497 252194246 254044308 254697512 254279889
4497 254279889 253438727 252244942 250207093 247810778 245634806 242967396 240364927 239081254
4489 239081254 239131900 240419444 242203426 242699328 241426269 240366895 241454812 243989951
4481 243989951 247018065 250935524 254807082 256730566 256737315 256386368 256155594 256315860 257295526
4472 257295526 258188993 257801252 256057780 253149380 248892406 244469953 241534476 240502377
4464 240502377 240367368 240255523 240286861 240690969 241600357 242778812 244093171 245753807 247385192
$$ packed form
4522B45002301j216651j952950j433597M18889J608397J351138J490761K324092
4514B47592380K538482J857998R43571O24252R00711R16117O95338M77979k11738
4505B56335090j220874k162191k198577l14951J755749J850062O53204m17623
4497B54279889q41162j193785k037849k396315k175972k667410k602469j283673
4489B39081254N0646J287544J783982M95902j273059j059374J087917K535139
4481B43989951L028114L917459L871558J923484O749l50947k30774J60266R79666
4472B57295526Q93467l87741j743472k908400m256974m422453k935477j032099
4464B40502377j35009j11845L1338M04108R09388J178455J314359J660636J631385
$$ plain form
4455 247385192 247756137 246301313 244332701 242763300 241603170 241627407 243938302 248718361
4447 248718361 253756165 256059318 255930421 255311417 254628731 253968940 253567643 253207942 252392130
4438 252392130 251079681 249899592 249502402 249910633 250621841 251481268 252464893 253719996 254639972
4429 254639972 253821849 251444219 248605673 245867751 244322493 245281240 248648910 253147550
4421 253147550 256479954 256776025 254325421 251268583 249386338 248089585 246086051 243701814
4413 243701814 242023758 241883215 243862097 247534842 251180435 253269225 253527424 252545028
4405 252545028 250860101 249433773 248809013 248955285 249472948 249673553 249558182 249199038 248871856
4396 248871856 249181525 249449544 248859671 247556188 245943081 244880549 245014589 246344122 249024261
$$ packed form
4455B47385192L70945j454824j968612j569401j160130K4237K310895M780059
4447B48718361N037804K303153j28897o19004o82686o59791m01297l59701q15812
4438B52392130j312449j180089l97190M08231P11208Q59427R83625J255103R19976
4429B54639972q18123k377630k838546k737922j545258R58747L367670M498640
4421B53147550L332404K96071k450604l056838j882245j296753k003534k384237
4413B43701814j678056j40543J978882L672745L645593K088790K58199r82396
4405B52545028j684927j426328o24760J46272N17663K00605j15371l59144l27182
4396B48871856L09669K68019n89873j303483j613107j062532J34040J329533K680139
$$ plain form
4387 249024261 252102114 254196353 254817771 253480213 251065962 249677050 249877452 250715294
4379 250715294 252246109 254298665 255179521 253632776 250950967 249571992 249775698 250318580
4371 250318580 250126279 249298062 249193054 250678078 253350880 255967431 257343354 257432220 256757878
4362 256757878 255176404 252776628 250146410 248048771 247718143 249843395 253344185 256224514
4354 256224514 256991398 255936368 254149341 252538230 251564422 251263534 251871302 252693811 253620158
4345 253620158 255011778 255667199 254751746 253035334 251046542 249114906 247874202 247409093
4337 247409093 247434394 247705397 248119344 248877446 250121079 251575485 253159627 254886127 255664966
4328 255664966 254681532 253912141 255263624 258011986 261020660 262990689 263228270 262331995 261297065
$$ packed form
4387B49024261L077853K094239O21418j337558k414251j388912K00402Q37842
4379B50715294J530815K052556Q80856j546745k681809j378975K03706N42882
4371B50318580j92301q28217j05008J485024K672802K616551J375923Q8866o74342
4362B56757878j581474k399776k630218k097639l30628K125252L500790K880329
4354B56224514P66884j055030j787027j611111r73808l00888O07768Q22509R26347
4345B53620158J391620O55421r15453j716412j988792j931636j240704m65109
4337B47409093K5301K71003M13947P58102J243633J454406J584142J726500P78839
4328B55664966r83434p69391J351483K748362L008674J970029K37581q96275j034930
$$ plain form
4319 261297065 261378474 262701970 263877472 262648961 258246696 253022841 248968506 246768277
4311 246768277 246973947 248238262 248938706 248550824 247874210 248009061 249334572 251364673 252608545
4302 252608545 252065052 250497687 249460217 249273218 250613563 254573754 259246984 262326898
4294 262326898 263500762 262667563 259895884 256245498 253351891 252043228 251563900 250451107
4286 250451107 248871659 247759224 247750597 248906523 251433724 254624475 257387712 260073838
4278 260073838 262983092 265922655 267973709 268297314 267681739 267205959 266896891 265963258 263870994
4269 263870994 260904239 258140940 256741428 256811410 257581085 258316649 258244411 257135551 255808552
4260 255808552 255275850 255679286 256707807 257125031 255241714 251844231 249217316 248369713 248696364
$$ packed form
4319B61297065Q1409J323496J175502j228511m402265n223855m054335k200229
4311B46768277K05670J264315P00444l87882o76614J34851J325511K030101J243872
4302B52608545n43493j567365j037470j86999J340345L960191M673230L079914
4294B62326898J173864q33199k771679l650386k893607j308663m79328j112793
4286B50451107j579448j112435q627J155926K527201L190751K763237K686126
4278B60073838K909254K939563K051054L23605o15575m75780l09068r33633k092264
4269B63870994k966755k763299j399512O9982P69675P35564p2238j108860j326999
4260B55808552n32702M03436J028521M17224j883317l397483k626915q47603L26651
$$ plain form
4251 248696364 249210123 249208239 249287629 249927645 250859844 251811571 252295523 251996606 251732935 251857630
4241 251857630 251363994 250689788 250926100 251940491 253202266 255241517 258376672 261989809
4233 261989809 265124336 267056599 268594361 270053255 270815135 271105250 270228651 266746026
4225 266746026 261362025 256125181 252585220 250743090 249758757 249522594 250260606 251376958
4217 251376958 252107907 252672553 252702242 251941075 251330103 251503705 252322702 253377120 254876595
4208 254876595 257362333 259486468 260153094 259536908 257780828 255918796 255002456 254971421 254549588
4199 254549588 253079201 251842624 251834406 252105519 251341237 249779462 248521680 249031615 251542034
4190 251542034 254669645 256719181 256927715 255909389 254402603 252664307 251089166 250283397
$$ packed form
4251B48696364N13759j884P9390O40016R32199R51727M83952k98917k63671J24695
4241B51857630m93636o74206K36312J014391J261775K039251L135155L613137
4233B61989809L134527J932263J537762J458894P61880K90115q76599l482625
4225B66746026n384001n236844l539961j842130r84333k36163P38012J116352
4217B51376958P30949N64646K9689p61167o10972J73602Q18997J054418J499475
4208B54876595K485738K124135O66626o16186j756080j862032r16340l1035m21833
4199B54549588j470387j236577q218K71113p64282j561775j257782N09935K510419
4190B51542034L127611K049536K08534j018326j506786j738296j575141q05769
$$ plain form
4182 250283397 250418120 251527403 254015317 257965589 262270588 265521611 267258202 267639047
4174 267639047 266733526 265067765 263357558 261957262 260741394 259972605 260380120 261776092
4166 261776092 262899843 262995105 263252499 265219808 268250444 270727133 272130342 272305927 271346153
4157 271346153 269649086 267855691 266720713 266012005 265619142 266187743 268084714 270524664
4149 270524664 271968480 272285172 273209510 275253560 276395887 275305610 273636423 273342468
4141 273342468 274419755 276080301 277834421 279057376 279404967 278837542 277821657 276706060
4133 276706060 275854297 275363224 274599043 273918453 273312076 271406139 268904898 267585861 267563540
4124 267563540 267453527 266480281 265042725 263931621 264144672 265863086 268251508 270432605
$$ packed form
4182B50283397J34723J109283K487914L950272M304999L251023J736591L80845
4174B67639047r05521j665761j710207j400296j215868p68789M07515J395972
4166B61776092J123751R5262K57394J967309L030636K476689J403209J75585r59774
4157B71346153j697067j793395j134978p08708l92863N68601J896971K439950
4149B70524664J443816L16692R24338K044050J142327j090277j669187k93955
4141B73342468J077287J660546J754120J222955L47591n67425j015885j115597
4133B76706060q51763m91073p64181o80590o06377j905937k501241j319037k2321
4124B67563540j10013r73246j437556j111104K13051J718414K388422K181097
$$ plain form
4116 270432605 272058417 273060684 273024630 272521452 273135055 275589747 278340945 279929412 280482819
4107 280482819 280745278 281071033 281320744 281617961 281105898 279295559 277492332 277300149 278753950
4098 278753950 281138227 283753294 285108451 284945592 284949325 285556672 285255492 283895883 282985602
4089 282985602 282651762 282345321 281741872 280977402 281005347 282024996 282752097 281775186 279783125
4080 279783125 278437428 278255421 278976084 280035377 281861144 284665674 287751544 290061886
4072 290061886 291063463 291292104 291292063 290552966 288958744 287544865 286906045 286632515 287026517
4063 287026517 288643544 291119898 293113804 293727807 293662740 293539042 293249755 293266535 293700690
4054 293700690 293407407 291882142 290109499 289148728 289636616 290974435 293037074 295636314
$$ packed form
4116B70432605J625812J002267l6054n03178O13603K454692K751198J588467N53407
4107B80482819K62459L25755K49711K97217n12063j810339j803227j92183J453801
4098B78753950K384277K615067J355157j62859L733O07347l01180j359609r10281
4089B82985602l33840l06441o03449p64470K7945J019649P27101r76911j992061
4080B79783125j345697j82007P20663J059293J825767K804530L085870K310342
4072B90061886J001577K28641m1p39097j594222j413879o38820k73530L94002
4063B87026517J617027K476354J993906O14003o5067j23698k89287J6780M34155
4054B93700690k93283j525265j772643r60771M87888J337819K062639K599240
$$ plain form
4046 295636314 296991996 296655084 296147722 296103862 297072192 298948760 300284664 301356718 303169590
4037 303169590 305507197 308218810 311223190 313987085 315853092 316373430 316635738 317859194
4029 317859194 319930076 322352990 324489753 325841574 327328667 330570987 335868723 342732005
4021 342732005 350570214 358423472 365084041 370506706 375432672 379927801 384948485 391420478
4013 391420478 398993936 406792415 413774931 420473018 428798245 438291236 446595246 453053242
4005 453053242 458717187 463134253 464485329 461090286 451471828 435454470 414636594 391361449
3997 391361449 367397815 343853484 322045882 303239586 287475046 272649217 255497452
3990 255497452 234507870 210577635 186464418 164941612 146093598 128732852 111260259
$$ packed form
4046B95636314J355682l36912n07362m3860R68330J876568J335904J072054J812872
4037C03169590K337607K711613L004380K763895J866007N20338K62308J223456
4029C17859194K070882K422914K136763J351821J487093L242320N297736O863282
4021C42732005P838209P853258O660569N422665M925966M495129N020684O471993
4013C91420478P573458P798479O982516O698087Q325227R492991Q304010O457996
4005D53053242N663945M417066J351076l395043r618458j6017358k0817876k3275145
3997C91361449k3963634k3544331k1807602j8806296j5764540j4825829j7151765
3990B55497452k0989582k3930235k4113217k1522806j8848014j7360746j7472593
$$ plain form
3983 111260259 93530681 78336510 68044673 63186976 62641861 65409943 70881537 78210865
3975 78210865 87321274 97133719 105624443 111994738 117061679 121795763 126983401 133318443
3967 133318443 139682005 144784103 148696669 152296745 155945352 158854224 160639803 161616465
3959 161616465 161555075 160994290 161930136 164785773 168180056 170512457 171030495 170042924 169444194
3950 169444194 170370334 171585788 171686722 171173241 171419437 172965458 175432353 177886966 179309799
3941 179309799 179425266 179082571 178741274 178276238 179107703 181668622 183537896 183435634 182842756
3932 182842756 183595238 185736652 189303437 195329567 202223658 207269341 209368457 209028483
3924 209028483 207509856 206174584 205097777 203299488 201109672 199499508 197773051 195189607
$$ packed form
3983A11260259j7729578j5194171j0291837m857697n45115K768082N471594P329328
3975G8210865R110409R812445Q490724O370295N066941M734084N187638O335042
3967A33318443O363562N102098L912566L600076L648607K908872J785579R76662
3959A61616465o1390n60785R35846K855637L394283K332401N18038r87571n98730
3950A69444194R26140J215454J00934n13481K46196J546021K466895K454613J422833
3941A79309799J15467l42695l41297m65036Q31465K560919J869274j02262n92878
3932A82842756P52482K141414L566785O026130O894091N045683K099116l39974
3924B09028483j518627j335272j076807j798289k189816j610164j726457k583444
$$ plain form
3916 195189607 193248056 192968767 193937591 195688472 198023223 200439011 202539266 204304390
3908 204304390 206100253 208259882 210159532 210926307 210901685 210898691 211622547 213417488 216209845
3899 216209845 219033301 220290964 219311573 217196117 215063361 213570402 213397238 213762814
3891 213762814 214453830 215701638 216749094 217252588 218102946 219627886 220677924 220177419 218341098
3882 218341098 216717834 216428173 218118920 220949953 222785935 223106208 222533369 220423368
3874 220423368 216901221 213483485 210400474 208127017 207246379 206923343 206775802 206938521 207965875
3865 207965875 210632823 214137268 216608805 217459810 217455863 217530440 218584335 220301320 221531195
3856 221531195 222299077 222698088 222379536 222387601 223134046 223756021 224548519 225384628 225617121 225435115
$$ packed form
3916A95189607j941551k79289R68824J750881K334751K415788K100255J765124
3908B04304390J795863K159629J899650P66775k4622k994P23856J794941K792357
3899B16209845K823456J257663r79391k115456k132756j492959j73164L65576
3891B13762814O91016J247808J047456N03494Q50358J524940J050038n00505j836321
3882B18341098j623264k89661J690747K831033J835982L20273n72839k110001
3874B20423368l522147l417736l083011k273457q80638l23036j47541J62719J027354
3865B07965875K666948L504445K471537Q51005l947P4577J053895J716985J229875
3856B21531195P67882L99011l18552Q065P46445O21975P92498Q36109K32493j82006
$$ plain form
3846 225435115 224872853 223152015 220485255 218470391 218326295 219511425 220043779 219299795 218378833
3837 218378833 218017945 218330992 218702931 218597367 218422866 217860689 216721770 215656232 215296843
3828 215296843 215968944 218089820 220878475 223217402 224967624 226007334 226891554 228372341
3820 228372341 230427223 232239695 233000659 233052794 233259963 233535282 233512563 232848462 230432911
3811 230432911 226931891 224879717 224938903 225362077 225846607 227394209 229383904 231070392 233144055
3802 233144055 235390267 236175070 234461279 230540615 225843721 222141970 220199444 219594060
3794 219594060 219196182 218608053 218087873 217794139 217768473 217809264 217690105 217315194 216843093 216375648
3784 216375648 216407442 217541844 219879021 223209199 226826419 230242132 233469218 235857551
$$ packed form
3846B25435115n62262j720838k666760k014864j44096J185130N32354p43984r20962
3837B18378833l60888L13047L71939j05564j74501n62177j138919j065538l59389
3828B15296843O72101K120876K788655K338927J750222J039710Q84220J480787
3820B28372341K054882J812472P60964N2135K07169K75319k2719o64101k415551
3811B30432911l501020k052174N9186M23174M84530J547602J989695J686488K073663
3802B33144055K246212P84803j713791l920664m696894l701751j942526o05384
3794B19594060l97878n88129n20180k93734k5666M0791j19159l74911m72101m67445
3784B16375648L1794J134402K337177L330178L617220L415713L227086K388333
$$ plain form
3776 235857551 237400076 238952098 240379695 240417826 238538960 236216895 235453269 236226138 237244027
3767 237244027 237303446 236277535 235150654 234925728 236211304 238078246 239286281 239424730 238802573
3758 238802573 238406488 238441924 238969699 239931919 240910437 241780672 241809332 240237522 237592202
3749 237592202 234755791 232596119 231538320 231705705 233334080 236446450 239983493 242252990
3741 242252990 243203492 243937922 244847965 245576336 245020819 243542685 242571749 242095560 241724725
3732 241724725 240972099 239400130 237298504 235396953 234158153 233488194 232746728 231474599
3724 231474599 230413215 230589036 231613227 232089181 232097712 232566885 233324393 233615275 232862011
3715 232862011 232046762 232644138 234591424 236891524 238749803 240042789 241190912 242348164
$$ packed form
3776B35857551J542525J552022J427597L8131j878866k322065p63626P72869J017889
3767B37244027N9419j025911j126881k24926J285576J866942J208035J38449o22157
3758B38802573l96085L5436N27775R62220R78518Q70235K8660j571810k645320
3749B37592202k836411k159672j057799J67385J628375L112370L537043K269497
3741B42252990R50502P34430R10043P28371n55517j478134r70936m76189l70835
3732B41724725p52626j571969k101626j901551j238800o69959p41466j272129
3724B31474599j061384J75821J024191M75954Q531M69173P57508K90882p53264
3715B32862011q15249N97376J947286K300100J858279J292986J148123J157252
$$ plain form
3707 242348164 243106613 242821825 241160997 238161019 234742472 232169158 230987130 231200175
3699 231200175 232239169 233483929 234127375 234137812 234452484 235522135 236340394 235821350 233986684
3690 233986684 231419049 228037310 224194431 221184382 219652062 218987819 218635434 219659181
3682 219659181 223035297 228625003 233721236 235797278 235858383 236135329 236881362 236441779 234801125
3673 234801125 233666216 233445579 233211407 232155095 231050940 230716781 230346770 229243115 227870621
3664 227870621 227334159 228421336 231142355 235118006 239145066 242158605 243712664 243093957
3656 243093957 240295453 236469560 232982840 230299060 228296015 227172558 227230149 229070365
3648 229070365 231804402 233940040 235284387 236052162 236469922 235984745 234798960 234149097 234354645
$$ packed form
3707B42348164P58449k84788j660828k999978l418547k573314j182028K13045
3699B31200175J038994J244760O43446J0437L14672J069651Q18259n19044j834666
3690B33986684k567635l381739l842879l010049j532320o64243l52385J023747
3682B19659181L376116N589706N096233K076042O1105K76946P46033m39583j640654
3673B34801125j134909k20637k34172j056312j104155l34159l70011j103655j372494
3664B27870621n36462J087177K721019L975651M027060L013539J554059o18707
3656B43093957k798504l825893l486720k683780k003045j123457N7591J840216
3648B29070365K734037K135638J344347P67775M17760m85177j185785o49863K05548
$$ plain form
3639 234354645 234969490 235671167 235231102 232976557 230449334 228982419 228575237 228855904 229521502
3630 229521502 230121401 230618346 231811097 233930680 235676400 235466963 234449005 234433364 235096332
3621 235096332 235221402 234723478 234966587 236647813 239475580 242766049 245527849 246572811
3613 246572811 245271011 243011862 241346305 240278408 239555258 239131507 239079829 238989295 237709282
3604 237709282 235690192 234541614 234288337 234266941 234542105 235627703 237495924 239262229 240556712
3595 240556712 242369992 244561421 245982416 246634204 247075724 247205168 246381126 244091988 240389037
3586 240389037 236433591 233270685 230654750 228858478 229220481 232106473 236750491 241136086
3578 241136086 243505412 244140819 243634810 241999160 240542698 239744085 238779899 237840483 238004974
$$ packed form
3639B34354645O14845P01677m40065k254545k527223j466915m07182K80667O65598
3630B29521502N99899M96945J192751K119583J745720k09437j017958j5641O62968
3621B35096332J25070m97924K43109J681226K827767L290469K761800J044962
3613B46572811j301800k259149j665557j067897p23150m23751n1678r0534j280013
3604B37709282k019090j148578k53277k1396K75164J085598J868221J766305J294483
3595B40556712J813280K191429J420995O51788M41520J29444q24042k289138l702951
3586B40389037l955446l162906k615935j796272L62003K885992M644018M385595
3578B41136086K369326O35407n06009j635650j456462p98613r64186r39416J64491
$$ plain form
3569 238004974 239932851 242314913 243539558 243851276 244410448 244927334 243753281 240954779
3561 240954779 238017616 235659309 234213836 233634350 233296140 232569794 231481614 230709149 230821435
3552 230821435 232302716 235251353 238543891 240688371 240941572 239484784 236933568 234242498
3544 234242498 232890990 233248131 234175597 234965626 235419767 235766048 236241948 236590473 236926187
3535 236926187 237328551 237521412 237180284 236073375 234845611 234743052 236998238 241052612 243991749
3526 243991749 244019264 242258494 239928617 237573245 234854699 231847505 229836202 229564887
3518 229564887 231015145 233805896 237356640 240577951 242489667 243294017 243352820 242552478 241384351
3509 241384351 240545308 240210833 240377263 240599229 240780457 240921825 240840052 240577458 240414684
$$ packed form
3569B38004974J927877K382062J224645L11718N59172N16886j174053k798502
3561B40954779k937163k358307j445473n79486l38210p26346j088180p72465J12286
3552B30821435J481281K948637L292538K144480K53201j456788k551216k691070
3544B34242498j351508L57141R27466P90029M54141L46281M75900L48525L35714
3535B36926187M02364J92861l41128j106909j227764j02559K255186M054374K939137
3526B43991749K7515j760770k329877k355372k718546l007194k011303k71315
3518B29564887J450258K790751L550744L221311J911716Q04350N8803q00342j168127
3509B41384351q39043l34475J66430K21966J81228J41368q1773k62594j62774
$$ plain form
3500 240414684 241061274 242522175 244377831 246231838 248044237 250258724 252859150 254867837
3492 254867837 256090272 256645223 255722933 252601781 248108614 244906980 244309131 245283078 245905692
3483 245905692 244961355 242630041 239741327 237395117 236267384 236003475 236184691 237205748
3475 237205748 238643067 239527844 239564902 239054427 238403129 237468894 236196094 235590453 236203332
3466 236203332 237252047 238398649 239711928 240698208 240558608 238579629 235502876 233351638
3458 233351638 233569890 236103434 239062511 240147824 238788397 236137721 234612328 235693335
3450 235693335 238201087 240802907 243049682 244718703 245896304 246122719 244829375 242982230
3442 242982230 241801144 240935798 239677595 237753756 235064554 232429512 230685235 229852765
$$ packed form
3500B40414684O46590J460901J855656J854007J812399K214487K600426K008687
3492B54867837J222435N54951r22290l121152m493167l201634n97849R73947O22614
3483B45905692r44337k331314k888714k346210j127733k63909J81216J021057
3475B37205748J437319Q84777L7058n10475o51298r34235j272800o05641O12879
3466B36203332J048715J146602J313279R86280j39600j978979l076753k151238
3458B33351638K18252K533544K959077J085313j359427k650676j525393J081007
3450B35693335K507752K601820K246775J669021J177601K26415j293344j847145
3442B42982230j181086q65346j258203j923839k689202k635042j744277q32470
$$ plain form
3434 229852765 229917132 231005663 232706612 234592708 236679400 239141375 241454903 242677445
3426 242677445 242384561 240852686 239714392 240231337 242087656 244452087 246586518 247586940
3418 247586940 246661111 244126191 241403211 238890969 235953348 232560560 229073843 225919907
3410 225919907 224033180 223643089 223821005 224501632 226171869 227793501 227988865 227435322 227786664
3401 227786664 229102284 229921855 229434124 228019213 226125335 224569138 225105106 228798409
3393 228798409 234421233 239286851 241446399 241270466 240876986 241717837 243713353 245485889
3385 245485889 246041744 245738033 245043135 243170069 240155207 237716582 236532424 235992029 235808071
3376 235808071 236211142 237030604 237383128 236952406 235880248 234792391 233973677 233318347 233769684
$$ packed form
3434B29852765O4367J088531J700949J886096K086692K461975K313528J222542
3426B42677445k92884j531875j138294N16945J856319K364431K134431J000422
3418B47586940r25829k534920k722980k512242k937621l392788l486717l153936
3410B25919907j886727l90091J77916O80627J670237J621632J95364n53543L51342
3401B27786664J315620Q19571m87731j414911j893878j556197N35968L693303
3393B28798409N622824M865618K159548j75933l93480Q40851J995516J772536
3385B45485889N55855l03711o94898j873066l014862k438625j184158n40395j83958
3376B35808071M03071Q19462L52524m30722j072158j087857q18714o55330M51337
$$ plain form
3367 233769684 234933833 235237376 234660545 234552591 235312728 236709825 238464783 240182267 241779735
3358 241779735 242542272 242357891 241636958 239620475 236210002 232413507 229780562 229892974 232052380
3349 232052380 234534398 236287132 236430912 235552581 234938706 234891095 234550628 233058083 231512041
3340 231512041 231392756 232870513 235007882 236979926 239356806 242896010 247308692 250872425
3332 250872425 251840166 250885743 250074790 249979909 249479802 248476275 247461925 246428704 245507065
3323 245507065 245007252 245000238 245072062 244681706 243614524 241833944 239677875 238205393 237981908
3314 237981908 238329193 238111365 236630184 234749880 234455398 236570090 240148000 243828467
3306 243828467 246525179 248006285 248265614 247126572 245306310 243529754 241215269 237853436
$$ packed form
3367B33769684J164149L03543n76831j07954P60137J397097J754958J717484J597468
3358B41779735P62537j84381p20933k016483l410473l796495k632945J12412K159406
3349B32052380K482018J752734J43780q78331o13875m7611l40467j492545j546042
3340B31512041j19285J477757K137369J972044K376880L539204M412682L563733
3332B50872425R67741r54423q10953r4881n00107j003527j014350j033221r21639
3323B45507065m99813p014P1824l90356j067182j780580k156069j472482k23485
3314B37981908L47285k17828j481181j880304k94482K114692L577910L680467
3306B43828467K696712J481106K59329j139042j820262j776556k314485l361833
$$ plain form
3298 237853436 233866425 229861330 227339209 228332852 231592887 234305929 236082605 237421219
3290 237421219 238161322 238507076 239253924 240335700 241390331 242340275 243219171 244195934 244435156
3281 244435156 242915318 239871572 236675848 234485526 232885573 231079299 228506946 225031753
3273 225031753 221924469 220590123 220923733 221877548 222813534 223975888 226212760 229687003
3265 229687003 233681223 237185902 239324373 239590147 238179119 236067879 234301778 233848467
3257 233848467 234651654 235919028 237900485 241016825 244371567 246980988 248611787 249516027
3249 249516027 250329478 251028769 250925524 250168140 248740340 246766394 244913607 243320744 242199491
3240 242199491 241840663 241984297 241831085 241280411 240889936 240572448 240198475 239853200 239239837
$$ packed form
3298B37853436l987011m005095k522121R93643L260035K713042J776676J338614
3290B37421219P40103L45754P46848J081776J054631R49944Q78896R76763K39222
3281B44435156j519838l043746l195724k190322j599953j806274k572353l475193
3273B25031753l107284j334346L33610R53815R35986J162354K236872L474243
3265B29687003L994220L504679K138471K65774j411028k111240j766101m53311
3257B33848467Q03187J267374J981457L116340L354742K609421J630799R04240
3249B49516027Q13451O99291j03245p57384j427800j973946j852787j592863j121253
3240B42199491l58828J43634j53212n50674l90475l17488l73973l45275o13363
$$ plain form
3231 239239837 238245113 237311177 236973644 237730087 239373728 241128871 242464494 243342151 244076206
3222 244076206 244164770 242605969 239932854 237508167 235718694 234325486 233895505 234947500
3214 234947500 237098815 239396857 241096321 242007114 241932341 240588845 238729071 237298483
3206 237298483 236491276 236598972 237341752 237590380 237069500 236717665 236774145 235789820 233121462
3197 233121462 230315640 229192780 229977350 231845852 233857751 235255990 235892301 236206898
3189 236206898 236388199 236921479 238134638 238982218 238873781 238527091 238695457 240054077 242598969
3180 242598969 245576025 247601227 247784475 246446712 244517851 242837086 241549288 240651245
3172 240651245 240184873 240052689 239874149 239546770 239491041 239747683 240371005 241644974 242662136
$$ packed form
3231B39239837r94724r33936l37533P56443J643641J755143J335623Q77657P34055
3222B44076206Q8564j558801k673115k424687j789473j393208m29981J051995
3214B34947500K151315K298042J699464R10793p4773j343496j859774j430588
3206B37298483q07207J07696P42780K48628n20880l51835N6480r84325k668358
3197B33121462k805822j122860P84570J868502K011899J398239O36311L14597
3189B36206898J81301N33280J213159Q47580j08437l46690J68366J358620K544892
3180B42598969K977056K025202J83248j337763j928861j680765j287798q98043
3172B40651245m66372j32184j78540l27379n5729K56642O23322J273969J017162
$$ plain form
3163 242662136 242083650 240058824 238199247 237782055 239230057 242070575 245154307 248354793
3155 248354793 251300206 253316546 254167539 253643088 252312629 250664441 248602082 246188306
3147 246188306 243515065 241658259 241073092 240446366 239271492 238113860 237607432 237613897 237463959
3138 237463959 237182965 237364225 237992463 238668676 239038967 239307661 239815817 241003845 243070929
3129 243070929 244947737 245578030 244155853 240122712 234656506 229387695 225118341 223071433
3121 223071433 223417921 224821468 227070254 230289737 233577153 235868661 236978318 237899609
3113 237899609 239686665 242415358 245372871 248008277 250003324 251212263 252098681 252810911
3105 252810911 252667051 251764986 251587755 253523271 256739851 259190735 259984794 259525152 258733216
$$ packed form
3163B42662136n78486k024826j859577m17192J448002K840518L083732L200486
3155B48354793K945413K016340Q50993n24451j330459j648188k062359k413776
3147B46188306k673241j856806n85167o26726j174874j157632n06428O465j49938
3138B37463959k80994J81260O28238O76213L70291K68694N08156J188028K067084
3129B43070929J876808O30293j422177m033141n466206n268811m269354k046908
3121B23071433L46488J403547K248786L219483L287416K291508J109657R21291
3113B37899609J787056K728693K957513K635406J995047J208939Q86418P12230
3105B52810911j43860r02065j77231J935516L216580K450884P94059m59642p91936
$$ plain form
3096 258733216 258201412 257387107 254843572 250615485 246229568 243058633 241098538 239534028
3088 239534028 238030167 237217280 237915833 239752373 241260044 241519580 241172017 241127380 240747217
3079 240747217 239639128 237932659 235541670 233214595 231477618 230447587 229806832 229635307
3071 229635307 231533742 235936266 240538072 243415906 244572700 244908128 244736691 243600365
3063 243600365 241658082 239611896 237745869 237054872 238463116 240951914 242931714 243881163
3055 243881163 243422203 241633879 239146649 236140185 233221400 231330504 230450479 230390904 231573121
3046 231573121 233444359 235171186 236787042 238761552 241128886 243444775 244727019 245065317
3038 245065317 245468476 245496919 244651193 244150162 245773936 249524928 253217124 255066375 255344612
$$ packed form
3096B58733216n31804q14305k543535m228087m385917l170935j960095j564510
3088B39534028j503861q12887O98553J836540J507671K59536l47563m4637l80163
3079B40747217j108089j706469k390989k327075j736977j030031o40755j71525
3071B29635307J898435M402524M601806K877834J156794L35428j71437j136326
3063B43600365j942283k046186j866027o90997J408244K488798J979800R49449
3055B43881163m58960j788324k487230l006464k918785j890896q80025n9575J182217
3046B31573121J871238J726827J615856J974510K367334K315889J282244L38298
3038B45065317M03159K8443q45726n01031J623774L750992L692196J849251K78237
$$ plain form
3029 255344612 254891051 253519669 250437716 246232237 242543493 240557585 240839248 242636215
3021 242636215 244712684 246363558 247009754 246507903 245709971 244332710 242230054 240331556
3013 240331556 239811765 241426409 243910461 244636587 243647083 243379526 245074041 247385714 247996930
3004 247996930 246626520 244797596 243511826 243181886 243148430 242148689 240724307 239799888 240117113
2995 240117113 241877899 243670122 244126817 242852972 240949993 239679242 239082781 238845706
2987 238845706 238894825 238943311 238783430 238678536 238726205 238888581 239168928 239460419 240277897 242561197
2977 242561197 245870247 248228778 248930849 248693353 248252935 248061737 247784933 247126333 246272103
2968 246272103 245866883 246092917 245429242 243498954 242122189 242043301 242045211 241948917 243272283
$$ packed form
3029B55344612m53561j371382l081953m205479l688744j985908K81663J796967
3021B42636215K076469J650874O46196n01851p97932j377261k102656j898498
3013B40331556n19791J614644K484052P26126r89504k67557J694515K311673O11216
3004B47996930j370410j828924j285770l29940l3456r99741j424382r24419L17225
2995B40117113J760786J792223M56695j273845j902979j270751n96461k37075
2987B38845706M9119M8486j59881j04894M7669J62376K80347K91491Q17478K283300
2977B42561197L309050K358531P02071k37496m40418j91198k76804o58600q54230
2968B46272103m05220K26034o63675j930288j376765p8888J910r6294J323366
$$ plain form
2959 243272283 245816645 248221366 249686939 250492220 251201436 251033384 249688798 248232398
2951 248232398 247856688 249090737 251362633 253973097 255900462 255585755 252525159 248203756
2943 248203756 244313063 242425738 242878139 244175130 245840062 248499536 251401730 253891100
2935 253891100 255678221 256881501 258197441 259614590 260326494 259674689 257682750 254651014
2927 254651014 251360164 248726220 246733590 245575678 245969519 247283033 248129685 247907515
2919 247907515 247181632 246482660 245840950 244989749 244321468 245128207 247331832 249372083 250184415
2910 250184415 250197548 250133475 249734950 248209967 245890057 244877461 245477300 245838512 246148279
2901 246148279 247477090 249060228 249817659 249568357 249132966 249198245 248978199 247665576 245661643
$$ packed form
2959B43272283K544362K404721J465573Q05281P09216j68052j344586j456400
2951B48232398l75710J234049K271896K610464J927365l14707l060596m321403
2943B48203756l890693j887325M52401J296991J664932K659474K902194K489370
2935B53891100J787121J203280J315940J417149P11904o51805j991939l031736
2927B54651014l290850k633944j992630j157912L93841J313514Q46652k22170
2919B47907515p25883o98972o41710q51201o68281Q06739K203625K040251Q12332
2910B50184415J3133o4073l98525j524983k319910j012596N99839L61212L09767
2901B46148279J328811J583138P57431k49302m35391O5279k20046j312623k003933
$$ plain form
2892 245661643 244838798 245958868 247328973 248073264 248642206 248970550 248685210 247790155 246986297
2883 246986297 246504977 246273932 246341293 246102191 244973948 243621349 242967203 243010639 243299308
2874 243299308 243775990 244436627 245163562 245836370 246324112 246379757 246220934 246860773 248458682
2865 248458682 249808118 248829452 246075566 244716394 245062929 245272578 244314280 243629373 245120521
2856 245120521 247953267 250884050 253252155 254431367 254263237 252726888 250253047 248151626
2848 248151626 246965809 246287299 245720706 245171538 245321683 245694023 245739986 245874284 246423367
2839 246423367 248423173 251864319 254980890 256606446 256586992 255868189 255910542 257073876 258480741
2830 258480741 258664152 257222212 254738920 252065895 249068843 245871431 243859168 243146675
$$ packed form
2892B45661643q22845J120070J370105P44291N68942L28344k85340q95055q03858
2883B46986297m81320k31045O7361k39102j128243j352599o54146M3436K88669
2874B43299308M76682O60637P26935O72808M87742N5645j58823O39839J597909
2865B48458682J349436r78666k753886j359172L46535K09649r58298o84907J491148
2856B45120521K832746K930783K368105J179212j68130j536349k473841k101421
2848B48151626j185817o78510n66593n49168J50145L72340M5963J34298N49083
2839B46423367J999806L441146L116571J625556j9454p18803M2353J163334J406865
2830B58480741J83411j441940k483292k673025k997052l197412k012263p12493
$$ plain form
2822 243146675 242689299 242350786 242908361 244379782 245511461 245554710 245078014 244386713 242725518
2813 242725518 239806964 236838129 234018624 230979095 228843066 228481351 228217981 227138649
2805 227138649 226519885 226696587 228072297 230806744 233672900 236277024 239104816 241382847
2797 241382847 242375340 242260700 241131662 239353280 237739983 236935073 236643755 237002828 238873504
2788 238873504 241805849 244489505 246739457 249133385 250928216 250169789 247173270 244090129
2780 244090129 242203758 241812366 242623244 244181506 245338781 245375221 244801257 244729633 245216258
2771 245216258 244870734 243231183 241365488 240290393 240426201 241541083 243173329 245261455
2763 245261455 246825383 246854452 246106813 246205374 247624963 249014264 249441506 248840829 247488793
$$ packed form
2822B43146675m57376l38513N57575J471421J131679M3249m76696o91301j661195
2813B42725518k918554k968835k819505l039529k136029l61715k63370j079332
2805B27138649o18764J76702J375710K734447K866156K604124K827792K278031
2797B41382847R92493j14640j129038j778382j613297q04910k91318L59073J870676
2788B38873504K932345K683656K249952K393928J794831p58427k996519l083141
2780B44090129j886371l91392Q10878J558262J157275L6440n73964p1624M86625
2771B45216258l45524j639551j865695j075095J35808J114882J632246K088126
2763B45261455J563928K9069p47639R8561J419589J389301M27242o00677j352036
$$ plain form
2754 247488793 246303003 246253122 247340911 248450359 248498059 247079509 244789485 242651332 241154675
2745 241154675 240625349 240551760 240258517 239514492 238637502 238457013 239407586 241277838 243176392
2736 243176392 244803633 246069390 245537915 242696936 238800923 235534310 233460376 231903724
2728 231903724 230548485 229546246 229306215 229869189 230998582 232652818 234583585 235602957
2720 235602957 235325396 234519884 234394671 236460742 240795385 246099667 251187818 255106329
2712 255106329 255999174 253552203 249947283 247159143 245411023 243933476 242789187 242969161
2704 242969161 245158075 248725323 252245851 254719031 256130464 256670788 256168393 254989257
2696 254989257 254151952 253685927 252947003 251477306 249651996 247368103 244112821 240727077
$$ packed form
2754B47488793j185790m9881J087789J109448M7700j418550k290024k138153j496657
2745B41154675n29326p3589k93243p44025q76990j80489R50573J870252J898554
2736B43176392J627241J265757n31475k840979l896013l266613k073934j556652
2728B31903724j355239j002239k40031N62974J129393J654236J930767J019372
2720B35602957k77561q05512j25213K066071M334643N304282N088151L918511
2712B55106329Q92845k446971l604920k788140j748120j477547j144289J79974
2704B42969161K188914L567248L520528K473180J411433N40324n02395j179136
2696B54989257q37305m66025p38924j469697j825310k283893l255282l385744
$$ plain form
2688 240727077 239028463 239747038 241889677 244142088 246213692 247923864 248835353 249417079
2680 249417079 249878631 249937260 249716975 250278893 252734033 256034030 258129248 258761943 257794948
2671 257794948 254677524 249647002 244234173 240260747 237212257 234013111 231368366 229877157
2663 229877157 230002573 231724495 233615136 234849462 235845144 236511966 236902099 238024016 239847154
2654 239847154 241810769 244124360 246301601 246289549 244669924 243865738 244090172 244613761 244437832
2645 244437832 243099830 241840758 241733549 242381852 242868623 242627425 241600966 240128012 239016515
2636 239016515 239246004 241021275 243436654 245467415 247013505 248706741 251115897 253580912
2628 253580912 255335557 256713108 257957402 258658653 258402782 258031075 258371863 258306841 256689068
$$ packed form
2688B40727077j698614P18575K142639K252411K071604J710172R11489N81726
2680B49417079M61552N8629k20285N61918K455140L299997K095218O32695r66995
2671B57794948l117424n030522n412829l973426l048490l199146k644745j491209
2663B29877157J25416J721922J890641J234326R95682O66822L90133J121917J823138
2654B39847154J963615K313591K177241j2052j619625q04186K24434N23589j75929
2645B44437832j338002j259072j07209O48303M86771k41198j026459j472954j111497
2636B39016515K29489J775271K415379K030761J546090J693236K409156K465015
2628B53580912J754645J377551J244294P01251k55871l71707L40788o5022j617773
$$ plain form
2619 256689068 254261075 252202616 250766868 249178888 247220325 245714928 245594638 246757359
2611 246757359 248141340 249201806 250412107 251787409 252182794 250697447 248610569 247703703
2603 247703703 248408263 250038653 251416022 252214648 253266738 254613990 255088373 254389672 253241579
2594 253241579 252048516 251152424 250965365 251458844 251877035 251498813 250925083 251044589 251150954
2585 251150954 249807563 247037950 244675757 243166705 241791065 241481046 242893835 245090071
2577 245090071 246767868 247252622 247710949 249462250 251749673 252674251 250964658 247237076
2569 247237076 243474923 241300904 240872800 241649037 244105647 247935870 250467120 250066476
2561 250066476 247823877 245740119 245527938 247438926 249815248 251252489 251413400 250703663
$$ packed form
2619B56689068k427993k058459j435748j587980j958563j505397j20290J162721
2611B46757359J383981J060466J210301J375302L95385j485347k086878r06866
2603B47703703P04560J630390J377369P98626J052090J347252M74383o98701j148093
2594B53241579j193063q96092j87059M93479M18191l78222n73730J19506J06365
2585B51150954j343391k769613k362193j509052j375640l10019J412789K196236
2577B45090071J677797M84754M58327J751301K287423R24578j709593l727582
2569B47237076l762153k174019m28104P76237K456610L830223K531250m00644
2561B50066476k242599k083758k12181J910988K376322J437241J60911p09737
$$ plain form
2553 250703663 249618190 248429026 247395483 246575371 246912242 248199189 248419069 247134202
2545 247134202 245252767 243264294 241458518 240103772 240018276 241403535 243470881 245364249
2537 245364249 246530736 246758534 245890215 244516966 244085728 245631430 247925482 248887414 248681548
2528 248681548 248717117 249683819 251880430 254697962 256986706 258565514 259907358 260696670 260068880
2519 260068880 258294007 256292638 254551970 252888456 251240624 249886178 249286244 249927585
2511 249927585 250941131 251144265 250303900 248388548 245526179 242086968 238646307 235800435
2503 235800435 234182231 233935941 234220390 234610235 234622395 234802819 235793774 236784378 237631281
2494 237631281 238497478 240017908 243340619 247376326 249935814 250684475 250156854 248379450
$$ packed form
2553B50703663j085473j189164j033543q20112L36871J286947K19880j284867
2545B47134202j881435j988473j805776j354746q5496J385259K067346J893368
2537B45364249J166487K27798q68319j373249m31238J545702K294052R61932k05866
2528B48681548L5569R66702K196611K817532K288744J578808J341844P89312o27790
2519B60068880j774873k001369j740668j663514j647832j354446n99934O41341
2511B49927585J013546K03134q40365j915352k862369l439211l440661k845872
2503B35800435j618204k46290K84449L89845J2160J80424R90955R90604Q46903
2494B37631281Q66197J520430L322711M035707K559488P48661n27621j777404
$$ plain form
2486 248379450 246655161 245638532 244251010 242002348 239539126 237039418 233905298 230420518
2478 230420518 227834369 226386705 226380568 227826391 229654413 231544558 234060700 237209753
2470 237209753 240330799 242615714 244834424 247395154 249191203 249665749 249189266 247977854
2462 247977854 246578400 245417998 244437966 243921295 243521345 243389385 244032986 244831356 245551150
2453 245551150 246502088 247895528 250113011 253424010 257046512 258909294 258636124 257297958
2445 257297958 255106571 252280758 250504080 251135879 253366610 255006786 254700461 252298249
2437 252298249 248586168 245166576 242584610 240718595 240115784 240215183 240058153 239794647 240518869
2428 240518869 242958205 245867854 246661401 244744000 241801801 239621938 239140145 239857606
$$ packed form
2486B48379450j724289j016629j387522k248662k463222k499708l134120l484780
2478B30420518k586149j447664o137J445823J828022J890145K516142L149053
2470B37209753L121046K284915K218710K560730J796049M74546m76483j211412
2462B47977854j399454j160402r80032n16671l99950j31960O43601P98370P19794
2453B45551150R50938J393440K217483L310999L622502J862782k73170j338166
2445B57297958k191387k825813j776678O31799K230731J640176l06325k402212
2437B52298249l712081l419592k581966j866015o02811R9399j57030k63506P24222
2428B40518869K439336K909649P93547j917401k942199k179863m81793P17461
$$ plain form
2420 239857606 240831164 241802490 243091468 245037069 246585384 246583017 245459310 245146404 247467488
2411 247467488 251901936 256306348 258649085 258737639 258181184 258386994 259993441 262674046 264697350
2402 264697350 264342984 261259860 256409670 252032440 249808470 249370530 249730414 249919349 250440809
2393 250440809 252055323 253843743 254961209 255433750 255346655 254321983 252593235 251802563 253142981
2384 253142981 255599696 257758189 259484117 261129007 261929744 259786519 254129002 247671678
2376 247671678 243719687 243075229 243808262 243232946 240903775 239181680 239466382 240936924 242039340
2367 242039340 242215281 242497106 243350296 244143291 244315437 243248675 241054667 239082219 238365532
2358 238365532 238859116 239465931 240061344 241835917 244606102 246595772 246853972 246670936 246872515
$$ packed form
2420B39857606R73558R71326J288978J945601J548315k367j123707l12906K321084
2411B47467488M434448M404412K342737Q8554n56455K05810J606447K680605K023304
2402B64697350l54366l083124m850190m377230k223970m37940L59884J88935N21460
2393B50440809J614514J788420J117466M72541q7095j024672j728748p90672J340418
2384B53142981K456715K158493J725928J644890Q00737k143225n657517o457324
2376B47671678l951991o44458P33033n75316k329171j722095K84702J470542J102416
2367B42039340J75941K81825Q53190P92995J72146j066762k194008j972448p16687
2358B38365532M93584O06815N95413J774573K770185J989670K58200j83036K01579
$$ plain form
2349 246872515 246494447 245012524 242979754 240772700 239093018 238475337 238598121 239547942 241469680
2340 241469680 244059503 246972615 249785946 252205481 253641498 253280932 251749071 251001976
2332 251001976 252278277 255107632 258004210 259784993 259941314 258761274 257225167 256326067
2324 256326067 256579881 257884234 260003983 262276545 262826565 259770870 253565385 247193471
2316 247193471 243608306 243732644 246415524 249748751 252366257 254258462 255682240 255519892
2308 255519892 253179312 250108994 247318606 244727381 242677037 241467160 241129112 241423538
2300 241423538 241858557 242448587 242968259 243163026 243592575 244789549 246957333 249729489 251911704
2291 251911704 253246552 253798300 252448281 248818355 245194716 243847657 244949420 247563081
$$ packed form
2349B46872515l78068j481923k032770k207054j679682o17681J22784R49821J921738
2340B41469680K589823K913112K813331K419535J436017l60566j531861p47095
2332B51001976J276301K829355K896578J780783J56321j180040j536107q99100
2324B56326067K53814J304353K119749K272562N50020l055695o205485o371914
2316B47193471l585165J24338K682880L333227K617506J892205J423778j62348
2308B55519892k340580l070318k790388k591225k050344j209877l38048K94426
2300B41423538M35019N90030N19672J94767M29549J196974K167784K772156K182215
2291B51911704J334848N51748j350019l629926l623639j347059J101763K613661
$$ plain form
2283 247563081 249728661 250799396 251985940 253600785 254870577 255316581 254947734 254256241
2275 254256241 253551338 253184550 253202427 253484753 253595767 252772594 251483149 250727702 250224354
2266 250224354 249075896 247676178 246829722 245901521 244307978 242617914 241717684 241865796 242317988
2257 242317988 242136264 241233183 240040941 239345231 239679999 240794337 242162315 243109926 243868017
2248 243868017 245167297 246618160 247143662 246746006 246456067 246646289 247274995 248190865 249081821
2239 249081821 250056126 250948551 251242791 250870671 249825441 247271127 243976255 243016302 245153887
2230 245153887 248438485 251442673 253437173 253499779 251836657 249650974 247929025 247137504
2222 247137504 247270549 247709565 247029419 245596783 244952481 245694944 247945626 250929011 253540622
$$ packed form
2283B47563081K165580J070735J186544J614845J269792M46004l68847o91493
2275B54256241p04903l66788J7877K82326J11014q23173j289445p55447n03348
2266B50224354j148458j399718q46456r28201j593543j690064r00230J48112M52192
2257B42317988j81724r03081j192242o95710L34768J114338J367978R47611P58091
2248B43868017J299280J450863N25502l97656k89939J90222O28706R15870Q90956
2239B49081821R74305Q92425K94240l72120j045230k554314l294872r59953K137585
2230B45153887L284598L004188J994500O2606j663122k185683j721949p91521
2222B47137504J33045M39016o80146j432636o44302P42463K250682K983385K611611
$$ plain form
2213 253540622 255435779 256616790 256914099 256288696 255191010 254977847 256472830 258290200
2205 258290200 257787935 254980683 251784705 249083092 247559100 246997578 246397229 245720876 244798756
2196 244798756 243435079 241968879 240821705 240376674 240585132 241366491 243398782 246548743
2188 246548743 249465064 251031886 251446914 251688011 250853173 248318295 244924420 241778391
2180 241778391 239854029 239452742 239830162 240263195 240748853 240768404 240454677 241304701 243104777
2171 243104777 244776435 245863225 246339728 246911134 248329314 249914238 250217995 249256693 248051603
2162 248051603 246605031 244392109 242083146 240704641 241076269 243156760 245504067 246717121
2154 246717121 246574617 245968240 245766514 246107937 246655988 246266650 244317925 242011412 241028844
$$ packed form
2213B53540622J895157J181011K97309o25403j097686k13163J494983J817370
2205B58290200n02265k807252l195978k701613j523992n61522o00349o76353r22120
2196B44798756j363677j466200j147174m45031K08458P81359K032291L149961
2188B46548743K916321J566822M15028K41097q34838k534878l393875l146029
2180B41778391j924362m01287L77420M33033M85658J9551l13727Q50024J800076
2171B43104777J671658J086790M76503N71406J418180J584924L03757r61302j205090
2162B48051603j446572k212922k308963j378505L71628K080491K347307J213054
2154B46717121j42504o06377k01726L41423N48051l89338j948725k306513r82568
$$ plain form
2145 241028844 241109665 241449243 242710908 244286945 244572352 243548332 242521538 242957816 244556743
2136 244556743 246745707 249327640 251752086 254160277 256012674 256415342 255281727 253812099
2128 253812099 252648517 250622476 247411216 244665775 243419852 243752320 245667046 249102179
2120 249102179 253313192 256236302 256808360 255741556 253596631 250563970 247886920 246419409
2112 246419409 245384530 243824189 241512953 239189407 238223181 238891722 240437272 242334141
2104 242334141 243589520 243327192 242135303 241711446 242823530 244413285 245060358 245493763 246730172
2095 246730172 247970686 247935015 246550392 244843062 243197886 241811307 241440687 242399394 244036574
2086 244036574 245391020 245899939 245706559 245228813 244427620 243547272 243333902 243499312 243235934
$$ packed form
2145B41028844Q0821L39578J261665J576037K85407j024020j026794M36278J598927
2136B44556743K188964K581933K424446K408191J852397M02668j133615j469628
2128B53812099j163582k026041l211260k745441j245923L32468J914726L435133
2120B49102179M211013K923110N72058j066804k144925l032661k677050j467511
2112B46419409j034879j560341k311236k323546r66226O68541J545550J896869
2104B42334141J255379k62328j191889m23857J112084J589755O47073M33405J236409
2095B46730172J240514l5671j384623j707330j645176j386579l70620R58707J637180
2086B44036574J354446N08919j93380m77746q01193q80348k13370J65410k63378
$$ plain form
2077 243235934 242382794 240946835 239229215 237700210 236280225 235479119 236384494 238943989
2069 238943989 241528839 243079025 244060321 245123527 246001925 245919206 244188810 240829627 237233096
2060 237233096 234835774 233814182 233565110 233693489 234274467 235068924 235610902 235988410 236680732
2051 236680732 238213821 240028022 241018489 240881359 240195251 239572079 238940603 238660320 238876200
2042 238876200 238997208 239356783 241149132 244421446 247885756 249652831 249060838 246721465
2034 246721465 243742494 241770037 241236787 241708509 242291143 242383836 241991040 241533969 241506235
2025 241506235 241777050 242231838 242975813 243544158 243349625 242530060 241416870 240305229 239282094
2016 239282094 238137554 237283113 237782252 238888266 238762052 237922726 238548858 240924097 244413291
$$ packed form
2077B43235934q53140j435959j717620j529005j419985q01106R05375K559495
2069B38943989K584850J550186R81296J063206Q78398q2719j730396l359183l596531
2060B37233096k397322j021592k49072J28379N80978P94457N41978L77508O92322
2051B36680732J533089J814201R90467j37130o86108o23172o31476k80283K15880
2042B38876200J21008L59575J792349L272314L464310J767075n91993k339373
2034B46721465k978971j972457n33250M71722N82634R2693l92796m57071k7734
2025B41506235K70815M54788P43975N68345j94533q19565j113190j111641j023135
2016B39282094j144540q54441M99139J106014j26214q39326O26132K375239L489194
$$ plain form
2007 244413291 249087764 254065335 257642335 259562520 260326779 259769686 258497898 258364073
1999 258364073 259507854 259481683 257842758 256149805 255412586 255061952 254241427 254108432 255153409
1990 255153409 256076950 256711784 257254952 256814106 255986700 255286709 253944054 252112652 250604272
1981 250604272 249711597 249386760 249709026 250310942 251189526 252950917 255459294 257529853 258201803
1972 258201803 257269044 255582654 254148422 252847257 251611659 250150509 247962277 245255415
1964 245255415 242917351 241598873 241303523 241204435 240981220 241512231 242461934 242962976 243272655
1955 243272655 243615995 244156454 246143433 249246111 251615713 252930651 253119004 252274287 251853469
1946 251853469 252820905 254384649 256151236 258184551 258950048 257506555 255302015 253339654
$$ packed form
2007B44413291M674473M977571L577000J920185P64259n57093j271788j33825
1999B58364073J143781k6171j638925j692953p37219l50634q20525j32995J044977
1990B55153409R23541O34834N43168m40846q27406o99991j342655j831402j508380
1981B50604272q92675l24837L22266O01916Q78584J761391K508377K070559O71950
1972B58201803r32759j686390j434232j301165j235598j461150k188232k706862
1964B45255415k338064j318478k95350r9088k23215N31011R49703N01042L09679
1955B43272655L43340N40459J986979L102678K369602J314938J88353q44717m20818
1946B51853469R67436J563744J766587K033315P65497j443493k204540j962361
$$ plain form
1938 253339654 250747726 248007014 246941255 247692405 249976533 253210462 255406163 255368768
1930 255368768 253440792 250681883 248836846 248300981 248341797 247398040 245055719 243081373 242614741
1921 242614741 243653214 244973787 245193419 245295143 246197161 246654919 245535732 243253561 241180839
1912 241180839 240664998 241682927 243871510 247356647 251682300 255619997 257714033 256619711
1904 256619711 252618137 248009526 245214420 244937399 246298160 248065151 250289516 254210341
1896 254210341 259962044 265684711 269371672 270054023 267853194 264549244 262126210 261050206
1888 261050206 260268440 258447049 255720581 253041580 250159697 246746246 243565305 241692934
1880 241692934 241648124 243171053 245445658 247959806 250331715 251016686 249185471 245876083
$$ packed form
1938B53339654k591928k740712j065759P51150K284128L233929K195701l7395
1930B55368768j927976k758909j845037n35865M0816r43757k342321j974346m66632
1921B42614741J038473J320573K19632J01724R02018M57758j119187k282171k072722
1912B41180839n15841J017929K188583L485137M325653L937697K094036j094322
1904B56619711m001574m608611k795106k77021J360761J766991K224365L920825
1896B54210341N751703N722667L686961O82351k200829l303950k423034j076004
1888B61050206p81766j821391k726468k679001k881883l413451l180941j872371
1880B41692934m4810J522929K274605K514148K371909O84971j831215l309388
$$ plain form
1872 245876083 242856580 241232588 240657242 240278133 240098714 241511930 244442791 247192164
1864 247192164 248305305 248358269 248914888 249922928 250646036 250694517 250199456 248738456 246064068
1855 246064068 243852211 243159622 244370356 247967022 252334398 255154018 256151652 255798955
1847 255798955 254524789 253596158 253739522 253579992 251519402 247887847 245072470 244229301 243471549
1838 243471549 241418896 238738065 235889216 232763132 230007416 228824834 228818440 229913404
1830 229913404 232997878 236679151 238472920 238490705 238747914 240282669 242723417 245532220
1822 245532220 247780081 248643632 248723907 249014416 249464018 249717183 249047836 247055636 244460516
1813 244460516 242058595 240591261 240423113 241880162 244618251 247620676 250316024 252742797
$$ packed form
1872B45876083l019503j623992n75346l79109j79419J413216K930861K749373
1864B47192164J113141N2964N56619J008040P23108M8481m95061j461000k674388
1855B46064068k211857o92589J210734L596666M367376K819620R97634l52697
1847B55798955j274166r28631J43364j59530k060590l631555k815377q43169p57752
1838B43471549k052653k680831k848849l126084k755716j182582o394J094964
1830B29913404L084474L681273J793769J7785K57209J534755K440748K808803
1822B45532220K247861Q63551Q0275K90509M49602K53165o69347j992200k595120
1813B44460516k401921j467334j68148J457049K738089L002425K695348K426773
$$ plain form
1805 252742797 254259295 254131214 253288478 253111044 253990321 255399148 256736865 257370772 257223974
1796 257223974 257033129 257556363 258870745 259787555 258782968 256163166 253714958 252854483 253672742
1787 253672742 254651880 254645624 253879713 253328417 253348429 253187274 252010499 249751754 247570239
1778 247570239 247382097 249673701 252354813 254135306 256289806 259042664 261204192 261665135
1770 261665135 259918265 256542093 251962893 247061130 243001992 240798153 240754785 242222940
1762 242222940 244311851 246115361 247489625 249217919 251753985 254531352 256578097 257212019
1754 257212019 256545576 255542423 254874754 253415842 250179870 247251769 246956998 248482472
1746 248482472 250556199 253131076 256251544 259149776 260927220 261860434 262128184 260953370
$$ packed form
1805B52742797J516498j28081q42736j77434Q79277J408827J337717O33907j46798
1796B57223974j90845N23234J314382R16810j004587k619802k448208q60475Q18259
1787B53672742R79138o256p65911n51296K0012j61155j176775k258745k181515
1778B47570239j88142K291604K681112J780493K154500K752858K161528M60943
1770B61665135j746870l376172m579200m901763m059138k203839m3368J468155
1762B42222940K088911J803510J374264J728294K536066K777367K046745O33922
1754B57212019o66443j003153o67669j458912l235972k928101k94771J525474
1746B48482472K073727K574877L120468K898232J777444R33214K67750j174814
$$ plain form
1738 260953370 258135214 254880037 253397139 255064576 258971200 263397242 266363906 266001716
1730 266001716 262212707 257006902 252470900 250052781 249286348 248721430 248238953 248426720 249207814
1721 249207814 249378386 248239310 246560498 245196933 244202775 243429965 243126525 243737480 244837538
1712 244837538 245192126 243998723 241892167 240171435 240197188 242571869 246025099 248846419
1704 248846419 250680085 251149791 250292720 248785347 246501491 243632418 241978385 242323017
1696 242323017 243401441 243756024 242731575 241719790 242597334 244540504 245605674 245485271
1688 245485271 244629995 243069431 240880143 238863440 237253568 235363802 233508932 233116402
1680 233116402 234326618 235292767 234909215 233765599 232626789 231999257 232856084 235767585 239814205
$$ packed form
1738B60953370k818156l255177j482898J667437L906624M426042K966664l62190
1730B66001716l789009n205805m536002k418119p66433n64918m82477J87767P81094
1721B49207814J70572j139076j678812j363565r94158p72810l03440O10955J100058
1712B44837538L54588j193403k106556j720732K5753K374681L453230K821320
1704B48846419J833666M69706q57071j507373k283856k869073j654033L44632
1696B42323017J078424L54583j024449j011785Q77544J943170J065170j20403
1688B45485271q55276j560564k189288k016703j609872j889766j854870l92530
1680B33116402J210216R66149l83552j143616j138810o27532Q56827K911501M046620
$$ plain form
1671 239814205 243711879 247692212 252291591 257020702 260301470 260653378 259512019 258849058
1663 258849058 258139961 257452071 258083796 259575986 259834370 257434803 253181432 249346253 247315664
1654 247315664 246877477 247193365 247480879 247613367 247845785 247714537 247292178 247749096 249136111
1645 249136111 250027859 249769218 249134913 248435727 247325877 245668292 243604033 242751636 243980386
$$ packed form
1671B39814205L897674L980333M599379M729111L280768L51908j141359o62961
1663B58849058p09097o87890O31725J492190K58384k399567m253371l835179k030589
1654B47315664m38187L15888K87514J32488K32418j31248m22359M56918J387015
1645B49136111Q91748k58641o34305o99186j109850j657585k064259q52397J228750
$$ [...]
##END NTUPLES=NMR SPECTRUM
##END=
