##TITLE=C13_DE-1_DMSO_TFA
 DMSO-d6, 22100 sc

 20.11.2023
##JCAMPDX= 6.0         $$ Bruker NMR JCAMP-DX V2.0
##DATA TYPE= NMR SPECTRUM
##DATA CLASS= NTUPLES
##ORIGIN= UXNMR, Bruker Analytische Messtechnik GmbH
##OWNER= root
$$ XWIN-NMR		Version 3.5
$$ Tue Nov 21 13:41:12 2023 Russian Standard Time (UT+4h)  she@DPX200
##.OBSERVE FREQUENCY= 50.327896
##.OBSERVE NUCLEUS= ^13C
##.ACQUISITION MODE= SIMULTANEOUS
##.ACQUISITION SCHEME= undefined
##.AVERAGES= 22101
##.DIGITISER RES= 17
##SPECTROMETER/DATA SYSTEM= spect
##.PULSE SEQUENCE= zgpg30
##.SOLVENT NAME= CDCl3
##.SHIFT REFERENCE= (INTERNAL, CDCl3, 0, 222.624)
##AUDIT TRAIL= $$ (NUMBER, WHEN, WHO, WHERE, WHAT)
$$ ##TITLE= Audit trail, XWIN-NMR		Version 3.5
$$ ##JCAMPDX= 5.01
$$ ##ORIGIN= Bruker BioSpin GmbH
$$ ##OWNER= she
$$ F:/spectra/data/she/nmr/c13/1/pdata/1/auditp.txt
$$ ##AUDIT TRAIL=  $$ (NUMBER, WHEN, WHO, WHERE, WHAT)
(   1,<2023-11-21 13:39:33.23 +0400>,<she>,<DPX200>,
      <created by zg, POWCHK disabled, PULCHK disabled
       terminated by command 'halt'
       configuration hash MD5:
       00 E9 B6 7A A2 85 ED C7 34 08 36 98 17 FE 4E 26
       data hash MD5: 32K
       95 0F 8E 99 EA D9 FA 9C CA BC 52 FF 3A 3A 65 EA>)
(   2,<2023-11-21 13:39:38.10 +0400>,<she>,<DPX200>,
      <Start of raw data processing
       efp BC_mod = 2 LB = 2 FT_mod = 6 PKNL = 1 PHC0 = -356.7891 PHC1 = 24.73753 SI = 32K 
       data hash MD5: 32K
       49 B1 69 A2 91 0F AD 63 33 C2 1E 37 FB 48 B9 36>)
(   3,<2023-11-21 13:39:59.57 +0400>,<she>,<DPX200>,
      <pk PHC0 = -24.5868 PHC1 = 12.8 
       data hash MD5: 32K
       55 5C 99 BB 13 26 84 A8 82 DE 05 F8 F8 78 8F 94>)
(   4,<2023-11-21 13:40:03.35 +0400>,<she>,<DPX200>,
      <abs ABSG = 5 
       data hash MD5: 32K
       53 77 17 1B DE C0 A2 F0 08 A1 6C 1B B9 35 55 39>)
(   5,<2023-11-21 13:40:27.78 +0400>,<she>,<DPX200>,
      <pk PHC0 = 4.818179 PHC1 = -6.800001 
       data hash MD5: 32K
       29 1F B8 B5 F3 11 7A 34 F0 14 5D 05 23 71 34 14>)
(   6,<2023-11-21 13:40:31.29 +0400>,<she>,<DPX200>,
      <abs ABSG = 5 
       data hash MD5: 32K
       A5 81 76 DF A0 14 8E 98 0C 49 0E FB A5 78 9D 71>)
$$ ##END=
$$ 
$$ hash MD5
$$ D1 8C 59 9B DC C5 F1 02 DE E6 9B 2E B7 48 63 A4
##$RELAX= 
##$RELAX= 
##$RELAX= 
##$RELAX= 
##$RELAX= 
##$RELAX= 
##$RELAX= 
##$RELAX= 
$$ Bruker specific parameters
$$ --------------------------
##$DU= <F:/spectra>
##$EXPNO= 1
##$NAME= <c13>
##$PROCNO= 1
##$TYPE= <nmr>
##$USER= <she>
##$AMP= (0..31)
100 100 100 100 100 100 100 100 100 100 100 100 100 100 100 100 100 100 
100 100 100 100 100 100 100 100 100 100 100 100 100 100 
##$AQSEQ= 0
##$AQ_mod= 1
##$AUNM= <au_zg>
##$AUTOPOS= <>
##$BF1= 50.322709
##$BF2= 200.13
##$BF3= 50.322709
##$BF4= 500.13
##$BF5= 500.13
##$BF6= 500.13
##$BF7= 500.13
##$BF8= 500.13
##$BYTORDA= 1
##$CFDGTYP= 0
##$CFRGTYP= 5
##$CHEMSTR= <none>
##$CNST= (0..31)
1 1 145 1 1 1 1 1 1 1 1 1 1 1 1 1 1 1 1 1 1 1 1 1 1 1 1 1 1 1 1 1 
##$CPDPRG= <waltz16>
##$CPDPRG1= <>
##$CPDPRG2= <waltz16>
##$CPDPRG3= <>
$$ [...]
##$SUBNAM4= <"">
##$SUBNAM5= <"">
##$SUBNAM6= <"">
##$SUBNAM7= <"">
##$SUBNAM8= <"">
##$SUBNAM9= <"">
##$SW= 239.972175391363
##$SWIBOX= (0..15)
0 1 3 0 0 0 0 0 0 0 0 0 0 0 0 0 
##$SW_h= 12077.2946859903
##$TD= 32768
##$TD0= 1
##$TE= 0
##$TE2= 300
##$TE3= 300
##$TEG= 300
##$TL= (0..7)
120 120 120 120 120 120 120 120 
##$TP= (0..7)
150 150 150 150 150 150 150 150 
##$TP07= 0
##$TPNAME0= <>
##$TPNAME1= <>
##$TPNAME2= <>
##$TPNAME3= <>
##$TPNAME4= <>
##$TPNAME5= <>
##$TPNAME6= <>
##$TPNAME7= <>
##$TPOAL= (0..7)
0.5 0.5 0.5 0.5 0.5 0.5 0.5 0.5 
##$TPOFFS= (0..7)
0 0 0 0 0 0 0 0 
##$TUNHIN= 0
##$TUNHOUT= 0
##$TUNXOUT= 0
##$USERA1= <user>
##$USERA2= <user>
##$USERA3= <user>
##$USERA4= <user>
##$USERA5= <user>
##$V9= 5
##$VALIST= <valist>
##$VCLIST= <CCCCCCCCCCCCCCC>
##$VD= 0
##$VDLIST= <DDDDDDDDDDDDDDD>
##$VPLIST= <PPPPPPPPPPPPPPP>
##$VTLIST= <TTTTTTTTTTTTTTT>
##$WBST= 1024
##$WBSW= 4
##$XGAIN= (0..3)
0 0 0 0 
##$XL= 0
##$YL= 0
##$YMAX_a= 129027784
##$YMIN_a= -62828769
##$ZGOPTNS= <>
##$ZL1= 120
##$ZL2= 120
##$ZL3= 120
##$ZL4= 120
##$ABSF1= 222.624
##$ABSF2= -17.3728
##$ABSG= 5
##$ABSL= 3
##$ALPHA= 0
##$AQORDER= 0
##$ASSFAC= 0
##$ASSFACI= 0
##$ASSFACX= 0
##$ASSWID= 0
##$AUNMP= <proc_1d>
##$AZFE= 0.1
##$AZFW= 0.5
##$BCFW= 0
##$BC_mod= 2
##$BYTORDP= 0
##$COROFFS= 0
##$CY= -3
##$DATMOD= 1
##$DC= 0
##$DFILT= <>
##$DTYPP= 0
##$F1P= 0
##$F2P= 0
##$FCOR= 0.5
##$FTSIZE= 32768
##$FT_mod= 6
##$GAMMA= 0
##$GB= 0
##$INTBC= 1
##$INTSCL= 4.134877e-10
##$ISEN= 128
##$LB= 2
##$LEV0= 0
##$LPBIN= 0
##$MAXI= 10000
##$MC2= 0
##$MEAN= 0
##$ME_mod= 0
##$MI= 0.1934396
##$NCOEF= 0
##$NC_proc= 3
##$NLEV= 6
##$NOISF1= 120.0001
##$NOISF2= 80.00006
##$NSP= 0
##$NTH_PI= 0
##$NZP= 0
##$OFFSET= 222.624
##$PC= 1.4
##$PHC0= -376.5577
##$PHC1= 30.73753
##$PH_mod= 1
##$PKNL= yes
##$PPARMOD= 0
##$PSCAL= 0
##$PSIGN= 0
##$REVERSE= no
##$SF= 50.3227315983092
##$SI= 32768
##$SIGF1= 140
##$SIGF2= 120
##$SINO= 11.81781
##$SIOLD= 32768
##$SREGLST= <13C.CDCl3>
##$SSB= 0
##$STSI= 32768
##$STSR= 0
##$SW_p= 12077.2946859903
##$SYMM= 0
##$S_DEV= 0
##$TDeff= 32768
##$TDoff= 0
##$TI= <>
##$TILT= no
##$TM1= 0
##$TM2= 0
##$TOPLEV= 0
##$USERP1= <user>
##$USERP2= <user>
##$USERP3= <user>
##$USERP4= <user>
##$USERP5= <user>
##$WDW= 1
##$XDIM= 32768
##$YMAX_p= 318591270
##$YMIN_p= -11861359
$$ End of Bruker specific parameters
$$ ---------------------------------
##NTUPLES= NMR SPECTRUM
##VAR_NAME=  FREQUENCY,     SPECTRUM/REAL,   SPECTRUM/IMAG
##SYMBOL=    X,             R,               I
##VAR_TYPE=  INDEPENDENT,   DEPENDENT,       DEPENDENT
##VAR_FORM=  AFFN,          ASDF,            ASDF
##VAR_DIM=   32768,         32768,           32768
##UNITS=     HZ,            ARBITRARY UNITS, ARBITRARY UNITS
##FACTOR=    0.368581032318806, 1,           1
##FIRST=     11203.0474430531, 0,            0
##LAST=      -874.247242937185, 0,           0
##MIN=       -874.247242937185, -11861359,   0
##MAX=       11203.0474430531, 318591270,    0
$$ Real data points
##PAGE= N=1
##DATA TABLE= (X++(R..R)), XYDATA
$$ [...]
11004B21476r8980M042Q8277J28497J02058K9875k780n976l3680p8589p7004m6169
$$ 221476 122496 126538 214815 343312 445370 475245 472465 466489 432809 354220 277216 231047
10992B31047m2526m3500m4304l9098q936O922J1796M9928P7795P0953N7248N5502
$$ 231047 188521 145021 100717 61619 52683 59605 71401 121329 199124 270077 327325 382827
10980C82827N2956L3935R467j1035n6245j33535j67280j42123j04017o4139q054
$$ 382827 435783 469718 479185 468150 411905 278370 111090 -31033 -135050 -199189 -207243
10969b07243L3229K7846J3628K5300K5923K122M779M6279O9133O4431N0763K9805
$$ -207243 -174014 -146168 -132540 -107240 -81317 -79195 -74416 -28137 40996 105427 156190 185995
10957A85995J6843P745k0424n1420n1370k4254K7401P3297P9021N0702J4860j6017
$$ 185995 202838 210583 190159 138739 87369 63115 90516 163813 242834 293536 308396 292379
10945B92379l6610m7761o8262q8136q9229o6567j5211M4314P7770Q6081Q6477
$$ 292379 255769 208008 139746 51610 -37619 -104186 -119397 -75083 2687 88768 175245
10934A75245R3542R6441N3269k7016r7613j46073j72229j58020p8477Q660M9759
$$ 175245 268787 365228 418497 391481 293868 147795 -24434 -182454 -260931 -252271 -202512
10923b02512M6125K8647K0907L1350M9700N6593M3219j6419q2418q3847n8886
$$ -202512 -156387 -127740 -106833 -75483 -25783 30810 74029 57610 -24808 -108655 -167541
10912a67541m8732l2549k8841m1688l2883j7858N997N6102Q2181O5739N2310P4331
$$ -167541 -216273 -248822 -277663 -319351 -352234 -370092 -364095 -307993 -225812 -160073 -107763 -33432
10900c3432J02866Q8715N1042J9194k2182o6081q9931p0708j8765J7026l067m3359
$$ -33432 69434 158149 209191 228385 206203 140122 50191 -20517 -39282 -22256 -25323 -68682
10888f8682l1195L3329N8296n193q0319q6584l8134L0834Q3299J20571J37970
$$ -68682 -99877 -66548 -8252 -13445 -93764 -180348 -218482 -187648 -104349 16222 154192
10877A54192J17561R1771Q7380O6805o192q1390j18698j29708j16569r2425m5156
$$ 154192 271753 363524 450904 517709 511517 430127 311429 181721 65152 -27273 -72429
10866g2429O011J0107j4881l0094n3912p0919m8604J1238O9544R1780P0213K7627
$$ -72429 -66418 -56311 -71192 -101286 -155198 -226117 -274721 -263483 -193939 -102159 -31946 -4319
10854d319m32p505k5849n8733m7306j7944l9796o1643k7431K0018L3687K2184
$$ -4319 -4751 -12256 -38105 -96838 -144144 -162088 -201884 -263527 -290958 -270940 -237253 -215069
10842b15069K6828N9962O5682Q619o4157p6925j8638M5412P0297O5293J8391o5009
$$ -215069 -188241 -128279 -62597 -53978 -118135 -195060 -213698 -168286 -97989 -32696 -14305 -79314
10830g9314j15418q8652m3884j5047J5556M4747O4820Q6489R3529Q3639P0913
$$ -79314 -194732 -283384 -327268 -342315 -326759 -282012 -217192 -130703 -37174 46465 117378
10819A17378N4053J7369j0704q141K2210N4990K2601m9102q6850q1297n6500j1800
$$ 117378 171431 188800 178096 169955 192165 247155 269756 220654 133804 52507 -3993 -15793
10807a5793L2893L6672K2059Q326j4905n1951q5336r9319p7610l4200p897O58
$$ -15793 17100 53772 75831 84157 69252 17301 -68035 -167354 -244964 -279164 -287061 -286403
10795b86403Q775K3942K9746L0372M5927N1164K9429j3029m3569n9875p5757n4986
$$ -286403 -277628 -253686 -223940 -193568 -147641 -96477 -67048 -80077 -123646 -183521 -259278 -314264
10783c14264L822K9239J8687M6974R9174J00873O0669K1118k549k0839n2884o8998
$$ -314264 -310442 -281203 -262516 -215542 -116368 -15495 45174 66292 63743 42904 -9980 -78978
10771g8978n5625k999O6461Q4149N5454M2052J9477k4604l0049j0389m2522j07572
$$ -78978 -134603 -137602 -71141 13008 68462 110514 129991 105387 75338 64949 22427 -85145
10759h5145j34640r2038q57O3699P1515N2366M3720N9223Q3457P5530K2790k7447
$$ -85145 -219785 -311823 -312680 -248981 -177466 -125100 -81380 -22157 61300 136830 159620 132173
10747A32173l6074j6019K529n274n0073r8736j00761m1778L0652Q9255J32363
$$ 132173 96099 80080 82609 77335 27262 -71474 -172235 -214013 -183361 -94106 38257
10736C8257J36977J01464O0712L3594K152j7184k760O612k4370o5907p9640p5255
$$ 38257 175234 276698 337410 371004 373156 355972 353212 359824 335454 269547 189907 114652
10724A14652o9189p7200o9510k9351r19k4313q7798j25179q1892m072O0172Q3992
$$ 114652 45463 -31737 -101247 -130598 -131517 -155830 -243628 -368807 -450699 -454771 -394599 -310607
10712c10607R8777J10826P9213M1886L5930K7246j4159n8929q2753j05907r6847
$$ -310607 -211830 -101004 -21791 20095 56025 83271 69112 10183 -72570 -178477 -275324
10701b75324k3981O5848J12947Q4019P174o3409q2202l2702L4944O0502M5787
$$ -275324 -299305 -233457 -120510 -36491 -29317 -92726 -174928 -207630 -172686 -112184 -66397
10690f6397K9391K9227L7118M8942L5416r028p5344j23411j06398n9624l2047
$$ -66397 -37006 -7779 29339 78281 113697 104669 29325 -94086 -200484 -260108 -292155
10679b92155r896K1655M3228L4705q503k9680J7592R0882J44134J41130Q5604
$$ -292155 -302051 -280396 -237168 -202463 -210966 -240646 -223054 -132172 11962 153092 238696
10668B38696K0188l6826o7231o8139m5911P38O0976P8500L1370j6158k5799j4930
$$ 238696 258884 222058 154827 86688 40777 41515 102491 180991 212361 196203 170404 155474
10656A55474J3262N0326N8745L9419L7411O7705Q9825R2573P8293M4767L903m5948
$$ 155474 168736 219062 277807 317226 354637 422342 512167 604740 683033 727800 731703 685755
10644F85755q6851p1384j7247J3473n561l0974l1462l5919o7004j03394r2638
$$ 685755 598904 527520 510273 523746 518185 487211 455749 419830 352826 249432 156794
10633A56794k2142M3577O7618P6285N5857M496m3472p6075q4947p3095p0114o2058
$$ 156794 134652 178229 245847 322132 377989 382485 339013 262938 177991 104896 34782 -27276
10621b7276l4584r031J0419M9537J02360J42438J48970J40410J22668P8722M3624
$$ -27276 -61860 -70891 -60472 -10935 91425 233863 382833 523243 645911 724633 768257
10610G68257K3057l3587q8696q0371k9798m246J3741Q4062J74965K24186K10535
$$ 768257 791314 757727 669031 588660 558862 554616 568357 652419 827384 1051570 1262105
10599A262105J60336J32711J48377J66498J80580K07067K53290L00307L32216
$$ 1262105 1422441 1555152 1703529 1870027 2050607 2257674 2510964 2811271 3143487
10590C143487K99091J31780r2379k45188k95241k97547l02184k91004k54497k23483
$$ 3143487 3442578 3574358 3481979 3236791 2941550 2644003 2341819 2050815 1796318 1572835
10580A572835j96856j59276r5450l3783j1815k8389q4063j63035j79674j29126
$$ 1572835 1375979 1216703 1121253 1087470 1075655 1047266 963203 800168 620494 491368
10570D91368q5566q1158j04791q4432j3659K1506L818k0713k5012l5976m6390
$$ 491368 405802 324644 219853 135421 121762 143268 147086 126373 101361 65385 18995
10559A8995l7395j6045K70q552k3828j9857P04L5493Q0790J02065Q0906J2455
$$ 18995 -18400 -34445 -34175 -42727 -66555 -86412 -85708 -50215 30575 132640 213546 226001
10547B26001n5135n2944o501K0432k897m8933o9269n1772p948O6901J25341J18071
$$ 226001 170866 117922 111421 131853 128956 80023 10754 -41018 -48966 17935 143276 261347
10535B61347Q0358N0711M1452N700p9579j14702o5119J362M1474K6903j3168n1154
$$ 261347 341705 392416 433868 439568 359989 245287 180168 181530 223004 249907 236739 185585
10523A85585n3040j3826K3016J1820l8434o9563n0248k1827k801K0048L4461K5529
$$ 185585 132545 118719 141735 153555 115121 45558 -4690 -26517 -29318 -9270 25191 50720
10511E0720J048p865O144L2032N9014P5328O8166K2970r741j4534j8232j2864
$$ 50720 51768 43903 50047 82079 141093 216421 284587 307557 297816 283282 265050 252186
10499B52186L312P500j8695o3899r6537r1273m8562L260L8653L7421J6968m313
$$ 252186 255498 262998 244303 180404 83867 -7406 -55968 -52708 -14055 23366 40334 36021
10487C6021k0379j508L3911N5320L5816j9268m5858q267M7907O8908M5960o25
$$ 36021 15642 14134 48045 103365 139181 119913 74055 65788 113695 182603 228563 227938
10475B27938o6389j24430j14882m1584L0032N4268M1741L6061L2873L2373O3988
$$ 227938 161549 37119 -77763 -119347 -89315 -35047 6694 42755 75628 108001 171989
10464A71989R0934O4400o187n6255o1347l5616k715J4936J8710l578o7571r8624
$$ 171989 262923 327323 321136 264881 203534 167918 165203 180139 198849 195271 127700 29076
10452B9076n2819L654J6911j2750n2498p9147p1707l9042n141K1281L0956O504
$$ 29076 -23743 -20089 -3178 -15928 -68426 -147573 -219280 -258322 -263463 -242182 -211226 -204722
10440b04722k9257l4875j6464k962P527L4229O1218N2373j0473p9675j05207q9601
$$ -204722 -233979 -268854 -285318 -288280 -280753 -246524 -185306 -132933 -143406 -223081 -328288 -417889
10428d17889n6920j3716M2084P3839O6265M6801L1805K0134J6829L1642K2755
$$ -417889 -474809 -488525 -446441 -372602 -306337 -259536 -227731 -207597 -190768 -159126 -136371
10417a36371q102Q413O3879J02535R3460K3893n3269q6577o7775j2544M8213P1110
$$ -136371 -144473 -136060 -72181 30354 123814 147707 94438 7861 -59914 -72458 -24245 46865
10405D6865M9002J9686O935k8375q5020j23917j41028j00475l6978j4409k3279
$$ 46865 95867 115553 122488 94113 9093 -114824 -255852 -356327 -393305 -407714 -430993
10394d30993j4635K1868O7813Q7649M5899k0814l9357k8476l2244k2253J5770
$$ -430993 -445628 -423760 -355947 -268298 -222399 -243213 -282570 -311046 -343290 -365543 -349773
10383c49773O5598J05866R1200K6151k2358k0519K1222M9680R878l7063m1047
$$ -349773 -284175 -178309 -87109 -60958 -83316 -103835 -82613 -32933 -23055 -60118 -101165
10372a01165n2231p0212q0306p1387l5702J5707O4406J14532J33862R6994M7351
$$ -101165 -153396 -223608 -303914 -375301 -411003 -395296 -330890 -216358 -82496 14498 61849
10361F1849J4406O691J6025L1862K4717j4957n9343q8853q7313p0058o7039n2973
$$ 61849 76255 82946 98971 130833 155550 140593 81250 -7603 -94916 -164974 -232013 -284986
10349b84986j7063R314J3005L1950P0509O5820J5775k1369k3743L937L9470M9755
$$ -284986 -302049 -292735 -279730 -247780 -177271 -111451 -95676 -117045 -140788 -136851 -97381 -47626
10337d7626K8576O837K595k155j4302k4017j6271J1125J4466k0353n4786o9721
$$ -47626 -19050 -12213 -9618 -11773 -26075 -50092 -66363 -55238 -40772 -61125 -115911 -185632
10325a85632p8566o6152j8508L3383M1277R558j163K9886O3541P0551P0020M4167
$$ -185632 -264198 -330350 -348858 -315475 -274198 -264640 -265803 -235917 -172376 -101825 -31805 12362
10313A2362k5384q3949o5802J2521O6332O5751L5141j4391n7490n9211o1010q1757
$$ 12362 -13022 -96971 -162773 -150252 -83920 -18169 16972 2581 -54909 -114120 -175130 -256887
10301b56887q2019n7510j6027N5958J31813J43744R3657N9899M9065M2246L9544
$$ -256887 -338906 -396416 -412443 -356485 -224672 -80928 12729 72628 121693 163939 203483
10290B03483K1370j8116j6948L9025N5564o808j02785j56034j10224m4959n2038
$$ 203483 224853 206737 189789 228814 284378 277570 174785 18751 -91473 -136432 -188470
10279a88470m9158L51N8995J13851J43874J27711P2338l320l0986k853L807l2053
$$ -188470 -237628 -237277 -178282 -64431 79443 207154 279492 276172 245186 242333 246140 214087
10267B14087o7817p0361o9350q4171r1931q2846m9073P968N0121M7933Q942l0533
$$ 214087 146270 75909 6559 -77612 -169543 -252389 -301462 -293494 -243373 -195440 -186498 -217031
10255b17031m7593m4606m1607m0118k5155L2189J05086J21499R9024O7999M1472
$$ -217031 -264624 -309230 -350837 -390955 -416110 -383921 -278835 -157336 -58312 9687 51159
10244E1159K6738J1739j1734j6323J920j1243n5181p2336m8173k2777l3159n8211
$$ 51159 77897 89636 77902 61579 63499 52256 -2925 -75261 -123434 -146211 -179370 -237581
10232b37581n5440l4213j1484J3892K6527M0716O5875O5216K9007K899J9171M3000
$$ -237581 -293021 -327234 -338718 -324826 -298299 -257583 -191708 -126492 -97485 -94586 -75415 -32415
10220c2415O2928Q3574P5514L4741k6482q0771r4599o5054k1384K5269N4235M1490
$$ -32415 30513 114087 189601 224342 197860 117089 22490 -42564 -63948 -38679 15556 57046
10208E7046J6766J5682M0941N8998K7163j9122n1763q5121j30900j48475q8661
$$ 57046 73812 89494 130435 189433 216596 197474 145711 60590 -70310 -218785 -307446
10197c07446J279M1458K4461Q88k5678n0227m8134j8097K4483M5083J3044j902
$$ -307446 -306167 -264709 -240248 -239360 -265038 -315265 -363399 -381496 -357013 -311930 -298886 -300788
10185c00788L0220P3120J22190J52805J25137O0806N724j8338J633J7031J8068
$$ -300788 -270568 -197448 -75258 77547 202684 263490 269214 250876 252509 269540 287608
10174B87608M0106M5972n187q5968j34338j33172r2911l3612K5457N4332L5292
$$ 287608 327714 373686 368499 282531 148193 15021 -77890 -111502 -86045 -31713 3579
10163C579N184k829J6121L5873J9497l274L468L8666Q1214J12885Q5298m246p3019
$$ 3579 8763 5934 22055 57928 77425 74151 77619 116285 197499 310384 395682 391436 318417
10150C18417q9295r4172r8457j11032j25023r0083j265P9601J08302Q6925P4431
$$ 318417 229122 134950 36493 -74539 -199562 -289645 -290910 -211309 -103007 -16082 58349
10139E8349R0247O0459n336p9073j10885m5338M1359M2495m1134j08619q4742
$$ 58349 148596 209055 203719 124646 13761 -31577 9782 52277 11143 -97476 -182218
10128a82218j0407K5452K6174N4319J06684J25997P6498l411m2156k6479j5010
$$ -182218 -192625 -167173 -140999 -86680 20004 146001 222499 219088 176932 150453 135443
10117A35443m3416n5367l6126k6757l0835m0779m0546l0708K652N7061Q6606P3190
$$ 135443 92027 36660 534 -26223 -57058 -97837 -138383 -169091 -166439 -109378 -22772 50418
10105E0418L4019l216j4283m338O745P62j5385k2320j4456P122M9158Q4959Q2572
$$ 50418 84437 81221 66938 62600 69345 70107 54722 32402 17946 25068 74226 159185 241757
10092B41757P3456P5031L1326p1176j33153j05672l6035P330J7158J5991K0832
$$ 241757 315213 390244 421570 350394 217241 111569 75534 82864 100022 116013 136845
10081A36845J1732j8697L742P3639R3300L0833m5307q5609j07785j14243n1133
$$ 136845 148577 129880 133622 207261 300561 331394 286087 200478 92693 -21550 -72683
10070g2683N4622R9448P6442L1627j1250k9950p801L6877N6990M2483K0059R079
$$ -72683 -18061 81387 157829 189456 178206 148256 140455 177332 234322 276805 296864 305943
10058C05943N925N995j7541m0803l4972k2248j6011j5227L646L7388K5052m6018
$$ 305943 311868 317863 300322 259519 224547 202299 186288 171061 174707 212095 237147 191129
10046A91129q8165n0646m873M37J6512N4840P6156N3212j4399q7837j23049r4097
$$ 191129 102964 52318 47445 47882 64394 119234 195390 248602 234203 146366 23317 -70780
10034g0780k9999K5297M1369L1098K1370p397k6293p656K9868N6386N7808N3242
$$ -70780 -100779 -75482 -34113 -3015 18355 10958 -15335 -22991 6877 63263 121071 174313
10022A74313L4605j5833o4341p7913o4342n0280o0770p7731p9149o4663m7170
$$ 174313 208918 193085 128744 50831 -13511 -63791 -124561 -202292 -281441 -346104 -393274
10011c93274k2902J8423N4586P4005P2383N3849J8566j2583j8711Q14M7388Q0783
$$ -393274 -416176 -397753 -343167 -269162 -196779 -142930 -124364 -136947 -155658 -154844 -107456 -26673
9999b6673N9005N235k9742l7591k1239j2078k5987l0239k545J7759K874j5055
$$ -26673 32332 37567 7825 -29766 -51005 -63083 -89070 -119309 -121854 -104095 -101221 -116276
9987a16276j3447J1294L9632L6348R258k592R990L8826P7018J06852R8407O5574
$$ -116276 -129723 -118429 -78797 -42449 -33191 -35783 -25793 13033 90051 196903 295310 360884
9975C60884L0176j2074m6989n5953o5243r9272j01436n8241q245J3237j1085n0908
$$ 360884 391060 378986 331997 276044 210801 111529 10093 -48148 -56393 -43156 -54241 -105149
9963a05149n6719k5196N721L4036N7659O7206P5963R0538J04581R8101M2299n2193
$$ -105149 -161868 -187064 -181343 -147307 -89648 -22442 53521 144059 248640 346741 389040 336847
9951C36847j15428r3985m6045k7846N291K5871J0233P001l469m9010q0804q0204
$$ 336847 221419 127434 81389 53543 58834 84705 94938 101939 98470 49460 -31344 -111548
9939a11548q8390j01133p1786M529O4075Q2167J04311J16165Q3477L9956K3107
$$ -111548 -199938 -301071 -372857 -368328 -304253 -222086 -117775 -1610 81867 121823 144930
9928A44930J6940P169o685k0041l1836n2858m3682k0076j4468r562p685j827N760
$$ 144930 161870 169039 162354 142313 110477 57619 13937 -6139 -20607 -30169 -37854 -39681 -33921
9915c3921p654L871O1476J14288J22910P2728n571n9748p4436o0432n6312r0183
$$ -33921 -41575 -37704 23772 138060 260970 333698 328127 268379 193943 133511 77199 -12984
9903a2984j21516j10066n3525K3806O5129M6186M619j9351r779O373l618j5781
$$ -12984 -134500 -244566 -298091 -274285 -209156 -162970 -158351 -177702 -187481 -181108 -184726 -200507
9891b00507j4971k2106n0883o4521l8644j2008n97L3989Q2092Q7428N1527J7154
$$ -200507 -215478 -237584 -288467 -352988 -391632 -403640 -404237 -370248 -288156 -200728 -149201 -132047
9879a32047J1722L9676O7981N1480J8410j5703l0020q758k3786p8290j05398p3001
$$ -132047 -120325 -80649 -12668 38812 57222 41519 11499 2741 -21045 -99335 -204733 -277734
9867b77734j2148K5236L2800L4743M6624O0844M4766J2277l132N307K6050L6993
$$ -277734 -289882 -264646 -231846 -197103 -150479 -89635 -44869 -32592 -35724 -30417 -4367 32626
9855C2626L3396K7100J0380j7033m2081o0846m7528j8708k942K0160L8187J3107
$$ 32626 66022 93122 103502 86469 44388 -16458 -63986 -82694 -85636 -65476 -27289 -14182
9843a4182j3768M456M0502L7343K5733M6030N1000L7158K1611N689k0125n2115
$$ -14182 -27950 -23494 17008 54351 80084 126114 177114 214272 235883 241572 221447 169332
9831A69332m4260q365R456k0025q7971j19337j04073p9735n8135k5626J2549M6485
$$ 169332 125072 116707 126163 106138 18167 -101170 -205243 -284978 -343113 -368739 -356190 -309705
9819c09705N1651L1754J8792J7760L506j3918j6390o676M699J4245L0363M8531
$$ -309705 -258054 -226300 -207508 -189748 -186242 -200160 -216550 -223226 -218527 -204282 -173919 -125388
9807a25388M3703K3848K5439K9534L2134M5126O6146N8177M978m5163o5115o2013
$$ -125388 -81685 -57837 -32398 -2864 29270 74396 140542 198719 203697 158534 93419 31406
9795C1406n1989l5462j676L2968M2125K3740O483l2073p5194n7451O113N1138
$$ 31406 -20583 -56045 -57721 -24753 17372 41112 47595 15522 -59672 -117123 -111010 -59872
9783e9872L8768k1292o4635n7106j3847K8905L2002l204m3970n0657k2813j378
$$ -59872 -21104 -42396 -107031 -164137 -177984 -149079 -117077 -120281 -164251 -214908 -237721 -239099
9771b39099L648P157M202M042R283m092l1494l7429J400L6629L0500K3602L4576
$$ -239099 -235451 -228294 -224092 -220050 -210767 -214859 -246353 -283782 -282382 -245753 -215253 -191651 -157075
9758a57075L6191K1985J2733J5797j264k8837q473P5925J29831Q1167K5892P992
$$ -157075 -120884 -98899 -86166 -70369 -71633 -100470 -108943 -33018 96813 177980 203872 211864
9746B11864k1955n6884m7573j4298k6767p8238q2357J386Q2714P4268J8022l2470
$$ 211864 189909 133025 85452 71154 44387 -33851 -116208 -114822 -32108 42160 60182 27712
9734B7712q2528j02041p2332l8071k2618j3157m053K3346N3164M2529J1515L345
$$ 27712 -54816 -156857 -229189 -267260 -289878 -303035 -307088 -283742 -230578 -188049 -176534 -173189
9722a73189P522K3301N0464O6199N9584L8351J4646l0973q1175q6876n0472Q948
$$ -173189 -165667 -142366 -91902 -25703 33881 72232 86878 55905 -25270 -112146 -162618 -153670
9710a53670O1115P9149O1319j8302j18229j51816r8709k6980J0661K4398J2827
$$ -153670 -92555 -13406 47913 29611 -88618 -240434 -339143 -366123 -355462 -331064 -318237
9699c18237j7452m1029l1181J4323N3106Q3563Q1166N3258M1121K3492L365L0686
$$ -318237 -335689 -376718 -407899 -393576 -340470 -256907 -175741 -122483 -81362 -57870 -54505 -23819
9687b3819P0165N8909K2775j466k787k4788q7203j21996q4986k2870K2806O1674
$$ -23819 46346 105255 128030 126564 123777 98989 11786 -110210 -195196 -218066 -195260 -133586
9675a33586P6558N7061J9709j5681m7475o8871o9930p5870p7308m9320l9848p6241
$$ -133586 -57028 33 19742 4061 -43414 -112285 -182215 -258085 -335393 -384713 -424561 -500802
9663e00802q2067k8798L8669P3256Q6579J13349J44768J39051R0276M4010J1699
$$ -500802 -582869 -611667 -572998 -499742 -413163 -299814 -155046 -15995 74281 118291 129990
9652A29990l1533q2612j12397r9607m6728J1443M3016M5451J9825k3909l2327
$$ 129990 98457 15845 -96552 -196159 -242887 -231444 -188428 -142977 -123152 -147061 -179388
9641a79388K7988Q8840R0672M3795k1899o3598m3872p46N612l5384o9956n1710
$$ -179388 -151400 -62560 28112 71907 50008 -13590 -57462 -58208 -52596 -87980 -157936 -209646
9629b09646k6115k6434l8879m2128n597M2925P8561Q5308P1937N6913L8795R353
$$ -209646 -235761 -262195 -301074 -343202 -348799 -305874 -227313 -142005 -70068 -13155 25640 34993
9617C4993l6219o8016q0163o3871k1837J6642J8744p325k7237m3366l0333J2288
$$ 34993 -1226 -69242 -149405 -213276 -235113 -218471 -199727 -207052 -234289 -277655 -307988 -295700
9605b95700K5412N103P69L9050O8495N9448J8869k7473m5162l5286k6813k4266
$$ -295700 -270288 -265185 -264416 -225366 -156871 -97423 -78554 -106027 -151189 -186475 -213288 -237554
9593b37554l462K8858K6892k2608o0742o2791m0275m815K4070K0209L180R506
$$ -237554 -241016 -212158 -185266 -207874 -268616 -331407 -371682 -376497 -352427 -332218 -329038 -319532
9581c19532M3960P5241R7369J39882J72809J23224n667j35584j76913j19532n6767
$$ -319532 -275572 -200331 -102962 36920 209729 332953 327286 191702 14789 -104743 -161510
9570a61510m6698n4278n1349m0553j9472O734M3201O4825M2427k452k7201j0949
$$ -161510 -208208 -262486 -313835 -354388 -373860 -367126 -323925 -259100 -216673 -219125 -246326 -257275
9558b57275J7848K7536j1746p5119p8772n0734n0936m0076j3590j0874j0504J2417
$$ -257275 -239427 -211891 -223637 -298756 -377528 -428262 -479198 -519274 -532864 -543738 -554242 -541825
9546e41825L6055N2181P8873J01995R9854R0435R7665J09038R7960M3826k0508
$$ -541825 -505770 -453589 -374716 -272721 -172867 -82432 15233 124271 222231 266057 245549
9535B45549n2756m7940j7325K0757K1455l6597p9549p1001n2789l4800j7010q401
$$ 245549 192793 144853 127528 148285 169740 133143 53594 -17407 -70196 -104996 -122006 -130407
9523a30407q772j8099j0179K3391N0712L7821J791k7858n7264o2629j6586N3922
$$ -130407 -139179 -157278 -167457 -144066 -93354 -55533 -53742 -81600 -138864 -201493 -218079 -164157
9511a64157Q8345Q6130P0331L8619O886J085P985j4251l8687o657L0634J1391
$$ -164157 -75812 10318 80649 119268 126154 127239 135224 120973 82286 75629 106263 117654
9499A17654j6421l816M2665O8594N4079L7180N8238R7873R1007L9303k1742p0015
$$ 117654 101233 97417 140082 208676 262755 299935 358173 456046 547053 586356 564614 494599
9487D94599r2425r8126r7761r2149o6953m4533m9330m1567M249M6427N8747N7128
$$ 494599 402174 304048 206287 114138 47185 2652 -46678 -88245 -83996 -37569 21178 78306
9475G8306L3518j2885m3248o7911r7962r4535p7471p0174j8116M8626N8569K7091
$$ 78306 111824 98939 55691 -12220 -110182 -204717 -282188 -352362 -370478 -321852 -263283 -236192
9463b36192L911K7647O4001Q8523R1123K6201p7405j28731j06709m6983j0540
$$ -236192 -232281 -204634 -140633 -52110 39013 65214 -12191 -140922 -247631 -294614 -305154
9452c05154j6062l8264n7304p3845q5442o2364j0559L5904O4007P9949O1637K3838
$$ -305154 -321216 -359480 -416784 -490629 -576071 -638435 -648994 -613090 -549083 -469134 -407497 -383659
9440c83659J8053L5624M3964J9301k0189m0736l5058j7348n90J2254J0062O07
$$ -383659 -365606 -329982 -286018 -266717 -286906 -327642 -362700 -380048 -380638 -368384 -358322 -357715
9428c57715l843K2286O0623P2448O0569L0617j323k6075m7202m8720j6066K5896
$$ -357715 -361558 -339272 -278649 -206201 -145632 -115015 -116338 -142413 -189615 -238335 -254401 -228505
9416b28505R977o6420j04338o9287j2185L0649P3140R9705R6939Q8547P0830L2914
$$ -228505 -218528 -284948 -389286 -458573 -470758 -440109 -366969 -267264 -170325 -81778 -10948 21966
9404B1966q594m4231m2877k3350m4427o0108l8471k6061k0234n588J6847K5778
$$ 21966 13372 -30859 -73736 -97086 -141513 -201621 -240092 -266153 -286387 -291975 -275128 -249350
9392b49350K2966N4201R5351O4156j9596p5007n0885J5873N6078N3253J6899j3690
$$ -249350 -226384 -172183 -76832 -12676 -32272 -107279 -158164 -142291 -86213 -32960 -16061 -29751
9380b9751l3394m9447m2110J0356Q1856J08198P5452L1762M351j3582j6029j2792
$$ -29751 -63145 -112592 -154702 -144346 -62490 45708 121160 152922 157273 143691 127662 114870
9368A14870l2529m1459k4958q922L933J2371K2942J5617o848j9021j0384K1240
$$ 114870 82341 40882 15924 7002 10935 23306 46248 61865 55017 35996 25612 46852
9356D6852M2520L4717j3429p5620q6000m6783k7408m9371o9899p3915n8233k5964
$$ 46852 89372 124089 110660 35040 -50960 -97743 -125151 -174522 -244421 -318336 -376569 -402533
9344d02533j4136l5148m4441j0626L0697M8422L6600O122N294N0894R3638J04374
$$ -402533 -416669 -451817 -496258 -506884 -476187 -427765 -391165 -385043 -379749 -328855 -235217 -130843
9332a30843R4994N9578m692n9025p6506m3522M542K5647K5405J494k7424k4936
$$ -130843 -35849 23729 19037 -39988 -116494 -160016 -155474 -129827 -104422 -102928 -130352 -155288
9320a55288N045L4827M0568J2124j4784j5925j0077j0162l1485n6793n7317k2998
$$ -155288 -150243 -115416 -74848 -62724 -77508 -93433 -103510 -113672 -145157 -201950 -259267 -282265
9308b82265K7748N7340O1773O5951Q0712R4555Q4968M9141O176m6924j03526j18374
$$ -282265 -254517 -197177 -135404 -69453 11259 105814 190782 239923 246099 199175 95649 -22725
9296b2725r0335m8295r282J1459K9654N4173N5138M5486N9735P9873O3402O296
$$ -22725 -113060 -161355 -170637 -159178 -129524 -75351 -20213 25273 85008 164881 228283 234579
9284B34579n7801p5186j2129P5653J00889P8871K2728o9085j13986r0363m1339
$$ 234579 176778 101592 89463 165116 266005 344876 367604 298519 184533 94170 52831
9273E2831l180M308q327l0772n5911p3511p3983q2861r7500o7080j3646K2785
$$ 52831 49651 53959 45632 14860 -41051 -114562 -188545 -271406 -368906 -435986 -449632 -426847
9261d26847L4175M9936P9086R3093P8194L1375l1315p5396q5317p3513m9700o096
$$ -426847 -392672 -342736 -263650 -170557 -92363 -60988 -92303 -167699 -253016 -326529 -376229 -382325
9249c82325K9660M1599O0564O1369J2330k4951l4584m7439m6698l6589n1180p0583
$$ -382325 -352665 -311066 -250502 -189133 -176803 -201754 -236338 -283777 -330475 -367064 -418244 -488827
9237d88827n9231k6165P472M5939R5991J14430O2167j0755l1121l484O220k1172
$$ -488827 -548058 -574223 -566751 -520812 -424821 -310391 -248224 -258979 -290100 -293584 -287364 -308536
9225c08536k5497K1950P3879R6107Q6570O0437K0452j5907k9173j8783K1074M9950
$$ -308536 -334033 -312083 -238204 -142097 -55527 4910 25362 9455 -19718 -38501 -17427 32523
9213C2523K9874n335j0990L768K4562L1754j5520q3465r4598n2542J0402N4675
$$ 32523 62397 57062 46072 49840 74402 106156 90636 7171 -87427 -139969 -129567 -74892
9201g4892L8615j0913n3913o5240l2726J5428M4460M8403M7843M5332M5719O5836
$$ -74892 -36277 -47190 -101103 -166343 -199069 -183641 -139181 -90778 -42935 2397 48116 113952
9189A13952Q8746P9204O8677R1122R4607M2232k5001o6500q9619q4842n1260m4559
$$ 113952 202698 281902 350579 441701 536308 578540 553539 487039 397420 312578 261318 216759
9177B16759p6366q8039n9831j3525K8687M3025L6163J0497l2361p6502q3748n2555
$$ 216759 140393 52354 -7477 -21002 7685 50710 86873 97370 65009 -11493 -95241 -147796
9165a47796j8662K7878O5392N3186q09n3330l5578L5791O5328L0775l718k237
$$ -147796 -166458 -138580 -73188 -20002 -20811 -74141 -109719 -73928 -8600 22175 18457 16220
9153A6220J1553j3422n1222m6805k1140j1622k7607o9647r1934m0647O9046J53073
$$ 16220 27773 14351 -36871 -83676 -104816 -116438 -144045 -213692 -305626 -346273 -277227 -124154
9141a24154J44981O5641O350k501k0336l6202j7915J6460K6258n107l7602m1726
$$ -124154 20827 86468 92818 90317 69981 33779 15864 32324 58582 53475 15873 -25853
9129b5853l5671m1564l9128j1925J6745K9369L5952M5731K3227j6497k2447j9839
$$ -25853 -61524 -103088 -142216 -154141 -137396 -108027 -72075 -26344 -3117 -19614 -42061 -61900
9117f1900l3304m4804n4760o7578n1311L657N8728Q5838N3871k9548q5283r5627
$$ -61900 -95204 -140008 -194768 -262346 -313657 -310000 -251272 -165434 -111563 -141111 -226394 -322021
9105c22021r4384p7502k1838M2770N8282L4056K6385K8444Q443l26J5612L8001
$$ -322021 -416405 -493907 -515745 -472975 -414693 -380637 -354252 -325808 -317365 -317691 -302079 -264078
9093b64078N5950O7987P3042O4019L6446L1562O3074R8680J03369O9862L3180
$$ -264078 -208128 -140141 -67099 -3080 33366 64928 128002 226682 330051 399913 433093
9082D33093K073j6033r997j7147m7089n3259l0381r369n020j8303j7395n081k2306
$$ 433093 435166 419133 409136 391989 344900 291641 261260 251891 246871 228568 211173 206092 183786
9069A83786o7180j08649j08634o1656j9611L3364Q4482P0392L2736P667j7879
$$ 183786 116606 7957 -100677 -162333 -181944 -148580 -64098 6294 39030 46697 28818
9058B8818k9766J564L7662J8794k5153m7258m9715m7067m3004j4387M6660Q7091
$$ 28818 -948 616 38278 57072 31919 -15339 -65054 -112121 -155125 -169512 -122852 -35761
9046c5761R6865Q6907N9017L9628j692p1934j11269q7256l3998K843K9717M9096
$$ -35761 61104 148011 207028 246656 244964 173030 61761 -25495 -59493 -56650 -26933 22163
9034B2163M6697K8598J5632Q907k740K0085P4928Q0948O0019M7437R342l1727
$$ 22163 68860 97458 113090 121997 119257 139342 214270 295218 355237 402674 412016 380289
9022C80289k6894J6283L3402j5549o8467o5437k8203K099m509m2269m9335k337
$$ 380289 353395 369678 403080 387531 319064 253627 225424 227523 223014 180745 131410 129073
9010A29073L8478L3994J522j9202l1571k3769M99j895m2571q1442p7560o0680
$$ 129073 167551 201545 203067 183865 152294 128525 129024 127129 84558 3116 -74444 -135124
8998a35124n1239o425M9610O7370N6155M6873O8108J03643J03735O1591Q911m0921
$$ -135124 -186363 -192788 -143178 -75808 -19653 27220 95328 198971 302706 364297 373208 332287
8986C32287n2128m5188n8789o2056m2903l0633m1890o6673p2305l0470M6531R1082
$$ 332287 280159 234971 176182 114126 71223 40590 -1300 -67973 -140278 -170748 -124217 -33135
8974c3135O9666K8055q091l2329m2916l1095J3059O2511O8488O341r0131j46859
$$ -33135 36531 64586 56495 24166 -18750 -49845 -36786 25725 94213 100554 10423 -136436
8962a36436j36079r9630m8541L5846J22769J53740J12687N4515K7778M3125O6877
$$ -136436 -272515 -372145 -420686 -384840 -262071 -108331 4356 58871 86649 129774 196651
8951A96651O9728N9747M0740n119n1723m7445J455L7882K9165J142P76O078n024
$$ 196651 266379 326126 366866 361747 310024 262579 264034 301916 331081 332223 332999 339077 334053
8938C34053k2636m7085n7517m9484l0978j7305k8715m2949k4496K0330M1869L6763
$$ 334053 311417 264332 206815 157331 126353 109048 80333 37384 12888 33218 75087 111850
8926A11850N628j3761M648K1588K2658K7126K6205O652J5141N2133M8606J433
$$ 111850 117478 103717 108365 129953 152611 179737 205942 212594 227735 279868 328474 329907
8914C29907o0647j08855q3563R115Q1929R2345P2610M3079J4023L491L1556M9525
$$ 329907 269260 160405 76842 85957 167886 260231 332841 375920 389943 393434 424990 474515
8902D74515L264n8713p5872n3824k4598k7860o8543q7060n1924j7782k5194m2441
$$ 474515 477779 419066 343194 289370 264772 236912 168369 81309 29385 11603 -13591 -56032
8890e6032j3812M6220Q2218O7997N6417P8099Q6123O3015M0689N0156Q3315J12510
$$ -56032 -69844 -23624 58594 126591 183008 261107 347230 410245 450934 501090 584405 696915
8878F96915J20150Q6995L2171K99l622J52J4952O0192J14703J22588Q8892N8355
$$ 696915 817065 904060 936231 936530 932908 933060 948012 1008204 1122907 1245495 1334387 1392742
8866A392742M4925N1986P9281J00098J09240R8564M7664k4176o6640n4300j5800
$$ 1392742 1437667 1489653 1568934 1669032 1778272 1876836 1924500 1900324 1833684 1779384 1763584
8855A763584l318m2838r8520j02982p5893q8574j23130j29633j15982q8552o0203
$$ 1763584 1760266 1717428 1618908 1515926 1440033 1351459 1228329 1098696 982714 894162 833959
8844H33959n0106p7228j07681j00099q0188o1857k7896j9192n4301p8497q3397
$$ 833959 783853 706625 598944 498845 418657 356800 328904 309712 255411 176914 93517
8833I3517p3055n1435k0462J5984N3960Q0359N8078J9445j1916k7468K246M8140
$$ 93517 20462 -30973 -51435 -35451 18509 98868 156946 176391 164475 137007 139253 187393
8821A87393M5519Q011j9201l3785k5254o96q539m6820o7791p4141m7313J2886
$$ 187393 232912 240923 221722 187937 162683 161987 153448 106628 38837 -35304 -82617 -69731
8809f9731O0641R8682J28834J22111J01055R4229Q6498P2032P0187J09148J57178
$$ -69731 -9090 89592 218426 340537 441592 535821 622319 694351 764538 873686 1030864
8798A030864J46907J06768J06337J25721J02463J8697o1659o8488o8718j11724
$$ 1030864 1177771 1284539 1390876 1516597 1619060 1637757 1576098 1507610 1438892 1327168
8788A327168j25192q6867o0489o4267o2320m6996l6590m6724p4146j20459j63195
$$ 1327168 1201976 1115109 1054620 990353 928033 881037 844447 797723 723577 603118 439923
8777D39923j46831r0615n6767j1408O0052R2940P1585N5023O9147Q2092O8610
$$ 439923 293092 202477 145710 134302 194354 287294 358879 413902 483049 565141 633751
8766F33751n113q2467j07429p9148l4209k1057m9452o5975l1839j045j4391n6863
$$ 633751 628638 546171 438742 359594 325385 304328 254876 188901 157062 156017 141626 84763
8754H4763q8832p1333j8941P88l6029l7848N2655J24753R6157K4491j4473k0193
$$ 84763 -4069 -75402 -94343 -93555 -129584 -167432 -114777 9976 106133 130624 116151 95958
8742I5958k6584l0327k1631j0651j9400j5135R561L5141N5117M4829J6414J856
$$ 95958 69374 39047 17416 6765 -12635 -27770 -18209 16932 72049 116878 133292 135148
8730A35148j8416n1294o8680n4594l109M4587M7547O867l8595p8077j03466q7741
$$ 135148 116732 65438 -3242 -57836 -60945 -16358 31189 38056 -539 -78616 -182082 -269823
8718b69823k1004O6979R1536N3141L6901K8118j2517k6470l877j1825m6267m0454
$$ -269823 -290827 -223848 -132312 -79171 -42270 -14152 -26669 -53139 -57016 -68841 -115108 -155562
8706a55562Q449M5364O0798N0317N841l6301l9674m711J5598j4974m8834j5477
$$ -155562 -147113 -101749 -40951 9366 15207 -21094 -60768 -65479 -49881 -64855 -113689 -129166
8694a29166M8364M0358j8560m4568k9139j2646L455L6419N9553N5643L9688L5890
$$ -129166 -80802 -40444 -59004 -103572 -132711 -145357 -141902 -105483 -45930 9713 49401 85291
8682H5291M3677K7330j4419n9554p7310n6941l3772k4034m651J1267J403j6689
$$ 85291 128968 156298 141879 82325 5015 -51926 -85698 -109732 -114383 -103116 -101713 -118402
8670a18402j5399J9102O4396P0588J6799o7284r7174m3124K4198M7658M1760M037
$$ -118402 -133801 -114699 -50303 20285 37084 -30200 -127374 -170498 -146300 -98642 -56882 -52845
8658e2845o0237j06051j01215o6321l1348R724L0677L3954M7531M2481J502l1196
$$ -52845 -113082 -219133 -320348 -386669 -418017 -408293 -377616 -343662 -296131 -253650 -252148 -283344
8646b83344k3013J5839M0468J1106k3824j5106L088Q044K5605M7445L8895J2792
$$ -283344 -306357 -290518 -250050 -238944 -262768 -277874 -274786 -266742 -241137 -193692 -154797 -142005
8634a42005J2885M7265R0347R4966O0974J2122n0044r5581j00350p5445m2215
$$ -142005 -129120 -81855 8492 103458 164432 176554 126510 30929 -69421 -144866 -187081
8623a87081l6020o3043o4573N762J00158J29707R6504M2933j6689o6255r2955
$$ -187081 -223101 -286144 -350717 -344955 -244797 -115090 -18586 24347 7658 -58597 -151552
8612a51552r1110o4747r858N7987Q2216M3882n464r726K1190P0762J18464J37431
$$ -151552 -242662 -307409 -317267 -259280 -177064 -133182 -138646 -148372 -127182 -56420 62044 199475
8600A99475J22944P4639O830m2314n9830m6946j5514K1163P1754J17306J22885
$$ 199475 322419 397058 403888 361574 301744 254798 239284 260447 332201 449507 572392
8589E72392J01256R3535J15928J43166J50565J24685Q2406O4814P5306R0168P3137
$$ 572392 673648 767183 883111 1026277 1176842 1301527 1383933 1448747 1524053 1614221 1687358
8578A687358L9709N1780J00252J07666N9282J1121l3637r5277j43356j54932j28674
$$ 1687358 1727067 1778847 1879099 1986765 2046047 2057168 2023531 1928254 1784898 1629966 1501292
8567A501292q0806l7150l0397o7665q7703o9351n0653n4339m5181k1876k5796
$$ 1501292 1420486 1383336 1352939 1285274 1197571 1128220 1077567 1023228 978047 956171 930375
8556I30375m2920l7005k1111k1039n1602j07205j52694j50275j06752l5204N1337
$$ 930375 887455 850450 829339 808300 756698 649493 496799 346524 239772 204568 255905
8545B55905Q7984M9426L073k7995m1683j2773M7110J11709J35133Q6406J827p5372
$$ 255905 343889 393315 396388 368393 326710 313937 361047 472756 607889 694295 696122 620750
8533F20750q6746j0446P8513J25912J01189J5339o2287o5016M003O2176N9099
$$ 620750 534004 523558 602071 727983 829172 844511 782224 717208 721211 783387 842486
8522H42486N0414O2803O0293L3871J4404L2845N6206O6760R5846J24573J07144
$$ 842486 892900 955703 1015996 1049867 1064271 1097116 1153322 1220082 1315928 1440501 1547645
8511A547645N6549L0656L8814N1174M2697N069m1744p3152r9534j31955j49359
$$ 1547645 1604194 1634850 1673664 1724838 1767535 1772604 1730860 1657708 1558174 1426219 1276860
8500A276860j40793j44605j36414r3476o6710o2983m9988j7675K9008O4723N1775
$$ 1276860 1136067 991462 855048 761572 694862 631879 581891 564216 593224 657947 709722
8489G09722r954n3622n8063n5902l6919l4960o9873r2666n9545Q678N2411N6739
$$ 709722 699768 646146 588083 532181 495262 460302 390429 297763 238218 246896 299307 356046
8477C56046L4226n60r964k0863o1170j02800j01793o9246l3913L779M4603P4483
$$ 356046 390272 389712 379748 358885 297715 194915 93122 23876 -10037 -6258 38345 112828
8465A12828Q7366Q7522P0918K7456k3608l0790l2069n9932r8664j48281j64376
$$ 112828 200194 287716 358634 386090 362482 331692 299623 239691 141027 -7254 -171630
8454a71630j12235k8389K8601N0378N4478N1193L0862o837m9681q4962o2140R234
$$ -171630 -283865 -312254 -283653 -233275 -178797 -127604 -96742 -103579 -153260 -238222 -300362 -291128
8442b91128N2775L7878P379j0192j8062m798L5860P5118P7438O4494O0355N9508
$$ -291128 -238353 -200475 -193096 -203288 -221350 -226148 -190288 -115170 -37732 26762 87117 146625
8430A46625N3720P1840R3765N4463l0981q4833n7097m196P450P370K8268L5297
$$ 146625 200345 272185 365950 420413 389432 304599 247502 243306 250756 258126 286394 321691
8418C21691n979o3239q3131l9960N6442J29182J35084Q4176j3769q6795p9523
$$ 321691 315712 252473 169342 129382 185824 315006 450090 534266 520497 433702 354179
8407C54179k8393J9858L6177K0674o395l1563m6612l6665k5478m7918n0784J3156
$$ 354179 325786 345644 381821 402495 396100 364537 317925 281260 255782 207864 157080 170236
8395A70236Q3612J04994Q7148O2536N5672M1348Q861l1179n7552j4162O0978O6535
$$ 170236 253848 358842 445990 508526 564198 605546 614407 583228 525676 511514 572492 639027
8383F39027J5080l2362m1512m4732o1982l7333K0536M2676K3974J9071K5995L1361
$$ 639027 654107 621745 580233 535501 473519 436186 456722 499398 523372 542443 568438 599799
8371E99799L7334M6561N2629J3080p4972j25449j16513p1576r927N1597Q1628
$$ 599799 637133 683694 736323 749403 674431 548982 432469 360893 350966 402563 484191
8360D84191N2328J6357j503n1918j35835j68137j03502K16P0855Q4148N6279K5384
$$ 484191 536519 552876 551373 499455 363620 195483 91981 92197 163052 247200 303479 328863
8348C28863k586k2618j4101J0422J6727Q409O469J1551P869J1067N5842Q1981
$$ 328863 326277 303659 289558 299980 316707 325116 331585 343136 351005 362072 417914 499895
8336D99895N2132J676k2003j3662j0853m0568m2116K2288P9364Q9809L9419j7994
$$ 499895 552027 553703 531700 518038 507185 466617 424501 446789 526153 615962 655381 637387
8324F37387k5445j1750r864j7121j9933m8973r2922r2292n3048k3976j1222J3876
$$ 637387 611942 600192 590328 573207 553274 504301 411379 319087 266039 242063 230841 244717
8312B44717N5120Q6732R9617J12657J09133J01827J10848J01775N8922N867l5329
$$ 244717 299837 386569 486186 598843 707976 809803 920651 1022426 1081348 1087215 1051886
8301A051886n2625o6465p7225o8156m6516j4617K2869O8402J07053J23822R4520
$$ 1051886 999261 932796 855571 787415 740899 726282 749151 817553 924606 1048428 1142948
8290A142948L56j00043j40922j47585j55545j19146m3286j5955k5300j2395N412
$$ 1142948 1143304 1043261 902339 754754 599209 480063 436777 420822 395522 383127 388539
8279C88539J186l0689m7942j4112L2677K5923k4131n3346k2078L6329M2449J0808
$$ 388539 389725 359036 311094 296982 329659 355582 331451 278105 256027 292356 334805 345613
8267C45613K4321P0234R7050R2538N6359K0988J0445J2734J3405K142m522K3013
$$ 345613 369934 440168 537218 629756 686115 707103 717548 730282 743687 745829 741307 764320
8255G64320N6467N3022L7405M5656M0171j1352p1963j05289j01838o5652j153
$$ 764320 820787 873809 911214 956870 997041 985689 913726 808437 706599 640947 639794
8244F39794Q2324J38876J24521O4574J2041l6990j00167j33890j17942r7726r4367
$$ 639794 722118 860994 985515 1050089 1062130 1025140 924973 791083 673141 575415 481048
8233D81048o7683j9513K3043N5234O8220P8636P0671L5548R021J038j2577j5165
$$ 481048 413365 393852 416895 472129 540349 618985 689656 725204 734225 735263 722686 707521
8221G07521J8855O8651R0990P1672K6867K638L7066R7011J37208J41658R0767
$$ 707521 726376 795027 886017 957689 984556 987194 1024260 1121271 1258479 1400137 1490904
8210A490904j5619r7689j10811r1799n3551r006J6171O204j9771m5358n9452m9649
$$ 1490904 1475285 1377596 1266785 1174986 1121435 1112429 1128600 1134804 1115033 1069675 1010223 960574
8198I60574j4734K1023J5135j9541l8667l1522r358k5380n3512k7090L7165P0366
$$ 960574 945840 966863 981998 962457 923790 892268 882910 857530 804018 776928 814093 884459
8186H84459M8786J7397J7604M775l5954m1463k1659r904P434K8664O9103J23246
$$ 884459 933245 950642 968246 973021 937067 895604 873945 864041 871475 900139 969242 1092488
8174A092488J27257J02772R6713O1658q006n9718r3164j03787o8530j4549K3063
$$ 1092488 1219745 1322517 1419230 1480888 1472882 1413164 1320000 1216213 1147683 1133134 1156197
8163A156197L3849L7844P2742J11691J07276P7890O2049M0433J1741J5939M2853
$$ 1156197 1190046 1227890 1300632 1412323 1519599 1597489 1659538 1699971 1711712 1727651 1770504
8152A770504N3221L5438J1893K5738O4679J01725J26653J30013J07625N2807n296
$$ 1770504 1823725 1859163 1871056 1896794 1961473 2063198 2189851 2319864 2427489 2480296 2475000
8141B475000j9892o359j2605k6361j5227J0698J8047k063l4775n1951m3181l6183
$$ 2475000 2455108 2448749 2436144 2409783 2394556 2405254 2423301 2421238 2386463 2334512 2291331 2255148
8129B255148k8095l0640p3500j34095j55991j12211m6094p46J3667j6620n2105
$$ 2255148 2227053 2196413 2122913 1988818 1832827 1720616 1674522 1673776 1687443 1670823 1618718
8118A618718n8760m4678r362L4138M9935L2669J759K493M8971Q3777Q3184O6614
$$ 1618718 1559958 1515280 1505918 1540056 1589991 1622660 1624419 1626912 1675883 1759660 1842844 1909458
8106A909458O3139P3801R5505J11414J08582R7621Q5327P2169O9671J03606J80847
$$ 1909458 1972597 2046398 2141903 2253317 2361899 2459520 2544847 2617016 2686687 2790293 2971140
8095B971140K53914K84835K89695K52911J62641J3725j84465l56724m26948l91653
$$ 2971140 3225054 3509889 3799584 4052495 4215136 4228861 4044396 3687672 3260724 2869071
8085B869071k82353j57226o7262j8566j9989m5881n3937p4759j10924j10816n4955
$$ 2869071 2586718 2429492 2362230 2343664 2323675 2277794 2223857 2149098 2038174 1927358 1872403
8074A872403L6132J00926R4377N0679O030l8421p4480q3415o0221j2082N7892
$$ 1872403 1908535 2009461 2103838 2154517 2160547 2122126 2047646 1964231 1904010 1891928 1949820
8063A949820J22970J18355L0072m4455n7769q5033j21072q6420M545Q5465J06223
$$ 1949820 2072790 2191145 2221217 2176762 2118993 2033960 1912888 1826468 1831013 1916478 2022701
8052B022701O7259L2725J3204j5877n7217p2557k2175N0966P9193O5190N9677
$$ 2022701 2089960 2122685 2135889 2120012 2062795 1990238 1968063 2019029 2098222 2163412 2223089
8041B223089Q0543R1800Q6722O5421K1094o032l061J5608R954j9291l6368n6117
$$ 2223089 2303632 2395432 2482154 2547575 2568669 2562637 2559576 2575184 2585138 2565847 2529479 2473362
8029B473362p9813p3085l1378O887K4671M5602Q0328R2442P6132P5582Q5902M8159
$$ 2473362 2393549 2320464 2289086 2295973 2320644 2366246 2446574 2539016 2615148 2690730 2776632 2824791
8017B824791l1879j01034j21905q4464m528M9504O3075Q3735Q7789N2027K6704
$$ 2824791 2792912 2691878 2569973 2485509 2480981 2530485 2593560 2677295 2765084 2817111 2843815
8006B843815N9060J05315J21972J22342R3227N6470P1356J04015R9277P5121O9090
$$ 2843815 2902875 3008190 3130162 3252504 3345731 3402201 3473557 3577572 3676849 3751970 3821060
7995C821060P1153N3750L1188K6784M8495P8976R8919J19009J48578J72738J68354
$$ 3821060 3892213 3945963 3977151 4003935 4052430 4131406 4230325 4349334 4497912 4670650 4839004
7984D839004J54701J62509J65296J32142R3117P8520R4149J49963K08684K09659
$$ 4839004 4993705 5156214 5321510 5453652 5546769 5625289 5719438 5869401 6078085 6287744
7974F287744J80912J76032J89899K14435K68958L49291M24366N05343N86023O58783
$$ 6287744 6468656 6644688 6834587 7049022 7317980 7667271 8091637 8596980 9183003 9841786
7964I841786P39753Q45418R78654J115163J249168J394662J591307J862031K167352
$$ 9841786 10581539 11426957 12405611 13520774 14769942 16164604 17755911 19617942 21785294
7955B1785294K459905K751027L073961L378101L565970L543647L213390K538150
$$ 21785294 24245199 26996226 30070187 33448288 37014258 40557905 43771295 46309445
7947D6309445J573233M28150p69697j876556k721413l212858l353294l222835
$$ 46309445 47882678 48310828 47541131 45664575 42943162 39730304 36377010 33154175
7939C3154175k943430k607954k251826j879365j536871j276988j071875q55989
$$ 33154175 30210745 27602791 25350965 23471600 21934729 20657741 19585866 18729877
7931A8729877o20702l92925k46508j92823j79791j69730j31299p8775k0594J1311
$$ 18729877 18109175 17716250 17469742 17276919 17097128 16927398 16796099 16717324 16696730 16708041
7921A6708041P885O4580J77083K54122K87751L35258M18310N17329O23586P72416
$$ 16708041 16715926 16780506 16957589 17211711 17499462 17834720 18253030 18770359 19393945 20166361
7911B0166361R67087J172402J394874J640393J912299K227603K603931L033196
$$ 20166361 21133448 22305850 23700724 25341117 27253416 29481019 32084950 35118146
7903C5118146L511370M054873M674673N399332O250974P244243Q346283R443749
$$ 35118146 38629516 42684389 47359062 52758394 59009368 66253611 74599894 84043643
7895H4043643J0358841J0878388J0811051R890863P873958M836816J170157k638089
$$ 84043643 94402484 105280872 116091923 125982786 133856744 138693560 139863717 137225628
7887A37225628o050918q615266j0145376j0676861j0392435r552126q409838p182169
$$ 137225628 131174710 122559444 112414068 101737207 91344772 81792646 73382808 66200639
7879F6200639o049482n081007m237440l476734k800418k236272j773376j389087
$$ 66200639 60151157 55070150 50832710 47355976 44555558 42319286 40545910 39156823
7871C9156823j092915q99423p81551o83397n87115n09354m39395l54632k50353
$$ 39156823 38063908 37164485 36382934 35699537 35112422 34603068 34163673 33809041 33558688
7862C3558688j18433N1552K73669N04299P23160R67120J220018J468583J729285
$$ 33558688 33440255 33491807 33765476 34269775 34992935 35960055 37180073 38648656 40377941
7853D0377941K052742K486951K976866L492722M065752M707435N486704O467969
$$ 40377941 42430683 44917634 47894500 51387222 55452974 60160409 65647113 72115082
7845G2115082P662212R072481J0653604J2396645J4358154J6489686J8607172
$$ 72115082 79777294 88849775 99503379 111900024 126258178 142747864 161355036
7838A61355036K0419183K1518383K1425456J9613207J5726362R852249K573124
$$ 161355036 181774219 203292602 224718058 244331265 260057627 269909876 272483000
7831B72483000n115722j2061007j7340943k0502549k1588496k1011924j9364036
$$ 272483000 267367278 255306271 237965328 217462779 195874283 174862359 155498323
7824A55498323j7181314j4864112j2670953j0689618q949893p469964o221372
$$ 155498323 138317009 123452897 110781944 100092326 91142433 83672469 77451097
7817G7451097n186289m346849l637607k991730k423000k004960j743122j606765
$$ 77451097 72264808 67917959 64280352 61288622 58865622 56860662 55117540 53510775
7809E3510775j514198j377999j194538r90403q05143o28638m03283j10678K35783
$$ 53510775 51996577 50618578 49424040 48433637 47628494 46999856 46596573 46485895 46721678
7800D6721678O08510R84463J367171J754895K170518K637260L170392L787248
$$ 46721678 47330188 48314651 49681822 51436717 53607235 56244495 59414887 63202135
7792F3202135M504258N357558O362217P501165Q790545J0269265J1990661J4015378
$$ 63202135 67706393 73063951 79426168 86927333 95717878 105987143 117977804 131993182
7784A31993182J6335456J8830914K1332747K3561684K5024171K5070963K3046353
$$ 131993182 148328638 167159552 188492299 212053983 237078154 262149117 285195470
7777B85195470J8559093J1697321L139386n929448j4197960k0599125k4513996
$$ 285195470 303754563 315451884 318591270 312661822 298463862 277864737 253350741
7770B53350741k5912647k5277342k3318109k0711805j7937853j5289313j2938920
$$ 253350741 227438094 202160752 178842643 158130838 140192985 124903672 111964752
7763A11964752j0934535r215969p702954o380545n288250m425816l776500l268587
$$ 111964752 101030217 91814248 84111294 77730749 72442499 68016683 64240183 60971596
7755F0971596k822864k448698k158708j912597j704967j526153j304706j047636
$$ 60971596 58148732 55700034 53541326 51628729 49923762 48397609 47092903 46045267
7747D6045267q01546n44343k59884J3828K74504N47071Q52535J201625J608045
$$ 46045267 45243721 44699378 44439494 44453322 44727826 45274897 46127432 47329057 48937102
7738D8937102K070127K558182L095266L721412M428944N245957O231608P379260
$$ 48937102 51007229 53565411 56660677 60382089 64811033 70056990 76288598 83667858
7730H3667858Q693813J0199926J1893981J3783618J5850737J7946041J9759460
$$ 83667858 92361671 102561597 114455578 128239196 144089933 162035974 181795434
7723A81795434K0906559K0921649J9273222J5571004R826886K607835n075157
$$ 181795434 202701993 223623642 242896864 258467868 268294754 270902589 265827432
7716B65827432j2083450j7525654k0912387k2187409k1706894k0075990j7871822
$$ 265827432 253743982 236218328 215305941 193118532 171411638 151335648 133463826
7709A33463826j5542615j3338841j1334231r572246q078408o839235n809828m938123
$$ 133463826 117921211 104582370 93248139 83675893 75597485 68758250 62948422 58010299
7701E8010299m189021l572603l101759k727155k412658k121709j870116j699365
$$ 58010299 53821278 50248675 47146916 44419761 42007103 39885394 38015278 36315913
7693C6315913j546617j348225j144252r48330p16684m93949l50281k54133j35068
$$ 36315913 34769296 33421071 32276819 31328489 30611805 30117856 29767575 29513442 29378374
7684B9378374N4133L01237N24733P14719R44428J254185J640232K076042K504366
$$ 29378374 29432507 29733744 30258477 30973196 31917624 33171809 34812041 36888083 39392449
7675C9392449K932008L450572M123183M905246N754545O674899P658073Q667647
$$ 39392449 42324457 45775029 49898212 54803458 60558003 67232902 74890975 83558622
7667H3558622R572197J0181997J0257972R500387P715151M910365J341959k468207
$$ 83558622 93130819 103312816 113570788 123071175 130786326 135696691 137038650 134570443
7659A34570443n945946q689668j0448599j1148504j0978128j0229796r144662
$$ 134570443 128624497 119934829 109486230 98337726 87359598 77129802 67985140
7652F7985140p938061o795715n787486m921037m210665l623201l101701k612461
$$ 67985140 60047079 53251364 47463878 42542841 38332176 34708975 31607274 28994813
7644B8994813k194635j888469j661554j469804j308433j161069j008490q43186
$$ 28994813 26800178 24911709 23250155 21780351 20471918 19310849 18302359 17459173
7636A7459173o87793n62182m58529l81410l25070k50182j64683r0541m9907l8012
$$ 17459173 16771380 16209198 15750669 15369259 15044189 14794007 14629324 14538783 14488876 14450864
7626A4450864j604Q0838J72417K51149L38899M51071N87751P75849J025247J265756
$$ 14450864 14449260 14530098 14702515 14953664 15292563 15743634 16331385 17107234 18132481 19398237
7616A9398237J447179J626954J908822K284015K657910K978796L255245L492601
$$ 19398237 20845416 22472370 24381192 26665207 29323117 32301913 35557158 39049759
7608C9049759L576139L348457K783665J889015O87324o33540j804672k702452
$$ 39049759 42625898 45974355 48758020 50647035 51334359 50700819 48896147 46193695
7600D6193695l308482l590548l553845l297813k939876k553778k204647j960909
$$ 46193695 42885213 39294665 35740820 32443007 29503131 26949353 24744706 22783797
7592B2783797j835840j770560j685533j539738j353053j179810j044291r16584
$$ 22783797 20947957 19177397 17491864 15952126 14599073 13419263 12374972 11458388
7584A1458388q15376p62563p23357o94077o49698n65550m87776m47136m16257
$$ 11458388 10643012 9880449 9157092 8463015 7813317 7247767 6759991 6312855 5896598
7575E896598l92475l70121l23108k42717j70018j74490k22905k38419k17763j93155
$$ 5896598 5504123 5134002 4810894 4568177 4398159 4223669 4000764 3762345 3544582 3351427
7565C351427j78369j65232j22817o4810j2812L6655O2919M5048J6518j0187l6349
$$ 3351427 3173058 3007826 2885009 2820199 2807387 2844042 2906961 2952009 2968527 2958340 2921991
7554B921991n5335o8545o9013m1192k550R715j6155n9731r0230j16671j28533
$$ 2921991 2866656 2798111 2729098 2687906 2685356 2695071 2678916 2619185 2528955 2412284 2283751
7543B283751j09203j26999j63738j37067q8108p5520p2063l9217K235L1900O2536
$$ 2283751 2174548 2047549 1883811 1746744 1658636 1583116 1511053 1471836 1474071 1505971 1568507
7532A568507R1983R5357P7038M6117L18l0548n2274p8098q3910p8807m9743Q410
$$ 1568507 1660490 1755847 1832885 1879002 1879320 1848772 1796498 1718400 1634490 1555683 1505940 1514350
7520A514350J9249j7870k5968r961k5031n0783m9765j7383J3289J2275K5587O9736
$$ 1514350 1533599 1515729 1489761 1479800 1454769 1403986 1354221 1336838 1350127 1362402 1387989 1457725
7508A457725Q3897N2932J8091J1181J1889q027m2852p2258n8887j072L5410N5830
$$ 1457725 1541622 1594554 1612645 1623826 1635715 1627688 1584836 1512578 1453691 1452619 1488029 1543859
7496A543859P7690N3268J6861R959J1632m748n8535j17022j18927n0888J5234
$$ 1543859 1621549 1674817 1691678 1701637 1713269 1708521 1649986 1532964 1414037 1363149 1378383
7485A378383K6713j3883o4498p7400o1166l9859k2529l67K2633K3618K9874M8821
$$ 1378383 1405096 1391213 1326715 1249315 1188149 1148290 1125761 1125394 1148027 1171645 1201519 1250340
7473A250340N3470L0486p135m4225m5179q898K6076M2405K5468L525K8031P3482
$$ 1250340 1303810 1334296 1327161 1282936 1237757 1228859 1254935 1297340 1322808 1326333 1354364 1427846
7461A427846R7035R9911P8095M8032J9114j0699m8041q5934r8737o5366j3075
$$ 1427846 1524881 1624792 1702887 1750919 1770033 1759334 1711293 1625359 1526622 1461256 1448181
7450A448181K222p714l147J9245L5423K7002K2386P892m2477q8797q1719l9342
$$ 1448181 1450403 1442689 1439542 1458787 1494210 1521212 1543598 1551490 1509013 1420216 1338497 1299155
7438A299155j503Q397j2183k6839j2131o197l4804m5787l3391k7165P927O2098
$$ 1299155 1297652 1306049 1293866 1267027 1254896 1248699 1213895 1168108 1134717 1107552 1115479 1177577
7426A177577O6249K6350j7210l6042j2292j807n5682j16768j18346q7816p5775
$$ 1177577 1243826 1270176 1252966 1216924 1204632 1202825 1147143 1030375 912029 824213 748438
7415G48438q0931j01657j16943q2791l7139j4922q779m471l261M140K9269P1473
$$ 748438 667507 565850 448907 366116 328977 314055 305276 300805 297544 301684 330953 402426
7403D02426J04699J03312P3265L7378O694j5653l9510m4724j7509J8708M1789
$$ 402426 507125 610437 683702 721080 727774 712121 672611 627887 610378 629086 670875
7392F70875O0793P8245P8561N2517J2496l4154p0768r0940j08883j02939o0645
$$ 670875 731668 809913 888474 940991 953487 919333 848565 757625 648742 545803 485158
7381D85158L99L0038K0879J3431K973m4618j07284j10398k4642Q6095J43105J51459
$$ 485158 485557 515595 536474 549905 552878 508260 400976 290578 265936 352031 495136 646595
7369F46595J24782N8091j6505p9300j35886j55416j13068m9909j1698N659K5750
$$ 646595 771377 829468 812963 733663 597777 442361 329293 279384 267686 273345 299095
7358B99095M3394K8383Q299K4523M2485K6936j9036p2338j10935j33992r9622
$$ 299095 342489 370872 379171 403694 446179 473115 454079 381741 270806 136814 37192
7347C7192j8808K6363K5624J6349K6968L4674L3695M2135J7496o0667j19463j01114
$$ 37192 18384 44747 70371 86720 113688 148362 182057 224192 241688 181021 61558 -39556
7335c9556k2824L2518M2267N3970P4610N3474j054j6021J4776M1480M0353O780
$$ -39556 -62380 -29862 12405 66375 140985 194459 193405 177384 192160 233640 273993 280773
7323B80773m8650q5039q3219n1874j4239M7039J19990J37196Q4500L6403L9328
$$ 280773 232123 147084 63865 11991 -2248 44791 164781 301977 386477 422880 462208
7312D62208M6383J062o5341q7520o1399l3996l4342l9532P92P1325J06981P6741
$$ 462208 508591 509653 444312 356792 295393 261397 227055 187523 188315 259640 366621 443362
7300D43362K6075J4824L2255M2619K1091j5630j9365K7452O5133L6674r369m0222
$$ 443362 469437 484261 516516 559135 580226 564596 545231 572683 637816 674490 665121 624899
7288F24899o8339o4306o0391o0315k109N4469N2344R235k9692l3859l5431o2891
$$ 624899 556560 492254 431863 371548 369439 423908 476252 485487 455795 421936 386505 323614
7276C23614r5792q6548l1643R257J6082K9182O1538P5147N5597M5586N6254N0842
$$ 323614 227822 141274 109631 118888 134970 164152 225690 300837 356434 402020 458274 509116
7264E09116Q110l4300l2734m6100j13084j59856j17606l3013K8427M1656K9707
$$ 509116 517226 482926 450192 404092 291008 131152 13546 -19467 8960 50616 80323
7253H0323N0485R4795Q9757L1090J183K2584L5612L3908M3606M2418K0986j1293
$$ 80323 130808 225603 315360 346450 347633 370217 405829 439737 483343 525761 546747 535454
7241E35454k7869N287N6959N8440J0966r866j1109m1824o3316m2576K760J4161
$$ 535454 507585 512872 569831 628271 639237 629371 618262 576438 513122 470546 473306 487467
7229D87467j4034j2786K3901L6552L4296M3917L6661N911k5142k5768j9178l1649
$$ 487467 473433 460647 484548 521100 555396 599313 635974 641885 616743 590975 571797 540148
7217E40148j8344J0080J226j6283M00J0972k450j9867l7580m4443m1717n3492
$$ 540148 521804 531884 533110 516827 517227 528199 525749 505882 468302 423859 382142 328650
7205C28650o1903m4761j4276R744L1374M0830L0414L1901O3160P9286L2175k6396
$$ 328650 266747 221986 207710 217454 248828 289658 320072 351973 415133 494419 526594 500198
7193E00198m3277m5304m9608j8526L5007O4396Q2407P2423J7802k2880j7576m467
$$ 500198 456921 411617 362009 343483 378490 442886 525293 597716 615518 592638 575062 570595
7181E70595j1134l8228n1470m9597o7171q1890n6855k2936q317J1018L5348K5868
$$ 570595 559461 521233 469763 420166 352995 271105 214250 191314 182997 194015 229363 255231
7169B55231L678M321J2340J4328J1713p998l7829l7243q29M6540P1202N7354L6085
$$ 255231 258909 263230 275570 289898 301611 293613 255784 218541 217712 264252 335454 392808 428893
7156D28893K5703M274o0854j29815j33505r4800o1707l8290l6862l9355k5311
$$ 428893 454596 458870 398016 268201 134696 39896 -21811 -60101 -96963 -136318 -161629
7145a61629q247Q509K2731L6270M0476K5593K107j4834n599R236K7309M4990L5231
$$ -161629 -169876 -161367 -138636 -102366 -61890 -36297 -34190 -49024 -54623 -45387 -18078 26912 62143
7132F2143O73k4652j3117n225k5773n0574m9530j4833O196r326l5511n0003n2896
$$ 62143 62816 38164 25047 19822 -5951 -56525 -106055 -120888 -114692 -124018 -159529 -209532 -262428
7119b62428m5446k1659J9351P6894J12228J00069O9132M7914M0677M3822M7257
$$ -262428 -307874 -329533 -310182 -233288 -121060 -20991 48141 96055 136732 180554 227811
7108B27811K6705K957j4254j5490K222J4269P968j3023m2208p7595p5975l8591
$$ 227811 254516 257473 243219 227729 229951 244220 252188 239165 196957 119362 43387 4796
7096D796l6959o1748n0704K524L9001L5994L7393N0297L6602m133k4261r00L8442
$$ 4796 -32163 -93911 -144615 -142091 -103090 -67096 -29703 20594 57196 53063 28802 27902 66344
7083F6344Q2294R2086O2960J3353m7185p4879q9884r4369o6435l4019p118N1323
$$ 66344 148638 240724 303684 317037 269852 194973 105089 10720 -55715 -89734 -96852 -45529
7071d5529Q9625P3782M4239K3858J4293J5367K9021K8887k390k5254j8421j616
$$ -45529 44096 117878 162117 185975 200268 215635 244656 273543 271153 245899 227478 225862
7059B25862J683l530j470J8961L4977K3533Q435M14k2642n6393o9576m7647j0350
$$ 225862 227545 224015 222545 241506 276483 300016 308451 308865 286223 229830 160254 112607 102257
7046A02257L2996P9102Q3029J9918m9736q3533q0587l9983J1778L9527M4508L6806
$$ 102257 135253 214355 297384 317302 267566 184033 103446 63463 75241 114768 159276 196082
7034A96082L8978N5341M4438J4737J2444L9882O2471O9042L7981m5407j19115
$$ 196082 235060 290401 334839 349576 362020 401902 464373 533415 571396 525989 406874
7023D06874j22242n1599K3065L3560N810p539k188k1801m9825l3054k1065m5908
$$ 406874 284632 233033 256098 289658 295468 287929 285741 263940 214115 181061 159996 114088
7011A14088n3316k2927R575L4382M2913K1522p942k4760m4634o4376n9653m1321
$$ 114088 60772 37845 47420 81802 124715 146237 138295 113535 68901 4525 -55128 -96449
6999i6449r04O1891Q8153N4684R565M678L8632Q0060J00110R6807Q4205M9989
$$ -96449 -97353 -35462 52691 107375 116940 121618 160250 240310 340420 437227 521432 571421
6987E71421k098m0526m9736m0992j8561M798j227k4901m6841o2503o9981m8856
$$ 571421 569323 528797 479061 438069 419508 424306 423079 398178 351337 288834 218853 169997
6975A69997j889J3513j7773o3201q2990o3475m6569m6160l7066O359L5520K2600
$$ 169997 168108 181621 163848 100647 17657 -45818 -92387 -138547 -175613 -169254 -133734 -111134
6963a11134K5025M0474M8748N0261N8974O8119N1734R442l7038n9431m6475k7849
$$ -111134 -86109 -45635 3113 53374 112348 180467 232201 241643 204605 145174 98699 70850
6951G0850j9191L34Q090j3942l8113m3671m2710l9886k9032p777K4014M3873N4251
$$ 70850 51659 51993 60083 46141 8028 -35643 -78353 -118239 -147271 -155048 -131034 -87161 -32910
6938c2910L6769j0531k8301J8930O4769O3987N2424N3512L7781k8j3306j4922
$$ -32910 3859 -6672 -34973 -16043 48726 112713 165137 218649 256430 256402 243096 228174
6926B28174r175p745l6345m2143k5039l8102n9908n5328k8722J5905M2523K7546
$$ 228174 218999 211254 174909 132766 107727 69625 9717 -45611 -74333 -58428 -15905 11641
6914A1641J894k4873o2606o4068p577N8082Q6995P6762M9897M3396M6509L730
$$ 11641 13535 -11338 -73944 -138012 -145589 -87507 -512 76250 126147 169543 216052 219782
6902B19782o9116r4334p2906n7076m5248k9758r853M026N5N98J9017L3972M5272
$$ 219782 150666 56332 -16574 -73650 -118898 -148656 -158509 -154483 -154428 -153830 -134813 -100841 -55569
6889e5569N9057M5024J666l9937l2205j8755o7506j36166j80364j68227j00839
$$ -55569 3488 48512 50178 10241 -21964 -40719 -108225 -244391 -424755 -592982 -693821
6878f93821p283Q8317J50461J70994J55646J14717O0131O614k0347M236M7042
$$ -693821 -701104 -612787 -462326 -291332 -135686 -20969 39162 45776 25429 29665 76707
6867G6707N1286L5382M2662O6650P5046K6804o3670j29995j47709j55392j71163
$$ 76707 127993 163375 206037 272687 347733 374537 310867 180872 33163 -122229 -293392
6856b93392j32400k8017O6711Q2691M2179j962l3719l3396l0391k9616q85N3841
$$ -293392 -425792 -453809 -387098 -304407 -262228 -264190 -297909 -331305 -361696 -391312 -392197 -338356
6844c38356R7054P3967J6350k5294m3174j9668N2335J14729R7210L0335j0930
$$ -338356 -241302 -167335 -150985 -176279 -219453 -239121 -186786 -72057 25153 55488 44558
6833D4558j8164l60J6100J3140L137O611J5417r951o9321j06444o5221J4720P1853
$$ 44558 26394 26034 42134 55274 58411 65022 80439 70488 1167 -105277 -170498 -155778 -83925
6820h3925J01015J00725Q8154R8456J07557O4591q25m4024o4026p6651p2428m6690
$$ -83925 17090 117815 205969 304425 411982 476573 475748 431724 367698 291047 218619 171929
6808A71929r330K6585L1739L1400K5618l1940j10000j39335p7399J0818L5226
$$ 171929 162599 189184 220923 252323 277941 246001 136001 -3334 -80733 -69915 -34689
6797c4689o935m0817l3387j3699k502J849L336P394K2646N6155R7587J07065O8527
$$ -34689 -41624 -82441 -115828 -129527 -132029 -130180 -126844 -119450 -96804 -40649 56938 164003 232530
6784B32530K0181J1117K8871N0524P8495Q7803N7342J4399j9618k8758k1431m4611
$$ 232530 252711 263828 292699 343223 421718 509521 566863 581262 561644 532886 511455 466844
6772D66844q9487j14881j10047q9414o6920m0764K688M7316O6395N7734N3921
$$ 466844 377357 262476 152429 63015 -3905 -44669 -41981 5335 71730 129464 183385
6761A83385O7509P8405L5550n6062j34154j48209q2870J3536Q6448J27453J30127
$$ 183385 250894 329299 364849 308787 174633 26424 -56446 -42910 43538 170991 301118
6750C01118P3406K81m1914o0506p4849o6474k8724J5915L2473J1998J928J2499
$$ 301118 374524 374805 332891 272385 197536 131062 102338 118253 150726 162724 164652 177151
6738A77151K4357N4924R9512J16754P9293K7009m230l7408n9740l2654J5697M2039
$$ 177151 201508 256432 355944 472698 551991 579000 574770 537362 477622 444968 460665 502704
6726E02704K5697l3213r2248q7011l3269n441k7734m8336j8288M4551Q1731P2817
$$ 502704 528401 495188 402940 315929 282660 277219 249485 201149 182861 227412 309143 381960
6714C81960O4460P9256P7591O8000P4798Q5296P0054L7914K2388K4317N8553J28120
$$ 381960 446420 525676 603267 671267 746065 831361 901415 939329 961717 986034 1044587 1172707
6702A172707J65331J50605J28654J17912J08437J07472J23369J05225L4004l6080
$$ 1172707 1338038 1488643 1617297 1735209 1843646 1951118 2074487 2179712 2213716 2177636
6692B177636o1041l3981O6780J91996K62497K92700L15275K98363K46908K03934
$$ 2177636 2116595 2082614 2149394 2341390 2603887 2896587 3211862 3510225 3757133 3961067
6682C961067J85789J95884K12822K59981L40708M08532M83792N86250O85968P28475
$$ 3961067 4146856 4342740 4555562 4815543 5156251 5564783 6048575 6634825 7320793 8049268
6672H049268O66142M89289K28437o1652l04271m64939n50527n44013m54180l49888
$$ 8049268 8715410 9204699 9433136 9371484 9067213 8602274 8051747 7507734 7053554 6703666
6662F703666l00926l39157m08199m49562m62334m52465m28689l72959k88005k42677
$$ 6703666 6402740 6063583 5655384 5205822 4743488 4291023 3862334 3489375 3201370 2958693
6652B958693k43933k67344k95186k94314k77033k49898j91230j15938p0518o1178
$$ 2958693 2714760 2447416 2152230 1857916 1580883 1330985 1139755 1023817 953299 892121
6642H92121m4697J356N4783P2518M9392J5234N437J4064r569l7408l1151j2686
$$ 892121 847424 848780 903563 976081 1025473 1040707 1046144 1060208 1050639 1013231 982080 969394
6630I69394M129K0420K4784R680r761k6844m3683o5167q8065r3169j05181j07158
$$ 969394 973523 993943 1018727 1028407 1018646 991802 948119 882952 794887 701718 596537 489379
6618D89379q8618p3546m8830j8214N235J7280L2026N3828P0458O4797K9802J2869
$$ 489379 400761 327215 278385 260171 265406 282686 314712 368540 438998 503795 533597 546466
6606E46466R740P390N0539Q4222M7210k2780n0906j4171J8881Q636m057p624k6486
$$ 546466 556206 563596 614135 698357 745567 722787 671881 657710 676591 685227 681170 673546 647060
6593F47060m3912m8223k4964K7154L8516j4560p5051r7753n1036J8636J3972l1244
$$ 647060 603148 554925 529961 557115 595631 581071 506020 408267 357231 375867 389839 358595
6581C58595m0095k5226j2146j042J8629O5973J17760J17841M9717m3507j02100
$$ 358595 318500 293274 281128 280086 298715 364688 482448 600289 650006 606499 504399
6570E04399j14141q2104j5968K7309K0952k9296p3320n5456r244K5291L6342J9131
$$ 504399 390258 308154 292186 319495 340447 311151 237831 182375 173131 198422 234764 253895
6558B53895m563k1795m5984n9887n2421l4412Q262N6920N8303J9380l513P323
$$ 253895 249332 227537 181553 121666 69245 34833 43095 100015 158318 177698 174185 181508
6546A81508K1842M900k6172m0757l5821j5142K2370M6789M3502M1493N5177Q3986
$$ 181508 203350 208250 182078 141321 105500 90358 112728 159517 203019 244512 299689 383675
6534C83675P7744K0935l8424q1889r9843p6676l7626J2337N8187O7062M9444L9962
$$ 383675 461419 482354 443930 362041 262198 185522 147896 160233 218420 285482 334926 374888
6522C74888M9687N5876M9117M0154K1297m19j3016j3051j0721j6198l0919m2929
$$ 374888 424575 480451 529568 569722 591019 590600 577584 564533 553812 537614 506695 463766
6510D63766m5730k8969j0037j7919m4672m5735o805K8686O4050Q8414O6687L4175
$$ 463766 418036 389067 379030 361111 316439 270704 263899 292585 356635 445049 511736 545911
6498E45911L5969O6589O4481K0383K3141J19276K61111L81013M20986L91604L60765
$$ 545911 581880 648469 712950 733333 756474 875750 1136861 1517874 1938860 2330464 2691229
6487B691229L29801K54056R7636j23593l28982m43937m39791l66229k77659j99717
$$ 2691229 3021030 3275086 3372722 3249129 2920147 2476210 2036419 1670190 1392531 1192814
6477A192814j53977j49996j36904p6138j8100Q448J2149K0003M0142L5272k777
$$ 1192814 1038837 888841 751937 675799 657699 666147 678296 698299 738441 773713 770936
6466G70936l6376m0820l7379l5389k2936j5392k482J8473L4706L6015L7908L4918
$$ 770936 734560 693740 656361 620972 598036 582644 580162 598635 633341 669356 707264 742182
6454G42182K5079L7259L9497K7543L6703N0984L4454j9441r1734j30358j09574
$$ 742182 767261 804520 844017 871560 908263 959247 993701 974260 882526 752168 642594
6443F42594m5718K3793O4467O8670O6333L0530n6935j12581r7511n4978r78N2777
$$ 642594 596876 620669 685136 753806 820139 850669 793734 681153 583642 528664 527686 580463
6431E80463Q1225P1376K1077l3487n1403m7905m1578j7479L3452P8339P1141K0868
$$ 580463 661688 733064 754141 720654 669251 621346 579768 562289 595741 674080 745221 766089
6419G66089k0269j8575J4619M7585M6193Q770n4392j03996j10402q3266k8068
$$ 766089 745820 727245 741864 789449 835642 844412 790020 686024 575622 492356 464288
6408D64288M4572P0895L3451j1620k7120R400N4441N0596K6230O68m1251o0178
$$ 464288 508860 579755 613206 601586 574466 583866 638307 688903 715133 715801 674550 614372
6396F14372j5114L5043N3895O4382M4719q582n2214p6488r5209r6856o9504l4420
$$ 614372 599258 634301 688196 752578 797297 788715 736501 660013 564804 467948 398444 364024
6384C64024L761P4577J45247J38060O6206O069k318L1228N2622K9697p616j5698
$$ 364024 367785 442362 587609 725669 791875 797944 795626 826854 879476 909173 901557 885859
6372H85859m23N040j8233n8582q0735n3074j9636j5699J4591O4220Q1449M9274
$$ 885859 885436 890476 872243 813661 732926 679852 660216 644517 659108 723328 804777 854051
6360H54051M636j3016j3316k6515m4950m1034r58N1202Q8414P7181L4922j0670
$$ 854051 858687 845671 832355 805840 760890 719856 718898 770100 858514 935695 970617 959947
6348I59947k3552K2753Q4783R7426J01405J35712J33996N7822j2776K24P3253
$$ 959947 936395 959148 1043931 1141357 1242762 1378474 1512470 1570292 1557516 1557740 1630993
6337A630993J56253K02802K10324K53204L50206L90432K96782J03287j46508l37762
$$ 1630993 1787246 1990048 2200372 2453576 2803782 3194214 3490996 3594283 3447775 3110013
6327C110013l54060k45203j28553m5987K6835Q2864R6689P0611K0074j7482n142
$$ 3110013 2755953 2510750 2382197 2336210 2363045 2445909 2542598 2613209 2633283 2615801 2610659
6316B610659L5283N9053M4505M990l8670n8012m3007j1581k685j8213k4460P003
$$ 2610659 2645942 2704995 2749500 2754490 2715820 2657808 2614801 2603220 2600535 2582322 2557862 2564865
6304B564865N5635P7128P0776O8970R2495J34400J90672K40098K77885K99206
$$ 2564865 2620500 2697628 2768404 2837374 2929869 3064269 3254941 3495039 3772924 4072130
6294D072130K98732K85846K51996K00587J57904J25218P8938J3415l1900m9832
$$ 4072130 4370862 4656708 4908704 5109291 5267195 5392413 5471351 5484766 5452866 5403034
6284E403034q3972j29041j30682r9549p5420m3828M892P7882J39754J58321J59533
$$ 5403034 5319062 5190021 5059339 4959790 4884370 4840542 4845434 4923316 5063070 5221391 5380924
6273E380924J30461J8435j47809k76428l35706l34974k65337j69434r0480m9167
$$ 5380924 5511385 5529820 5382011 5105583 4769877 4434903 4169566 4000132 3909652 3860485
6263C860485o6683j06149j05557p7853o4340n9945m6635m1604n4675o9830o5809
$$ 3860485 3793802 3687653 3582096 3504243 3439903 3379958 3333323 3291719 3237044 3167214 3101405
6252C101405k7774J2186o395q0754j53917j64186j08427o2248p4370j28099k03055
$$ 3101405 3073631 3085817 3079422 2998668 2844751 2680565 2572138 2509890 2435520 2307421 2104366
6241B104366k46504k35922j85394j04330k9372Q615K759p424J1338K8950P621
$$ 2104366 1857862 1621940 1436546 1332216 1302844 1311459 1314218 1306794 1318132 1347082 1354703
6230A354703l3046n1967m1913k5045j7572o897O707J1240J1196J4108L2743L7153
$$ 1354703 1321657 1269690 1227777 1202732 1185160 1178263 1184970 1196210 1207406 1221514 1254257 1291410
6218A291410q361r2463j63882j73380j30347o5166j9101j2469j2291J3652O0848
$$ 1291410 1283049 1190586 1026704 853324 722977 657811 638710 626241 613950 627602 688450
6207F88450Q5810L9779l5797o0527m0881j4776O142J7816j0577o7834q7190o6577
$$ 688450 774260 814039 778242 717715 676834 662058 668200 686016 675439 607605 520415 453838
6195D53838j9252L604j7047j8093K3930M6564M0101K5933R710P016J4103K7959
$$ 453838 434586 438190 421143 403050 426980 473544 513645 539578 549288 556304 570407 598366
6183E98366M1979O5387P4192O0420L0442O43m2635q3725r4455p5070l9776m063
$$ 598366 640345 705732 779924 840344 870786 871429 828794 745069 650614 575544 535768 531705
6171E31705J9861M5937Q5858Q2047M1135J6254p992n1804r8964j04194p0731j6040
$$ 531705 551566 597503 683361 765408 806543 822797 814805 763001 664037 559843 489112 473072
6159D73072L5272M4560J2157k3168m8581n3781k8533o897k384J9997N8407O2257
$$ 473072 508344 552904 565061 541893 493312 439531 410998 404101 401717 421714 480121 542378
6147E42378L2264J2232J7308J1722k703j8188n9154r9617j02148p9075o3424m7087
$$ 542378 574642 586874 604182 615904 613201 595013 535859 436242 334094 255019 191595 144508
6135A44508l594L1577r384q1407j44066j90229j74326j09846n1983M229Q3586
$$ 144508 140914 172491 163107 81700 -62366 -252595 -426921 -536767 -588750 -584521 -500935
6124e00935J29507J22954J05440J09878J16615R7044N4692J7753m782M412L1346
$$ -500935 -371428 -248474 -143034 -33156 83459 180503 235195 252948 248166 252578 283924
6113B83924L8412L7952K0874j5553l8388k6317J1972M1086K4948o296k0591l3372
$$ 283924 322336 360288 381162 365609 327221 300904 312876 353962 378910 372614 352023 318651
6101C18651k6502r322k905j6910n6467p8758k2038O3467R7853P0715K5075M260
$$ 318651 292149 282827 279922 263012 206545 127787 105749 169216 267069 337784 362859 367119
6089C67119P476L9395O4295L6982o600k470K3730J4857R465O3944J36214J50549
$$ 367119 374595 413990 478285 515267 508667 506197 529927 544784 554249 618193 754407 904956
6077I04956J00856L0698m3737p8529o5744p7706j09167j18253o7497K6501Q8310
$$ 904956 1005812 1036510 992773 914244 848500 770794 661627 543374 475877 502378 590688
6066E90688J15616J57823J88143J75373J48141R9560M9819O4390R7343P7039K8036
$$ 590688 706304 864127 1052270 1227643 1375784 1475344 1525163 1589553 1686896 1763935 1791971
6055A791971Q964J6988R132j5795m2488p8399j07210q4753m8198j5910L6642Q1781
$$ 1791971 1800935 1817923 1827055 1811260 1768772 1690373 1583163 1498410 1450212 1434302 1470944 1552725
6043A552725R2681N9468R237q518J8598O6010J02725R4708P9078Q2062O7209K4829
$$ 1552725 1645406 1704874 1714111 1705593 1724191 1790201 1892926 1987634 2066712 2148774 2215983 2240812
6031B240812j7196l7999n8962q5477j04138j15842j30985j45777j34962q5122
$$ 2240812 2223616 2185617 2126655 2041178 1937040 1821198 1690213 1544436 1409474 1324352
6021A324352r039N1671M8142j6956r1488j05938p1480n6560q6229j14325j03389
$$ 1324352 1315313 1366984 1415126 1398170 1306682 1200744 1129264 1072704 986475 872150 768761
6010G68761o4248k8146l2220p6536j07282p1388R373O9789R6913R8109M6136k7677
$$ 768761 704513 676367 644147 567611 460329 388941 398314 468103 565016 663125 709261 681584
5998F81584n8559m2631j5737J4312M6921O0513N9907M6167Q225l9019p9810j01574
$$ 681584 623025 580394 564657 578969 625890 686403 746310 792477 800702 761683 681873 580299
5986E80299j04812r7103p0132j4330M1916O1384M0116P218j4244k6845m5566p3353
$$ 580299 475487 378384 308252 293922 335838 397222 437338 444556 430312 403467 357901 284548
5974B84548o1811p05M4664K1258j3111j1335k3576m4955l8667l1663m7744m9482
$$ 284548 222737 222032 266696 287954 274843 263508 239932 194977 156310 124647 76903 27421
5962B7421l8058n7691j01672j05857n4277L065N1167Q3277Q2980O3902K8994k0923
$$ 27421 -10637 -68328 -170000 -275857 -330134 -327069 -275902 -192625 -109645 -45743 -16749 -37672
5950c7672n0133l8265q1M1270M8540L3046L9892O6813O1731J1308l0120n5863
$$ -37672 -87805 -126070 -126151 -84881 -36341 -3295 36597 103410 165141 176449 146329 90466
5938I0466o4021l8894R993N1445L6632r628j8379L308K3398L9736L6588K1160
$$ 90466 26445 -12449 -2456 48989 85621 75993 57614 60922 84320 124056 160644 181804
5926A81804n413m4104o8067n8024k7330n7n1l1611o2249p3980n9988r657L3034
$$ 181804 176391 132287 64220 6196 -21134 -21191 -21242 -52853 -115102 -189082 -249070 -258727 -225693
5913b25693R813k4473j6719l15n864j6813k5086k4065j0210P512p404m5341n0346
$$ -225693 -215880 -240353 -257072 -257387 -263251 -280064 -305150 -329215 -339425 -331913 -339317 -384658 -435004
5900d35004q390L8520N2701M6583N0878P7826J02842R3192N5155M0939N8499P2541
$$ -435004 -443394 -404874 -352173 -305590 -254712 -176886 -74044 19148 74303 115242 173741 246282
5888B46282O4109L8104M467m555o474m1572r2690r9963m1822R837K7538J9375
$$ 246282 310391 348495 352962 348407 341933 300361 207671 107708 65886 75723 103261 122636
5876A22636q554j0385L5270O1554L6046J991j8307l6522n3234o3591n6138j3877
$$ 122636 114082 103697 138967 200521 236567 238558 220251 183729 130495 66904 10766 -3111
5864c111K5191L6605J2552n1253r7802j03406q9785o7914k9023L1474O7807O5588
$$ -3111 22080 58685 71237 19984 -77818 -181224 -271009 -338923 -367946 -336472 -268665 -203077
5852b03077O0341M7107K7217K3283J6663l382k6207n6363p9294p8733m7771M608
$$ -203077 -142736 -95629 -68412 -45129 -28466 -31848 -58055 -114418 -193712 -272445 -320216 -315608
5840c15608K0953J417j1123k652P045J6261L8140M6229O984m8220p3898n5518
$$ -315608 -294655 -293238 -304361 -307013 -299968 -283707 -245567 -199338 -192354 -240574 -314472 -369990
5828c69990Q436P3131P9992L3855n782l5704q7130j14631m4597N1761O7727L0702
$$ -369990 -361554 -288423 -208431 -174576 -180358 -216062 -303192 -417823 -462420 -410659 -342932 -312230
5816c12230K3872M6178P7778Q2567L3385k8329n0383k3076j753k013j7772m7732
$$ -312230 -288358 -242180 -164402 -81835 -48450 -76779 -127162 -150238 -151991 -154004 -171776 -219508
5804b19508o1231o0162k0320M2763L8138q300k4592j0753N554j3946k4813L0112
$$ -219508 -280739 -340901 -361221 -318458 -280320 -288620 -313212 -323965 -318411 -332357 -357170 -327058
5792c27058Q5222Q0705L1239l2499o8542p6515p4247l8906J1036K1436J8008L9595
$$ -327058 -241836 -161131 -129892 -162391 -230933 -307448 -381695 -420601 -409565 -388129 -370121 -330526
5780c30526P1859P6467O0834N3134N6895O2902L1952l4846o1172j9116K6449M2401
$$ -330526 -258667 -182200 -121366 -68232 -11337 51565 83517 48671 -12501 -31617 -5168 37233
5768C7233L1783K4023K9848L2649J2237j6260l8809o8948q5018o3526m7932n1848
$$ 37233 69016 93039 122887 155536 167773 151513 112704 43756 -41262 -104788 -152720 -204568
5756b04568m1605N097P2180J18911J12497O8761K7610r159k9244j1716J2504k1386
$$ -204568 -246173 -241076 -168896 -49985 62512 131273 158883 149724 120480 108764 121268 99882
5744I9882r7799j24964p3441k5686q462Q651J6582M4067R1252P7744J4274j8112
$$ 99882 2083 -122881 -196322 -222008 -230470 -221819 -205237 -161170 -69918 7826 22100 3988
5732C988k7908k4457J0968N1220N9162J9871k0300k1878j3106P677K9836K1605
$$ 3988 -23920 -48377 -37409 13811 72973 92844 72544 50666 37560 45237 75073 96678
5720I6678P672K446k3153o2460q4868o2716j1384J3981j4148m1970k6454P347
$$ 96678 104350 106796 83643 21183 -63685 -126401 -137785 -123804 -137952 -179922 -206376 -199029
5708a99029L3609M1600N4034Q2222R3297O9733K3492k1502m3546n9778p5427p4692
$$ -199029 -165420 -123820 -69786 12436 105733 175466 198958 177456 133910 74132 -1295 -75987
5696g5987o6810n7250m4670k5813r571j1711q712J0145L0953K5010L2420O0956
$$ -75987 -142797 -200047 -244717 -270530 -280101 -291812 -300524 -290379 -259426 -234416 -201996 -141040
5684a41040P2392O0332J5541l0327l8700k3453j9589k4751l547K6785M5047O7608
$$ -141040 -68648 -8316 7225 -23102 -61802 -85255 -104844 -129595 -133142 -106357 -61310 6298
5672F298O8051K3740m6905r1832p9187l1839L153L1181O1169N4244K1712k993
$$ 6298 74349 98089 51184 -40648 -119835 -151674 -148521 -117340 -56171 -1927 19785 16792
5660A6792k3357l5031l4457P051N8560R0322Q9393N6681M1143O9340R7081O2950
$$ 16792 -6565 -41596 -76053 -69002 -10442 79880 169273 225954 267097 336437 433518 496468
5648D96468l913j9463J3203K5889j5018q7517j24636j00108o5430o3603p5952
$$ 496468 492555 473092 486295 512184 497166 409649 285013 184905 119475 55872 -20080
5637b0080q9430q3457j7323O5378Q9326Q6120R8252R9794O8712K4023p439k5263
$$ -20080 -109510 -192967 -210290 -144912 -55586 30534 128786 228580 297292 321315 313876 288613
5625B88613n6784q5904j06205q5624l4372N085J5464k9973q5890r0644q1060o2229
$$ 288613 231829 145925 39720 -45904 -80276 -75191 -59727 -89700 -175590 -266234 -347294 -409523
5613d09523j4560K7982M3344N1363O8656O9895N3904N0406N4296N5242O1306O4116
$$ -409523 -424083 -396101 -352757 -301394 -232738 -162843 -108939 -58533 -4237 51005 112311 176427
5601A76427M0671j694m1186m2096j0585K131p713j3674Q366M4558N2231M6703
$$ 176427 217098 215404 174218 132122 121537 123668 115955 102281 110647 155205 207436 254139
5589B54139K6202j1590j8665k4949l2232j4031J1819M4299O3429L6803m3877j29021
$$ 254139 280341 268751 250086 225137 192905 178874 190693 234992 298421 335224 291347 162326
5577A62326j46735j05109m5279K938L1141O3043J37530K05172K09521J70861J41195
$$ 162326 15591 -89518 -134797 -131859 -100718 -37675 99855 305027 514548 685409 826604
5566H26604J21915J18468J44302J78923K20666K65184K70079J91824Q451k08544
$$ 826604 948519 1066987 1211289 1390212 1610878 1876062 2146141 2337965 2346416 2137872
5556B137872l15379l15822k78424k39373k23122k06169j60981j06571p9189p9206
$$ 2137872 1822493 1506671 1228247 988874 765752 559583 398602 292031 212842 133636
5546A33636o2462J512P2159R4337Q1986O3126N1038N7603M1152l9251j32591j59961
$$ 133636 71174 72686 144845 239182 321168 384294 435332 492935 534087 494836 362245 202284
5534B02284r4321L171N9670O8298N9512K5226j9245l0726k3533j7435R747O4926
$$ 202284 107963 111134 170804 239102 298614 323840 304595 273869 250336 232901 242648 307574
5522C07574P9416L1926k1481n4493o0701k0631O4380J43883J74237J60358J69255
$$ 307574 386990 418916 397435 342942 282241 261610 325990 469873 644110 804468 973723
5511I73723K31201L11353L80629M00716L27965J51746o6884k38390l11820l08118
$$ 973723 1204924 1516277 1896906 2297622 2625587 2777333 2710449 2472059 2160239 1852121
5501A852121k81324k51453k25162j76324j31896j36917j47721j19079n5588J1578
$$ 1852121 1570797 1319344 1094182 917858 785962 649045 501324 382245 326657 338235
5491C38235M9795M2350K8543L7058M6352K8399J261j4840j875M4566J17837J84611
$$ 338235 388030 430380 458923 495981 542333 570732 571993 557153 555278 599844 717681 902292
5479I02292J98453J55178O6927l1437j12550j70959j75489j23071n4485j576O964
$$ 902292 1100745 1255923 1322850 1291413 1178863 1007904 832415 709344 654859 653283 660247
5468F60247k1004n4411q2966r5627q6902q9858j05561o9219J687N6661O0269J3161
$$ 660247 639243 584832 501866 406239 319337 229479 123918 54699 56386 113047 173316 186477
5456A86477l7309o8992o2567l4675k6003k9363j5624K0076N1898N2321L8269L0282
$$ 186477 149168 80176 17609 -17066 -43069 -72432 -88056 -67980 -16082 36239 74508 104790
5444A04790K1827N025r441k072M0334R9194J34407J13710M8944l0629r4742j21977
$$ 104790 126617 131642 122201 120129 160463 259657 394064 507774 556718 526089 431347 309370
5432C09370j10889o5226k2623J4073J9527l2868p0671o2657m2256k5734j3089
$$ 309370 198481 133255 110632 124705 144232 111364 40693 -21964 -64220 -89954 -103043
5421a03043k3967l1621k4102k9134k1796O696N9893R1372P4670M5809K167k8065
$$ -103043 -127010 -158631 -182733 -211867 -233663 -226967 -167074 -75702 -1032 44777 46944 18879
5409A8879q015L1749N9610N8833L4798K381j2656M768K455m0441m8697n043J6850
$$ 18879 10864 42613 102223 161056 195854 198235 185579 190347 192802 152361 103664 98621 115471
5396A15471J650O58J5562K039j7433J748N1421Q9799R7406O9309L1679m71m0163
$$ 115471 117121 117779 133341 135380 117947 119695 171116 260915 358321 427630 459309 458838 418675
5383D18675j07985j67882j62985r6251P791O8004N2608P573l4922m0840k0287
$$ 418675 310690 142808 -20177 -116428 -108637 -40633 11975 19548 -15374 -56214 -76501
5372g6501j3546p729J2976L3394M3285K6561k0369p0224r3787r0937o4189m0036
$$ -76501 -90047 -97776 -84800 -51406 -8121 18440 -1929 -72153 -165940 -256877 -321066 -361102
5360c61102k6297K915J9646J4486Q641J1337K6540O2430J03955J03417N1560j7101
$$ -361102 -387399 -384484 -364838 -350352 -341711 -330374 -303834 -241404 -137449 -34032 17528 427
5348D27n1840m0893L682N0436N2258J8782k3625n4530n6429n6724o8404n3208
$$ 427 -51413 -92306 -88624 -38188 14070 32852 9227 -45303 -101732 -158456 -226860 -280068
5336b80068q766K0062K2536R681k7884o8520o9542k3896L9597P4029O9126L2194
$$ -280068 -288834 -268772 -246236 -236555 -264439 -332959 -402501 -426397 -386800 -312771 -243645 -211451
5324b11451p445j7L4400M9089L6976L0056L5504L4654O541j7579R083M3954M2889
$$ -211451 -218896 -218913 -184513 -135424 -98448 -68392 -32888 1766 8307 -9272 -189 43765 86654
5311H6654K6552J4565O909n440l4315l3253K6569O4058L7369Q806J6449K9298
$$ 86654 113206 127771 134680 129240 94925 61672 88241 152299 189668 198474 214923 244221
5299B44221J8803J230j5975l0915m0632o3177q9754j19298j27987n7649M0116
$$ 244221 263024 264254 248279 217364 176732 113555 23801 -95497 -223484 -281133 -241017
5288b41017R2435J09048J08934J31938J59686J55228J22891O8033L0024M9635
$$ -241017 -148582 -39534 69400 201338 361024 516252 639143 707176 737200 786835
5278G86835J09261J55043J63267J89283K69731L19017K34076K8058j88851l34020
$$ 786835 896096 1051139 1214406 1403689 1673420 1992437 2226513 2254571 2065720 1731700
5268A731700l84256l51586k75807j79357j01422n5305m0428k5329P387J1755j2401
$$ 1731700 1347444 995858 720051 540694 439272 383967 343539 318210 325597 337352 324951
5257C24951k5453o284J1949n400m0686p0050p9740m6595o792J842j5948j9047
$$ 324951 299498 293214 305163 299763 259077 189027 109287 62692 55900 57742 41794 22747
5245B2747M081M0073P1849O3669L3598J8666K7714N0575P7261R7899Q7080P3547
$$ 22747 26828 66901 138750 202419 236017 254683 282397 332972 410233 508132 595212 668759
5233F68759P6947P4349J3858q2441j33811j39155j13732p5744l6332K1094L9950
$$ 668759 745706 820055 833913 751472 617661 478506 364774 289030 252698 273792 313742
5222C13742k895j4507L4740Q1896Q3313L5917m8424j11174j25247j29689j23762
$$ 313742 310847 296340 331080 412976 496289 532206 483782 372608 247361 117672 -6090
5211f090q7384m3455K68M9903P4515O2062N2664M7160L3586L1680M4427N1840
$$ -6090 -93474 -136929 -136661 -86758 -12243 49819 102483 149643 183229 214909 259336 311176
5199C11176K5161q703j9593k7010m8379q3942j05394o8624M981M5543L4481Q948
$$ 311176 336337 327634 308041 281031 232652 148710 43316 -25308 -20327 25216 59697 68645
5187F8645k5841o3905o1851j9041J8360K7608J2731j2143k1689q141O860K393
$$ 68645 42804 -21101 -82952 -101993 -83633 -56025 -43294 -55437 -77126 -85267 -78407 -76014
5175g6014J7899O8206J13544J09764M7481l0795o4554m9882j0433L3809O2943
$$ -76014 -58115 10091 123635 233399 280880 250085 185531 135649 125216 159025 221968
5164B21968O2513J2018o0066j04483r5306l2054L4035N7901M8987M1232J9310
$$ 221968 284481 296499 236433 131950 36644 4590 38625 96526 145513 186745 206055
5153B06055k9878n9236o2195o9875o1348o373N5163Q5273N2920k9366n3878J5
$$ 206055 176177 116941 54746 -15129 -76477 -82850 -27687 57586 110506 81140 27262 27277
5141B7277N1149O1474N4492M1402k486n8866p5255l8371J7195N2566M6466K7510
$$ 27277 78426 139900 194392 235794 233308 174442 99187 60816 78011 130577 177043 204553
5129B04553J0192r199j7899k7699l9009n9940p7082o6426l9006k1553k1092m0054
$$ 204553 214745 205546 187647 159948 120939 60999 -16083 -82509 -121515 -143068 -164160 -204214
5117b04214p4091p9890m1629J3881N4287N9919M5610L7936J7250r311j3070R112
$$ -204214 -278305 -358195 -399824 -385943 -331656 -271737 -226127 -188191 -170941 -180252 -193322 -184210
5105a84210M8773P1524L9449l5466p7520o4994k0499L9977O9431N0576O443m0393
$$ -184210 -135437 -63913 -24464 -59930 -137450 -202444 -222943 -182966 -113535 -62959 -56516 -96909
5093i6909n7626l6096r25q20m3071o6764n3305k0225M650Q433L6045R8111J43384
$$ -96909 -154535 -190631 -191556 -192376 -235447 -302211 -355516 -375741 -371091 -362658 -326613 -228502 -85118
5080h5118J53696J30988Q4214L9893J4277k608r236o010j3485m0380o1414m4391
$$ -85118 68578 199566 283780 323673 337950 335342 326106 320096 306611 266231 204817 160426
5068A60426j5517j8579k8142r343J2291k886m0809m8250j2350J1527J9319M0952
$$ 160426 144909 126330 98188 88845 101136 98250 57441 9191 -3159 8368 27687 68639
5056F8639N4768L1753J678k4324n1830o1798l3113J603n726q337L2211O9924O3892
$$ 68639 123407 155160 156838 132514 80684 18886 -14227 -12624 -18350 -26687 5524 75448 139340
5043A39340L5205L5700O9949P8273L4454l0707o5064m5791j3129J636K0523N1383
$$ 139340 174545 210245 280194 358467 392921 362214 297150 251359 238230 239866 260389 311772
5031C11772N5719L4184L1547K9140L373j8859m2024n9195n7497n6077p3784r2885
$$ 311772 367491 401675 433222 462362 465735 446876 404852 345657 288160 232083 158299 65414
5019F5414p1176l6926m2079m5142L479N7031N4058J9430J0698K9717L9974L2113
$$ 65414 -5762 -42688 -84767 -129909 -126430 -69399 -15341 4089 14787 44504 84478 116591
5007A16591K4879J5505Q863N551k0537p0192j06886j10168r7262q3941l9617M2311
$$ 116591 141470 156975 165838 171389 150852 80660 -26226 -136394 -233656 -317597 -357214 -314903
4995c14903R0793P7797M5752J5493k6826o2932n9812m2278k3567q743J0001K4242
$$ -314903 -224110 -146313 -100561 -85068 -111894 -174826 -234638 -276916 -300483 -309226 -299225 -274983
4983b74983J4279J3798M8035R6182J28551J28053Q6740K9252j7482m4638l3475
$$ -274983 -260704 -246906 -198871 -102689 25862 153915 240655 269907 252425 207787 174312
4972A74312j0857j5617l0824l8275n8763n3963O41N9184P2410K4848m9690j10066
$$ 174312 163455 147838 117014 78739 19976 -33987 -33346 25838 98248 123096 73406 -36660
4960c6660j24524j02912o5537l9316m4091n1736j2617L5992K3800k7200k3223
$$ -36660 -161184 -264096 -329633 -368949 -413040 -464776 -477393 -441401 -417601 -444801 -468024
4949d68024N5769J23241J32754Q5062J8732m366K0243L7058K7132N480K586O408
$$ -468024 -412255 -289014 -156260 -71198 -52466 -56832 -36589 469 27601 33081 35667 42075
4937D2075n229k0879l4010k9723K1705O5209O6293O1300M4653J1118n2298j13872
$$ 42075 36846 15967 -18043 -47766 -26061 39148 105441 166741 211394 222512 170214 56342
4925E6342j16766q7525q7027r9120o6716l983M1122O7888Q6039Q3626N3195K9557
$$ 56342 -60424 -147949 -234976 -334096 -400812 -404795 -363673 -295785 -209746 -126120 -72925 -43368
4913d3368J0236m1479q2763p0122k5516J5895K2247J2922K4471L5241L1946L2792
$$ -43368 -33132 -74611 -157374 -227496 -253012 -237117 -214870 -201948 -177477 -142236 -110290 -77498
4901g7498L9930L9055K2412Q932L878J2696M2153M4581J9072K273j602J455j2735
$$ -77498 -37568 1487 23899 32831 36709 49405 91558 136139 155211 157484 155882 157337 144602
4888A44602l4127m9744n3030k5852P535J335k2373l0629l8085l5159o560K7588
$$ 144602 110475 60731 7701 -18151 -10616 -9281 -31654 -62283 -100368 -135527 -142087 -114499
4876a14499L6159L1034J2359j4416l4554n9304p9216q0396p9560n7534r42M4048
$$ -114499 -78340 -47306 -34947 -49363 -83917 -143221 -222437 -302833 -382393 -439927 -440869 -396821
4864c96821N1983J9739l1832m7024k5989k1045k5860r920K7170Q0303R7198N0141
$$ -396821 -344838 -325099 -356931 -403955 -429944 -450989 -476849 -486769 -459599 -379296 -282098 -231957
4852b31957J661n642L1382R4079J13016P1851J6919k1781l7108l5165k2890o749
$$ -231957 -230296 -235938 -204556 -110477 2539 74390 91309 69528 32420 -2745 -25635 -32384
4840c2384J3397K9880K5909J56j9369j6280j7165m9062q3851p9354l2742K0156
$$ -32384 -18987 10893 36802 36958 17589 1309 -15856 -64918 -148769 -228123 -260865 -240709
4828b40709K9071L753j4437l0358o8701q6374k4738P3464J28113J12097O1635
$$ -240709 -211638 -207885 -222322 -252680 -321381 -407755 -432493 -359029 -230916 -118819 -57184
4817e7184J4941j7733k3283R659N7730P5385O0125M2572L7929M1148M4479N9633
$$ -57184 -42243 -59976 -83259 -73600 -15870 59515 119640 162212 200141 241289 285768 345401
4805C45401P2772O2129N1654L2430j0108l9011o01O0295O1683K69o8956j01014
$$ 345401 418173 480302 531956 564386 554278 515267 514666 574961 636644 636913 567957 466943
4793D66943j09928j20009j24375r4499m3703l34J7682K8238L0307O942n567J3041
$$ 466943 357015 237006 112631 18132 -25571 -25905 -8223 20015 50322 57264 51697 64738
4781F4738J7459m499r648p831m3609q1555o7742l8827m9799q5237r4067n0989
$$ 64738 82197 77698 68050 60219 16610 -64945 -132687 -171514 -221313 -306550 -400617 -451606
4769d51606J0699K8477J3641Q077Q527J0109J5657K0599K9999M0157J7048k2915
$$ -451606 -440907 -412430 -398789 -390712 -382185 -372076 -356419 -335820 -305821 -265664 -248616 -271531
4757b71531n8997q3710o0883l131K5922M417k8881m9176n5818m3770K872M5048
$$ -271531 -330528 -414238 -475121 -478252 -452330 -447913 -476794 -525970 -581788 -625558 -622686 -577638
4745e77638M3635M4131L6748m55k7611k1575J2997M6085O4682Q0492R4668R1990
$$ -577638 -534003 -489872 -453124 -453579 -481190 -502765 -489768 -443683 -379001 -298509 -203841 -111851
4733a11851P3633N3004K7148k489l9062m7380k5628l39R892k558n284J1184J6753
$$ -111851 -38218 14786 41934 39445 383 -46997 -72625 -72964 -63072 -65630 -70914 -59730 -42977
4720d2977l36k3194m1165m9909m6854m1068m3865l4995m51K6932K1750n803l4572
$$ -42977 -43313 -66507 -107672 -157581 -204435 -245503 -289368 -324363 -324814 -297882 -276132 -281935 -316507
4707c16507o0828o8233m3738r959J1076J5057K8029M0633L9551N0251N5718M9681
$$ -316507 -377335 -445568 -489306 -499265 -488189 -473132 -445103 -404470 -364919 -314668 -258950 -209269
4695b09269N4033N0628J9797K164K3965M9483O7326P0849M7042K4614J7262j7638
$$ -209269 -155236 -104608 -84811 -82647 -58682 -9199 58127 128976 176018 200632 217894 200256
4683B00256o8421o2766r846K8915K6858P231j5577m1143o7321p8528o4829m7371
$$ 200256 131835 69069 59223 88138 114996 122227 106650 65507 -1814 -80342 -145171 -192542
4671a92542k9690N17J7869K1163N6056J20934J64275J33578M8671k3396m4799
$$ -192542 -222232 -221715 -203846 -182683 -126627 -5693 158582 292160 340831 317435 272636
4660B72636j3195K4803M3396N0374K313r8291j53903j08967k1108J1263k56n306
$$ 272636 259441 284244 327640 378014 380327 282036 128133 19166 -1942 9321 9065 3759
4648C759j0770k3801k0933p655J0733L5678O2094P5052M8366J1911l096K0026
$$ 3759 -7011 -30812 -51745 -59400 -48667 -12989 49105 124157 172523 184434 181338 201364
4636B01364N4354M7868J6824Q052K4366L4558Q021l1922m8450l7761n991N7402
$$ 201364 255718 303586 320410 328462 352828 387386 395407 363485 315035 277274 271283 328685
4624C28685J27683J36310R1003M1189j4001p4183r0509n7127j2963J3437K5636
$$ 328685 456368 592678 683681 724870 710869 636686 546177 489050 476087 489524 515160
4613E15160L4311J6509l7269p7536n9301J1756O5344M7923j37k9531l6466m7699
$$ 515160 549471 565980 528711 451175 391874 403630 468974 516897 516760 487229 450763 403064
4601D03064q5165j35335j42606r6428n4331m7668l4661J6726P4338Q3374L3491
$$ 403064 317899 182564 39958 -56470 -110801 -158469 -193130 -176404 -102066 -18692 14799
4590A4799m4381r6115p6047j1630M9064R6319J01133L1100l2721k7712M640J3526
$$ 14799 -29582 -125697 -201744 -213374 -164310 -67991 33142 64242 31521 3809 8449 21975
4578B1975l441j9441l1229k7321j7173j0130r573q112q654k3772k0108P584L3886
$$ 21975 18534 -907 -32136 -59457 -76630 -86760 -96333 -104445 -113099 -136871 -156979 -149395 -115509
4565a15509N9572Q5330Q5833L5225l5400p7193p0263l6381m036J817n0835j06904
$$ -115509 -55937 29393 115226 150451 115051 37858 -32405 -68786 -72822 -71005 -121840 -228744
4553b28744j00095l3373N0046O8240L4287P754k5806n5890n3873l4667j2529l090
$$ -228744 -328839 -362212 -312166 -243926 -209639 -201885 -227691 -283581 -337454 -372121 -384650 -387740
4541c87740j3810k4657l0333j2418L1714N6198N8318O6189P8921P4469O3274N6478
$$ -387740 -401550 -426207 -456540 -468958 -437244 -381046 -322728 -256539 -177618 -103149 -39875 16603
$$ [...]
##END NTUPLES=NMR SPECTRUM
##END=
