##TITLE=C13_DE-14sh-TFA
 CDCl3, 22300 sc

 5.10.2023
##JCAMPDX= 6.0         $$ Bruker NMR JCAMP-DX V2.0
##DATA TYPE= NMR SPECTRUM
##DATA CLASS= NTUPLES
##ORIGIN= UXNMR, Bruker Analytische Messtechnik GmbH
##OWNER= root
$$ XWIN-NMR		Version 3.5
$$ Fri Oct  6 13:37:31 2023 Russian Standard Time (UT+4h)  she@DPX200
##.OBSERVE FREQUENCY= 50.327896
##.OBSERVE NUCLEUS= ^13C
##.ACQUISITION MODE= SIMULTANEOUS
##.ACQUISITION SCHEME= undefined
##.AVERAGES= 18395
##.DIGITISER RES= 17
##SPECTROMETER/DATA SYSTEM= spect
##.PULSE SEQUENCE= zgpg30
##.SOLVENT NAME= DMSO
##.SHIFT REFERENCE= (INTERNAL, DMSO, 0, 222.624)
##AUDIT TRAIL= $$ (NUMBER, WHEN, WHO, WHERE, WHAT)
$$ ##TITLE= Audit trail, XWIN-NMR		Version 3.5
$$ ##JCAMPDX= 5.01
$$ ##ORIGIN= Bruker BioSpin GmbH
$$ ##OWNER= she
$$ F:/spectra/data/she/nmr/c13/1/pdata/1/auditp.txt
$$ ##AUDIT TRAIL=  $$ (NUMBER, WHEN, WHO, WHERE, WHAT)
(   1,<2023-10-06 10:00:59.31 +0400>,<she>,<DPX200>,
      <created by zg, POWCHK disabled, PULCHK disabled
       terminated by command 'halt'
       configuration hash MD5:
       00 E9 B6 7A A2 85 ED C7 34 08 36 98 17 FE 4E 26
       data hash MD5: 32K
       62 66 C9 87 AF AF 0E A1 FB 5E 1E 62 B5 72 29 CF>)
(   2,<2023-10-06 13:35:24.35 +0400>,<she>,<DPX200>,
      <Start of raw data processing
       efp BC_mod = 2 LB = 2 FT_mod = 6 PKNL = 1 PHC0 = -371.4357 PHC1 = 26.93753 SI = 32K 
       data hash MD5: 32K
       BC EF 77 21 0A A7 3F B6 DE 95 D5 26 B1 39 FB 20>)
(   3,<2023-10-06 13:35:27.56 +0400>,<she>,<DPX200>,
      <abs ABSG = 5 
       data hash MD5: 32K
       E3 D8 87 E9 CD E2 8D 60 61 97 8C 26 77 4E 09 31>)
(   4,<2023-10-06 13:36:16.98 +0400>,<she>,<DPX200>,
      <pk PHC0 = 3.086085 PHC1 = 5 
       data hash MD5: 32K
       40 AB 03 AF 41 AC 63 B9 42 0B 44 62 34 E1 EC 01>)
(   5,<2023-10-06 13:36:21.73 +0400>,<she>,<DPX200>,
      <abs ABSG = 5 
       data hash MD5: 32K
       91 08 CB 09 0F AE 24 EE 0E 22 97 5A D9 E9 51 32>)
(   6,<2023-10-06 13:36:50.14 +0400>,<she>,<DPX200>,
      <pk PHC0 = 0.8543079 PHC1 = -1.8 
       data hash MD5: 32K
       1C 56 F9 5F 4C 36 7F 17 82 A2 F2 A5 68 50 2F 75>)
(   7,<2023-10-06 13:36:54.65 +0400>,<she>,<DPX200>,
      <abs ABSG = 5 
       data hash MD5: 32K
       53 7D 84 1B 5D FF 7D D8 49 27 44 32 77 49 7A E0>)
$$ ##END=
$$ 
$$ hash MD5
$$ 58 4A E6 07 94 AF 38 6F 00 CB D6 16 C7 3B E5 4C
##$RELAX= 
##$RELAX= 
##$RELAX= 
##$RELAX= 
##$RELAX= 
##$RELAX= 
##$RELAX= 
##$RELAX= 
$$ Bruker specific parameters
$$ --------------------------
##$DU= <F:/spectra>
##$EXPNO= 1
##$NAME= <c13>
##$PROCNO= 1
##$TYPE= <nmr>
##$USER= <she>
##$AMP= (0..31)
100 100 100 100 100 100 100 100 100 100 100 100 100 100 100 100 100 100 
100 100 100 100 100 100 100 100 100 100 100 100 100 100 
##$AQSEQ= 0
##$AQ_mod= 1
##$AUNM= <au_zg>
##$AUTOPOS= <>
##$BF1= 50.322709
##$BF2= 200.13
##$BF3= 50.322709
##$BF4= 500.13
##$BF5= 500.13
##$BF6= 500.13
##$BF7= 500.13
##$BF8= 500.13
##$BYTORDA= 1
##$CFDGTYP= 0
##$CFRGTYP= 5
##$CHEMSTR= <none>
##$CNST= (0..31)
$$ [...]
##$SUBNAM4= <"">
##$SUBNAM5= <"">
##$SUBNAM6= <"">
##$SUBNAM7= <"">
##$SUBNAM8= <"">
##$SUBNAM9= <"">
##$SW= 239.972175391363
##$SWIBOX= (0..15)
0 1 3 0 0 0 0 0 0 0 0 0 0 0 0 0 
##$SW_h= 12077.2946859903
##$TD= 32768
##$TD0= 1
##$TE= 0
##$TE2= 300
##$TE3= 300
##$TEG= 300
##$TL= (0..7)
120 120 120 120 120 120 120 120 
##$TP= (0..7)
150 150 150 150 150 150 150 150 
##$TP07= 0
##$TPNAME0= <>
##$TPNAME1= <>
##$TPNAME2= <>
##$TPNAME3= <>
##$TPNAME4= <>
##$TPNAME5= <>
##$TPNAME6= <>
##$TPNAME7= <>
##$TPOAL= (0..7)
0.5 0.5 0.5 0.5 0.5 0.5 0.5 0.5 
##$TPOFFS= (0..7)
0 0 0 0 0 0 0 0 
##$TUNHIN= 0
##$TUNHOUT= 0
##$TUNXOUT= 0
##$USERA1= <user>
##$USERA2= <user>
##$USERA3= <user>
##$USERA4= <user>
##$USERA5= <user>
##$V9= 5
##$VALIST= <valist>
##$VCLIST= <CCCCCCCCCCCCCCC>
##$VD= 0
##$VDLIST= <DDDDDDDDDDDDDDD>
##$VPLIST= <PPPPPPPPPPPPPPP>
##$VTLIST= <TTTTTTTTTTTTTTT>
##$WBST= 1024
##$WBSW= 4
##$XGAIN= (0..3)
0 0 0 0 
##$XL= 0
##$YL= 0
##$YMAX_a= 102077640
##$YMIN_a= -33421238
##$ZGOPTNS= <>
##$ZL1= 120
##$ZL2= 120
##$ZL3= 120
##$ZL4= 120
##$ABSF1= 222.624
##$ABSF2= -17.3728
##$ABSG= 5
##$ABSL= 3
##$ALPHA= 0
##$AQORDER= 0
##$ASSFAC= 0
##$ASSFACI= 0
##$ASSFACX= 0
##$ASSWID= 0
##$AUNMP= <proc_1d>
##$AZFE= 0.1
##$AZFW= 0.5
##$BCFW= 0
##$BC_mod= 2
##$BYTORDP= 0
##$COROFFS= 0
##$CY= -3
##$DATMOD= 1
##$DC= 0
##$DFILT= <>
##$DTYPP= 0
##$F1P= 0
##$F2P= 0
##$FCOR= 0.5
##$FTSIZE= 32768
##$FT_mod= 6
##$GAMMA= 0
##$GB= 0
##$INTBC= 1
##$INTSCL= 4.134877e-10
##$ISEN= 128
##$LB= 2
##$LEV0= 0
##$LPBIN= 0
##$MAXI= 10000
##$MC2= 0
##$MEAN= 0
##$ME_mod= 0
##$MI= 0.1934396
##$NCOEF= 0
##$NC_proc= 1
##$NLEV= 6
##$NOISF1= 120.0001
##$NOISF2= 80.00006
##$NSP= 0
##$NTH_PI= 0
##$NZP= 0
##$OFFSET= 222.624
##$PC= 1.4
##$PHC0= -367.4953
##$PHC1= 30.13753
##$PH_mod= 1
##$PKNL= yes
##$PPARMOD= 0
##$PSCAL= 0
##$PSIGN= 0
##$REVERSE= no
##$SF= 50.3227315983092
##$SI= 32768
##$SIGF1= 140
##$SIGF2= 120
##$SINO= 11.81781
##$SIOLD= 32768
##$SREGLST= <13C.CDCl3>
##$SSB= 0
##$STSI= 32768
##$STSR= 0
##$SW_p= 12077.2946859903
##$SYMM= 0
##$S_DEV= 0
##$TDeff= 32768
##$TDoff= 0
##$TI= <>
##$TILT= no
##$TM1= 0
##$TM2= 0
##$TOPLEV= 0
##$USERP1= <user>
##$USERP2= <user>
##$USERP3= <user>
##$USERP4= <user>
##$USERP5= <user>
##$WDW= 1
##$XDIM= 32768
##$YMAX_p= 392094879
##$YMIN_p= -24182009
$$ End of Bruker specific parameters
$$ ---------------------------------
##NTUPLES= NMR SPECTRUM
##VAR_NAME=  FREQUENCY,     SPECTRUM/REAL,   SPECTRUM/IMAG
##SYMBOL=    X,             R,               I
##VAR_TYPE=  INDEPENDENT,   DEPENDENT,       DEPENDENT
##VAR_FORM=  AFFN,          ASDF,            ASDF
##VAR_DIM=   32768,         32768,           32768
##UNITS=     HZ,            ARBITRARY UNITS, ARBITRARY UNITS
##FACTOR=    0.368581032318806, 1,           1
##FIRST=     11203.0474430531, 0,            0
##LAST=      -874.247242937185, 0,           0
##MIN=       -874.247242937185, -24182009,   0
##MAX=       11203.0474430531, 392094879,    0
$$ Real data points
##PAGE= N=1
##DATA TABLE= (X++(R..R)), XYDATA
$$ [...]
15686D91206k14358j12678o1536n0180j00318k87429m85860m79437k80240r82
$$ 491206 276848 164170 102634 52454 -47864 -335293 -821153 -1300590 -1580830 -1581812
15676a581812K68122M16183L72705K77123K04941N4718r1725j25644K3546J64216
$$ -1581812 -1313690 -897507 -524802 -247679 -42738 11980 -79745 -205389 -181843 -17627
15666a7627Q8376l6013j01695j33204k13796k73529k17088j08462r3255k13493
$$ -17627 70749 34736 -66959 -200163 -413959 -687488 -904576 -1013038 -1106293 -1319786
15656a319786k95280k16812q8829j2234J0093M9699J67654J87556O5465q4933
$$ -1319786 -1615066 -1831878 -1920707 -1932941 -1922848 -1873149 -1705495 -1517939 -1452474 -1537407
15646a537407k17366l17731l19544j56052J30625M04227O26835O82226M65570
$$ -1537407 -1754773 -2072504 -2392048 -2548100 -2417475 -2013248 -1386413 -704187 -238617
15637b38617J69357p0640k08248j73436o1290p520j1816n7803m9956J19L8011
$$ -238617 -69260 -139900 -348148 -521584 -582874 -590394 -602210 -660013 -709969 -709850 -671839
15626f71839J19930J57318J02030j2348q1745j5591R1746Q6202K665m7189m7650
$$ -671839 -551909 -394591 -292561 -304909 -386654 -402245 -310499 -224297 -221632 -268821 -316471
15615c16471M087R2162R9222n1889k26935k35374j59669p5717L5672J24663J08379
$$ -316471 -312384 -220222 -121000 -172889 -399824 -635198 -794867 -870584 -834912 -710249 -601870
15604f01870Q3241Q3412L8709j6577J9686Q5509J12575R2659M506o1500j15702
$$ -601870 -518629 -435217 -396508 -413085 -393399 -307890 -195315 -102656 -98150 -159650 -275352
15593b75352j63098j97805j58822M8836L00672M95645N51886L23054m1097j28255
$$ -275352 -438450 -636255 -795077 -746241 -445569 50076 601962 925016 883919 755664
15583G55664K0447P7810J410j13724j45677j54306j75237j29410j18155j06924
$$ 755664 776111 853921 855331 741607 595930 441624 266387 136977 18822 -88102
15573h8102p96J14632L2675k69855m91915m36223k08910L6704K20156K87063K38129
$$ -88102 -88898 25734 58409 -211446 -703361 -1139584 -1348494 -1311790 -1091634 -804571 -566442
15562e66442K20020K97739L09146K86263K58970J38547K0105l5978j04875j99526
$$ -566442 -346422 -48683 260463 546726 805696 944243 964348 928370 823495 623969
15552F23969k08875j63754p1719J10867K11343R3574l8684l3863j02779k85686
$$ 623969 415094 251340 179621 290488 501831 595405 556721 522858 420079 134393
15542A34393k96803j05693L7085M9160o593n8677j59539k68265k38787j14007
$$ 134393 -162410 -268103 -231018 -181858 -188451 -247128 -406667 -674932 -913719 -1027726
15532a027726j6826J936L4663J00967J55236J93642K49203L32433L90504L51098
$$ -1027726 -1044552 -1042616 -1007953 -906986 -751750 -558108 -308905 23528 414032 765130
15522G65130J88086r0078l05491l26887l54992m29342l90730j83455O5614J51906
$$ 765130 953216 863138 557647 230760 -124232 -553574 -944304 -1127759 -1062145 -910239
15512i10239N9262K3386J89094L25459K92859J37821l8127m7079Q3218J80475
$$ -910239 -850977 -827591 -638497 -313038 -20179 117642 79515 32436 115654 296129
15502B96129J68788J45503K30845K96668K57924K87367L87157M38436L73140K70085
$$ 296129 464917 610420 841265 1137933 1395857 1683224 2070381 2508817 2881957 3152042
15492C152042J84970J15361J06425P9136P1194M3318K5271L3984r2857k93479
$$ 3152042 3337012 3452373 3558798 3637934 3709128 3752446 3777717 3811701 3718844 3425365
15482C425365m44695m21178k07087p0584j50252k86226m01827m43049l48731k32460
$$ 3425365 2980670 2559492 2352405 2281821 2131569 1845343 1443516 1000467 651736 419276
15472D19276k23104j57474M8798J47900N0150J3050J61822L32534L09856J13502
$$ 419276 196172 38698 87496 235396 285546 298596 460418 792952 1102808 1216310
15462A216310m8889j31949k52974l60441l35682k33738j36982m9736j2553k4724
$$ 1216310 1167421 1035472 782498 422057 86375 -147363 -284345 -334081 -346634 -371358
15452c71358m8810o5814q3833j33114j58948o9752L8917K8859k0913n3928j17225
$$ -371358 -420168 -485982 -569815 -702929 -861877 -931629 -892712 -863853 -884766 -938694 -1055919
15441a055919p1945O3508Q4263L5123J29644K89498L23400K15746O7330l8313
$$ -1055919 -1127864 -1064356 -980093 -944970 -815326 -525828 -202428 13318 80648 42335
15431D2335j36249j75920j52274j88127k12829j38462m6432R0796K24157K24867
$$ 42335 -93914 -269834 -422108 -610235 -823064 -961526 -1007958 -917162 -693005 -468138
15421d68138J57206R6096J5635k6116m950n155k913Q2257J23158R4619Q3135O0450
$$ -468138 -310932 -214836 -199201 -225317 -230267 -235422 -238335 -156078 -32920 61699 144834 205284
15409B05284M0547R301L0869P4499K3141j2740Q6774K37599L52214L87212K95799
$$ 205284 245831 255132 286001 360500 383641 370901 457675 695274 1047488 1434700 1730499
15398A730499J01768j09577k33473k26253r7179K2940o1132j95910j51711j2627
$$ 1730499 1832267 1722690 1489217 1262964 1165785 1188725 1127593 931683 779972 767345
15388G67345K8072J34P4388J48155P9416j19777l07085l64345l28608l34657l87361
$$ 767345 795417 795551 869939 1018094 1097510 977733 670648 306303 -22305 -356962 -744323
15377g44323l12276j44685L010J08629J43247J66303K50502K88323K81724K14460
$$ -744323 -1056599 -1201284 -1198274 -1089645 -946398 -780095 -529593 -241270 40454 254914
15367B54914L9043p1773j08240q4058J3146N2552J9435O0279J57688J85923M7841
$$ 254914 293957 222184 113944 29886 43032 95584 115019 175298 332986 518909 566750
15356E66750k20749m79660o06569n37221l06670Q278K52956L65634L73164K88894
$$ 566750 346001 -133659 -740228 -1277449 -1584119 -1575841 -1322885 -957251 -584087 -295193
15346b95193J57162L8754j6088m4457m1998k9076K6352J74295K35423K20760K10829
$$ -295193 -138031 -99277 -115365 -159822 -201820 -230896 -204544 -30249 205174 425934 636763
15335F36763R3313j45974k39240j55197o6118J22586L32809L15008J59247j5182
$$ 636763 730076 584102 344862 189665 123547 246133 578942 893950 1053197 1038015
15325A038015q4060p1937j33184k19241k58859j97233Q223J30845M6640j7682
$$ 1038015 953955 882018 748834 529593 270734 73501 81724 212569 259209 241527
15315B41527j0073L2602N5427J01085J28030j6758k13855k48584j94828j91104
$$ 241527 231454 264056 319483 420568 548598 531840 317985 69401 -125427 -316531
15305c16531k37126k00021k7412P9462p450m0635J6880o1352j63766j15339P1363
$$ -316531 -553657 -753678 -781090 -701628 -709078 -749713 -732833 -794185 -957951 -1073290 -1001927
15294a001927K44743K38308J57368N1856j71636m11551m87731l14492n5537O4185
$$ -1001927 -757184 -518876 -361508 -309652 -481288 -892839 -1380570 -1695062 -1750599 -1686414
15284a686414J08245J23656J25379J82691J52533l9751k01338j30280R4992K16431
$$ -1686414 -1578169 -1454513 -1329134 -1146443 -993910 -1033661 -1234999 -1365279 -1270287 -1053856
15274a053856J73783J43142J86988J14914r2414j75533p4485J9556N9522J37246
$$ -1053856 -880073 -736931 -549943 -435029 -527443 -702976 -777461 -757905 -698383 -561137
15264e61137K88240M78282M99822K49406p2914k26222k80725l36064l44721k88197
$$ -561137 -272897 205385 705207 954613 881699 655477 374752 38688 -306033 -594230
15254e94230j45980j8357L0324R6555K01280J47198p561m7728j7651L9145J48379
$$ -594230 -740210 -758567 -728243 -631688 -430408 -283210 -290771 -338499 -356150 -317005 -168626
15243a68626J63891M7025q4102j06168k6566O2163P008k13595l76229k84905m632
$$ -168626 -4735 42290 -41812 -147980 -174546 -112383 -105375 -318970 -695199 -980104 -984736
15232i84736K20347K87729K37277J97538K37189K32338O6970j46810j87941j7042
$$ -984736 -764389 -476660 -239383 -41845 195344 427682 494652 347842 159901 142859
15222A42859J52205J11754l7853j26283j26268k7621N5173P988j45037k02007
$$ 142859 295064 406818 368965 242682 116414 88793 143966 151954 6917 -195090
15212a95090j11948p9676o7310j2514J6378N8018J01536r247k48514l62915k24927
$$ -195090 -307038 -386714 -454024 -466538 -450160 -392142 -290606 -299853 -548367 -911282 -1136209
15201a136209k6711j794q1278j58771j35992K1578K17480L34594K89064P9403
$$ -1136209 -1162920 -1164714 -1245992 -1404763 -1540755 -1519177 -1301697 -967103 -678039 -598636
15191e98636j24666j78322j00632O0755J45602R1047n7164j64230m4418J89892
$$ -598636 -723302 -901624 -1002256 -941501 -795899 -704852 -762016 -926246 -970664 -780772
15181g80772L40936L68677K78668J53437j7253j74813j75947n7810J8224o9429
$$ -780772 -439836 -71159 207509 360946 343693 168880 -7067 -64877 -46653 -116082
15171a16082j43582p0554J7318O4181J37994K04146J54756r742j84309k79493
$$ -116082 -259664 -330218 -312900 -248719 -110725 93421 248177 238435 54126 -225367
15161b25367k16249o2778J6559R9414J92453J49859P3178J31372J49479K0677
$$ -225367 -441616 -504394 -487835 -388421 -195968 -46109 27069 158441 307920 328597
15151C28597n2861o580j341j26020l25469m34068l39181j09368J58709K88909
$$ 328597 275736 269156 267815 141795 -183674 -617742 -956923 -1066291 -907582 -618673
15141f18673J48116p8769j70047j75085k29649k67603j69937K4902K27718K82099
$$ -618673 -470557 -549326 -719373 -894458 -1124107 -1391710 -1561647 -1536745 -1309027 -1026928
15131a026928K08724J74730L01550M39126L53729J66333M3245r0556k73044l65437
$$ -1026928 -818204 -643474 -341924 97202 450931 617264 660509 569953 296909 -68528
15121f8528k91924k17955j47936k2316J15941K83749L77369K81231Q0478j2526
$$ -68528 -360452 -578407 -726343 -748659 -632718 -348969 28400 309631 390109 377583
15111C77583L0375J3146j02256j35148j25753j87014k07702j89146j21944N7830
$$ 377583 407958 421104 318848 183700 57947 -129067 -336769 -525915 -647859 -590029
15101e90029K69779M20214M21501K80266J78999J42160R7210M4748k2968j27780
$$ -590029 -320250 99964 521465 801731 980730 1122890 1220100 1264848 1241880 1114100
15091A114100k35132l25483l39418k77734k01853j23597n052K16314K74636J37281
$$ 1114100 878968 553485 214067 -63667 -265520 -389117 -394169 -177855 96781 234062
15081B34062P5328J03926K14975L63685M42837L09543o4452l99629m22268j84029
$$ 234062 309390 413316 628291 991976 1434813 1744356 1679904 1280275 858007 673978
15071F73978Q21p9143k56868l27246l14575k78804k59038k39003j95384j60188
$$ 673978 674799 595656 338788 11542 -303033 -581837 -840875 -1079878 -1275262 -1435450
15061a435450j41700j38751j47082k17415k37030m2798J20577J41635J95242K59152
$$ -1435450 -1577150 -1715901 -1862983 -2080398 -2317428 -2360226 -2239649 -2098014 -1902772 -1643620
15051a643620K26646J70593K11685K53089J53439L1673l3690p0629j07432j66987
$$ -1643620 -1416974 -1246381 -1034696 -781607 -628168 -596495 -630185 -700814 -808246 -975233
15041i75233j38869k5565M1852P9838R7928O4770o4970k86008l46431k27369n2770
$$ -975233 -1114102 -1139667 -1097815 -1017977 -920049 -855279 -920249 -1206257 -1552688 -1780057 -1832827
15030a832827J23507K55385L88301M07453K71398N8093j57611k83249j91141J45214
$$ -1832827 -1709320 -1453935 -1065634 -658181 -386783 -328690 -486301 -769550 -960691 -815477
15020h15477M34671M49329K27512n8194k21654k34363j23651P8075J93875J70973
$$ -815477 -380806 68523 296035 237841 16187 -218176 -341827 -263752 -69877 101096
15010A01096J52345J00614R852Q5032K99556L33159J25816j12223k62260k41244
$$ 101096 253441 354055 363907 448939 748495 1081654 1207470 1095247 832987 591743
15000E91743j07360j05408l40220m78445k62257L8072J25124L5557k4876Q9355
$$ 591743 484383 378975 38755 -439690 -701947 -663875 -538751 -503194 -528070 -438715
14990d38715K42390K80068K66840K34861J44616l803n1773P6637K14390J34581
$$ -438715 -196325 83743 350583 585444 730060 726257 674484 751121 965511 1100092
14980A100092p5054k59940l70048l52585k62187j39621k1316M4711J57549J88816
$$ 1100092 1025038 765098 395050 42465 -219722 -359343 -380659 -335948 -178399 10417
14970A0417k3931l13547l77860k21384N5113L00933K84764J30367L1731J5738
$$ 10417 -13514 -327061 -704921 -926305 -871192 -570259 -285495 -155128 -123397 -107659
14960a07659N1285J47419K37200J98190Q4597K3890q213o4043j50455j95557o3955
$$ -107659 -56374 91045 328245 526435 611032 634922 626709 562666 412211 216654 152699
14949A52699J28673J82724J54978J22560O4734q962q4357j08784k3220R1742J31662
$$ 152699 281372 464096 619074 741634 806368 797406 713049 604265 581045 672787 804449
14938H04449m7952k88573l34958j99416j3728J36288K04293J67124M6689o8976
$$ 804449 756497 467924 132966 -66450 -80178 56110 260403 427527 474216 405240
14928D05240j39196j97755j73802m3991P8640J15481M0563k1106J8176Q5003O9104
$$ 405240 266044 68289 -105513 -149504 -70864 44617 85180 64074 82250 167253 236357
14917B36357o0003k01789k97243l49173k35812p575J62629J94070J44185R4684
$$ 236357 176354 -25435 -322678 -671851 -907663 -915238 -752609 -558539 -414354 -319670
14907c19670l1781j71355k69554l18103k53680k16769k27564l5905K86059L77734
$$ -319670 -351451 -522806 -792360 -1110463 -1364143 -1580912 -1808476 -1844381 -1558322 -1180588
14897a180588J85355r7090k96784k87702o0961J59847K54403K56386K07602J88868
$$ -1180588 -995233 -1092323 -1389107 -1676809 -1737770 -1577923 -1323520 -1067134 -859532 -670664
14887f70664J89797J79140J15384O9265N4674O3694J29024J77155J29135r101
$$ -670664 -480867 -301727 -186343 -117078 -62404 1290 130314 307469 436604 427503
14877D27503j44665j26625K8391J44456n771k49286k40413m0257M8139m1237o2415
$$ 427503 282838 156213 184604 329060 323289 74003 -166410 -206667 -158528 -199765 -262180
14866b62180l5351q5189j65468k03605j51379n8962j131N4578J0700q5792p7152
$$ -262180 -297531 -382720 -548188 -751793 -903172 -962134 -963265 -908687 -897987 -983779 -1060931
14855a060931p6507l3843J31719L04024L69557L12763K25584K23295K51343K01803
$$ -1060931 -1137438 -1171281 -1039562 -735538 -365981 -53218 172366 395661 647004 848807
14845H48807O7162p3776k29436l24704k51676p8588K0128j06004k70684k61090
$$ 848807 915969 842193 612757 288053 36377 -42211 -22083 -128087 -398771 -659861
14835f59861j77112j63601k38893k23629k0154K37433L69752L30514J73078n816
$$ -659861 -836973 -1000574 -1239467 -1463096 -1483250 -1245817 -876065 -545551 -372473 -378289
14825c78289j25956k06134k91653l14017k33049p8033J47457L35696M19653L69521
$$ -378289 -504245 -710379 -1002032 -1316049 -1549098 -1627131 -1479674 -1143978 -724325 -354804
14815c54804L46368M36984M19622K94269J53580k247q6690l6083J4315q4095k33960
$$ -354804 -8436 428548 848170 1142439 1296019 1293772 1207082 1170999 1185314 1101219 867259
14804H67259k93673k69043k45795j73641j17785k96407n14378m28087k15043j59263
$$ 867259 573586 304543 58748 -114893 -232678 -529085 -1043463 -1471550 -1686593 -1845856
14794a845856j51104n0387P342P353l8317m3503J66148L82196L97678K75344J00158
$$ -1845856 -1996960 -2047347 -2040005 -2032652 -2070969 -2114472 -1948324 -1566128 -1168450 -893106 -792948
14783g92948n6963o7086O4090J20353M4283m3016q8770J178J84713K70051K15767
$$ -792948 -849911 -916997 -852907 -732554 -688271 -731287 -820057 -818879 -634166 -364115 -148348
14772a48348J18802O8192M5651k6140j03007l3863J46213K48857K15391P3797
$$ -148348 -29546 38646 84297 58157 -44850 -78713 67500 316357 531748 605545
14762F05545j47946l25735m00297m62884m71504k39700L8918M6652n5696r0653
$$ 605545 457599 131864 -268433 -731317 -1202821 -1442521 -1403603 -1356951 -1412647 -1503300
14752a503300j20947j18740J0886J64745K91351L32259K51629K04069J65632M3458
$$ -1503300 -1624247 -1742987 -1732101 -1567356 -1276005 -943746 -692117 -488048 -322416 -278958
14742b78958j04235j95932k55193k41778j67297j88975l15692l75213k77500j50959
$$ -278958 -383193 -579125 -834318 -1076096 -1243393 -1432368 -1748060 -2123273 -2400773 -2551732
14732b551732o7397M0030K03651L87649M95933N49053N45658M77666L70015J83344
$$ -2551732 -2619129 -2579099 -2375448 -1987799 -1491866 -942813 -397155 80511 450526 633870
14722F33870N7842J05589J76274J96610J71817J91241K02567K1734k69264n18211
$$ 633870 691712 797301 973575 1170185 1342002 1533243 1735810 1757544 1488280 970069
14712I70069n94297m35722j09442J44319J59041N9125k5711m4555o0215j36747
$$ 970069 375772 -59950 -169392 -25073 133968 193093 167382 122827 62612 -74135
14702g4135k03106j96436j42459j20255j20044r9011p6575m2230M0837J35371
$$ -74135 -277241 -473677 -616136 -736391 -856435 -955446 -1032021 -1074251 -1033414 -898043
14692h98043J76150J30881J00162J73913K32111J14447p2908j33787j66046k53347
$$ -898043 -721893 -591012 -490850 -316937 -84826 29621 -43287 -177074 -343120 -596467
14682e96467k31695n0294J70917L38947L87454L03036J43716o452j11645j33779
$$ -596467 -828162 -878456 -707539 -368592 18862 321898 465614 459162 347517 213738
14672B13738q2083L1975K09909L71744L64224J39168j09574k74568l61917l09376
$$ 213738 131655 163630 373539 745283 1109507 1248675 1139101 864533 502616 193240
14662A93240j67252j05041j94882l59247m54751l23597r271K15201L11710L37150
$$ 193240 25988 -79053 -273935 -633182 -1087933 -1411530 -1420801 -1205600 -893890 -556740
14652e56740K57170J78014J95741K66784L40174K91406J12001j3434j1357O2908
$$ -556740 -299570 -121556 74185 340969 681143 972549 1084550 1071116 1059759 1122667
14642A122667J05633k3838j97748k46575k73296k20817r4447o1256n4470n2494
$$ 1122667 1228300 1204462 1006714 760139 486843 266026 171579 110323 55853 3359
14632C359j22692j33518r1389q4708q5537k3425L1250J6358J9516j13503l61192
$$ 3359 -119333 -252851 -344240 -428948 -514485 -537910 -506660 -490302 -470786 -584289 -945481
14621i45481m35032k84966j03868o4265l4874J61627M18077N83890N72586L82842
$$ -945481 -1380513 -1665479 -1769347 -1833612 -1868486 -1706859 -1288782 -704892 -132306 250536
14611B50536J81756L8229j27496k19537j28986l1343o9854r8632l8457q3133j73142
$$ 250536 432292 470521 343025 123488 -5498 -36841 -106695 -205327 -243784 -326917 -500059
14600e00059r3503n039k4045j03445k11464k76251k85325k83619k65106k11425
$$ -500059 -593562 -598601 -622646 -726091 -937555 -1213806 -1499131 -1782750 -2047856 -2259281
14590b259281m0045J95976L02581K80057K64318K50651J18190m7861q1652l9269
$$ -2259281 -2299326 -2103350 -1800769 -1520712 -1256394 -1005743 -887553 -935414 -1017066 -1056335
14580a056335K0117O6369n4873k78006l56408k08384L0555K41743L27384K37108
$$ -1056335 -1036218 -969849 -1024722 -1302728 -1659136 -1867520 -1836965 -1595222 -1267838 -1030730
14570a030730P1878p0318j70957k37847k55073j72074j3863J22323J69277J11517
$$ -1030730 -958852 -1029170 -1200127 -1437974 -1693047 -1865121 -1878984 -1756661 -1587384 -1475867
14560a475867n6595j71694j15940j2877J14282K31475J57999q6507k54674j90151
$$ -1475867 -1532462 -1704156 -1820096 -1832973 -1718691 -1487216 -1329217 -1415724 -1670398 -1860549
14550a860549M2214K83531L60125J92958j4040m7276R4436K57057L84344L50240
$$ -1860549 -1818335 -1534804 -1174679 -981721 -995761 -1043037 -948601 -691544 -307200 43040
14540D3040J09620j53123l29972l53824j92533J0352J19203K41955M02725M16030
$$ 43040 152660 -463 -330435 -684259 -876792 -866440 -747237 -505282 -102557 313473
14530C13473J74248j57068k92985k07919r3190q39J75472L69104L33936J43746
$$ 313473 487721 330653 37668 -170251 -263441 -264280 -88808 280296 614232 757978
14520G57978M9374N6299k5253k73043m50664l17250o4858J08000K82091M12813
$$ 757978 807352 863651 838398 565355 114691 -202559 -267417 -159417 122674 535487
14510E35487L86954L10900K67751J85701j05429m20155m15381j26214J98119L33863
$$ 535487 922441 1233341 1501092 1686793 1581364 1161209 745828 619614 817733 1151596
14500A151596L15067K02289j6144j81869k45536l30583k81875q4440O337j36N6023
$$ 1151596 1466663 1668952 1652808 1470939 1225403 894820 612945 528505 534842 534706 590729
14489E90729R2355P6060P8229J45131K43622K55951J82910J59992J41729m854
$$ 590729 683084 759144 837373 982504 1226126 1482077 1664987 1824979 1966708 1961854
14479A961854k03953l07297l44465l54296k55601q2949L9583l0121j25243r3601
$$ 1961854 1757901 1450604 1106139 751843 496242 413293 452876 422755 297512 203911
14469B03911r2546j74314k21539j57841j531J45830J68809J25249P5552n8905
$$ 203911 111365 -62949 -284488 -442329 -443860 -298030 -129221 -3972 71580 12675
14459A2675j24990o4089j8941m1452q2806m8455J2320L5732Q5657O0260j89832
$$ 12675 -112315 -176404 -195345 -236797 -319603 -368058 -355738 -320006 -234349 -174089 -363921
14448c63921m20652m40184l22030j46119l62J20694J82088K39694K92986K01531
$$ -363921 -784573 -1224757 -1546787 -1692906 -1693268 -1572574 -1390486 -1150792 -857806 -656275
14438f56275Q6462P2787N2729L2173J12043K02501J68055L9842p7543p3894O2643
$$ -656275 -569813 -497026 -444297 -412124 -300081 -97580 70475 110317 32774 -41120 21523
14427B1523J70163R9710j32633k23089o9996O6171L6909n3908j17104k30599k93431
$$ 21523 191686 291396 158763 -64326 -134322 -68151 -31242 -85150 -202254 -432853 -726284
14416g26284j93236j14725p1985l0981o3302j44991j59433l1646K37740M68722
$$ -726284 -919520 -1034245 -1106230 -1137211 -1200513 -1345504 -1504937 -1536583 -1298843 -830121
14406h30121M54239L46496K42764L9397j13985j21535p4909m2568L4952J67777
$$ -830121 -375882 -29386 213378 252775 138790 17255 -57654 -100222 -65270 102507
14396A02507J65857K0814j14597r2630K8414J69033L37669M05523K39281k6094
$$ 102507 268364 289178 174581 81951 110365 279398 617067 1022590 1261871 1235777
14386A235777j82050k20892k83531m48309n40645m07243k67966k15354k7728K21655
$$ 1235777 1053727 832835 549304 100995 -439650 -846893 -1114859 -1330213 -1357941 -1136286
14376a136286L39412L24196K23554Q2211m0285r7999m4082M3370J66969L57669
$$ -1136286 -796874 -472678 -249124 -166913 -207198 -305197 -349279 -305909 -138940 218729
14366B18729M37124K70664J1303j30107p4961R2266J59706J20052J32266J85050
$$ 218729 655853 926517 937820 807713 732752 825018 984724 1104776 1237042 1422092
14356A422092P3851j16229k13367k65197k45647j03070L5064N1471j41659m44625
$$ 1422092 1495943 1379714 1166347 901150 655503 552433 587497 638968 497309 52684
14346E2684n76193n08500l40243j64557j9049J15347J50991J58573K30164L24154
$$ 52684 -523509 -1032009 -1372252 -1536809 -1555858 -1440511 -1289520 -1130947 -900783 -576629
14336e76629L60725K50726J37622J40878J95732K96599L24400J66999j2669j65103
$$ -576629 -215904 34822 172444 313322 509054 805653 1130053 1297052 1284383 1119280
14326A119280l03609l70661k94071j41699p40P3384M6389l8609j27278k00118
$$ 1119280 815671 445010 150939 9240 8500 81884 128273 89664 -37614 -237732
14316b37732k62061k57190j28308P3881K36259J55783r9489k37208k78651k62797
$$ -237732 -499793 -756983 -885291 -811410 -575151 -419368 -518857 -756065 -1034716 -1297513
14306a297513r5768J07667J61977J23104J10606Q8501O9304K26961M56852M87471
$$ -1297513 -1393281 -1285614 -1123637 -1000533 -889927 -801426 -732122 -505161 -48309 439162
14296D39162K93427K6051r2013K0372J92482K27531R2478p4891m5135M3438p3914
$$ 439162 732589 758640 666627 686999 879481 1107012 1199490 1124599 1079464 1122902 1048988
14285A048988j85427p0854O3695P7302J09954J53833J22297O5292M4399J4416
$$ 1048988 863561 792707 856402 933704 1043658 1197491 1319788 1385080 1429479 1443895
14275A443895O521n9177k53291m17095n04680m90432l14728M0943L62969L87538
$$ 1443895 1450416 1391239 1137948 720853 216173 -274259 -588987 -548044 -185075 202463
14265B02463J44731m3522n6789M453J18306J92274J67688Q3526o9334j29084m0331
$$ 202463 347194 303672 246883 251336 369642 561916 729604 813130 743796 614712 574381
14254E74381l4376j40602k47719k24508k5451J45503J54870J51198J86311J93932
$$ 574381 540005 399403 151684 -72824 -98275 47228 202098 353296 539607 733539
14244G33539J64207J45626J27262N3930l7645o8679j16622j96691k13017k66595
$$ 733539 897746 1043372 1170634 1224564 1186919 1118240 1001618 804927 591910 325315
14234C25315l40663k52419j38726r2246p3827j09912j96850k44178r6512J50250
$$ 325315 -15348 -267767 -406493 -498739 -572566 -682478 -879328 -1123506 -1220018 -1069768
14224a069768K52733K10406R3011q4492k24537k51310r8500Q6773R9630l1117
$$ -1069768 -817035 -606629 -513618 -598110 -822647 -1073957 -1172457 -1085684 -986054 -1017171
14214a017171k07052k66417j28729N205R6732K53974L13570K13364J7888j27873
$$ -1017171 -1224223 -1490640 -1619369 -1614164 -1517432 -1263458 -949888 -736524 -718636 -846509
14204h46509j19163p159P0050K599j54194j98717n0766J11883J56143J68590K19270
$$ -846509 -965672 -972831 -902781 -900182 -1054376 -1253093 -1303859 -1191976 -1035833 -867243 -647973
14193f47973J73208l4266k31863k62223k73428k96787j91969o5847l2891K6053
$$ -647973 -474765 -509031 -740894 -1003117 -1276545 -1573332 -1765301 -1831148 -1864039 -1837986
14183a837986Q6930K7930j7283J17645L33252M16989K84064J6693k29232k99729
$$ -1837986 -1751056 -1723126 -1740409 -1622764 -1289512 -872523 -588459 -571766 -800998 -1100727
14173a100727j21136N3386J7826o0802l6666p3332j60062j09948j5728j3465P510
$$ -1100727 -1221863 -1168477 -1150651 -1211453 -1248119 -1321451 -1481513 -1591461 -1607189 -1620654 -1613144
14162a613144J52007K97305L52693L91172M14918L30899J20570j46623l06130
$$ -1613144 -1461137 -1163832 -811139 -419967 -5049 325850 446420 299797 -6333
14153f333j83140K01122O25590P32311M02750r888j98610k69968l36366m26519
$$ -6333 -189473 11649 637239 1369550 1772300 1762412 1563802 1293834 957468 530949
14143E30949m82271l74219j06868Q0145J61848J95919J35681N3315L886o958J1702
$$ 530949 48678 -325541 -432409 -352264 -190416 5503 141184 194499 198385 191427 203129
14132B03129L6563P4377J10895O6695K0543K0670j7858r3617j74298k23078l25148
$$ 203129 239692 314069 424964 491659 512202 532872 515014 421397 247099 24021 -301127
14121c01127m02263l00211j41445J3608J59067J75606Q1718J35666L30466M49993
$$ -301127 -703390 -1003601 -1145046 -1131438 -972371 -796765 -715047 -579381 -248915 201078
14111B01078L89701J80506K2923p3578k18449l18832k98824j54059P4522J98300
$$ 201078 590779 771285 794208 720630 502181 183349 -115475 -269534 -195012 3288
14101C288J72836J46859Q0321q1501k65738l70043k88865r4428k8969q9436o706
$$ 3288 176124 322983 403304 321803 56065 -313978 -602843 -697271 -726240 -815676 -822382
14090h22382K60924M49067N09128M71424L06081M6193j37395j35950n4368n4064
$$ -822382 -561458 -112391 396737 868161 1174242 1220435 1083040 947090 892722 838658
14080H38658j06579j01141j61328l88055n17602m32680l09963k61868k15232j29926
$$ 838658 732079 630938 469610 81555 -436047 -868727 -1178690 -1440558 -1655790 -1785716
14070a785716M45K67308N70368O58871M56894O5146k98963m06894k52059n3303
$$ -1785716 -1785271 -1517963 -947595 -288724 168170 233316 -65647 -472541 -724600 -777903
14060g77903J20667J97618J14321J456m2781m9109o3953l8151O431q8090k63076
$$ -777903 -657236 -459618 -345297 -343841 -386622 -435731 -499684 -537835 -531404 -619494 -882570
14049h82570l13606k81372j85297k8668J67372K92280K02248M5156P3088K18585
$$ -882570 -1196176 -1477548 -1662845 -1691513 -1524141 -1231861 -1029613 -984457 -911369 -692784
14039f92784J57205m9238j77179j77764j01253P0975K76062L38579K90722K76585
$$ -692784 -535579 -584817 -761996 -939760 -1041013 -970038 -693976 -355397 -64675 211910
14029B11910L28606K71562K0373k36796l11249k95128k73975j89338p3015K3814
$$ 211910 540516 812078 832451 595655 284406 -10722 -284697 -474035 -547050 -523236
14019e23236J02173K27729M00139L75117J47810p5185k23576k37279j14988j04234
$$ -523236 -421063 -193334 206805 581922 729732 654547 430971 193692 78704 -25530
14009b5530j44556r9938l3062q4233k13501k34946j83609r8330m1369j06196k21080
$$ -25530 -170086 -270024 -303086 -387319 -600820 -835766 -1019375 -1117705 -1159074 -1265270 -1486350
13998a486350k82812k30370j7578J54176J07668o4495k14847k87871k82910j99661
$$ -1486350 -1769162 -1999532 -2017110 -1862934 -1755266 -1819761 -2034608 -2322479 -2605389 -2805050
13988b805050k9028J07858J34243J78377K14153K08899K25261K26685K23464K25196
$$ -2805050 -2834078 -2726220 -2591977 -2413600 -2199447 -1990548 -1765287 -1538602 -1315138 -1089942
13978a089942J75105N8793r06Q2662J91637K58965K76004K21397J37302J38333
$$ -1089942 -914837 -856044 -856950 -774288 -582651 -323686 -47682 173715 311017 449350
13968D49350J75682Q7084p8083j78472k24645k58148k55290j12567J27005J88027
$$ 449350 625032 712116 634033 455561 230916 -27232 -282522 -395089 -268084 -80057
13958h0057J27599Q7894K1799j02805j85192o0032J26010J08553j3395p1974m9472
$$ -80057 47542 135436 157235 54430 -130762 -190794 -64784 43769 30374 -41600 -91072
13947i1072n4050q5306l0655m7393j55577j32147M2107J88360J63118L4637o7569
$$ -91072 -145122 -230428 -261083 -308476 -464053 -596200 -554093 -365733 -202615 -167978 -235547
13936b35547r0863j5995L6519l7770j37824j29745J4740J63956K21778K02394
$$ -235547 -326410 -342405 -305886 -343656 -481480 -611225 -596485 -432529 -210751 -8357
13926h357J80027K68840L87658L52996K04008N1951r1329k10361k67412k64255
$$ -8357 171670 440510 828168 1181164 1385172 1437123 1345794 1135433 868021 603766
13916F03766r1492J61344K35841J22933l6230k14668l41268l32802k27015n0761
$$ 603766 512274 673618 909459 1032392 996162 781494 440226 107424 -119591 -170352
13906a70352R9096J29171J46251K52480L81320L88467K31589m112k00868k99293
$$ -170352 -71256 57915 204166 456646 837966 1226433 1458022 1453910 1253042 953749
13896I53749l07671k41971j64755j25045j51347r9990M6715J42813J86146J61404
$$ 953749 646078 404107 239352 114307 -37040 -137030 -90315 52498 238644 400048
13886D00048R2324j6799j32978j99525j75478p5901m2135n4395r6967k25837k67412
$$ 400048 492372 475573 342595 143070 -32408 -108309 -150444 -204839 -301806 -527643 -795055
13875g95055j65171m7438J00870K55622L55519L74049L04407J24461j11734k36701
$$ -795055 -960226 -1007664 -906794 -651172 -295653 78396 382803 507264 395530 158829
13865A58829k25804o7078K24359L43806J88925m2879l27084n67824n81105m08511
$$ 158829 -66975 -134053 90306 434112 623037 580158 253074 -314750 -895855 -1304366
13855a304366j79670k487R0567K04100L00072K74949J51533k3125m6654N3343
$$ -1304366 -1484036 -1486523 -1395956 -1191856 -891784 -616835 -465302 -488427 -535081 -481738
13845d81738O2283K2445O4784J56629J77289M8964j23025j39696o9392n479M546
$$ -481738 -419455 -397010 -332226 -175597 1692 50656 -72369 -212065 -281457 -286936 -282390
13834b82390j8143l6572o7738R19J52495K12883J596k96667k31806J07465K50536
$$ -282390 -300533 -337105 -404843 -403924 -251429 -38546 -36950 -333617 -565423 -457958 -207422
13823b07422J58088K4362J4826P9949J88653K19796M2682j41138j63404q4863
$$ -207422 -49334 -24972 -10146 69803 258456 478252 520934 379796 216392 131529
13813A31529j4500J37146K65519J48656M1435Q500j32857k90808l34957k36345
$$ 131529 117029 254175 519694 668350 709785 718285 585428 294620 -40337 -276682
13803b76682o7462P075p4385j32323j61505k02389j84359j00047K9275K02175
$$ -276682 -344144 -337069 -411454 -543777 -705282 -907671 -1092030 -1192077 -1162802 -960627
13793i60627L49546L65538L47251L70228L36737J52059r5690k36738k47134j80756
$$ -960627 -611081 -245543 101708 471936 808673 960732 865042 628304 381170 200414
13783B00414j30331p7891n1678j15269j36464o9558J8309J33031K42408K99567
$$ 200414 70083 -7808 -59486 -174755 -311219 -380777 -362468 -229437 12971 312538
13773C12538L07044K27229L7267j83441l07121l04792k81577l04973l34573l08529
$$ 312538 619582 846811 884078 700637 393516 88724 -192853 -497826 -832399 -1140928
13763a140928j93558o0728L8451J04900J73413J14484j12147l05775l76904k98610
$$ -1140928 -1334486 -1395214 -1356763 -1251863 -1078450 -963966 -1076113 -1381888 -1758792 -2057402
13753b057402j37989r730k8297j46671k47894k44337j21659L5825J59177K30846
$$ -2057402 -2195391 -2205121 -2233418 -2380089 -2627983 -2872320 -2993979 -2958154 -2798977 -2568131
13743b568131J88819J08321J58329K74347K87988L09505M32336M15000J65260
$$ -2568131 -2379312 -2270991 -2112662 -1838315 -1550327 -1240822 -808486 -393486 -228226
13734b28226r5401l01334m89194o23860n45773k77293m1178J61928K77550K64178
$$ -228226 -323627 -624961 -1114155 -1738015 -2283788 -2561081 -2602259 -2440331 -2162781 -1898603
13724a898603J41003J8860L4301K2396o7839m8830J09730K05711J82135K36075
$$ -1898603 -1757600 -1738740 -1704439 -1682043 -1749882 -1798712 -1688982 -1483271 -1301136 -1065061
13714a065061L91747M15999K23987r605j0808J15953O9456q0545m4225J68877
$$ -1065061 -673314 -257315 -33328 -42933 -53741 62212 131668 51123 6898 175775
13704A75775K50610J05531j79396m15690m42791j67788K61716N15312M80033K82678
$$ 175775 426385 531916 352520 -63170 -505961 -673749 -412033 103279 583312 865990
13694H65990L8585j17262j30243j16552k10266l28833l73087l26321k05731j26562
$$ 865990 904575 787313 657070 540518 330252 1419 -371668 -697989 -903720 -1030282
13684a030282j50895k20723k35423j24586n3182l5280J36950L35377L34040J18650
$$ -1030282 -1181177 -1401900 -1637323 -1761909 -1815091 -1850371 -1713421 -1378044 -1044004 -925354
13674i25354n7668n3379k40j2152p2760j22128r9133k2988M6260P5394J0514r0568
$$ -925354 -983022 -1036401 -1036641 -1048793 -1121553 -1243681 -1342814 -1365802 -1319542 -1244148 -1233634 -1324202
13662a324202j59903j69321j75926k03134j14780O0332J62335J97036J86579J33076
$$ -1324202 -1484105 -1653426 -1829352 -2032486 -2147266 -2086934 -1924599 -1727563 -1540984 -1407908
13652a407908J81843K18437J12697m5662j65464m1892K59139L68436K28853K4872
$$ -1407908 -1226065 -1007628 -894931 -940593 -1106057 -1147949 -888810 -520374 -291521 -266649
13642b66649j24993j76622j46129n653R2592M8902n4049j62781k04100j27492
$$ -266649 -391642 -568264 -714393 -720046 -627454 -578552 -632601 -795382 -999482 -1126974
13632a126974L4193J45299J47526J51767J87307J45221J7539j34015j45550o357
$$ -1126974 -1092781 -947482 -799956 -648189 -460882 -315661 -298122 -432137 -577687 -584044
13622e84044J7068p1252l9980O6526J26841K49482L87388L39594K13991J60141
$$ -584044 -566976 -638228 -678208 -611682 -484841 -235359 152029 491623 705614 865755
13612H65755P0330q1003k22040k71052j67080J4869J63903K36056J92226m0127
$$ 865755 936085 855082 633042 361990 194910 209779 373682 609738 801964 761837
13602G61837k07737k09854k23525l24169l52121j80048K4694J14188J68091J81365
$$ 761837 554100 344246 120721 -203448 -555569 -735617 -710923 -596735 -428644 -247279
13592b47279J36169J54092K17475J19366r4718j29566l5935M9492J27494J03864
$$ -247279 -111110 42982 260457 379823 285105 155539 119604 169096 296590 400454
13582D00454j30375l58056l86718l42687l25665k74256p3697K72487N28947O32829
$$ 400454 270079 -87977 -474695 -817382 -1143047 -1417303 -1491000 -1218513 -689566 -56737
13572e6737O35031N48191M27457L26453J48763r8779j90178r8887K038k561o8271
$$ -56737 578294 1126485 1553942 1880395 2029158 1930379 1740201 1641314 1643352 1640791 1572520
13561A572520j05844j52677j38734p3989o4099q8227j32494k17997k61264j92163
$$ 1572520 1466676 1313999 1175265 1101276 1037177 948950 816456 598459 337195 145032
13551A45032k6489K39610M19561L68360K19029P1261j48524l90293m77746l03374
$$ 145032 118543 358153 777714 1146074 1365103 1436364 1287840 897547 419801 116427
13541A16427M2632K85508K68656J92062J12252R39k5236j1620r4095k84770l81542
$$ 116427 159059 444567 713223 905285 1017537 1018476 993240 981620 887525 602755 221213
13530B21213k87219j57962j31738j29693q582J74919K18361J96379K19955J52400
$$ 221213 -66006 -223968 -355706 -485399 -493981 -319062 -100701 95678 315633 468033
13520D68033J3816m0082m1968j10467j53237j56648j53618j47257j59460k09353
$$ 468033 481849 441767 399799 289332 136095 -20553 -174171 -321428 -480888 -690241
13510f90241k24062j83801j09871q1660j02753l7535L9187J2415P570P0159J21427
$$ -690241 -914303 -1098104 -1207975 -1289635 -1392388 -1429923 -1390736 -1378321 -1370751 -1300592 -1179165
13499a179165J67413K01713K24974K13234Q0180l4797K6721K17441L43669K74281
$$ -1179165 -1011752 -810039 -585065 -371831 -291651 -326448 -299727 -82286 261383 535664
13489E35664J58983J17380O3480r463p3126j52039l01244m70405m69650l00979
$$ 535664 694647 812027 875507 866044 792918 640879 339635 -130770 -600420 -901399
13479i01399j23598j8771L276k8205L3706J56737K23187K16810J17079m5497k23453
$$ -901399 -1024997 -1043768 -1040492 -1068697 -1034991 -878254 -655067 -438257 -321178 -366675 -590128
13468e90128l42675k59276l3593J09564J74743K71108K99278J85088J8215q3334
$$ -590128 -932803 -1192079 -1225672 -1116108 -941365 -670257 -370979 -185891 -167676 -251010
13458b51010j37698k06060k66214k83660j99942k001J94068L22633L50238K43970
$$ -251010 -388708 -594768 -860982 -1144642 -1344584 -1346585 -1152517 -829884 -479646 -235676
13448b35676N8494o6271q8375l4899l7467j07664k20459l11134k89579k26554
$$ -235676 -177182 -243453 -331828 -366727 -404194 -511858 -732317 -1043451 -1333030 -1559584
13438a559584j70690r1431O7193L17963N50765N91384M02213K43690J96857J00075
$$ -1559584 -1730274 -1821705 -1754512 -1436549 -885784 -294400 107813 351503 548360 648435
13428F48435m398m980O0541Q9535N3096N1740P0256L693j08279j85352j07292
$$ 648435 644037 639057 699598 789133 842229 893969 964225 967918 859639 674287 566995
13417E66995N3114J09298K3674q7845j46270j23769k9408O9942J42050Q6995j74734
$$ 566995 620109 729407 753081 665236 518966 395197 365789 435731 577781 664776 490042
13406D90042l59897l24330k04791j04916r8023j75001j84665k0650K19873M13136
$$ 490042 130145 -194185 -398976 -503892 -601915 -776916 -961581 -982231 -762358 -349222
13396c49222M50971L27214K21700J89298J15416l3782j92424k50258j91484p0142
$$ -349222 101749 428963 650663 839961 955377 921595 729171 478913 287429 217287
13386B17287M3375M375j79028l50821m02198k79159m8563O6676L9811P162Q2826
$$ 217287 260662 265037 86009 -264812 -667010 -946169 -994732 -928056 -888245 -881083 -798257
13375g98257J34624J7842j33218k04368j41259k5815Q9612K19508K64995K56481
$$ -798257 -663633 -645791 -779009 -983377 -1124636 -1150451 -1060839 -841331 -576336 -319855
13365c19855K55618K01310R5408O7184J98512L03209K28966O8799O794N3608O4862
$$ -319855 -64237 137073 232481 299665 498177 801386 1030352 1099151 1105945 1159553 1224415
13354A224415m2740j21977n9061K202O8470J70621J28623n6762k00731k41973
$$ 1224415 1181675 1059698 1000637 1002839 1071309 1241930 1370553 1313791 1113060 871087
13344H71087j94537j29046r4787q0931j02670j80874k43698j88451m4450O7314
$$ 871087 676550 547504 452717 371786 269116 88242 -155456 -343907 -388357 -321043
13334c21043J55165K03273J46515N7722K8665k776j5155Q5833J85400J26290r0678
$$ -321043 -165878 37395 183910 241632 270297 267521 252366 338199 523599 649889 559211
13323E59211l15874l31510j77392q1012r8718j37641q0264J8774P7773J33630
$$ 559211 243337 -88173 -265565 -346577 -445295 -582936 -663200 -644426 -566653 -433023
13313d33023K22764K39130J32939p178p2041J516J30100J42903j0302r3337o5143
$$ -433023 -210259 28871 161810 154632 82591 84107 214207 357110 346808 253471 188328
13302A88328m6169Q619R8908K13938K95340K60962K06363K27626K27788J40182
$$ 188328 142159 150778 249686 463624 758964 1019926 1226289 1453915 1681703 1821885
13292A821885R2646R2392K8949p6050j59253j55139j03412j79836m01222m61402
$$ 1821885 1914531 2006923 2035872 1959822 1800569 1645430 1542018 1362182 960960 499558
13282D99558j75673J86035L86394M45229L68609K58256J76243R2444j6401j55228
$$ 499558 323885 509920 896314 1341543 1710152 1968408 2144651 2237095 2220694 2065466
13272B065466k57494l28826l32346k44493j01389L2477O3163L3402J7132N8683
$$ 2065466 1807972 1479146 1146800 902307 800918 833395 896558 929960 947092 1005775
13262A005775J51516J51711M7889j14845l32909n21712n59666m23767j85890M4197
$$ 1005775 1157291 1309002 1356891 1242046 909137 387425 -172241 -596008 -781898 -737701
13252g37701J12311N2863J6437Q3853J94021K46968K83680L43055M27383N12075
$$ -737701 -625390 -572527 -556090 -472237 -278216 -31248 252432 595487 1022870 1534945
13242A534945N46471N61417M35681J19032j63556k54930k25628k46693k41940
$$ 1534945 2081416 2642833 3078514 3197546 3033990 2779060 2553432 2306739 2064799
13233B064799j24437q1391j05436m4249J49593K67822J05845j26719k17325k42862
$$ 2064799 1940362 1858971 1753535 1709286 1858879 2126701 2232546 2105827 1888502 1645640
13223A645640l21644l73777k40179k8732Q5140J03368J15196J10892J19178J45354
$$ 1645640 1323996 950219 710040 681308 766448 869816 985012 1095904 1215082 1360436
13213A360436R2848l0312n4452N3913J36115R7022k5544j66882k44822k78660
$$ 1360436 1453284 1422972 1368520 1422433 1558548 1655570 1630026 1463144 1218322 939662
13203I39662l78686l79072k17908j62819j34305q227P0142J24556J49755J65824
$$ 939662 560976 181904 -36004 -198823 -333128 -341355 -271213 -146657 3098 168922
13193A68922J62299J0279j25556q0407K5670O2893R9785J25572J03112N6497J257
$$ 168922 331221 341500 215944 135537 161207 224100 323885 449457 552569 609066 610323
13182F10323L8004J84237K85368K99409K92781K33501O8594j15940k25605k69224
$$ 610323 648327 832564 1117932 1417341 1710122 1943623 2012217 1896277 1670672 1401448
13172A401448k47434j80610j27566j00685r2514j43312j73647j40466J4680K36522
$$ 1401448 1154014 973404 845838 745153 652639 509327 335680 195214 209894 446416
13162D46416L30762L39035L28093J96534j31787m36404m46237k30771M3741K48196
$$ 446416 777178 1116213 1444306 1640840 1509053 1072649 626412 395641 439382 687578
13152F87578K84244K32696K20958J97019J31436J04697P2400M0729N2834P4290
$$ 687578 971822 1204518 1425476 1622495 1753931 1858628 1931028 1971757 2024591 2098881
13142B098881R7413R8866J02311J10875N6313J5794M9377J33693J45028J6604
$$ 2098881 2196294 2295160 2397471 2508346 2564659 2580453 2629830 2763523 2908551 2925155
13132B925155r9204r3815k5408m4852j58170k95526k24338P1089J79937J6219
$$ 2925155 2825951 2732136 2706728 2661876 2503706 2208180 1983842 2054931 2234868 2251087
13122B251087q6145m6502K7698J00820Q9531j9687j34130k24076l04986l14378
$$ 2251087 2164942 2118440 2146138 2246958 2336489 2316802 2182672 1958596 1653610 1339232
13112A339232j99225j26873k55716l65973k62095M7753L77462L95458J28735j10263
$$ 1339232 1140007 1013134 757418 391445 129350 177103 554565 950023 1078758 968495
13102I68495k00586k03377k04935k09874j63845K7743K80171M58146M55033K90483
$$ 968495 767909 564532 359597 149723 -14122 13621 293792 751938 1206971 1497454
13092A497454K58367K92037L10645L36513L07647K86433K99262K16323L1499k12674
$$ 1497454 1755821 2047858 2358503 2695016 3002663 3289096 3588358 3804681 3836180 3623506
13082C623506l36762k20880j04145q9026j06280p4803J1002j1172j46869j47647
$$ 3623506 3286744 3065864 2961719 2872693 2766413 2691610 2702612 2691440 2544571 2396924
13072B396924k1289R2431J71406L24272N33871N71389L57636Q5246j02896l63291
$$ 2396924 2375635 2468066 2639472 2963744 3497615 4069004 4426640 4511886 4408990 4045699
13062D045699n34385l36203L2109K10365J48861J0437j50120k74607k12406j09720
$$ 4045699 3511314 3175111 3207220 3417585 3566446 3576883 3426763 3152156 2939750 2830030
13052B830030j30371l6974K35016M05149L80126K12659o0398l68168m39556j77160
$$ 2830030 2699659 2662685 2897701 3302850 3682976 3895635 3835237 3467069 3027513 2850353
13042B850353J90845M79806M94972L17525K30475K44014J91399J4431j86638k58839
$$ 2850353 3041198 3521004 4015976 4333501 4563976 4807990 4999389 5013820 4827182 4568343
13032D568343j76084o1812P589N8179J26164J82821J74471J36107J75360K56375
$$ 4568343 4392259 4330447 4338036 4396215 4522379 4705200 4879671 5015778 5191138 5447513
13022E447513K83332L25188L36777L02735K50367J68332J68369K52642L38204
$$ 5447513 5730845 6056033 6392810 6695545 6945912 7114244 7282613 7535255 7873459
13013G873459M06267M04568L59708L77170L80263K37680l4454k40134j98914J47146
$$ 7873459 8279726 8684294 9044002 9421172 9801435 10039115 10004661 9764527 9565613 9712759
13003I712759N33310N54998L22926K74352N17533P92152Q74394P56293O51154
$$ 9712759 10246069 10801067 11123993 11398345 11915878 12708030 13582424 14338717 14989871
12994A4989871O35477O62486O87442P72310Q90394R96292J168557J401365J630318
$$ 14989871 15625348 16287834 16975276 17747586 18637980 19634272 20802829 22204194 23834512
12985B3834512J823596J986455K143528K359823K656965L128104L575934L804192
$$ 23834512 25658108 27644563 29788091 32147914 34804879 37932983 41508917 45313109
12977D5313109M147501M789530N523574O238355P034641P984460R052707J0276963
$$ 45313109 49460610 54250140 59773714 66012069 73046710 81031170 90083877 100360840
12969A00360840J1772882J3742694J6223718J9008206K2100079K5756571K9985736
$$ 100360840 112133722 125876416 142100134 161108340 183208419 208964990 238950726
12962B38950726L4084429L6791470L5989543K8298377J1714304j0369122k9987965
$$ 238950726 273035155 309826625 345816168 374114545 385828849 375459727 345471762
12955C45471762m0973524m2928977l9194170l3407404k7703383k2707643j8416583
$$ 345471762 304498238 261569261 222375091 188967687 161264304 138556661 120140078
12948A20140078j4825407j2029437j0063207q618918p342388o266660n273167
$$ 120140078 105314671 93285234 83222027 74603109 67260721 60994061 55720894
12941E5720894m332214l720846l357336l069419k796537k488920k175293j829769
$$ 55720894 51388680 47667834 44310498 41241079 38444542 35955622 33780329 31950560
12933C1950560j527076j323864j207898j099756r63694q35583o74851n53236m58449
$$ 31950560 30423484 29099620 27891722 26791966 25828272 24992689 24317838 23764602 23306153
12924B3306153l02480j80235j36860j98666l34810l76497l43468j85520Q0936
$$ 23306153 23003673 22823438 22686578 22487912 22153102 21776605 21433137 21247617 21328553
12915B1328553K28248K73680L49009M65713N30004N60996O82643Q89439J064732
$$ 21328553 21556801 21830481 22179490 22645203 23175207 23736203 24418846 25308285 26373017
12906B6373017J172616J309924J561927J816965J948833K123997K309298K100446
$$ 26373017 27545633 28855557 30417484 32234449 34183282 36307279 38616577 40717023
12898D0717023J513712R91776Q28542J010090J405862J928545K488904L065026
$$ 40717023 42230735 43222511 44051053 45061143 46467005 48395550 50884454 53949480
12890E3949480L629786M097783M675209N624885O797870Q028585R359223J0839014
$$ 53949480 57579266 61677049 66352258 71977143 78775013 86803598 96162821 107001835
12882A07001835J2519967J4482610J6908481J9856221K3250488K7132507L1404936
$$ 107001835 119521802 134004412 150912893 170769114 194019602 221152109 252557045
12875B52557045L5488952L7778936L5417299K5036432N816215j7025036l5058279
$$ 252557045 288045997 325824933 361242232 386278664 392094879 375069843 340011564
12868C40011564m3523147m3405971l8452744l2099234k6247068k1462695j7578106
$$ 340011564 296488417 253082446 214629702 182530468 156283400 134820705 117242599
12861A17242599j4387089j1801642r656447p988434o909042o172252n445342m639995
$$ 117242599 102855510 91053868 81397421 73408987 66499945 60327693 54882351 50242356
12853E0242356l890297l332297k852027k464306k301161k233768k152832j991779
$$ 50242356 46352059 43019762 40167735 37703429 35402268 33168500 31015668 29023889
12845B9023889j708886j428592j227059j042546q70173p53714o13428l90514k81884
$$ 29023889 27315003 25886411 24659352 23616806 22746633 21992919 21379491 20988977 20707093
12836B0707093l81359m51177l99312l16088k29375j52591j18990q3029k3435j9084
$$ 20707093 20325734 19874557 19475245 19159157 18929782 18777191 18658201 18575172 18551737 18532653
12826A8532653k2627R5710K58971L71115M75752N96914O27198O13525P71670R97328
$$ 18532653 18510026 18605736 18864707 19235822 19711574 20308488 20935686 21549211 22320881 23318209
12816B3318209J023041Q80799Q19318R32945J206165J611655K025188K336208
$$ 23318209 24341250 25222049 26041367 26974312 28180477 29792132 31817320 34153528
12808C4153528K498506K659511K959697L414201M009018M632714N210390N834697
$$ 34153528 36652034 39311545 42271242 45685443 49694461 54327175 59537565 65372262
12800F5372262O622268P499984Q322403R293413J0731197J2642688J4906613J7549511
$$ 65372262 71994530 79494514 87816917 97110330 107841527 120484215 135390828 152940339
12792A52940339K0724669K4325791K8212503L2253200L5749762L6840952L2485317
$$ 152940339 173665008 197990799 226203302 258456502 294206264 331047216 363532533
12785C63532533J9808782n18534k2158324l7387506m3184913m1735228l6698000
$$ 363532533 383341315 382822781 360664457 323276951 280092038 238356810 201658810
12778B01658810l0782868k5321229k0677529j6901888j3892230j1429712r373649
$$ 201658810 170875942 145554713 124877184 107975296 94083066 82653354 73279705
12771G3279705p671284o408100n547330m886331m294109l711406l188721k903360
$$ 73279705 65608421 59200321 53652991 48766660 44472551 40761145 37572424 34669064
12763C4669064k789084k643146k362676k025350j807619j584291j225562r06851
$$ 34669064 31879980 29236834 26874158 24848808 23041189 21456898 20231336 19324485
12755A9324485p93050q81793j039629j084389r35623o94091n40178n70287o57317
$$ 19324485 18531435 17649642 16610013 15525624 14590001 13895910 13355732 12785445 12128128
12746A2128128o42712n90297n78362n41724m66868k96806n7393J34084K14290
$$ 12128128 11485416 10895119 10316757 9775033 9308165 9011359 8953966 9088050 9302340
12737I302340J52115K757n4783j41624m17377o14968n89401m00933j41910n664
$$ 9302340 9454455 9457212 9402429 9260805 8843428 8228460 7639059 7238126 7096216 7090552
12727G090552j4850p0055k31299m52180o01021n22217k78743j39224j44950r6217
$$ 7090552 7075702 7005647 6774348 6322168 5721147 5198930 4920187 4780963 4636013 4539796
12717D539796L5785j4716k72934m24271l08215p1259O3651M4418l6329j13355
$$ 4539796 4575581 4560865 4287931 3863660 3555445 3484186 3547837 3592255 3555926 3442571
12707C442571j04966p6700j06373r8418n5436R3945K51457K69939J52659l7295
$$ 3442571 3337605 3260905 3154532 3056114 3000678 3094623 3346080 3616019 3768678 3731383
12697C731383j59364j43245o7058J3740O5244P8223Q8467R2175K2917m0263n7777
$$ 3731383 3572019 3428774 3361716 3375456 3440700 3518923 3607390 3699565 3722482 3682219 3624442
12686C624442j64794k91769l70576l58984k67302k17685j97627j20595l319N1600
$$ 3624442 3459648 3167879 2797303 2438319 2171017 1953332 1755705 1635110 1631791 1683391
12676A683391j3170l7430J06371K18821K18064K23107J44739k8338j34359q4783
$$ 1683391 1670221 1632791 1739162 1957983 2176047 2399154 2543893 2515555 2381196 2296413
12666B296413m786J3388N2795N7443p5992j64272j14490j3892J07431J47522J36310
$$ 2296413 2291627 2305015 2357810 2415253 2339261 2174989 2060499 2046607 2154038 2301560 2437870
12655B437870J44438R0263l6963j72601k78312l29867k39260j6435J90590K19578
$$ 2437870 2582308 2672571 2635608 2463007 2184695 1854828 1615568 1599133 1789723 2009301
12645B009301J66247J37561R567j17500j98715k86267k83288j95901r8287q0439
$$ 2009301 2175548 2313109 2322676 2205176 2006461 1720194 1436906 1241005 1142718 1062279
12635A062279l1609K07182M64475N85729N86738M34540P0055k81765l45981k14321
$$ 1062279 1030670 1237852 1702327 2288056 2874794 3309334 3379389 3097624 2751643 2537322
12625B537322j25690j13994q4396m0469q5925j46703j21049j25916j39279r7226
$$ 2537322 2411632 2297638 2213242 2172773 2086848 1940145 1819096 1693180 1553901 1456675
12615A456675o7017r8042j69542j99181j89032j65432r3519J4165N4290K4991
$$ 1456675 1389658 1291616 1122074 922893 733861 568429 474910 489075 543365 568356
12605E68356N3912J80097L33404L52371K26248Q4937k9421j32407k67247m21696
$$ 568356 622268 802365 1135769 1488140 1714388 1799325 1769904 1637497 1370250 948554
12595I48554m71116l67967j32891L3902K5349p0535j46922j04932M4521K11393
$$ 948554 477438 109471 -23420 10482 35831 -34704 -181626 -286558 -242037 -30644
12585c0644K12683P2530n1980j38327j62234o8564J19476K78059L11621L05437
$$ -30644 182039 254569 202589 64262 -97972 -166536 -47060 230999 542620 848057
12575H48057K85164K35220J28328O5463K6771k9428J3581J07691Q4793k780l4989
$$ 848057 1133221 1368441 1496769 1562232 1589003 1559575 1573156 1680847 1765640 1762860 1727871
12564A727871m1827o1550j90486l40097k18525L0452J76405K69835K85124J01732
$$ 1727871 1686044 1624494 1434008 1093911 875386 905838 1082243 1352078 1637202 1738934
12554A738934j41432k02115n5833J27138J53753R9687Q4786Q1242J5399j0479
$$ 1738934 1597502 1395387 1339554 1466692 1620445 1720132 1804918 1886160 1901559 1891080
12544A891080N9370K6367p5729j47331j67723j31990r3610q4571l9290P3505J31876
$$ 1891080 1950450 1976817 1901088 1753757 1586034 1454044 1360434 1275863 1236573 1310078 1441954
12533A441954K4270j34860j44285n4455l1506p5957p2326l7690m9148p9445j03660
$$ 1441954 1466224 1331364 1187079 1132624 1101118 1025161 952835 915145 865997 786552 682892
12522F82892j85932l48597m90770n25852m10489j63093J24784K84847K34290Q2478
$$ 682892 496960 148363 -342407 -868259 -1278748 -1441841 -1317057 -1032210 -797920 -715442
12512g15442K3883J42980L97998N82332N02025K80989J31890P4398J06637J59158
$$ -715442 -691559 -548579 -150581 431751 933776 1214765 1346655 1421053 1527690 1686848
12502A686848P3812j10177k34986k42727j15068N1004L5821j42379k82405l33595
$$ 1686848 1760660 1650483 1415497 1172770 1057702 1108706 1144527 1002148 719743 386148
12492C86148l26580k45516j08796N9101J71651J91086J47192R1837J72752L14456
$$ 386148 59568 -185948 -294744 -235643 -63992 127094 274286 366123 538875 853331
12482H53331L76117K44627m0303k35785k41840j26516N0536P2935n2784j27181
$$ 853331 1229448 1474075 1433772 1197987 956147 829631 880167 953102 900318 773137
12472G73137j28475p8663l7008n2163j02650j37765j03636l5489m8368j30271
$$ 773137 644662 565999 528991 476828 374178 236413 132777 97288 48920 -81351
12462h1351j11190L980O8541J10159J20877N3339K4646j331p5495j25038j43257
$$ -81351 -192541 -188561 -120020 -9861 111016 164355 189001 187670 112175 -12863 -156120
12451a56120j98030k05521r777K99228N36581N85220N06418L06109Q6831r26l2227
$$ -156120 -354150 -559671 -569448 -270220 266361 851581 1357999 1664108 1750939 1750013 1717786
12440A717786k22296m78527n63214m69369l55982l05030k16319q8350k3562n9398
$$ 1717786 1495490 1016963 453749 -15620 -371602 -676632 -892951 -981301 -1004863 -1064261
12430a064261j40877j32400j7984J22625K21661K59943K08857J48753J91333K67450
$$ -1064261 -1205138 -1337538 -1355522 -1232897 -1011236 -751293 -542436 -393683 -202350 65100
12420F5100L21154L40226J61159m8295q8048k1517L8982R0912N7944j13904k26860
$$ 65100 386254 726480 887639 839344 751296 729779 768761 859673 917617 803713 576853
12409E76853j67517q6819n4090L2137J16731R9442J8150k9584m7872m7256K2004
$$ 576853 409336 322517 268427 300564 417295 516737 534887 505303 457431 410175 432179
12398D32179J04105J86116K29333J56863P4037M8784M0689n4866k10717k58140
$$ 432179 536284 722400 951733 1108596 1182633 1231417 1272106 1217240 1006523 748383
12388G48383k24121j59230j14263j72277k66493k36305k8965J98404L45418M26000
$$ 748383 524262 365032 250769 78492 -188001 -424306 -453271 -254867 90551 516551
12378E16551L47549R6878r6067j20412o7069o0477j23821j85907k04081j32410
$$ 516551 864100 960978 864911 744499 677430 616953 493132 307225 103144 -29266
12368b9266L8941J68697K48494L26350K79438N9710k26131m01985l46025j00689
$$ -29266 9675 178372 426866 753216 1032654 1092364 866233 464248 118223 17534
12358A7534J64182L17368L19791K70924J71089O3214R5526J45635J19725M1677
$$ 17534 181716 499084 818875 1089799 1260888 1324102 1419628 1565263 1684988 1726665
12348A726665n1764j38388k66994l49079l55265l66270m00872l97657k09558Q9136
$$ 1726665 1674901 1536513 1269519 920440 565175 198905 -201967 -599624 -809182 -720046
12338g20046K55213K74434K60556K52932K29114J51838J06543J29290J22766K9600
$$ -720046 -464833 -190399 70157 323089 552203 704041 810584 939874 1062640 1092240
12328A092240n1746r3510j91460k77575k35012j64200j56971k00793k18949j84202
$$ 1092240 1040494 946984 755524 477949 242937 78737 -78234 -279027 -497976 -682178
12318f82178j95175k54268k83708j46656O7169K03127K39619Q6442r5718r5465
$$ -682178 -877353 -1131621 -1415329 -1561985 -1494816 -1291689 -1052070 -965628 -1061346 -1156811
12308a156811M0880J93422L40751M28209L50282J65550K7490n0228p723K02080
$$ -1156811 -1115931 -922509 -581758 -153549 196733 362283 389773 339545 331822 533902
12298E33902L86298L35052J18638m9163j38980j43350j62401k13385j63792R53
$$ 533902 920200 1255252 1373890 1324727 1185747 1042397 879996 666611 502819 503772
12288E03772J79613J86401l9975j95823j22836k4216q663k7816l1919o0156p6223
$$ 503772 683385 869786 829811 633988 511152 486936 478273 450457 418538 358382 282159
12277B82159K0680J24499O6037j07477j04742J28441L48246K97635L390k39811
$$ 282159 302839 427338 493375 385898 281156 409597 757843 1055478 1058868 819057
12267H19057k56236k48455l03217k61865r6223R608m9914j56404j08477O1314
$$ 819057 562821 314366 11149 -250716 -346939 -337331 -387245 -543649 -652126 -590812
12257e90812J60876J36717K693j77477l04584k92841k00717p3245P9150K58473
$$ -590812 -429936 -293219 -290526 -468003 -772587 -1065428 -1266145 -1339390 -1260240 -1001767
12247a001767L94199M28507L15250J05573o9153j74773j31023O1704K13824K75224
$$ -1001767 -607568 -179061 136189 241762 172609 -2164 -133187 -71483 142341 417565
12237D17565L06743K57649J11607K9094R5003J90096K16780K75638L01857J38183
$$ 417565 724308 981957 1093564 1122658 1217661 1407757 1624537 1900175 2202032 2340215
12227B340215j27461k59006k49703k31683k39935k53965j88107K2525J58423J18798
$$ 2340215 2212754 1953748 1704045 1472362 1232427 978462 790355 812880 971303 1090101
12217A090101K5410r2379j78315k11588j38866p5765j87419k81942j78230k6820
$$ 1090101 1115511 1023132 844817 633229 494363 418598 231179 -50763 -228993 -255813
12207b55813J21030K16576K07948K59478L82016N17234N56307K86993j59670m40327
$$ -255813 -134783 81793 289741 549219 931235 1448469 2004776 2291769 2132099 1691772
12197A691772m90427m43731k84051j26020r2651o2299n244O9004J23115J38712
$$ 1691772 1201345 757614 473563 347543 254892 192593 187349 256353 379468 518180
12187E18180J01641o1795j95192k00562k31787k87686k68841k40716j87574j07245
$$ 518180 619821 558026 362834 162272 -69515 -357201 -626042 -866758 -1054332 -1161577
12177a161577j37293j74631k2753J40179K57001L88569L44179J04444m5957m6297
$$ -1161577 -1298870 -1473501 -1496254 -1356075 -1099074 -710505 -366326 -261882 -307839 -354136
12167c54136k862J15648J80760J35357R7760J32108J98827K24895K07781K57747
$$ -354136 -356998 -241350 -60590 74767 172527 304635 503462 728357 936138 1193885
12157A193885L44199K54345p3755m20765n64742m46998j58645O9305P3565M8165
$$ 1193885 1538084 1792429 1718674 1297909 733167 286169 127524 196829 270394 318559
12147C18559J20771J11529m1983j26727m7637M0054Q7897k004k44268m13042k93312
$$ 318559 439330 550859 508876 382149 334512 374566 462463 460459 216191 -196851 -490163
12136d90163J3141J99052J81008r032k85471m61469m68811l57573j70671M8160
$$ -490163 -477022 -277970 -96962 -105994 -391465 -852934 -1321745 -1679318 -1849989 -1801829
12126a801829K56989L20324K50415J93260J36275o9883l76357m30732r5529L24283
$$ -1801829 -1544840 -1224516 -974101 -780841 -644566 -714449 -1090806 -1521538 -1617067 -1292784
12116a292784N04407M28939L80548L79582K45033J09957R0025J01209J67082K52343
$$ -1292784 -788377 -359438 21110 400692 645725 755682 845707 946916 1113998 1366341
12106A366341J01328j77960k75003j96335j07227j20183j44759p6896J5641Q6809
$$ 1366341 1467669 1289709 1014706 818371 711144 590961 446202 369306 384947 471756
12096D71756M0946j05507j06999P5277K16899J43907r8703k45318j78102o335
$$ 471756 512702 407195 300196 375473 592372 736279 637576 392258 214156 207821
12086B07821J25377K27044K98676K83457J55715K7576P1002J77350J68331M1104
$$ 207821 333198 560242 858918 1142375 1298090 1325666 1396668 1574018 1742349 1783453
12076A783453q1033j59991k55658k64309j40000m8631q4626j93890k35185j50535
$$ 1783453 1702420 1542429 1286771 1022462 882462 833831 749205 555315 320130 169595
12066A69595K6026J64531K42271K88832K66562J73783N6351j03039l02302m79272
$$ 169595 195621 360152 602423 891255 1157817 1331600 1387951 1284912 982610 503338
12056E03338n28135m10212k40083r5652K907L8879k9805m7722N7339J59923J35814
$$ 503338 -24797 -435009 -675092 -770744 -767837 -728958 -758763 -806485 -749146 -589223 -453409
12045d53409n703j6122J11500J95584K03660K10991K85182K82860R6095o8244
$$ -453409 -459112 -475234 -363734 -168150 35510 246501 531683 814543 910638 842394
12035H42394j00406o8362K7666R5475J49784K97174L92661K53947n1332k27067
$$ 842394 741988 673626 701292 796767 946551 1243725 1636386 1890333 1839001 1611934
12025A611934k00793n3763J2107n6474j07438j77949k38489j87804j09501p0000
$$ 1611934 1411141 1357378 1369485 1313011 1205573 1027624 789135 601331 491830 421830
12015D21830n1539l5397l9908J0932J44105J46633k2857j03584j24898j29013
$$ 421830 370291 334894 294986 305918 450023 596656 573799 470215 345317 216304
12005B16304l6016O3061R4216O3113m995j03599j39290j23901k63160m37501l69810
$$ 216304 180288 243349 337565 400678 395683 292084 152794 28893 -234267 -671768 -1041578
11994a041578j03840J53712K61715J82756K5901m8991r6386j15386l5340Q122
$$ -1041578 -1145418 -991706 -729991 -547235 -521334 -570325 -666711 -782097 -817437 -809315
11984h09315j8633k4625M2203J72372K00060J32976J14301J15461N4156O823K0231
$$ -809315 -827948 -852573 -810370 -637998 -437938 -304962 -190661 -75200 -21044 -14221 6010
11973F010L5818M8760L2085q6668j77519j04195O688J8973L0963J43614K72566
$$ 6010 41828 90588 122673 36005 -141514 -245709 -239021 -220048 -189085 -45471 227095
11962B27095J90321j2035j65771k56020k52186j47580k3650K470n8750n4365M3835
$$ 227095 417416 405381 239610 -16410 -268596 -416176 -439826 -437356 -496106 -550471 -506636
11951e06636P8212P8764R383j41704k00294r9088J02898K88806K75186J04032
$$ -506636 -428424 -349660 -340277 -481981 -682275 -781363 -678465 -389659 -114473 -10441
11941a0441l2617j12960j14901J9025J59092R4555j51920l73610m73958m17662
$$ -10441 -43058 -156018 -270919 -251894 -92802 1753 -150167 -523777 -997735 -1415397
11931a415397k48002q7492o1053m8725N4850J53017K31465K90240K60830J38004
$$ -1415397 -1663399 -1750891 -1811944 -1860669 -1805819 -1652802 -1421337 -1131097 -870267 -732263
11921g32263J3445O224N9479J17020J62926O9083j75426k92687j02590J92283
$$ -732263 -718818 -712594 -653115 -536095 -373169 -304086 -479512 -772199 -874789 -682506
11911f82506L69373L29791J09277j47485j73965K643J35636K29757L27324K91405
$$ -682506 -313133 16658 125935 -21550 -195515 -192872 -57236 172521 499845 791250
11901G91250R8968q7057j49795n8794J36537L50001L85883J12139k42890l93931
$$ 791250 890218 803161 653366 594572 731109 1081110 1466993 1579132 1336242 942311
11891I42311l17922j98975j85976k23694j82043k8419J45591K64592K42357O6739
$$ 942311 624389 425414 239438 15744 -166299 -194718 -49127 215465 457822 524561
11881E24561j40170l12654m05632l35061o9294J83843J98555j0086k41805k40772
$$ 524561 384391 71737 -333895 -668956 -738250 -554407 -355852 -365938 -607743 -848515
11871h48515M4591L26707L68012J61768j30080k49027j08373J51646M25862N66309
$$ -848515 -803924 -477217 -109205 52563 -77517 -326544 -434917 -283271 142591 708900
11861G08900N02411K85539J0625k27800k60177j38156r8141p5098R6255K41314
$$ 708900 1211311 1496850 1507475 1279675 1019498 881342 783201 708103 804358 1045672
11851A045672K05001R3537O4075J53018J65674n7037l10021m82880n71545m26479
$$ 1045672 1250673 1344210 1408285 1561303 1726977 1669940 1359919 877039 305494 -120985
11841a20985j79507j16802j61553j07159N9135K35049K47310O5447j45883j88836
$$ -120985 -300492 -417294 -578847 -686006 -626871 -391822 -144512 -79065 -224948 -413784
11831d13784M4465L27427M21470L48415J48970j9610r0141r3064m1193m5537j29832
$$ -413784 -369319 -41892 379578 727993 876963 857353 767212 674148 632955 587418 457586
11820D57586j61014o6770n389j02049k44871k91533k06830n8710N7836R9744J25296
$$ 457586 296572 229802 224413 122364 -122507 -414040 -620870 -679580 -621744 -522000 -396704
11809c96704K09184L73934M31365K03569j11131l39987m26095l47857j98244j08601
$$ -396704 -187520 186414 617779 821348 710217 370230 -55865 -403722 -601966 -710567
11799g10567j15405n4539P3437P8983j3702O1107K53000K88891J94983J00501
$$ -710567 -825972 -880511 -807074 -728091 -741793 -680686 -427686 -138795 56188 156689
11789A56689P2890J44365J61665M2420j08126j48722j23595j14671n0705n9353
$$ 156689 229579 373944 535609 578029 469903 321181 197586 82915 32210 -27143
11779b7143j96367k55904j14823P0410J00817P1117N0033M3870J57521L93161
$$ -27143 -223510 -479414 -594237 -523827 -423010 -351893 -301860 -257990 -100469 292692
11769B92692M41968K18350m2546j57994q4371J1700J4434m8842p2137l9708k7189
$$ 292692 734660 953010 910464 752470 668099 679799 694233 645391 573254 533546 506357
11758E06357O3421K02665J87791J25328K29660L90923L71533K20048N7283q3151
$$ 506357 569778 772443 960234 1085562 1315222 1706145 2077678 2297726 2355009 2271858
11748B271858k15524l33220k96863k54652l23831m22242n10039m61106k54679
$$ 2271858 2056334 1723114 1426251 1171599 847768 425526 -84513 -545619 -800298
11739h00298o9312K0714N6417Q5862K49302M24171L57143J49557k1840j26261
$$ -800298 -869610 -848896 -792479 -706617 -457315 -33144 323999 473556 451716 325455
11729C25455j99382j85141o1851P3284J62615J82301K38123L10091K74639J61303
$$ 325455 126073 -59068 -120919 -47635 114980 297281 535404 845495 1120134 1281437
11719A281437O4288o4471j97454k43638k00087j27222r6100o2207k0123L7122
$$ 1281437 1345725 1281254 1083800 840162 640075 512853 416753 354546 334423 371545
11709C71545P5564Q3942J58059K65910K45674R0734r2475j94399k42523k83364
$$ 371545 447109 531051 689110 955020 1200694 1291428 1198953 1004554 762031 478667
11699D78667k63741j73652l5332M2181j5314j21298k14040k63913k09252o6494
$$ 478667 214926 41274 5942 48123 32809 -88489 -302529 -566442 -775694 -842188
11689h42188L0287Q8510J36398J96699K84565K69498J81692J90995K62115J30548
$$ -842188 -811901 -723391 -586993 -390294 -105729 163769 345461 536456 798571 929119
11679I29119o8262j05518r1934j05912k18338l53671l10036j51551m988N1731
$$ 929119 860857 755339 663405 557493 339155 -14516 -324552 -476103 -481091 -429360
11669d29360M4601j0956n9406m5767j04301k53337k15228R357J55667K26882K41967
$$ -429360 -384759 -395715 -455121 -500888 -605189 -858526 -1073754 -1064397 -908730 -681848 -439881
11658d39881J67476L0939k4760M3009L6846r9449j22976p7913j25492j14810q4155
$$ -439881 -272405 -241466 -266226 -223217 -186371 -285820 -408796 -486709 -612201 -727011 -811166
11647h11166l2271P3912J34191J25427P3516Q7637R2845r174j55744k60485k89838
$$ -811166 -843437 -769525 -635334 -509907 -436391 -348754 -255909 -265083 -420827 -681312 -971150
11636i71150k63486k09856l8359K32110M61828N66668N00652K92416L8350j48890
$$ -971150 -1234636 -1444492 -1482851 -1250741 -788913 -222245 278407 570823 609173 460283
11626D60283j72424o711J40418O7892q4186j74046k09307j69525q0074K6678Q1201
$$ 460283 287859 281148 421566 489458 405272 231226 21919 -147606 -227680 -201002 -119801
11615a19801J01112J40582J21570o9j22552j87901j28986N3551J59221J19262
$$ -119801 -18689 121893 243463 243394 120842 -67059 -196045 -142494 16727 135989
11605A35989M0345j1190L79N1185J55648J85928O2724o5054j18886j69302j75177
$$ 135989 176334 165144 165523 216708 372356 558284 621008 555954 437068 267766 92589
11594I2589n2622L2054m7400p7112k4920o9311k17422l58720l06373o5180Q7529
$$ 92589 39967 72021 24621 -52491 -77411 -146722 -364144 -722864 -1029237 -1094417 -1006888
11583a006888J31840J43194J20464J24608R9408L450m0054n750O6960O6492qP411
$$ -1006888 -875048 -731854 -611390 -486782 -387374 -383924 -423978 -429728 -362768 -296276 -296284 -288873
11571b88873P1739P2016L9648O2295R2358J18084J21197R1619K0867r3891j65803
$$ -288873 -217134 -145118 -105470 -43175 49183 167267 288464 380083 400950 307059 141256
11560A41256j73276j82204r8817K3228R4601K18385K45125J51749N2926p7410
$$ 141256 -32020 -214224 -313041 -289813 -195212 23173 268298 420047 472973 395563
11550C95563j03356n2234r709M7626N4552p2179k57127l49230l55090k55162L48
$$ 395563 292207 239973 230264 277890 332442 260263 3136 -346094 -701184 -956346 -955998
11539i55998J87130K79809L15196K07359Q138j15454o5137M2911P7050J11060
$$ -955998 -768868 -489059 -173863 33496 41634 -73820 -138957 -96046 -18996 92064
11529I2064J91463K05661N5244j42444k01600j31441m0882P8151J61074J51244
$$ 92064 283527 489188 544432 401988 200388 68947 28065 106216 267290 418534
11519D18534J31701O7769q2182j44810j06303n8099K0719J22734J13267J4834
$$ 418534 550235 618004 535822 391012 284709 226610 247329 370063 483330 498164
11509D98164m1620j46414k88888k59198r8958j5209p3217j05195O101J41421J21955
$$ 498164 456544 310130 21242 -237956 -336914 -352123 -425340 -530535 -524434 -383013 -261058
11498b61058L6634Q7693J54574P71l88248p53912q25326o13972k36776K25901
$$ -261058 -224424 -136731 17843 18614 -369634 -1123546 -1948872 -2562844 -2799620 -2573719
11488b573719N60544N77026M29976L35119K65944R7430j05281k18198l05186k66105
$$ -2573719 -2013175 -1436149 -1006173 -671054 -405110 -307680 -412961 -631159 -936345 -1202450
11478a202450R911L10229M52676N24022N14248L74971K59935J69935L2824n6706
$$ -1202450 -1192539 -882310 -429634 94388 608636 983607 1243542 1413477 1446301 1389595
11468A389595m7610j12128k25873k31294k14102k41606j73196M212J47618J39257
$$ 1389595 1341985 1229857 1003984 772690 558588 316982 143786 147998 295616 434873
11458D34873O3866M2235J1561L3891J45804K27691K89241K49833r5372m87583
$$ 434873 498739 540974 552535 586426 732230 959921 1249162 1498995 1403623 916040
11448I16040o16660n54173l88861j55293R0453K40967K65086J98718J06160j0961
$$ 916040 299380 -254793 -643654 -798947 -708494 -467527 -202441 -3723 102437 91476
11438I1476j15536j31458q7191p2089r2925j48777j96303j28342j9042P0487J41117
$$ 91476 -24060 -155518 -242709 -314798 -407723 -556500 -752803 -881145 -900187 -829700 -688583
11427f88583J15913M2741n8581j64141j66355q5695m7996k3207P3329J71032K66968
$$ -688583 -572670 -529929 -588510 -752651 -919006 -1004701 -1052697 -1075904 -1002575 -831543 -564575
11416e64575L75067L65054K07976N2339r9194j86420j84954j80374j48443q1085
$$ -564575 -189508 175546 383522 435861 336667 150247 -34707 -215081 -363524 -444609
11406d44609O486M1556q3421j35609n3080L2030J32980J44638N6188L104l94L2515
$$ -444609 -438123 -396567 -479988 -615597 -668677 -636647 -503667 -359029 -302841 -299737 -300131 -267616
11394b67616R4652R2872l83j13152j44886m2605Q1999K23726L25969K76036J56449
$$ -267616 -172964 -80092 -80475 -193627 -338513 -381118 -299119 -75393 250576 526612 683061
11383F83061J30236K20708L04346K13958L513j82098l38472m11580k95955j11727
$$ 683061 813297 1034005 1338351 1552309 1555822 1373724 1035252 623672 327717 215990
11373B15990n2885p4710p5738m7144j05555k55391l13212k32752m3610J10661
$$ 215990 163105 88395 12657 -34487 -140042 -395433 -708645 -941397 -985007 -874346
11363h74346J02452J7864m358l4320q9994r4913j07045q3449K0157O2157j8682
$$ -874346 -771894 -754030 -758388 -792708 -882702 -977615 -1084660 -1168109 -1147952 -1085795 -1104477
11352a104477j83514k15186q8556p7J8410J37485L38242L37221J67738J03471
$$ -1104477 -1287991 -1503177 -1591733 -1591810 -1573400 -1435915 -1097673 -760452 -592714 -489243
11342d89243J64027K47635K71672Q5795j86048k84326k75536k26454j03689K2821
$$ -489243 -325216 -77581 194091 279886 93838 -190488 -466024 -692478 -796167 -773346
11332g73346j4166j32400m5797K20949M44231N12296M30444K05730n9949k08469
$$ -773346 -787512 -919912 -965709 -744760 -300529 211767 642211 847941 787992 579523
11322E79523j23835Q6585J55779k065k24041l20748k49741q5377L0354L3750o8927
$$ 579523 455688 542273 698052 695987 471946 151198 -98543 -183920 -153566 -119816 -188743
11311a88743j57535j77518j13801J07036L54999L49772J11167o9918q7339k0772
$$ -188743 -346278 -523796 -637597 -530561 -175562 174210 285377 215459 128120 107348
11301A07348O3906J08285J10987J00817R789r7836o0129Q0236J56975J78461J95614
$$ 107348 171254 279539 390526 491343 501132 403296 343167 423403 580378 758839 954453
11290I54453K01395J92729R1238m8254m7732N0391J20971J59639J88119J53246
$$ 954453 1155848 1348577 1439815 1391561 1343829 1394220 1515191 1674830 1862949 2016195
11280B016195L0279j75645l38734k74371j23676q9180o7449M0459P4449o1811
$$ 2016195 2046474 1870829 1532095 1257724 1134048 1044868 977419 1017878 1092327 1030516
11270A030516k35924l76312m18732k94037r6564J3876J9716J7480R8196K07621
$$ 1030516 794592 418280 -452 -294489 -391053 -377177 -357461 -339981 -241785 -34164
11260c4164L13548M13214L97895K33190O6497K3330J22301K14796K22822J47120
$$ -34164 279384 692598 1090493 1323683 1390180 1413510 1535811 1750607 1973429 2120549
11250B120549L208j89288m34113n80802m62264j88581p1005j05727j09373n6196
$$ 2120549 2123757 1934469 1500356 919554 457290 268709 197704 91977 -17396 -73592
11240g3592k0944p1473p2304N6268K81615M10350K30510q6708k02478r9041J5362
$$ -73592 -94536 -166009 -238313 -182045 99570 509920 740430 653722 451244 352203 367565
11229C67565O0565J40816K36915K55631J72304k9375k29374k59598j06782R7285
$$ 367565 428130 568946 805861 1061492 1233796 1204421 975047 715449 608667 705952
11219G05952K17699J83030M3848j2352Q3833K06905J42615p4356k21797k52527
$$ 705952 923651 1106681 1150529 1138177 1222010 1428915 1571530 1497174 1275377 1022850
11209A022850o1351K00440K16693J04443J2121o5914j04047j38355j63375j96064
$$ 1022850 961499 1161939 1378632 1483075 1495196 1429282 1325235 1186880 1023505 827441
11199H27441k85918l18955k73069k44817j92407j05661J3630J27969K48015L27862
$$ 827441 541523 222568 -50501 -295318 -487725 -593386 -579756 -451787 -203772 124090
11189A24090K05631k6673j58141j31831m2866J45925L45595K75163P6333k8842
$$ 124090 329721 303048 144907 13076 -29790 116135 461730 736893 813226 784384
11179G84384m1042N8060J98344J55745k8781j47895j17290k823O4919M4502N9878
$$ 784384 743342 801402 999746 1155491 1126710 978815 861525 858702 923621 968123 1028001
11168A028001J60925J96295J34032J10669K02201K89109K22429L4858k09089l12474
$$ 1028001 1188926 1385221 1519253 1629922 1832123 2121232 2343661 2378519 2169430 1856956
11158A856956j92595r329J21481J62397K21535L61617M52062L60099K09764J63619
$$ 1856956 1664361 1655032 1776513 1938910 2160445 2522062 2974124 3334223 3543987 3707606
11148C707606J42792L2899m1175J8054P4442J10230K42487M28449M65763L05473
$$ 3707606 3850398 3883297 3842122 3860176 3934618 4044848 4287335 4715784 5181547 5487020
11138E487020J63012K83682O11693Q52350Q22785P23353P99321J061819J461314
$$ 5487020 5650032 5933714 6545407 7397757 8220542 8943895 9743216 10805035 12266349
11129A2266349J875095K290288K712251K988987L108816L200671L156344K603851
$$ 12266349 14141444 16431732 19143983 22132970 25241786 28442457 31598801 34202652
11121C4202652J447960l7117j382117k266461k693598k693829k395420k037786
$$ 34202652 35650612 35613495 34231378 31964917 29271319 26577490 24182070 22144284
11113B2144284j629238j093421n38794k1846L41230M07778K88830P6679j43120
$$ 22144284 20515046 19421625 18882831 18860985 19202215 19609993 19898823 19975502 19832382
11104A9832382k79507m23449o26809q89674j126332j338083j542362j605028j516712
$$ 19832382 19552875 19129426 18502617 17612943 16486611 15148528 13606166 12001138 10484426
11095A0484426j359158j086742o96775l82257k18387q8041N6582J90073K85459
$$ 10484426 9125268 8038526 7341751 6959494 6741107 6653066 6709648 6899721 7185180
11086G185180K92143K37776K89820M74224N78836N90236N46235M21521J66940
$$ 7185180 7477323 7715099 8004919 8479143 9057979 9648215 10194450 10615971 10782911
11077A0782911j91441m75532n64741m69620m05480n09432o35427o52751n80416
$$ 10782911 10591470 10115938 9551197 9081577 8676097 8166665 7531238 6878487 6298071
11068F298071l44584K0515L71941O34694P96672Q16356O71373N10110M60728M50307
$$ 6298071 5953487 5974002 6345943 6980637 7777309 8593665 9265038 9775148 10235876 10686183
11058A0686183L44508J97056J39413J08450n5649k55381l28062l39586k75817
$$ 10686183 11030691 11227747 11367160 11475610 11419961 11164580 10836518 10496932 10221115
11049A0221115p0214J55446K57131K98843L70414M75775O32051P27374P79012
$$ 10221115 10150901 10306347 10563478 10862321 11232735 11708510 12340561 13067935 13846947
11040A3846947R45484J150037J303360J405844J509407J757175K303514L023625
$$ 13846947 14792431 15942468 17245828 18651672 20161079 21918254 24221768 27245393
11032B7245393L670227M195692M640327M823498M433558L483136K092110K59783
$$ 27245393 30915620 35111312 39751639 44575137 49008695 52491831 54583941 54843724
11024E4843724j682209l206023m143282m665776m799248m384443l532321k509513
$$ 54843724 53161515 49955492 45812210 41146434 36347186 31962743 28430422 25920909
11016B5920909j579167q92355m14655j00433Q0630J68936J27418r5726m55759
$$ 25920909 24341742 23449387 23034732 22934299 23014929 23183865 23311283 23215557 22759798
11007B2759798p81999j045418j266834j386590j258907r09744o34777m78247k35514
$$ 22759798 21977799 20932381 19665547 18278957 17020050 16110306 15475529 14997282 14761768
10998A4761768P6899L18825N85118R81314J494624K020040K374503K434068K109895
$$ 14761768 14838667 15157492 15742610 16723924 18218548 20238588 22613091 25047159 27157054
10989B7157054J434199P00951o696p01612j053188q34154k73032K86804Q12088
$$ 27157054 28591253 29292204 29285508 28583896 27530708 26696554 26423522 26710326 27522414
10980B7522414J511863K415875L360413M172583M808324N329982N781789O146461
$$ 27522414 29034277 31450152 34810565 38983148 43791472 49121454 54903243 61049704
10972F1049704O299760O132609N512289M260303K271996k32306k815116n283275
$$ 61049704 67349464 73482073 78994362 83254665 85526661 85294355 82479239 77195964
10964G7195964p352474q624606q774368p881117o482739n086760l982948l174711
$$ 77195964 69843490 61218884 52444516 44563399 38080660 32993900 29010952 25836241
10956B5836241k559272k126211j761436j390155j124171j006544r40639q53679
$$ 25836241 23276969 21150758 19389322 17999167 16874996 15868452 14927813 14074134
10948A4074134p58704o51441n70306m62980j84814Q4528N8271k22523m41580l78200
$$ 14074134 13315430 12663989 12093683 11630703 11445889 11530417 11588688 11366165 10924585 10546385
10938A0546385n6617K69888M61500N50191N76048O79353R69145J296714J546202
$$ 10546385 10489768 10759656 11221156 11771347 12347395 13026748 13995893 15292607 16838809
10929A6838809J722769J763689J563380J224586Q48669K60034n79017j360408
$$ 16838809 18561578 20325267 21888647 23113233 23961902 24221936 23642919 22282511
10921B2282511j794904j929366j918028j869968j862008j782791j497988j190502
$$ 22282511 20487607 18558241 16640213 14770245 12908237 11125446 9627458 8436956
10913H436956j082452r35369o10225l26930k19755k91501m50306n41022n01893
$$ 8436956 7354504 6419135 5808910 5481980 5262225 4970724 4520418 3979396 3477503
10904C477503l96983l10131l46690m10260l54541k10405j04528o9048J277J83140
$$ 3477503 3080520 2770389 2423699 2013439 1658898 1448493 1343965 1274917 1276194 1459334
10894A459334L18301K23374Q1613O2658J40724K12119J99465J11396O2693J21085
$$ 1459334 1777635 2001009 2082622 2145280 2286004 2498123 2697588 2808984 2871677 2992762
10884B992762K35894K78366J26010j13178l09086m06398l38828j64682p3980n9304
$$ 2992762 3228656 3507022 3633032 3519854 3210768 2804370 2465542 2300860 2226880 2167576
10874B167576n1233m1796J0168J39300K25226J65621m7750k70042l60826l74874
$$ 2167576 2116343 2074547 2084715 2224015 2449241 2614862 2567112 2297070 1936244 1561370
10864A561370l80659l10730j73013m5543Q2482K33955L47534K89780N6148j90568
$$ 1561370 1180711 869981 696968 651425 733907 967862 1315396 1605176 1661324 1470756
10854A470756l14292k90223k46383l03196l21781k63611j85484m8418J08024J63243
$$ 1470756 1156464 866241 619858 316662 -5119 -268730 -454214 -502632 -394608 -231365
10844b31365J47216K65995M54878M82045L35429J62101l0649j93720k28693j17435
$$ -231365 -84149 181846 636724 1118769 1454198 1616299 1585650 1391930 1163237 1045802
10834A045802K0967R7900R0277j5899n9979n4121k24685m48959m58478k75034
$$ 1045802 1066769 1164669 1254946 1239047 1179068 1124947 900262 451303 -7175 -282209
10824b82209j94714l05881l80247l27940k13150j33735p1347L0242Q5893J03317
$$ -282209 -476923 -782804 -1163051 -1490991 -1704141 -1837876 -1909223 -1878981 -1793088 -1689771
10814a689771R6940J00418J12514Q6161P8847N1606K861j2539O1929J32590M1305
$$ -1689771 -1592831 -1492413 -1379899 -1293738 -1214891 -1163285 -1160424 -1172963 -1111034 -978444 -937139
10803i37139j20362j39526k9944m491q764J19701J60240P479j5226J66415L07738
$$ -937139 -1057501 -1197027 -1226971 -1231462 -1240226 -1120525 -960285 -952806 -968032 -801617 -493879
10792d93879K47831N5636j27446j83619j87436j88827j28671P3168L47478N51996
$$ -493879 -246048 -190412 -317858 -501477 -688913 -877740 -1006411 -933243 -585765 -33769
10782c3769N53057L71209J59205P97r0472r8144J2930J13832J24914J34278J80163
$$ -33769 519288 890497 1049702 1050499 960027 861883 874813 988645 1113559 1247837 1428000
10771A428000J44024o9379l46793m48333m01261m01529l52038j17151J17416K30743
$$ 1428000 1572024 1502645 1155852 707519 306258 -95271 -447309 -564460 -447044 -216301
10761b16301K42842J53653L4293j9967K8937R7101J71244K76606K68409Q2413
$$ -216301 26541 180194 214487 194520 223457 320558 491802 768408 1036817 1119230
10751A119230k07517m23789m78819l71288j55444K9091P9619k2286r3385Q954
$$ 1119230 911713 487924 9105 -362183 -517627 -488536 -408917 -431203 -524588 -515634
10741e15634J52428K04269K23375K72232J75382q1944k83364l33752k57659j98308
$$ -515634 -363206 -158937 64438 336670 512052 430108 146744 -187008 -444667 -642975
10731f42975k10196n7231K93782N36176M73203K55421J69932K48310K51205O3319
$$ -642975 -853171 -910402 -616620 -80444 392759 648180 818112 1066422 1317627 1380946
10721A380946q8093j52693l05337m72177l98104j65221M15O9857Q4168Q8707P8638
$$ 1380946 1292853 1140160 834823 362646 -35458 -200679 -200264 -130407 -46239 42468 121106
10710A21106M1492M0200J03417k144l05746n04836n27094m87505l54134j28407
$$ 121106 162598 202798 306215 304071 -1675 -506511 -1033605 -1521110 -1875244 -2003651
10700b003651L5854J28369K19373K57020J55035p0805k29381j61131L3637J44359
$$ -2003651 -1967797 -1839428 -1620055 -1363035 -1208000 -1278805 -1508186 -1669317 -1635680 -1491321
10690a491321J07802j6406n2993L5287J73030J91557R7660R7622J93992K21361
$$ -1491321 -1383519 -1399925 -1452918 -1417631 -1244601 -1053044 -955384 -857762 -663770 -442409
10680d42409K06143L00227L79513K69543J34543J10735M9314j69563l50774l48166
$$ -442409 -236266 63961 443474 713017 847560 958295 1007609 838046 487272 139106
10670A39106j81659J13784M18085N56927M77505K62239n2018l12663m33633m85191
$$ 139106 -42553 71231 489316 1046243 1523748 1785987 1733969 1421306 987673 502482
10660E02482m42880k79863j31988p0712j12758j63402q2678P4154J25296L6098
$$ 502482 59602 -220261 -352249 -422961 -535719 -699121 -781799 -707645 -582349 -546251
10650e46251L5490J70022J64032M6436l0062j00576j70010j56746o1210N39K7873
$$ -546251 -510761 -340739 -176707 -130271 -160333 -260909 -430919 -587665 -648875 -648336 -620463
10639f20463P5970P9351L0329j1604K1250J34816K55984L71191L74370K21827
$$ -620463 -544493 -465142 -434813 -446417 -425167 -290351 -34367 336824 711194 933021
10629I33021P5482l624m9815j23066k17370k77718k95953l30100k94380j31240
$$ 933021 1008503 1004879 955064 831998 614628 336910 40957 -289143 -583523 -714763
10619g14763O1693K52538L63931L49086L35496K48972J11899R8673O9909n8538
$$ -714763 -653070 -400532 -36601 312485 647981 896953 1008852 1107525 1177434 1118896
10609A118896j73600j66415r4407j00027j85099j58700j7822J00171J22720N2515
$$ 1118896 945296 778881 684474 584447 399348 240648 222826 322997 445717 498232
10599D98232L4794P4348O7027K1819l1803j23043j82083p6625J83884K86724R3366
$$ 498232 533026 607374 674401 696220 664417 541374 359291 282666 466550 753274 846640
10588H46640j25327k23152k46234l16472n29129o48547m10393L206K93719M08757
$$ 846640 721313 498161 251927 -64545 -593674 -1242221 -1652614 -1649408 -1355689 -946932
10578i46932L32210J57609P190j02943j22558p6018m9125K0871J25132J25632
$$ -946932 -614722 -457113 -449923 -552866 -675424 -751442 -800567 -779696 -654564 -528932
10568e28932n756j88557j96589l4592L8349J0582P5947K05404K25935J93770J47494
$$ -528932 -534688 -723245 -919834 -954426 -916077 -905495 -829548 -624144 -398209 -204439 -56945
10557e6945K6601k9672P69p252p4386q5971p5600j19241n9599K06282L65947K78556
$$ -56945 -30344 -60016 -59247 -66499 -140885 -226856 -302456 -421697 -481296 -275014 90933 369489
10545C69489K18430K34115J18606n3078j18472j77492l14351l82805k78411j60475
$$ 369489 587919 822034 940640 887562 769090 591598 277247 -105558 -383969 -544444
10535e44444j05650m969J24715K17415J60934k5907j58360k04205j64215j1176
$$ -544444 -650094 -655063 -530348 -312933 -151999 -177906 -336266 -540471 -704686 -715862
10525g15862J29118P5738o8114j09154r1417l7849M1544M2271P1366L00666N45879
$$ -715862 -586744 -511006 -579120 -688274 -779691 -817540 -775996 -733725 -662359 -361693 184186
10514A84186O13194N23983K63165j05174l53595l31245k04603j61413j88493j61978
$$ 184186 797380 1321363 1584528 1479354 1125759 794514 589911 428498 240005 78027
10504G8027o4325o4333j69092k55807k63990k08235j61389j09070k1773K6812
$$ 78027 13702 -50631 -219723 -475530 -739520 -947755 -1109144 -1218214 -1239987 -1213175
10494a213175O0473J44990K41272L07177K86673K06832J86395K03715J54791J22919
$$ -1213175 -1152702 -1007712 -766440 -459263 -172590 34242 220637 424352 579143 702062
10484G02062Q9141l4793j58496k43705k67198k91992l07383k24022o1473Q6900
$$ 702062 791203 756410 597914 354209 87011 -204981 -512364 -736386 -797859 -710959
10474g10959J69757J57888J66539K49673K57375J51701M4645p5488k01672k74293
$$ -710959 -541202 -383314 -216775 32898 290273 441974 486619 411131 209459 -64834
10464f4834k59761j58276j57403k18741j21891M5409J04970r69o5713M0238J26841
$$ -64834 -324595 -482871 -640274 -859015 -980906 -935497 -830527 -831496 -897209 -856971 -730130
10453g30130J01179O4782O2244P5514P3250J32370K28047J63563K9738o5641j61954
$$ -730130 -628951 -564169 -501925 -426411 -353161 -220791 7256 170819 200557 134916 -27038
10442b7038j78124m7603J43657L06194L38307J43243k14171m03117k97334r1631
$$ -27038 -205162 -252765 -109108 197086 535393 678636 464465 61348 -235986 -327617
10432c27617M6487R6431J05072N8980l0360j51155k40068k17364j44520p5506
$$ -327617 -281130 -184699 -79627 -20647 -51007 -202162 -442230 -659594 -804114 -879620
10422h79620J9559K18997L66045J95487j05977k88103k82151j44209j0399M3815
$$ -879620 -860061 -641064 -275019 -79532 -185509 -473612 -755763 -899972 -910371 -866556
10412h66556J07851J94334K04298J07794o2872j98227l09440l60779k10584P2008
$$ -866556 -758705 -564371 -360073 -252279 -315151 -513378 -822818 -1183597 -1394181 -1322173
10402a322173K90584L52583K92551K17472P3252j74231k70588q0405J59554J78819
$$ -1322173 -1031589 -679006 -386455 -168983 -95731 -269962 -540550 -620955 -461401 -282582
10392b82582l2108k29820k22353q6786m3728n0811k717P281q6399j80506j04506
$$ -282582 -314690 -544510 -766863 -853649 -897377 -948188 -950905 -943624 -1030023 -1210529 -1315035
10381a315035M9202O2729n5456j99756j86583k3705J69988M28838O11883N34230
$$ -1315035 -1265833 -1203104 -1258560 -1458316 -1644899 -1668604 -1498616 -1069778 -457895 76335
10371G6335L10088J53453J43066K05576J92105M1149m2241Q9577J70748q2519
$$ 76335 386423 539876 682942 888518 1080623 1121772 1079531 1169108 1339856 1257337
10361A257337m06401m28786k08726m9344p9025j55616j63020q1808L9756J9594
$$ 1257337 850936 422150 213424 164080 85055 -70561 -233581 -315389 -275633 -256039
10351b56039j20763j13527N7971J89024K00441N3586j09853j60233r8004O3970
$$ -256039 -376802 -490329 -432358 -243334 -42893 10693 -99160 -259393 -357397 -293427
10341b93427J94668J11694m945L7041J45609J69138R3457k8291j82582k30389
$$ -293427 -98759 12935 7990 45031 190640 359778 453235 424944 242362 11973
10331A1973j17928j9719j8737k5517N8080J73808K02791N9934p5116N2401J98719
$$ 11973 -105955 -125674 -144411 -169928 -111848 61960 264751 324685 249569 301970 500689
10320E00689J02497j48839l82070m70952l58538j46752q8157k19592k44011o7850
$$ 500689 603186 454347 72277 -398675 -757213 -903965 -992122 -1211714 -1455725 -1523575
10310a523575J14992K20459K49663K25539J31343j2775r4349J1659J71772K27355
$$ -1523575 -1408583 -1188124 -938461 -712922 -581579 -594354 -688703 -677044 -505272 -277917
10300b77917J71028K3650J6834J85394J87503m2776k53567l21189k40608j36168
$$ -277917 -106889 -83239 -66405 118989 306492 263716 10149 -311040 -551648 -687816
10290f87816n2762L8454J56814K99061L25459K61601K66737L06269J92146n2376
$$ -687816 -740578 -702124 -545310 -246249 79210 340811 607548 913817 1105963 1053587
10280A053587k22923k06183o1890O9232J07427L5428r8927k59534k98541j81696
$$ 1053587 830664 624481 562591 631823 739250 774678 675751 416217 117676 -64020
10270f4020q4600j7689P7372J63320J51125l2984k91606m27022m35927l42451
$$ -64020 -148620 -166309 -88937 74383 225508 192524 -99082 -526104 -962031 -1304482
10260a304482j42039k1864k3887n609J13008K24468K16856O1071p1031J5385K17749
$$ -1304482 -1446521 -1468385 -1492272 -1497881 -1384873 -1160405 -943549 -882478 -953509 -938124 -720375
10249g20375J70228q9143k64108l06217k72487k16589j81363j02212O5840K25000
$$ -720375 -550147 -639290 -903398 -1209615 -1482102 -1698691 -1880054 -1982266 -1916426 -1691426
10239a691426L26493L52603L42435K84461J43368k9826k17515k75162j00816J46236
$$ -1691426 -1364933 -1012330 -669895 -385434 -242066 -271892 -489407 -764569 -865385 -719149
10229g19149K30557J33055R227j955M5590O1976J05906J97010J94688J09967J04997
$$ -719149 -488592 -355537 -346310 -348265 -302675 -240699 -134793 62217 256905 366872 471869
10218D71869J15364J18357J61085O4873j61865l26289l36046k04448j08984r8236
$$ 471869 587233 705590 866675 931548 769683 443394 107348 -97100 -206084 -304320
10208c04320j08968q1147K3497J83767L21753L27064K14831J53403O7269j26418
$$ -304320 -413288 -494435 -470938 -287171 34582 361646 576477 729880 797149 670731
10198F70731j70003j5812J55512K05415J02939k9745r3293j13759j21641j37383
$$ 670731 500728 484916 640428 845843 948782 919037 825744 711985 590344 452961
10188D52961j19976o1714r2716j73073k08548k12559k02221j48397o1150L5463
$$ 452961 332985 271271 178555 5482 -203066 -415625 -617846 -766243 -827393 -791930
10178g91930Q1981M5041L6994J04388J30920K5314j72709k68283q9435J71233
$$ -791930 -709949 -664908 -627914 -523526 -392606 -367292 -540001 -808284 -897719 -726486
10168g26486K51106J70984l27j40796j51105r8256L6722J89317K84399M20963
$$ -726486 -475380 -304396 -304723 -445519 -596624 -694880 -658158 -468841 -184442 236521
10158B36521N77952O06030M97752L19327O3875k07365m44802n95932n63623l75922
$$ 236521 814473 1420503 1918255 2237582 2301457 2094092 1649290 1053358 489735 113813
10148A13813k13842j08670O7545K70586L52042K29535K3807o2725n5883p7222
$$ 113813 -100029 -208699 -141154 129432 481474 711009 734816 672091 616208 538986
10138E38986j33483j91761k85107l94305l88881l32574l24129k64224p2300J19068
$$ 538986 405503 213742 -71365 -465670 -854551 -1187125 -1511254 -1775478 -1847778 -1728710
10128a728710J31424J07980Q7041J2749N6069J84208J52134k6190k11795k82118
$$ -1728710 -1597286 -1489306 -1402265 -1389516 -1333447 -1149239 -997105 -1023295 -1235090 -1517208
10118a517208r6415K29200L63432K15175L8317K9544J59363K22877K60443K77349
$$ -1517208 -1613623 -1384423 -1020991 -805816 -767499 -737955 -578592 -355715 -95272 182077
10108A82077K52403K74295L14959K77327J18105n8042j05090q2011j38265r3685
$$ 182077 434480 708775 1023734 1301061 1419166 1361124 1256034 1174023 1035758 942073
10098I42073O5618J00726j04555l89640n34621m96805l55167k03420o4799J6871
$$ 942073 1007691 1108417 1003862 614222 79601 -417204 -772371 -975791 -1040590 -1023719
10088a023719l1629j67804k74864k24234m2015J35789K46234K66269K55743L51299
$$ -1023719 -1055348 -1223152 -1498016 -1722250 -1764265 -1628476 -1382242 -1115973 -860230 -508931
10078e08931M25097L67080K57211Q4161n7588n0077o3940k22685l69097l15152
$$ -508931 -83834 283246 540457 624618 567030 516953 453013 230328 -138769 -453921
10068d53921j61626k00817l59586l23085p5590J36728K40307K62553K49010K97855
$$ -453921 -615547 -816364 -1175950 -1499035 -1574625 -1437897 -1197590 -935037 -686027 -388172
10058c88172L11514K29444O5749j41364l14954l79544l88177l59315k05212q149
$$ -388172 -76658 152786 218535 77171 -237783 -617327 -1005504 -1364819 -1570031 -1578180
10048a578180J64793K92783L75911L72475K72614J42867j0107j48944k10716k06044
$$ -1578180 -1413387 -1120604 -744693 -372218 -99604 43263 33156 -115788 -326504 -532548
10038e32548j42714o6116l118l471k3906M791j2468j49984k98711l20371k35617
$$ -532548 -675262 -741378 -744496 -747967 -771873 -767082 -779550 -929534 -1228245 -1548616 -1784233
10027a784233o3521K06386M72567N04969K70901j309j20131r6647q0896j51006
$$ -1784233 -1847754 -1641368 -1168801 -663832 -392931 -394240 -514371 -611018 -691914 -842920
10017h42920k07605j24714O063J12275K46845M15351N23923M15253J48657l6802
$$ -842920 -1050525 -1175239 -1169176 -1056901 -810056 -394705 129218 544471 693128 656326
10007F56326j26289k06439k48256k82460k76886k19541o0225J29645J85161J36536
$$ 656326 530037 323598 75342 -207118 -484004 -703545 -763770 -634125 -448964 -312428
9997c12428Q6636P6300M4961O4055J44136J57937J13909P0038p970k5546J49315
$$ -312428 -225792 -149492 -104531 -40476 103660 261597 375506 445544 437574 412028 561343
9986E61343K95842J93821K2208p0956j47796k28946k54624j76918J2125J94015
$$ 561343 857185 1051006 1073214 1002258 854462 625516 370892 193974 206099 400114
9976D00114K45233J28611j00168k66152l07613k39645j77565j84244j95362k31488
$$ 400114 645347 773958 673790 407638 100025 -139620 -317185 -501429 -696791 -928279
9966i28279k20292k01255k48209j30458J00932K00620K34290J39986K1877R9955
$$ -928279 -1148571 -1349826 -1598035 -1728493 -1627561 -1426941 -1192651 -1052665 -1030788 -930833
9956i30833K54742L46144K99037J36180k5832k26683m03068m37126l29067q1788
$$ -930833 -676091 -329947 -30910 105270 79438 -147245 -550313 -987439 -1316506 -1398294
9946a398294K05420L47101K98609J33658J4170o3300j28425j30727n8724m772
$$ -1398294 -1192874 -845773 -547164 -413506 -399336 -462636 -591061 -721788 -780512 -785284
9936g85284J3768O6544P5497N4901Q7626J62846K02603J98353J24779m2608k31719
$$ -785284 -771516 -704972 -629475 -574574 -486948 -324102 -121499 76854 201633 159025 -72694
9925g2694l11946k33381j09238P356M4763N7187J22940O8542r3047j88928j62684
$$ -72694 -384640 -618021 -727259 -719903 -675140 -617953 -495013 -426471 -519518 -708446 -871130
9914h71130o1262P2576J90066K74854K93345K52085J84971J83508J85928J52512
$$ -871130 -932392 -859816 -669750 -394896 -101551 150534 335505 519013 704941 857453
9904H57453Q7424p1345l08721m70577l81011k17424q6920L8751J62026L06997
$$ 857453 944877 873532 564811 94234 -286777 -504201 -591121 -552370 -390344 -83347
9894h3347L71994K64735k2908l15347l64649k17073r4515p6944j43889j31718
$$ -83347 288647 553382 530474 215127 -149522 -366595 -461110 -538054 -681943 -813661
9884h13661m6021l193M5694N4702K3194P7940J47547J83084K17184J37669l5030
$$ -813661 -859682 -862875 -817181 -762479 -739285 -661345 -513798 -330714 -113530 24139 -10891
9873a0891j63311k33968k15698j13276o6438k2180R8908K28087L52449M26711
$$ -10891 -174202 -408170 -623868 -737144 -803582 -825762 -726854 -498767 -146318 280393
$$ [...]
##END NTUPLES=NMR SPECTRUM
##END=
