##TITLE=C13_DE-14HK2-HCl
 D2O, 22400 sc

 26.10.2023
##JCAMPDX= 6.0         $$ Bruker NMR JCAMP-DX V2.0
##DATA TYPE= NMR SPECTRUM
##DATA CLASS= NTUPLES
##ORIGIN= UXNMR, Bruker Analytische Messtechnik GmbH
##OWNER= root
$$ XWIN-NMR		Version 3.5
$$ Fri Oct 27 13:40:03 2023 Russian Standard Time (UT+4h)  she@DPX200
##.OBSERVE FREQUENCY= 50.327896
##.OBSERVE NUCLEUS= ^13C
##.ACQUISITION MODE= SIMULTANEOUS
##.ACQUISITION SCHEME= undefined
##.AVERAGES= 22401
##.DIGITISER RES= 17
##SPECTROMETER/DATA SYSTEM= spect
##.PULSE SEQUENCE= zgpg30
##.SOLVENT NAME= CDCl3
##.SHIFT REFERENCE= (INTERNAL, CDCl3, 0, 222.624)
##AUDIT TRAIL= $$ (NUMBER, WHEN, WHO, WHERE, WHAT)
$$ ##TITLE= Audit trail, XWIN-NMR		Version 3.5
$$ ##JCAMPDX= 5.01
$$ ##ORIGIN= Bruker BioSpin GmbH
$$ ##OWNER= she
$$ F:/spectra/data/she/nmr/c13/1/pdata/1/auditp.txt
$$ ##AUDIT TRAIL=  $$ (NUMBER, WHEN, WHO, WHERE, WHAT)
(   1,<2023-10-27 13:38:52.34 +0400>,<she>,<DPX200>,
      <created by zg, POWCHK disabled, PULCHK disabled
       terminated by command 'halt'
       configuration hash MD5:
       00 E9 B6 7A A2 85 ED C7 34 08 36 98 17 FE 4E 26
       data hash MD5: 32K
       99 98 AA F6 A6 02 5D 12 11 FE D6 4B 0E 92 63 99>)
(   2,<2023-10-27 13:38:57.45 +0400>,<she>,<DPX200>,
      <Start of raw data processing
       efp BC_mod = 2 LB = 2 FT_mod = 6 PKNL = 1 PHC0 = -367.4953 PHC1 = 30.13753 SI = 32K 
       data hash MD5: 32K
       5C CC D5 87 63 F0 A1 B1 C6 4B EE 09 7B 92 C2 C5>)
(   3,<2023-10-27 13:39:03.45 +0400>,<she>,<DPX200>,
      <abs ABSG = 5 
       data hash MD5: 32K
       1B 8A F6 2A 41 0D 2A 0D 2C 63 9A 62 7B B8 AF 9D>)
(   4,<2023-10-27 13:39:28.40 +0400>,<she>,<DPX200>,
      <pk PHC0 = 0.9595685 PHC1 = 2.400001 
       data hash MD5: 32K
       6E 27 A0 31 B6 92 E4 1B 04 44 D0 25 1D 4A 96 65>)
(   5,<2023-10-27 13:39:32.76 +0400>,<she>,<DPX200>,
      <abs ABSG = 5 
       data hash MD5: 32K
       6E F8 5D C6 92 E2 B1 96 6E D6 67 B9 D9 6B 40 E1>)
$$ ##END=
$$ 
$$ hash MD5
$$ 0F 1C EF 26 D2 5C B9 44 5B 6A AD B1 22 A5 D7 4B
##$RELAX= 
##$RELAX= 
##$RELAX= 
##$RELAX= 
##$RELAX= 
##$RELAX= 
##$RELAX= 
##$RELAX= 
$$ Bruker specific parameters
$$ --------------------------
##$DU= <F:/spectra>
##$EXPNO= 1
##$NAME= <c13>
##$PROCNO= 1
##$TYPE= <nmr>
##$USER= <she>
##$AMP= (0..31)
100 100 100 100 100 100 100 100 100 100 100 100 100 100 100 100 100 100 
100 100 100 100 100 100 100 100 100 100 100 100 100 100 
##$AQSEQ= 0
##$AQ_mod= 1
##$AUNM= <au_zg>
##$AUTOPOS= <>
##$BF1= 50.322709
##$BF2= 200.13
##$BF3= 50.322709
##$BF4= 500.13
##$BF5= 500.13
##$BF6= 500.13
##$BF7= 500.13
##$BF8= 500.13
##$BYTORDA= 1
##$CFDGTYP= 0
##$CFRGTYP= 5
##$CHEMSTR= <none>
##$CNST= (0..31)
1 1 145 1 1 1 1 1 1 1 1 1 1 1 1 1 1 1 1 1 1 1 1 1 1 1 1 1 1 1 1 1 
##$CPDPRG= <waltz16>
##$CPDPRG1= <>
##$CPDPRG2= <waltz16>
##$CPDPRG3= <>
##$CPDPRG4= <mlev>
##$CPDPRG5= <mlev>
##$CPDPRG6= <mlev>
##$CPDPRG7= <mlev>
##$CPDPRG8= <mlev>
##$CPDPRGB= <>
##$CPDPRGT= <>
##$D= (0..31)
$$ [...]
##$SUBNAM4= <"">
##$SUBNAM5= <"">
##$SUBNAM6= <"">
##$SUBNAM7= <"">
##$SUBNAM8= <"">
##$SUBNAM9= <"">
##$SW= 239.972175391363
##$SWIBOX= (0..15)
0 1 3 0 0 0 0 0 0 0 0 0 0 0 0 0 
##$SW_h= 12077.2946859903
##$TD= 32768
##$TD0= 1
##$TE= 0
##$TE2= 300
##$TE3= 300
##$TEG= 300
##$TL= (0..7)
120 120 120 120 120 120 120 120 
##$TP= (0..7)
150 150 150 150 150 150 150 150 
##$TP07= 0
##$TPNAME0= <>
##$TPNAME1= <>
##$TPNAME2= <>
##$TPNAME3= <>
##$TPNAME4= <>
##$TPNAME5= <>
##$TPNAME6= <>
##$TPNAME7= <>
##$TPOAL= (0..7)
0.5 0.5 0.5 0.5 0.5 0.5 0.5 0.5 
##$TPOFFS= (0..7)
0 0 0 0 0 0 0 0 
##$TUNHIN= 0
##$TUNHOUT= 0
##$TUNXOUT= 0
##$USERA1= <user>
##$USERA2= <user>
##$USERA3= <user>
##$USERA4= <user>
##$USERA5= <user>
##$V9= 5
##$VALIST= <valist>
##$VCLIST= <CCCCCCCCCCCCCCC>
##$VD= 0
##$VDLIST= <DDDDDDDDDDDDDDD>
##$VPLIST= <PPPPPPPPPPPPPPP>
##$VTLIST= <TTTTTTTTTTTTTTT>
##$WBST= 1024
##$WBSW= 4
##$XGAIN= (0..3)
0 0 0 0 
##$XL= 0
##$YL= 0
##$YMAX_a= 107402374
##$YMIN_a= -37603190
##$ZGOPTNS= <>
##$ZL1= 120
##$ZL2= 120
##$ZL3= 120
##$ZL4= 120
##$ABSF1= 222.624
##$ABSF2= -17.3728
##$ABSG= 5
##$ABSL= 3
##$ALPHA= 0
##$AQORDER= 0
##$ASSFAC= 0
##$ASSFACI= 0
##$ASSFACX= 0
##$ASSWID= 0
##$AUNMP= <proc_1d>
##$AZFE= 0.1
##$AZFW= 0.5
##$BCFW= 0
##$BC_mod= 2
##$BYTORDP= 0
##$COROFFS= 0
##$CY= -3
##$DATMOD= 1
##$DC= 0
##$DFILT= <>
##$DTYPP= 0
##$F1P= 0
##$F2P= 0
##$FCOR= 0.5
##$FTSIZE= 32768
##$FT_mod= 6
##$GAMMA= 0
##$GB= 0
##$INTBC= 1
##$INTSCL= 4.134877e-10
##$ISEN= 128
##$LB= 2
##$LEV0= 0
##$LPBIN= 0
##$MAXI= 10000
##$MC2= 0
##$MEAN= 0
##$ME_mod= 0
##$MI= 0.1934396
##$NCOEF= 0
##$NC_proc= 0
##$NLEV= 6
##$NOISF1= 120.0001
##$NOISF2= 80.00006
##$NSP= 0
##$NTH_PI= 0
##$NZP= 0
##$OFFSET= 222.624
##$PC= 1.4
##$PHC0= -366.5357
##$PHC1= 32.53753
##$PH_mod= 1
##$PKNL= yes
##$PPARMOD= 0
##$PSCAL= 0
##$PSIGN= 0
##$REVERSE= no
##$SF= 50.3227315983092
##$SI= 32768
##$SIGF1= 140
##$SIGF2= 120
##$SINO= 11.81781
##$SIOLD= 32768
##$SREGLST= <13C.CDCl3>
##$SSB= 0
##$STSI= 32768
##$STSR= 0
##$SW_p= 12077.2946859903
##$SYMM= 0
##$S_DEV= 0
##$TDeff= 32768
##$TDoff= 0
##$TI= <>
##$TILT= no
##$TM1= 0
##$TM2= 0
##$TOPLEV= 0
##$USERP1= <user>
##$USERP2= <user>
##$USERP3= <user>
##$USERP4= <user>
##$USERP5= <user>
##$WDW= 1
##$XDIM= 32768
##$YMAX_p= 211417687
##$YMIN_p= -76364707
$$ End of Bruker specific parameters
$$ ---------------------------------
##NTUPLES= NMR SPECTRUM
##VAR_NAME=  FREQUENCY,     SPECTRUM/REAL,   SPECTRUM/IMAG
##SYMBOL=    X,             R,               I
##VAR_TYPE=  INDEPENDENT,   DEPENDENT,       DEPENDENT
##VAR_FORM=  AFFN,          ASDF,            ASDF
##VAR_DIM=   32768,         32768,           32768
##UNITS=     HZ,            ARBITRARY UNITS, ARBITRARY UNITS
##FACTOR=    0.368581032318806, 1,           1
##FIRST=     11203.0474430531, 0,            0
##LAST=      -874.247242937185, 0,           0
##MIN=       -874.247242937185, -76364707,   0
##MAX=       11203.0474430531, 211417687,    0
$$ Real data points
##PAGE= N=1
##DATA TABLE= (X++(R..R)), XYDATA
$$ [...]
8083B100651n38553q3121L08296K89103K1956r865K68616M03482P5303l51362
8073B484506k60217M0586K923m48744q75711q12612m49120j48218p2242k23195
8063g62044m90927n22280j78482J83395M06546N81282P56276Q41170N87205J26041
8053A528182o323K97596M56155j2405q03308j165686r25057m50172j2532K55110
8043h38440L00448L19253M44252M03259M4735l93290m45050o6259L41172N90465
8033G00545N86637N00494M36357L20953J66230o4416l15368m87674m71002k47226
8023A125530M9727K06764J92673K49752L92746M33654J83418k80063n55712o12656
8013A385833n56047k80324K56290R57244J331199R72387J52157o56789j087646
$$ y = [2100651, 1562098, 1478977, 1787273, 2076376, 2098332, 2088467, 2357083, 2760565, 2835868, 2484506, 2224289, 2264875, 2267798, 1819054, 943343, 130731, -318389, -466607, -538849, -762044, -1252971, -1775251, -1953733, -1770338, -1363792, -782510, -26234, 814936, 1402141, 1528182, 1521859, 1819455, 2275610, 2263205, 1459897, 294211, -630846, -1081018, -1093550, -838440, -537992, -218739, 225513, 628772, 673507, 280217, -164833, -231092, 110080, 700545, 1287182, 1787676, 2224033, 2544986, 2711216, 2646800, 2331432, 1843758, 1372756, 1125530, 1175257, 1382021, 1574694, 1824446, 2217192, 2650846, 2834264, 2554201, 1998489, 1385833, 829786, 549462, 805752, 1762996, 3094195, 4066582, 4218739, 3561950, 2474304]
8004B474304j168458j162441r81173o90129n31907k57935K16440M47796L02394
7995a351109R4097o4091k35961k64578j09737L1228J16593K84454M21797K70759
7985h06548j06565l71210k74225j3104K6630j98284m71520m75695q7952M84307
7975b294166O54853L63179n0738m46939n95448m96353k26359k5295n4415k05029
7965c376710k72695j07027J63601K40450J87641J37630J13247J58909L22398P03616
7955a728940R15125O40375J05439l33459m29152k11668L0251P5493l0342N9513
7945i07365K88959J89582j54179m95852q36621p48272j90692K30142M72405P52107
7935a399786O22428o0425n43504n65385l63056k650M02433R15781J354387J101789
$$ y = [2474304, 1305846, 143405, -837768, -1527897, -2059804, -2317739, -2101299, -1653503, -1351109, -1257012, -1321103, -1557064, -1821642, -1931379, -1900151, -1783558, -1499104, -1077307, -806548, -913113, -1284323, -1558548, -1571652, -1545022, -1743306, -2214826, -2690521, -2778473, -2294166, -1639313, -1276134, -1326872, -1773811, -2369259, -2865612, -3091971, -3117266, -3171681, -3376710, -3649405, -3756432, -3592831, -3352381, -3164740, -3027110, -2913863, -2754954, -2432556, -1728940, -813815, -173440, -68001, -401460, -830612, -1042280, -1012029, -936536, -966878, -907365, -618406, -428824, -583003, -1078855, -1915476, -2663748, -2854440, -2624298, -2151893, -1399786, -777358, -837783, -1381287, -1946672, -2309728, -2312378, -1909945, -994164, 360223, 1462012]
7925A462012L38034l74473p54221p84910o77649l35602J32229L82015O47705P99548
7915H34688L89709j33353k50756l17635o45792q71355p46995m81355j028N43570
7905a680302N99573L87779L97759M25059K82479L7353o5791L1066k9986j88751
7895A96238O2209N14248N90510L78397Q439l51162m49165l76630l0726M76954
7885A019312M75734p2131n47049o16065m06177j79467O001K05638J97368k1011
7875F2153l01964n45901n22767k68894j46279k7261L85450Q01440Q10579N59634
7865H06190L53231K33425K84328L83146K52699O7154o7328m50813o77605m02054
7855G82373M4289K72142K20270J32067J29107K27813L48257J78836k52959n73503
$$ y = [1462012, 1800046, 1425573, 671352, -113558, -791207, -1126809, -994580, -612565, 35140, 834688, 1224397, 1091044, 840288, 522653, -123139, -994494, -1741489, -2222844, -2223872, -1680302, -1080729, -692950, -295191, 129868, 412347, 449700, 383909, 414975, 384989, 196238, 258447, 772695, 1363205, 1741602, 1750041, 1398879, 949714, 573084, 542358, 1019312, 1495046, 1422915, 875866, 259801, -146376, -325843, -319842, -114204, 83164, 62153, -239811, -785712, -1308479, -1577373, -1723652, -1750913, -1365463, -564023, 246556, 806190, 1159421, 1392846, 1677174, 2060320, 2313019, 2380173, 2312845, 1862032, 1184427, 782373, 826662, 1098804, 1319074, 1451141, 1580248, 1808061, 2156318, 2335154, 2082195, 1508692]
7845A508692p05085o17400l72168j19918P5016O0791k19617o48152q41832m52193
7835b331866P3669L22745P09735J350205J499285R38698J43732m74946p52231
7826A479026q49790p80909m95195j35706J4060j07019k20008k50353j99206j59980
7816a705080k21974k11746J49209O23770P81399M71519j41208o25855q27898q16664
7806b524528n08618K0430M01127N14269L28791j1577l44176n80462o14011o42681
7796c961436p37596m69027J57136N68406O00705N18978P25173R58211P23527L81889
7786e34034J69472m5746l18517n24076l31354J98555P87817J078140Q87350O72593
7776B040200N55818N69515O39074L05290l46826q17760q75612p99004q66808r74493
$$ y = [1508692, 803607, 186207, -185961, -305879, -230863, -170072, -389689, -1037841, -1879673, -2331866, -2258197, -1935452, -1225717, 124488, 1623773, 2562471, 2706203, 2231257, 1479026, 629236, -151673, -646868, -782574, -768514, -875533, -1095541, -1345894, -1545100, -1705080, -1927054, -2138800, -1989591, -1365821, -584422, -112903, -254111, -879966, -1707864, -2524528, -3033146, -3012716, -2611589, -2097320, -1768529, -1780106, -2124282, -2704744, -3318755, -3961436, -4699032, -5168059, -5010923, -4442517, -3841812, -3322834, -2597661, -1639450, -915923, -534034, -364562, -410308, -728825, -1252901, -1584255, -1385700, -597883, 480257, 1367607, 2040200, 2596018, 3165533, 3804607, 4109897, 3763071, 2945311, 2069699, 1270695, 403887, -570606]
7766e70606q59101n05181k13383k11889k66088k27357j44698j51443l59545m36046
7756c945337k16989Q8817M23087P07042P57683N81783K70337Q668L1079R3293
7746a200537j2666q2470J26087N10877N32562K40148P2244J31881J15173j93028
7736B40271n26233l87640L5937K76873L73411M67235O68587P85135N86903L42855
7726B863334J36787j20077k45558l36277n37470o80710o05836l09163m80O6769
7716B31319m6980l18856n95584n28592n1367K79299K86005K63184L36517K19055
7706G4000j18318l74009m68141l70248j43378J95967L85343L13253L36144L58504
7696A89117L07130J15805m02192p41307m39800j06688j56477k35278o9756K43904
$$ y = [-570606, -1429707, -1934888, -2148271, -2360160, -2626248, -2853605, -2998303, -3149746, -3509291, -3945337, -4162326, -4073509, -3650422, -2943380, -2185697, -1603914, -1333577, -1324909, -1293830, -1200537, -1213203, -1295673, -1169586, -658709, -126147, 114001, 186245, 318126, 433299, 240271, -285962, -673602, -637665, -360792, 12619, 479854, 1148441, 1933576, 2520479, 2863334, 3000121, 2880044, 2634486, 2298209, 1760739, 1080029, 474193, 165030, 164550, 231319, 184339, -134517, -730101, -1258693, -1310060, -1030761, -744756, -481572, -145055, 74000, -44318, -418327, -886468, -1256716, -1400094, -1204127, -818784, -505531, -169387, 189117, 496247, 612052, 209860, -531447, -971247, -1077935, -1234412, -1469690, -1539446, -1295542]
7686a295542L91462K45276J45201K83954K24708q6446k34798q5061N8709J14852
7676b37685J90338L69424M35038R9723k72767n31608n44372j80911K59486K77394
7666a35940n6981j55324j16008j54326k22308k66730j18247l8536j94989j76197
7656a635586J20338L78153K21399l8551j14105r2460P1935L43433M84325L07471
7646D6352L9481J8358J33038K58905L80264L80815R6101j83551k12201r0685N8129
7635I25006J23685J3694q5431k6049N4331m7877j55017q3234p0328k05737k47219
7624A95824L7458M65244N48756L68468J29577j66118n37872p35926m32928J10175
7614a7342M98008P99902J027871R34128O04152J79265k49611n56669o98266n83432
$$ y = [-1295542, -904080, -658804, -513603, -229649, -4941, -91387, -326185, -411246, -352537, -237685, -47347, 322077, 757115, 856838, 584071, 52463, -491909, -672820, -413334, -135940, -192921, -348245, -464253, -618579, -840887, -1107617, -1225864, -1264400, -1459389, -1635586, -1515248, -1137095, -915696, -954247, -1068352, -1160812, -1088877, -745444, -261119, 46352, 85833, 104191, 237229, 496134, 876398, 1257213, 1353314, 1169763, 957562, 866877, 925006, 1048691, 1062385, 976954, 950905, 1005236, 957359, 802342, 719108, 648780, 443043, 195824, 233282, 698526, 1247282, 1615750, 1745327, 1579209, 1041337, 305411, -127517, -17342, 480666, 1280568, 2308439, 3242567, 3846719, 4025984, 3776373, 3219704, 2521438, 1938006]
7604A938006l42646l05568l13339j06652L18615P44413Q62002O24140M96468N57115
7594D472554L56242n7124m48083o77280p66401p61926n35560k80064k77729m83031
7584E41598n20308k47721L3616K46398K82517J20997m3262k64297l56531m6031
7574b53024L99329M95132J94408k57344o39732q74870q00431m04184Q4144M53868
7564a602704P58083J120004J058434K56364n87597p31561l39084J96789N75116
7555G03844N92547N44385M45574Q0960k55599l72215m37110n11583o64781r22009
7545g95987q98941n08667n8753K87217K94074J73437L34518M97394M07959J09267
7535a58482k54322l94883l37002j91260j22795k23151k20873j28124q2535J46835
$$ y = [1938006, 1595360, 1289792, 976453, 869801, 1188416, 1932829, 2794831, 3418971, 3915439, 4472554, 4828796, 4771672, 4323589, 3646309, 2879908, 2117982, 1582422, 1302358, 1024629, 541598, 21290, -226431, -192815, 53583, 336100, 457097, 413835, 149538, -206993, -253024, 146305, 641437, 835845, 578501, -61231, -936101, -1736532, -2140716, -2056572, -1602704, -844621, 275383, 1333817, 1590181, 1002584, 271023, -68061, 128728, 703844, 1296391, 1840776, 2286350, 2367310, 2111711, 1739496, 1302386, 790803, 126022, -795987, -1694928, -2203595, -2262348, -1975131, -1681057, -1507620, -1173102, -675708, -267749, -158482, -412804, -807687, -1144689, -1335949, -1458744, -1681895, -1902768, -2030892, -2113427, -1966592]
7525a966592N28826O48799M99338N07635O24390O39604N22633J96737j10362r8407
7515A992601l0446j31036k86941m12004m05108j51899J62819J38066r4072l05533
7505D76447m18209k96406j47231K00149O96536P24722L92840Q1802q3958r9955
7495A526737l12045o65429p12075m60655j88324o2647r2030j14126l5650K75492
7485h40752P12700Q30590N87885K33403o07J53571M13103M36575J18652k97348
7475B347772m51402n60735o05521k75092L41805P41467O04137K10891j51860l42504
7465A858958m00395m16663k66366k3991K21467L48694M44950N26540L51080L5265
7455B679539j62996j75827N3675K92389L03414J69632Q5286K53799M82485L20870
$$ y = [-1966592, -1437766, -788967, -289629, 218006, 842396, 1482000, 2004633, 2201370, 2091008, 1992601, 1962155, 1831119, 1544178, 1132174, 727066, 575167, 737986, 876052, 781980, 476447, 58238, -238168, -385399, -185250, 511286, 1236008, 1628848, 1710650, 1626692, 1526737, 1214692, 549263, -162812, -623467, -811791, -874438, -966468, -1080594, -1116244, -840752, -128052, 702538, 1290423, 1523826, 1523219, 1676790, 2089893, 2526468, 2645120, 2347772, 1896370, 1335635, 730114, 455022, 796827, 1538294, 2142431, 2353322, 2201462, 1858958, 1458563, 1041900, 775534, 751543, 973010, 1321704, 1766654, 2293194, 2644274, 2679539, 2516543, 2340716, 2394391, 2686780, 2990194, 3159826, 3245112, 3498911, 3981396, 4302266]
7445D302266l0885J0066J94958L39299N01297O18811O92031O36678L92834J88823
7435G846178L56205O40651O58602N31226N97292Q16476J074292J168819J263764
7426A4953505J730549K289288K760731L149803L569726M437340N614529O800092
7418D5305563Q233534J0084003J1913113J2228215R280341L082756k770975n038201
7410I2318349m014349j079368K583432N786132P248159O490558N026429M333126
7402A18692468L118747p27456o425476j0368160j0762726q838952n941670k986481
7394G5760294j061801j164659l422612o317717p955566p957116p147673n972236
7386C4760914m685362l599904k909740k543205k399113k339081j997092j180200
$$ y = [4302266, 4271381, 4281447, 4476405, 4815704, 5317001, 5935812, 6627843, 7264521, 7657355, 7846178, 8202383, 8843034, 9501636, 10032862, 10630154, 11446630, 12520922, 13689741, 14953505, 16684054, 18973342, 21734073, 24883876, 28453602, 32890942, 38505471, 45305563, 53539097, 63623100, 75536213, 87764428, 97044769, 100127525, 97356550, 92318349, 88304000, 87224632, 89808064, 95594196, 102842355, 109332913, 114359342, 118692468, 121811215, 121083759, 114658283, 104290123, 93527397, 84688445, 78746775, 75760294, 74698493, 73533834, 70111222, 63793505, 55837939, 47880823, 40733150, 34760914, 30075552, 26475648, 23565908, 21022703, 18623590, 16284509, 14287417, 13107217]
7378A3107217l12209j04090m26676o01921n67343o42318q07448p34934n66824
7369H343454n36215n16425l75290k00613o6872j33815k09262q4002k18817o81646
7359E320497q49860o89967l83361N480J91398K17942L26665L47534O4837j80006
7349D371159j86357k47639k60764r4856P074J63973M60000O30947N69134K86436
7339E699107k93897p30701q06647o77082j57630M01360M26748J39630r977j3757
7329C977154p932M82J29602K33596R4784k09273n16195n19623j52673K01382N04
7318C231808n97834q23219n70865k59385n7732J16035J58862j4633j53719j12765
7308I16553n7624k53855o35818p65079m66593J52758Q05359J064997P37095Q6405
$$ y = [13107217, 12795008, 12690918, 12264242, 11662321, 11094978, 10452660, 9645212, 8910278, 8343454, 7807239, 7290814, 6915524, 6714911, 6648039, 6514224, 6304962, 6220960, 6002143, 5320497, 4470637, 3780670, 3397309, 3402789, 3594187, 3812129, 4138794, 4486328, 4551165, 4371159, 4184802, 3937163, 3676399, 3581543, 3588617, 3752590, 4212590, 4843537, 5412671, 5699107, 5405210, 4674509, 3867862, 3190780, 3033150, 3434510, 3861258, 4000888, 3990911, 3977154, 3969222, 3969704, 4099306, 4332902, 4427686, 4218413, 3702218, 3182595, 3029922, 3231304, 3231808, 2633974, 1810755, 1239890, 980505, 922773, 1038808, 1197670, 1183037, 1029318, 916553, 858929, 605074, -30744, -795823, -1262416, -1109658, -304299, 760698, 1497793, 1584198]
7298A584198m16973m20223m2467J37045o4212l51172m14361m06712m07550l99887
7288a202314l63503j47464J74411L94049M94962N74852M99476L58965K81297K71657
7278A336388L12240K75466J91510J96763J78696k7899m56280q76630q35893m49107
7268a54746j65809k5357O9509K60188M42950L82758O0669k71007k17117K36789
7258F18827O27036N35346J59115k87725o78931q50587p03532k50898L92584R18533
7248D79768R81484O65340M36292K30272j82705o25540q93901p61554j46924M26298
7238F08830O54574O04056N14399N47033N50821M38217K94598J48142J94660N13326
7228E068656Q79212R26010N74859J92994r768K0331K05137J46837j26425j40681
$$ y = [1584198, 1167225, 747002, 704535, 841580, 777368, 426196, 11835, -394877, -802427, -1202314, -1565817, -1713281, -1538870, -1144821, -649859, -75007, 424469, 783434, 1064731, 1336388, 1648628, 1924094, 2115604, 2312367, 2491063, 2463164, 2006884, 1130254, 294361, -154746, -320555, -345912, -276403, -16215, 426735, 809493, 870162, 599155, 382038, 618827, 1245863, 1781209, 1940324, 1652599, 973668, 123081, -580451, -831349, -438765, 479768, 1461252, 2126592, 2562884, 2793156, 2610451, 1984911, 1091010, 329456, 182532, 608830, 1263404, 1867460, 2381859, 2928892, 3479713, 3917930, 4212528, 4360670, 4555330, 5068656, 5947868, 6873878, 7448737, 7641731, 7631963, 7652294, 7857431, 8004268, 7877843, 7737162]
7218G737162J39674M33735O01011P51353Q61670P41904O45644J131821K194151
7209A5238125L003522L147724L194491L596493M283676M948710N658491O852793
7201D9924025Q709445J1223068J3754983J5307184J5538479J4662546J3234961
7194A42354691J1778116J0082802P703513M218934l16524m925910r332052j3603233
7186A47960337j6869543j8065011j7017134j4535235j1708810r293738p452777
7179E3018089o021397m875340m034888l450670l156574k876290k288349j851631
7171B4462950j941057k269390k625109k718080k120265j097448m33098m65306
7163A0793197p41670q40073p34724p23923q20034q23453n35365q2606J68203J65016
$$ y = [7737162, 7876836, 8310571, 8911582, 9662935, 10524605, 11266509, 11912153, 13043974, 15238125, 18241647, 21389371, 24583862, 28180355, 32464031, 37412741, 43071232, 49924025, 58633470, 69856538, 83611521, 98918705, 114457184, 129119730, 142354691, 154132807, 164215609, 171919122, 176138056, 175821532, 170895622, 161563570, 147960337, 131090794, 113025783, 96008649, 81473414, 69764604, 60470866, 53018089, 46996692, 42121352, 38086464, 34635794, 31479220, 28602930, 26314581, 24462950, 22521893, 20252503, 17627394, 14909314, 12789049, 11691601, 11258503, 10793197, 10051527, 9211454, 8476730, 7752807, 6932773, 6109320, 5573955, 5491349, 5659552, 5824568]
7153E824568J34270J28165J97845K45635J68657J64046J82411J06676p202j50111
7143F994960k68826k09598r3695p6999j60846j51864j52106l18625m44470k62681
7133D855250L4685O1160j1655k0504j30040l42578k31398K16475M58524L80942
7123E270861L1167n19815r37826j024027p98941n20303n57664p93703p21581j84165
7113g55997N08641Q60780Q08762O17343L82614O7768k92541n82440p11839o78431
7103B24660n28738k07363J63933L11195M07772M10977J15266l25303n67776m90272
7093d85649n1930L87172M44710J62504j84323j20438K65526M78302N52159N89353
7083B037386M61089L54631L45320L39429J60997j97932k71966k60473m94007o67579
$$ y = [5824568, 5958838, 6087003, 6284848, 6530483, 6699140, 6863186, 7045597, 7152273, 7145071, 6994960, 6726134, 6516536, 6422841, 6345842, 6184996, 6033132, 5881026, 5562401, 5117931, 4855250, 4889935, 4951095, 4939440, 4918936, 4788896, 4446318, 4214920, 4431395, 4889919, 5270861, 5302028, 4782213, 3844387, 2820360, 2021419, 1501116, 943452, 149749, -571832, -755997, -247356, 613424, 1422186, 2039529, 2422143, 2489911, 2197370, 1614930, 903091, 224660, -304078, -511441, -347508, -36313, 371459, 782436, 897702, 572399, 4623, -485649, -537579, -150407, 294303, 456807, 272484, 152046, 417572, 895874, 1448033, 2037386, 2498475, 2853106, 3198426, 3537855, 3698852, 3500920, 3228954, 2968481, 2474474, 1806895]
7073A806895o69467n75836l95923j42957Q2611K19966K73787J09595k34287n02972
7063b8588q19626j193027j200098o83193R5412O39795P48154P57978P05012K77413
7053g00768j73804R4158O27515O62533L10276j18095k74815j19689O0434K93375
7043F61120P66179J187983J248410Q74179K75963j66325l17090l39659k56931
7034C933829n4368J82935J85291k77117q14268q05913k60990J93134K57630J74561
7024B714724K38029K71029K8555j50324j26352j47718l88626o20331o49856o13528
7014E55602l70000O3960L36047J31602k86668l87658j50586R829k34473n31079
7004h63424m08699k56049l11692k44425j03575j34917k23583j38549K3988J18975
$$ y = [1806895, 1137428, 561592, 165669, 22712, 105323, 325289, 599076, 708671, 474384, -28588, -848214, -2041241, -3241339, -3924532, -3829120, -3189325, -2441171, -1683193, -978181, -700768, -874572, -780414, -152899, 509634, 819910, 701815, 427000, 307311, 367745, 661120, 1427299, 2615282, 3863692, 4737871, 5013834, 4847509, 4530419, 4190760, 3933829, 3879461, 4062396, 4247687, 3970570, 3156302, 2350389, 2089399, 2282533, 2540163, 2714724, 2952753, 3223782, 3252337, 3102013, 2975661, 2827943, 2439317, 1818986, 1169130, 555602, 185602, 249562, 585609, 717211, 430543, 42885, -107701, -97872, -332345, -863424, -1272123, -1528172, -1839864, -2084289, -2187864, -2322781, -2546364, -2684913, -2660925, -2541950]
6994b541950M42484Q24116Q21861O06699K32631l03982o94393n87467k10500j29391
6984a539892j33645k34029n86648p66012n03860j00560K72780O81442P76938L72840
6974a760646q3296k41529j8098K39775J43210j07875j66351j09407k3194M9545
6964b077866J48766K45478J90001J93803L50897O09332Q10391P54282M80847Q5964
6954A791895l57224p79045j008789r45051o44491k82051P5385K36220K08743K43908
6944a460500L87525M74441M82303O53101P72121O70331K83522k34792o45314q57218
6934E25520q37001o75405n96407o37385k76614L82980O47194N46488L82863K93635
6924b44132J57922J9808j6906K6454J20176J53643P3897J74541N36814O13809
$$ y = [-2541950, -2099466, -1275350, -453489, 153210, 385841, 81859, -612534, -1200001, -1410501, -1539892, -1673537, -1907566, -2494214, -3260226, -3764086, -3864646, -3591866, -2910424, -2133486, -1760646, -1843942, -2085471, -2103569, -1863794, -1720584, -1828459, -1994810, -2104217, -2127411, -2077866, -1929100, -1683622, -1493621, -1299818, -948921, -339589, 470802, 1225084, 1705931, 1791895, 1434671, 655626, -353163, -1298214, -1942705, -2224756, -2149371, -1913151, -1704408, -1460500, -1072975, -598534, -116231, 536870, 1308991, 1979322, 2262844, 2028052, 1382738, 525520, -311481, -986886, -1583293, -2220678, -2497292, -2114312, -1467118, -920630, -537767, -244132, -86210, -66402, -83308, -56854, 63322, 216965, 290862, 465403, 1002217, 1616026]
6914A616026K93154r7784l67702m48006l50030K651M44415N25225K85351O6730
6904A970030o9651j05895R290J25275L03728M29945J60844m32697q09739r49941
6894F31189r74594o69121m3774L52970M17965M09715L88250N80165R34801J030647
6884C058213Q00341M55614K74315K34714l1023k15693j70972q7457n6194q4522
6874D177336k99949n65494m82722l21301o68683j159348j176306q41235m08562
6865a746264j63163k87992n83062p08720m96067k03907L6806K60483L43494L50621
6855c197771N09036N41772M15910K90642L04352M59053N72929N06906L25676K81997
6845A010502M27013N28329K89228q1707l00593k83127k50707p3672L78797N36471
$$ y = [1616026, 1909180, 1811396, 1443694, 995688, 645658, 648309, 1092724, 1617949, 1903300, 1970030, 1900379, 1794484, 1803774, 1929049, 2232777, 2662722, 2823566, 2390869, 1581130, 631189, -343405, -1012526, -1056300, -703330, -285365, 124350, 512600, 1092765, 2027566, 3058213, 3858554, 4314168, 4588483, 4823197, 4792174, 4576481, 4405509, 4318052, 4261858, 4177336, 3877387, 3311893, 2829171, 2507870, 1839187, 679839, -496467, -1337702, -1746264, -1909427, -2197419, -2780481, -3489201, -3985268, -4189175, -4152369, -3891886, -3548392, -3197771, -2688735, -2146963, -1731053, -1440411, -1136059, -677006, -104077, 402829, 728505, 1010502, 1437515, 1965844, 2255072, 2173365, 1872772, 1589645, 1338938, 1265266, 1644063, 2180534]
6835B180534L07123K45706L59956L78388k8203o59475r45558q42246m37875N0152
6825F08502M23057N76060M16660J05418j71653l51881l15740j08288j7419O1465
6815A226181K82747M45954L92967L2877l97944n39162l42218q1254L4924j7587
6805A037485k4557R3522n5565m72294p01408n95885k81324o8355j22111k37793
6795a428285l02820j56149K12876N53142P20919N75384K71668R6674P2395m4449
6785E71355k07001l61427n05418m36724j90728l5401j31748j29153J12660K97709
6775a015876M01192N60814P41504R47034R61191O79398K96253L4518n735l0599
6765C569694o8953j28690k59285l27030k29490j880J06668p614j59671m49930
$$ y = [2180534, 2487657, 2733363, 3093319, 3471707, 3443504, 2784029, 1838471, 996225, 558350, 608502, 1031559, 1607619, 2024279, 2129697, 1958044, 1606163, 1290423, 1182135, 1164716, 1226181, 1508928, 1954882, 2347849, 2380726, 1982782, 1443620, 1101402, 1020148, 1055072, 1037485, 1012928, 1106450, 1050885, 578591, -122817, -718702, -1000026, -1068381, -1190492, -1428285, -1731105, -1887254, -1674378, -1121236, -400317, 175067, 446735, 543409, 615804, 571355, 364354, 2927, -502491, -939215, -1129943, -1165344, -1297092, -1426245, -1313585, -1015876, -614684, -53870, 687634, 1634668, 2595859, 3275257, 3571510, 3606028, 3600293, 3569694, 3500741, 3372051, 3112766, 2785736, 2556246, 2554366, 2661034, 2653420, 2493749, 2043819]
6755B043819p38369o06135k26563l07907p18091p00482k97099J40267M21265L09912
6745f79383R2921J09977P4932j60869k88419j03979K56347O08271N94837R0575
6735E95210n01326o82689m74566q9967J66610j36138o37579o61382l16927K9535
6725b709219L06836M33712K78110n5295k76120k77922j56562J631J34991J17681
6715b202157J65944L30077K91036m1373m04270k99835M8418J40807L1101n6490
6705a996742J87898M95931J57518o34767r04256n53620j37320K82188O13069N04833
6695a985268J01969l6283J55365K81945K71941K00402r119j42376j55823k53961
6685a571208l66549l81515l46208k46641R987K91896L14077K71086L23149L90266
$$ y = [2043819, 1305450, 699315, 472752, 164845, -553246, -1253728, -1550827, -1410560, -989295, -679383, -586462, -476485, -401553, -562422, -850841, -954820, -698473, -90202, 504635, 595210, 93884, -588805, -1063371, -1153338, -986728, -1122866, -1760445, -2421827, -2738754, -2709219, -2402383, -1968671, -1690561, -1745856, -2021976, -2299898, -2456460, -2454829, -2319838, -2202157, -2036213, -1706136, -1415100, -1456473, -1860743, -2160578, -2112160, -1971353, -1940252, -1996742, -1808844, -1312913, -1155395, -1790162, -2694418, -3248038, -3385358, -3103170, -2490101, -1985268, -1883299, -1919582, -1764217, -1482272, -1210331, -1009929, -1019048, -1161424, -1317247, -1571208, -1937757, -2319272, -2665480, -2912121, -2902134, -2610238, -2296161, -2025075, -1701926, -1311660]
6675a311660K88090J1335l63123o30697o71204m33010M7610M99255N86364M63740
6665a513300N27066M45938J08565o0891J61860N53364O81893N70465L53012N9658
6655A887630j65149k70373j48673N8784L9603j26583k49864k28698r3003k7154
6645F76520R2263L93475N85860M78624m1855q77283j332209j257262r66400n07669
6635b755936j15410N2690P0928j20123n32825p19457l26917K14426N01436O21285
6625c109903N29195K31762j93752l86605o6088O58209J181505J130176O69780
6616F44279J61369o7557k02135l32919l61246k99527k04463l2016M2662k14171
6606h65724n91623o18352j45736N64124R15502P44508L75977J37574m3992k28315
$$ y = [-1311660, -1023570, -1012235, -1375358, -2006055, -2677259, -3110269, -3062659, -2563404, -1977040, -1513300, -986234, -540296, -431731, -492622, -330762, 222602, 904495, 1474960, 1827972, 1887630, 1722481, 1452108, 1303435, 1362219, 1401822, 1275239, 1025375, 796677, 703674, 676520, 768783, 1162258, 1748118, 2226742, 2184887, 1307604, -24605, -1281867, -2248267, -2755936, -2871346, -2818656, -2747728, -2867851, -3400676, -4120133, -4447050, -4232624, -3731188, -3109903, -2580708, -2348946, -2542698, -2929303, -2995391, -2337182, -1155677, -25501, 644279, 805648, 738091, 535956, 203037, -158209, -457736, -662199, -694215, -651553, -865724, -1457347, -2075699, -2221435, -1657311, -741809, 2699, 378676, 516250, 472258, 243943]
6596B43943k52453l96516q06988r28426l19448N86852R27427N64437O4859j59533
6586d75846j96286k08826k53656l35027l19820k50510k69931r2415L30984M56586
6576a614747J91844k423j4475R6686J95365K51046K37506j4555m50927p17909
6566a842589n15739J34799Q13505Q86964M03094j10466l26946k80582k31915k58751
6556a328626j39640J72712L18726K31099Q4715P7522J33880O3896j7607R8775
6546c04548K59623P1713l19396n88985n92711l73691j19620r8670k22387j02507
6536b391179J38604K63633L01030R6520j61241r7729J19051J93386L95428P14017
6526d28480Q56399Q76591N87537M9437l12712m78505n34031m99179n91416p50754
$$ y = [243943, -8510, -405026, -1212014, -2140440, -2459888, -1873036, -945609, -381172, -316313, -475846, -672132, -880958, -1134614, -1469641, -1789461, -2039971, -2309902, -2402317, -2071333, -1614747, -1422903, -1425326, -1439801, -1343115, -1147750, -896704, -659198, -673753, -1124680, -1842589, -2358328, -2223529, -1410024, -523060, -119966, -230432, -557378, -837960, -1069875, -1328626, -1468266, -1295554, -976828, -745729, -661014, -583492, -449612, -385716, -403323, -304548, -44925, 26788, -292608, -881593, -1474304, -1847995, -1967615, -2066285, -2288672, -2391179, -2252575, -1988942, -1687912, -1591392, -1752633, -1850362, -1731311, -1537925, -1142497, -428480, 427919, 1304510, 1892047, 1941484, 1628772, 1150267, 616236, 117057, -474359, -1225113]
6516a225113p27900n26682j54294K53661N13879O05283N43956K48125l29587p96126
6506a594798p22111l00214O8186K76128L11471J76614n8109k09317k17008j05180
6496b374338M5781M4863o881L01719P57869Q53043N75566J37062m3933J16097
6486D06848K55596J09501j68317k93379m23785n37736m70929m48426n66800m45248
6476b582675J58733Q18640J235641J499451J383551Q32649J21159l78087l27083
6467B761979m3645Q948j18457j56791j79893j68532k3546J72052K03914j27258
6457B328771m03099l70868k26160l4844K53736L76904J63402j53596k27642j98450
6447A508154q843L74197N42574M16767J50037Q559J60576L15220K33764J08240
$$ y = [-1225113, -1953013, -2479695, -2633989, -2380328, -1866449, -1261166, -717210, -469085, -798672, -1594798, -2316909, -2617123, -2548937, -2272809, -1961338, -1784724, -1842833, -2052150, -2269158, -2374338, -2328557, -2283694, -2290575, -1988856, -1230987, -377944, 197622, 334684, 290751, 406848, 662444, 771945, 603628, 310249, -113536, -651272, -1122201, -1570627, -2137427, -2582675, -2423942, -1605302, -369661, 1129790, 2513341, 3345990, 3467149, 3089062, 2761979, 2718334, 2727282, 2608825, 2452034, 2272141, 2103609, 2080063, 2252115, 2456029, 2328771, 1925672, 1554804, 1328644, 1293800, 1547536, 1924440, 2087842, 1934246, 1706604, 1508154, 1499311, 1873508, 2416082, 2832849, 2982886, 2991445, 3152021, 3467241, 3701005, 3809245]
6437C809245j24216m66300p43858p41588o62543q44145j019888r09401m87505
6428b190199J2931J99558J0578j96732k33131k51175j84820J07653O85467J099322
6418i40548O89741k52019q95398p89492o1727O53203R51599Q45058L70208j19438
6408D51187j51843O2297L2989k18821k04272J9352p5282l09121k85373R2507N14137
6397g2243P98108J026209R53245N58771L01458K65602J09932M3824N45374J243161
6387E773441J587546J615456J511214J353927J459755K006163K625365L041528
6379B0974395L417123M097042M843461M906118L598093J085314j339912k520889
6371C9060745k410649j660918r01121q3497R96898K424355M217753O014545P056762
$$ y = [3809245, 3685029, 3218729, 2474871, 1733283, 1070740, 226595, -793293, -1702694, -2190199, -2177268, -1977710, -1967132, -2163864, -2396995, -2648170, -2832990, -2725337, -2039870, -940548, -250807, -502826, -1398224, -2187716, -2249443, -1596240, -644641, 200417, 570625, 451187, 299344, 361641, 394630, 175809, -28463, -9111, -84393, -393514, -678887, -586380, -72243, 725865, 1752074, 2705319, 3264090, 3565548, 3831150, 3941082, 3984906, 4530280, 5773441, 7360987, 8976443, 10487657, 11841584, 13301339, 15307502, 17932867, 20974395, 24391518, 28488560, 33332021, 38238139, 41836232, 42921546, 41581634, 39060745, 36650096, 34989178, 34088057, 34004560, 35001458, 37425813, 41643566, 47658111, 54714873]
6362E4714873O564911M129253o1594m300211o718933p293273o911304o237270
6354C3886452n252686l945640k913273k426372k128938j937841j908725j719789
6346A1653188j212980o39238k56959j68215l22907n11166n01506l92508m12745
6337G234964l87740k23452j7298R7466r6645m61675r19938j395587j600453j339238
6327H90404n49636K74344M71922J11075k67273k64578J14083N43912M53663k37063
6317A540853q04883q60094n52210k24986j08873l2709J86913L74554K19556j66180
6307d28059k40518o479L14500N09488L35983J22795L02643N96537N62693M00204
6297B469787J54984k22017m80136n64547n28433m01425k65635j19920J4958R8722
$$ y = [54714873, 61279784, 65409037, 65347443, 61047232, 54328299, 47035026, 40123722, 33886452, 28633766, 24688126, 21774853, 19348481, 17219543, 15281702, 13372977, 11653188, 10440208, 9800970, 9544011, 9375796, 9052889, 8541723, 8040217, 7647709, 7234964, 6847224, 6623772, 6606474, 6703940, 6607295, 6145620, 5225682, 3830095, 2229642, 890404, 340768, 615112, 1087034, 1198109, 930836, 666258, 780341, 1324253, 1777916, 1540853, 735970, -124124, -676334, -901320, -1010193, -1042902, -855989, -481435, -261879, -428059, -668577, -675056, -360556, 148932, 484915, 607710, 910353, 1506890, 2069583, 2469787, 2624771, 2402754, 1922618, 1358071, 829638, 428213, 162578, 42658, 57616, 156338]
6287A56338K52191K71498q8200l01643J00655O61646P24138L95113p1139n76975
6277A523622o37989j70020L17145M14012J16770j54289j94928j03511j45406j21390
6267H44016J92777M98614M29642K65326M29496N53947L00656k20198o65504q34657
6257A794115o95340l62286Q9200N24064M66899j04889m98518l93460l44120n28305
6247e2640p51914r51203p60567k41506J94055K06106j26504l80012l09342P9792
6237c093735N16658N44711J02622m76729q83227q00589j07449P27057R89994P39098
6227a741589N32064L80859K21077J14409r5522l44137q8687N66449Q08283K80382
6217F33588l79308m32109j96876j91363l25191k89728j12701J32141L62175L32865
$$ y = [156338, 408529, 680027, 591827, 290184, 390839, 1052485, 1776623, 2171736, 2100597, 1523622, 885633, 715613, 1032758, 1446770, 1563540, 1409251, 1214323, 1110812, 965406, 844016, 1036793, 1535407, 1965049, 2230375, 2659871, 3213818, 3514474, 3294276, 2628772, 1794115, 1098775, 736489, 825689, 1349753, 1816652, 1711763, 1213245, 819785, 475665, -52640, -804554, -1755757, -2516324, -2757830, -2563775, -2357669, -2484173, -2864185, -3173527, -3093735, -2577077, -2032366, -1929744, -2406473, -3289700, -4090289, -4197738, -3470681, -2480687, -1741589, -1209525, -828666, -607589, -493180, -588702, -932839, -1021526, -455077, 353206, 633588, 254280, -177829, -374705, -566068, -891259, -1180987, -1293688, -1161547, -799372, -466507]
6207d66507J71806K2971J58J98082K40459J23157K42819M83971O55851O03069
6197B275836M13177L18068l4760p66428j189122j002893o58617l94954p7033M06232
6187g10494P05670N11309o0071o78729r05272n67593J2831K96723J50557o065
6177a251134K63896O68430Q07976O67923L53628N4293n2928M651J69723L63939
6167B050397M15547M62065M37916J68304k38955m98494m74557k95160q8272O1447
6157B000238P3376o6817l21171o10575r14811j142363j025312m63970L53711R31998
6147a185696Q40818L33511k02157m45338l15907K0789M18864O54865P56703J087027
6137A963479J527126J703393J616363J308180R84206J043428J730120K635927
$$ y = [-466507, -294701, -271730, -271572, -73490, 166969, 290126, 532945, 1016916, 1672767, 2275836, 2689013, 3007081, 2972321, 2205893, 1016771, 13878, -644739, -1039693, -1116726, -710494, -4824, 506485, 446414, -232315, -1137587, -1705180, -1692349, -1395626, -1245069, -1251134, -987238, -318808, 489168, 1157091, 1510719, 1565012, 1512084, 1516735, 1686458, 2050397, 2465944, 2928009, 3365925, 3534229, 3295274, 2796780, 2322223, 2027063, 1938791, 2000238, 2073614, 2006797, 1685626, 1075051, 160240, -982123, -2007435, -2471405, -2117694, -1185696, -344878, -11367, -213524, -658862, -974769, -953980, -535116, 119749, 876452, 1963479, 3490605, 5193998, 6810361, 8118541, 9102747, 10146175, 11876295, 14512222]
6129A4512222L363847M015195M796333N534290N620476M643608K533327O2380
6121D5081678j764469k531204k161155j170303r5110J082039K353228L691724
6113D4486428N328667O903171P246058N178814P88248l983989p131609q113683
6105E0702105p523285o391184n462429m823811m397530l988291l079593j979723
6097A3056259j249796q00197p83685j259233j708324j908232j874307j399337
6089B073148n78246J79284O61731P29190L19817j51590l72293m50126n37835o38656
6079A234424n75404j32802N25177J055050J048849M48154k79063n92928k86768
6070B444689J60502L62104L27420J18739j96912m44284o07625m13860K24317O54262
$$ y = [14512222, 17876069, 21891264, 26687597, 32221887, 37842363, 42485971, 45019298, 45081678, 43317209, 40786005, 38624850, 37454547, 37359437, 38441476, 40794704, 44486428, 49815095, 56718266, 63964324, 69143138, 69931386, 65947397, 58815788, 50702105, 43178820, 36787636, 31325207, 26501396, 22103866, 18115575, 15035982, 13056259, 11806463, 11006266, 10222581, 8963348, 7255024, 5346792, 3472485, 2073148, 1494902, 1674186, 2335917, 3065107, 3384924, 3233334, 2861041, 2410915, 1873080, 1234424, 659020, 526218, 1051395, 2106445, 3155294, 3603448, 3324385, 2731457, 2444689, 2605191, 2967295, 3294715, 3413454, 3216542, 2772258, 2164633, 1750773, 1975090, 2629352]
6060B629352N20163K75381K54841K77850K09338J01360n5587k30503k49167l07964
6050C425064m36454m36771k74477k06419l58502m77527k77798K09656O50142Q56267
6040B673181L69724q40449j545502j140207l80076K24858N83797M79065P271m36761
6030e099o24472l50005N9951J74106R397o2983J33955M08892O29989N11218J43662
6019A028611j59693l91771m97515m28449k34904p7359r2486n2544J73580M81018
6009b51512Q78252J253488J289951P17366n4275k96492j50912J06935L83519L62251
5999D238571N4521l94948p11046o08483n01689n31178n48236m99242k86652j04211
5989A07407k39003l37582p3535K08257J75321M9014O3224K15776M81084P21213
$$ y = [2629352, 3149515, 3424896, 3679737, 3957587, 4166925, 4268285, 4212698, 3982195, 3733028, 3425064, 2988610, 2551839, 2277362, 2070943, 1712441, 1234914, 957116, 1166772, 1816914, 2673181, 3042905, 2202456, 656954, -483253, -863329, -638471, -54674, 424391, 431662, -5099, -629571, -979576, -919625, -745519, -736122, -799105, -665150, -256258, 373731, 884949, 1028611, 868918, 477147, -20368, -448817, -683721, -761080, -853566, -906110, -732530, -251512, 626740, 1880228, 3170179, 3887545, 3833270, 3536778, 3385866, 3492801, 3876320, 4238571, 4293092, 3898144, 3187098, 2578615, 2076926, 1545748, 997512, 498270, 211618, 107407, -131596, -469178, -542713, -334456, -159135, -110121, -46897, 168879, 649963, 1371176]
5979A371176O86014J71851n37669p97454m72224p7284P7029j8679j6335J35427
5969E21852J22251m7984o2689M3700p7776l51291m43420l64237l06868l37647
5959a304109j98399N1149K08997L14184L43317L36514L90354N45865M33579N2849
5949A174300k60998m72827m86054l86120n28543p30863o62366m83164k28606K48245
5939b816996Q83855J176236R78728N85533K28282J34018R8747q8943l44718l40395
5929D94347j11429o0794l1212Q2745J4257k78761l98533r9679L76225O24174M58117
5918A069457K61524K55734K30092J54756N181k24160n12972q74296j201102j170014
5908b005800p70235k65278Q3006J70392L29969O32765P55437O21938M74217M11396
$$ y = [1371176, 2057190, 2229041, 1691372, 893918, 421694, 344410, 421439, 402760, 386425, 521852, 644103, 596119, 533430, 577130, 499354, 148063, -295357, -659594, -966462, -1304109, -1502508, -1451359, -1242362, -928178, -584861, -248347, 142007, 687872, 1121451, 1174300, 913302, 440475, -45579, -431699, -960242, -1691105, -2353471, -2836635, -3065241, -2816996, -1933141, -756905, 221823, 807356, 1035638, 1169656, 1268403, 1179460, 834742, 494347, 382918, 322124, 290912, 373657, 387914, 109153, -289380, -389059, -12834, 611340, 1069457, 1330981, 1586715, 1816807, 1971563, 1976744, 1752584, 1239612, 365316, -835786, -2005800, -2776035, -3041313, -2958307, -2787915, -2457946, -1825181, -1069744, -447806, 26411, 437807]
5898D37807M84485N64230O18435N99781M96897M94737O59562N74353K5906o12039
5888D344154j023143j188569j114497n63101J88869N85471N82818N51830M25442
5879B789274J07038k63284n84344p72901o16644l82774m17415k79381K65395P31063
5869E76027O98072J98983n09132r42556q30919m31784j42657r4379p3937N6527
5859a495755K48759L13927J07209p009J03204J91810M1073k01172k45133k57999
5849a201086j97800r0810p5450n6664K6321K19082N22209Q11588Q37746P31385
5839A526521N73481K32070k26362n06600p13255j077728j231104q20609k72261
5830b515847O5299J13822K16194N34096O38231N53162O43501P89352O86252M60278
$$ y = [437807, 922292, 1486522, 2104957, 2704738, 3201635, 3696372, 4355934, 4930287, 4956193, 4344154, 3321011, 2132442, 1017945, 454844, 643713, 1229184, 1812002, 2363832, 2789274, 2896312, 2633028, 2048684, 1275783, 659139, 276365, -141050, -420431, -155036, 576027, 1274099, 1473082, 963950, 21394, -809525, -1241309, -1383966, -1478345, -1552282, -1495755, -1246996, -933069, -825860, -832869, -729665, -537855, -496782, -697954, -943087, -1201086, -1398886, -1489696, -1565146, -1621810, -1595489, -1376407, -854198, -42610, 795136, 1526521, 2100002, 2332072, 2105710, 1599110, 885855, -191873, -1422977, -2243586, -2515847, -2450548, -2336726, -2120532, -1586436, -948205, -395043, 248458, 1037810, 1724062, 2184340]
5820B184340L78328K77504k70411r07340r84147m00295L38138N08289J68623J05118
5810A398147M63086Q45332Q50299N27383L31118N00640Q98071P79534j64243r99774
5800E429593r20963l17985J33130K45161J42019L17361Q47969J210514J135700
5791H222499J112440J576405K345816L327969M599535N848197O810665P634582
5783D1478108Q482393R636049J1439885J3699780J6028778J7891039J8189578
5776A36845610J6790614J4907773J2594831R403313M718394j926888r455268j7132567
5768A66745812k2743720k3545618k0525309j6419858j2819881j0191913q379136
5761E2120377o932793n682220m657031l711276l052868k577663k283621k446782
$$ y = [2184340, 2562668, 2840172, 2569761, 1662421, 678274, 277979, 616117, 1124406, 1293029, 1398147, 1861233, 2706565, 3556864, 4084247, 4415365, 4916005, 5814076, 6593610, 6429367, 5429593, 4508630, 4190645, 4323775, 4568936, 4710955, 5028316, 5876285, 7086799, 8222499, 9334939, 10911344, 13257160, 16585129, 21184664, 27032861, 33843526, 41478108, 49960501, 59596550, 71036435, 84736215, 100764993, 118656032, 136845610, 153636224, 168543997, 181138828, 190542141, 195260535, 193333647, 183878379, 166745812, 144002092, 120456474, 99931165, 83511307, 70691426, 60499513, 52120377, 45187584, 39505364, 34848333, 31137057, 28084189, 25506526, 23222905, 20776123]
5753B0776123k540841k275151k110743j940487j575491j170905q51137o79841
5745G631527n85885m89464k95347j43681k51957m17604l18794j40601K8086K74359
5735E290639M03020L29981K52124J74739j5733j54922k74486o16967j052788j226447
5725C109160r34145l71455O0508J77056R7073O8495J22213N0135p8141j83788
5715B117111k62291j09136K35303M06971J23981k78710m89370n95873l76754K80357
5705A051589R52193J071670N39097K771j02644l4957M267n1060j26644j31896
5695C174386k79943n82902n57728k10496o4491l44043p33746r32691p40716j87915
5685a460285M72654R83519J128723Q06434K90584m7377j85125j28361K23251P80410
$$ y = [20776123, 18235282, 15960131, 13849388, 11908901, 10333410, 9162505, 8311368, 7631527, 7045642, 6556178, 6260831, 6117150, 5865193, 5447589, 5128795, 4988194, 5016280, 5290639, 5693659, 6023640, 6275764, 6450503, 6434770, 6279848, 6005362, 5388395, 4335607, 3109160, 2175015, 1803560, 1864068, 2041124, 2138197, 2206692, 2328905, 2379040, 2300899, 2117111, 1854820, 1745684, 1980987, 2387958, 2511939, 2233229, 1743859, 1147986, 771232, 1051589, 2003782, 3075452, 3614549, 3617320, 3514676, 3479719, 3483986, 3432926, 3306282, 3174386, 2894443, 2311541, 1753813, 1543317, 1478826, 1134783, 401037, -531654, -1272370, -1460285, -987631, -4112, 1124611, 1931045, 2221629, 2174252, 1989127, 1860766, 2084017, 2864427]
5675B864427J086822J030922N66921j39917l76724M3335L29290J07349j18239
5666E394186k41446m53926p38989q10719n63705m35226n89909p28919p44811n04541
5656d18005j82251j03144j92358j71642L5537L05169M04673J73532q3768k4619
5646b56876L35730O19096N52332L16348N0226j87787j62467J22106L89469O52040
5636B430217P73553O48653N49122N67707O55684P17816O84559Q28051J069076
5627H924438J228090J633188K282895K833254L365777M165444N179112O357596
5619C5969794P885677J0118097J2683883J4798868J5351992J2496875N957152
5612A15262338q05790n310864q748939j1594467j2648294j1766668r741178p352437
$$ y = [2864427, 3951249, 4982171, 5549092, 5409175, 5032451, 5075786, 5405076, 5512425, 5394186, 5152740, 4698814, 3959825, 3149106, 2585401, 2150175, 1560266, 831347, 86536, -418005, -600256, -703400, -895758, -1067400, -1031863, -726694, -322021, -148489, -232257, -256876, 78854, 697950, 1250282, 1566630, 1616856, 1429069, 1266602, 1388708, 1778177, 2430217, 3203770, 3852423, 4401545, 4969252, 5624936, 6342752, 7027311, 7855362, 8924438, 10152528, 11785716, 14068611, 16901865, 20267642, 24433086, 29612198, 35969794, 43855471, 53973568, 66657451, 81456319, 96808311, 109305186, 115262338, 114456548, 109145684, 100396745, 88802278, 76153984, 64387316, 54646138, 47293701]
5604D7293701n364176l936924k877298j979932j069592q3011Q53556J634335K505936
5595C6976595L815292N497257P558066J0206919J3067244J5066953J4152910Q642518
5587A14983754J252200l587721o030248q736539j1459914j2322375j1409105r929934
5579E2760118q625343p478069o264859m867851l576396k593812j734530j012975
5571A6606283o09165m65508n13181q15486j109726j136713r52140o11600l09478
5562A0083286j71312k63813o65563j144000j340296j262586r99849m92038J3804
5553C757633K31693J41364M6725P6875J63895J05031l12012p59644q68219o45795
5543A937546k30640J80205L43710L67297M72502L86373K42l61976n19500n40839
$$ y = [47293701, 41929525, 37992601, 35115303, 33135371, 32065779, 31982768, 32836324, 34470659, 36976595, 40791887, 46289144, 53847210, 64054129, 77121373, 92188326, 106341236, 114983754, 116235954, 112648233, 106617985, 97881446, 86421532, 74099157, 62690052, 52760118, 44134775, 36656706, 30391847, 25523996, 21947600, 19353788, 17619258, 16606283, 15997118, 15531610, 15018429, 14202943, 13093217, 11956504, 11004364, 10392764, 10083286, 9911974, 9648161, 8982598, 7838598, 6498302, 5235716, 4235867, 3743829, 3757633, 3989326, 4130690, 4177415, 4254290, 4418185, 4523216, 4211204, 3451560, 2583341, 1937546, 1706906, 1887111, 2230821, 2598118, 3070620, 3456993, 3457235, 3095259, 2575759, 2034920]
5533B034920m14746j60218q5783j9824K94116L40360N1283r0044m1298j50587
5523A758179m06952o12768o96317m91153l0182K31596J86190p207k04879K3049
5513b50444N70097O62497K92865j11788m98472q15843q43164n48204j23077N1885
5503a613648j17814k50342k56832k76460j45074K12443M98158N07846L17307J20175
5493a004241J33399K62990L90771M53483M26530N83337Q16201P90412M32586o3656
5483C221812l37818l34853l88676m61110k75342J3937Q5241p8103p1624K13682
5473A587146K61025L4981M7260K96371M38900L83342J17433j56233n6400K80414
5463C234239M07437K5897n68845p49115m59797l2379K67521K11873j7654j27038
$$ y = [2034920, 1620174, 1459956, 1374173, 1354349, 1648465, 1988825, 2040108, 1950064, 1908766, 1758179, 1351227, 738459, 42142, -449011, -479193, -247597, -61407, -68614, -273493, -250444, 319653, 982150, 1275015, 1163227, 664755, -151088, -994252, -1542456, -1665533, -1613648, -1731462, -1981804, -2238636, -2515096, -2660170, -2447727, -1949569, -1441723, -1124416, -1004241, -870842, -607852, -217081, 236402, 662932, 1246269, 2062470, 2852882, 3285468, 3221812, 2883994, 2549141, 2160465, 1699355, 1424013, 1437950, 1523191, 1445088, 1373464, 1587146, 1848171, 1883152, 1930412, 2226783, 2665683, 3049025, 3166458, 3010225, 2953825, 3234239, 3641676, 3667573, 3098728, 2349613, 1889816, 1857437, 2124958, 2336831, 2319177, 2192139]
5453B192139k8808L38803N07662J51263o6429Q7252L8051k29942j82639o5480
5443B741872l04870m80001k39246Q6088J1834j51182n3648J89014K70559m9013
5433B021407k93476k61006m44029o35765m58652k207J39854J6621J14602K76570
5423D73919R5245j58425m6578L26921N05250K81164J26862K90944L99816J65399
5413B460517j45230j40634J05678L26371M37543N43734N81338O93189P78407M70496
5403F111409o4285m75161n87410n43069n59329n34511m86118l06730Q5353J76230
5393B816379l41321q51386q09478k60519L77769Q82994J237060J213700J042656
5384E307854R44380P41196M75921K04814R1273K75095L77912K07629J29110N42894
$$ y = [2192139, 2163331, 2502134, 3009796, 3161059, 3094630, 3181882, 3219933, 2989991, 2807352, 2741872, 2437002, 1957001, 1717755, 1803843, 1815677, 1664495, 1610847, 1799861, 2070420, 2021407, 1727931, 1466925, 1022896, 387131, -71521, -73728, 66126, 82747, 197349, 473919, 569164, 410739, 364161, 691082, 1196332, 1477496, 1604358, 1895302, 2295118, 2460517, 2315287, 2174653, 2280331, 2606702, 3044245, 3587979, 4169317, 4862506, 5640913, 6111409, 6047124, 5571963, 4984553, 4441484, 3882155, 3347644, 2861526, 2554796, 2640149, 2816379, 2475058, 1623672, 814194, 553675, 931444, 1814438, 3051498, 4265198, 5307854, 6252234, 6993430, 7469351, 7674165, 7765438, 8040533, 8418445, 8626074, 8755184, 9298078]
5374I298078J156895J661139K149061K446126K589943L018257L746055M661204
5366C0726758N745116P017072Q631997J0847151J3687641J7034489K0569933K3105674
5358A37365831K2402442J7411360J1365632R021833R139943M710646p797879k1832290
5350A81787518k8394630k6960121k2390883j7978096j4396229j1569308r378716
5343E0719535p314613n135582l394612k203008j310207j095595j532703j804885
5335B6928330j403489p55896k73390Q6357M02477O99172Q20142P82719Q46451
5326B8132873J065270J502886K238587L288802M277631M645234M681694N559473
5318E5392450P578745J0088204J2598208J4834072J5630662J2807433N965170
$$ y = [9298078, 10454973, 12116112, 14265173, 16711299, 19301242, 22319499, 26065554, 30726758, 36471874, 43488946, 52120943, 62968094, 76655735, 93690224, 114260157, 137365831, 159768273, 177179633, 188545265, 197567098, 206707041, 211417687, 203619808, 181787518, 153392888, 126432767, 104041884, 86063788, 71667559, 60098251, 50719535, 43404922, 38269340, 34874728, 32671720, 31361513, 30265918, 28733215, 26928330, 25524841, 24768945, 24495555, 24581912, 24984389, 25683561, 26503703, 27286422, 28132873, 29198143, 30701029, 32939616, 36228418, 40506049, 45151283, 49832977, 55392450, 62971195, 73059399, 85657607, 100491679, 116122341, 128929774, 134894944]
5311A34894944r24401l263144o22176M890593J1410784J6617892J6427318P050688
5303A86482498q838832k1610531k5619320k3313233j9055489j5030137j1521471
5296F1493485q606395o454776n181819m472707l903940l197794k336061j775764
5288B5564229j680412j670299j451143j057542q07759o58480n98310o32463o42421
5279A6365400p61101r55456r97322r94040j088748j040659o42516k9646N89175
5270A0445087Q48041N84574Q9386n13869r97365r45912j51317J048307J852143
5261A2259075K091991K145563K116655K124224K397555K914874L753993N063150
5253C4867080O638150Q089215R520556J1621893J4758891J8940550K3834105K7564554
$$ y = [134894944, 133970543, 130707399, 130085223, 134975816, 146386600, 163004492, 179431810, 186482498, 177643666, 156033135, 130413815, 107100582, 88045093, 73014956, 61493485, 52887090, 46432314, 41250495, 36777788, 32873848, 29676054, 27339993, 25564229, 23883817, 22213518, 20762375, 19704833, 18897074, 18238594, 17640284, 17007821, 16365400, 15604299, 14648843, 13651521, 12657481, 11568733, 10528074, 9885558, 9855912, 10445087, 11293128, 11877702, 11967088, 11453219, 10455854, 9509942, 9358625, 10406932, 12259075, 14351066, 16496629, 18613284, 20737508, 23135063, 26049937, 29803930, 34867080, 41505230, 49594445, 59115001, 70736894, 85495785, 104436335, 128270440, 155834994]
5245A55834994K5947256J5094692o55563j0379890j0621733o040853k769194n452489
5237A60957220j2834554j8450299j8919044j6048096j2669997j0104791q126578
5230F3803861o408817n225860m845593m697991m344739l966519l532967l004112
5222B7777263k533509k072861j713082j595931j707266j801332j671384j313399
5214A3368499p66321k64785k56520n49837p34964p76966o62859m11295j53981
5205H790971q9681k87116n21019n20671k77295K2877K28977L47001J49137k57079
5195G586102j83456Q9758Q2755r1741m20683p36110n76306k9380K83047K68286
5185F272272N1414k63009l92255p4230L89468N09352O6083p98216j324340j010224
$$ y = [155834994, 181782250, 196876942, 196221379, 185841489, 175219756, 169178903, 166409709, 160957220, 148122666, 129672367, 110753323, 94705227, 82035230, 71930439, 63803861, 57395044, 52169184, 47323591, 42625600, 38280861, 34314342, 30781375, 27777263, 25243754, 23170893, 21457811, 19861880, 18154614, 16353282, 14681898, 13368499, 12602178, 12337393, 12080873, 11531036, 10796072, 10019106, 9356247, 8944952, 8790971, 8701290, 8414174, 7893155, 7372484, 7095189, 7118066, 7347043, 7694044, 7843181, 7586102, 7402646, 7492404, 7575159, 7483418, 7062735, 6326625, 5750319, 5720939, 6003986, 6272272, 6323686, 6060677, 5668422, 5594192, 5983660, 6493012, 6559095, 5760879, 4436539, 3426315]
5175C426315l06191J40405P4280l30339o17566m53396J34214M82627J33388n89466
5165B094271j011293r81940p59218m05223j44147j61228l61974n65571n98885
5156b895208l03545J64472M28369L51333J68331P048q9900o9594J3083l1144k6112
5145b282867K61702N08419O71156R08990J017314Q02600M01301R6696R359M7323
5135B441993K01934M93352P92840P23707K65851J10728L60213M18766K96096J78810
5125F284290o363k61479m77006m36910r5157K32734K90036N9927n2347J21962
5115E659687L90517O74021P96946P14660M80576J47262Q7173M45133P31123J006697
5105A1133795J677907K343795K615812K859706L323724L885951M655826N857501
$$ y = [3426315, 3120124, 3260529, 3334809, 3004470, 2386904, 1933508, 2067722, 2550349, 2683737, 2094271, 1082978, 101038, -658180, -1063403, -1207550, -1368778, -1730752, -2296323, -2895208, -3198753, -3034281, -2605912, -2254579, -2086248, -2079200, -2169100, -2238694, -2225611, -2256755, -2282867, -2021165, -1512746, -841590, 67400, 1084714, 1887314, 2288615, 2385311, 2394670, 2441993, 2643927, 3137279, 3930119, 4653826, 4919677, 5030405, 5390618, 5809384, 6105480, 6284290, 6277927, 6016448, 5539442, 5102532, 5007375, 5240109, 5530145, 5590072, 5537725, 5659687, 6050204, 6724225, 7521171, 8235831, 8716407, 8863669, 8950842, 9395975, 10127098, 11133795, 12811702, 15155497, 17771309, 20631015, 23954739, 27840690, 32496516, 38354017]
5097C8354017P545867R722223J2344718J5652061J9931137K4828014K8587064
5090A56965101K7381864J7852234L499037o855636r396782p844115q190640j2656964
5082A60754099j7848024k0023063j9039061j6642048j3941823j1257189r022249
5075E2980642p383905o075519m957408m156051l481567k799023k289597j827836
5067B0009736j351154r54723q17212j075406j357523j344557j243418j104419
5059A0761324j045167r95943p70678n00172k82862j1083L00044M13014L0022m88270
5049G410229p05867o82353o65828m99326J44456J012393J403919R89016J44124
5040H550763m49307o47201o35598m17414j54828O0519K68796K47298q9903n71190
$$ y = [38354017, 45899884, 55622107, 67966825, 83618886, 103550023, 128378037, 156965101, 184346965, 202199199, 205698236, 198842600, 189445818, 181601703, 173411063, 160754099, 142906075, 122883012, 103843951, 87201903, 73260080, 62002891, 52980642, 45596737, 39521218, 34563810, 30407759, 26926192, 24127169, 21837572, 20009736, 18658582, 17703859, 16886647, 15811241, 14453718, 13109161, 11865743, 10761324, 9716157, 8720214, 7949536, 7449364, 7166502, 7155419, 7455463, 7868477, 7898499, 7410229, 6704362, 6022009, 5356181, 4856855, 5001311, 6013704, 7417623, 8406639, 8550763, 8101456, 7454255, 6818657, 6401243, 6246415, 6306934, 6575730, 6823028, 6733125, 6161935]
5030F161935q54263n65485m2970J32599o5611m54400q91974r48431n56651p2555
5020A842194K73014L24555L27136L60799K11855m7541r1654J44730L19958J29852
5010C794898l35204n27213m24907l47838k85275j50339m6907J13302J73106n3557
5000A910066l14419k38751K22197N37470L07800p2380m1244J11753J03598r6240
4990B429850l73325m54679l85615m31178o92555r39932p73263l00441L2170J47287
4980a741681L30903O57542Q25477N55454J7467l61942n11784m73505j75005K08575
4970f68499O66760J205205J655752J737617J376016J031816R37743O42849R9331
4961H684590l07815m23844k66264j75915j70033j26543j75498k03175k07727m70781
$$ y = [6161935, 5307672, 4742187, 4699217, 4831816, 4766205, 4311805, 3419831, 2471400, 1914749, 1842194, 2115208, 2439763, 2766899, 3127698, 3339553, 3292012, 3200358, 3345088, 3665046, 3794898, 3459694, 2932481, 2507574, 2159736, 1874461, 1724122, 1677215, 1790517, 1963623, 1910066, 1595647, 1356896, 1579093, 2116563, 2424363, 2351983, 2310739, 2422492, 2526090, 2429850, 2056525, 1601846, 1216231, 785053, 92498, -847434, -1620697, -1921138, -1888968, -1741681, -1410778, -753236, 72241, 627695, 645162, 283220, -228564, -702069, -877074, -668499, -1739, 1203466, 2859218, 4596835, 5972851, 7004667, 7942410, 8585259, 8684590, 8376775, 7952931, 7686667, 7510752, 7340719, 7214176, 7038678, 6835503, 6627776, 6156995]
4951F156995r24367j305982j323841p09114M1967K16008o6462m76885q71633j077224
4941c40538j004185q12466n30089M2966P58554R94967N24135n2904j15376J34801
4931d00135K38890J56809J7950O3215K95366K73961j5265j16075o7360j16432
4921C30924j78599r4291M6254J23016J29673J03425J89577L26839L89435M08418
4911A774671M37335K59339j29282k48423n5031j6114j84976l35193l78286m40743
4901F83297n38424o62734p30253n55019k17532q621o4027O356M20611Q61217R50690
4890A45561M08099m12208r70434q78436j87641L42791K45182j98224n10235m01569
4880b417114j88148n1708J30038K32229J76076J26828J28294K20549M80051Q06802
$$ y = [6156995, 5232628, 3926646, 2602805, 1893691, 1935658, 2151666, 2085204, 1608319, 736686, -340538, -1344723, -2157189, -2687278, -2644312, -1885758, -890791, -366656, -419560, -534936, -400135, -161245, -4436, 13514, 76729, 372095, 646056, 630791, 514716, 447356, 330924, 152325, 58034, 104288, 227304, 356977, 460402, 649979, 976818, 1366253, 1774671, 2212006, 2471345, 2342063, 2093640, 2038609, 2022495, 1837519, 1502326, 1124040, 683297, 144873, -517861, -1248114, -1803133, -2020665, -2029286, -2093313, -2086957, -1666346, -805129, 145561, 553660, 141452, -828982, -1707418, -1895059, -1552268, -1307086, -1505310, -2015545, -2417114, -2605262, -2656970, -2526932, -2294703, -2118627, -1991799, -1863505, -1642956, -1162905, -356103]
4870c56103R79555R14712O91735L00770j40624m64562n84248o05339o80341o50033
4860e94478m59104m0553N32487Q48451N88837J05071k44018n25400o61127m74605
4850i24439k49327j99632j31084N3186K30229L22654K96743K10553M0389L5835
4840c14893J98599K98383M08664M08293K09268M1490K2924l9066l04379p43920
4830A85363q58058l47950K39458L84156M63297O48444N90654L16250P3120l2141
4820A662593j17030k07502k31455k90564k40798N8042J64664J2497q414J9684
4810H21717j11905l42176o41720q54486q03042m84946j2740K63097K93397K20762
4800a652042J58388J41984K11560M37746N45427L00642q3572k73878j06446K60048
$$ y = [-356103, 623452, 1538164, 2229899, 2530669, 2390045, 1925483, 1341235, 735896, 55555, -594478, -1053582, -1094135, -561648, 286803, 875640, 980711, 736693, 211293, -449834, -924439, -1173766, -1373398, -1504482, -1451296, -1221067, -898413, -601670, -391117, -350728, -314893, -116294, 182089, 590753, 999046, 1208314, 1249804, 1272728, 1233662, 929283, 185363, -672695, -1020645, -781187, -397031, 66266, 714710, 1305364, 1621614, 1694734, 1662593, 1545563, 1338061, 1106606, 816042, 575244, 633286, 797950, 810447, 802033, 821717, 709812, 367636, -274084, -1128570, -1931612, -2416558, -2429298, -2166201, -1872804, -1652042, -1493654, -1351670, -1140110, -702364, -156937, 143705, 60133, -213745, -320191, -60143]
4790f0143O32101P28617N71060M35564K61105O0474N9251J98048M01608O19877
4780C907562J007201J498938J731531J274117K48120p83908j378306j495623j366463
4771D643169r62887n25324n31715p88293o93822l01014M2793K41952J85442k3697
4761A286604M847J54857J76800J29652K04206M27852M96956L09244l9097l86519
4751B765402o21857o41137n09083m41857j94947K10055K65735R7806J11313K08898
4741A250328P8275l42133p09616o47273l56948j9525K63486L23523J19514j06329
4731a46698j83148j78128k57866l04283k32581j71011o3679J03579J72281J73440
4721a088094J96440K49365K84152K02422P9385q9253l37209m95466l62430o9778
$$ y = [-60143, 571958, 1300575, 1871635, 2307199, 2568304, 2628778, 2688029, 2886077, 3287685, 3907562, 4914763, 6413701, 8145232, 9419349, 9667469, 8883561, 7505255, 6009632, 4643169, 3680282, 3154958, 2623243, 1834950, 1141128, 840114, 882907, 1124859, 1310301, 1286604, 1291451, 1446308, 1623108, 1752760, 1956966, 2384818, 2881774, 3191018, 3151921, 2765402, 2143545, 1502408, 993325, 551468, 356521, 566576, 832311, 930117, 1041430, 1250328, 1328603, 986470, 276854, -370419, -727367, -746892, -483406, -159883, -40369, -146698, -329846, -507974, -765840, -1070123, -1302704, -1473715, -1537394, -1433815, -1261534, -1088094, -891654, -642289, -358137, -155715, -76330, -165583, -502792, -998258, -1360688, -1430466]
4711a430466J85689K32604J51660K76414M98074M15336k2848n13095o73384n19923
4701a399939k53500j01886p7361j8112j21659k38992M0422M53728P11295Q08258
4691a97746O13340K45489N8529m8154l10000o36891p62554m55902j8046K8810
4681a483125r0291o9356R8845L78378N64539N59479M80067L70851L12466K96865
4671A418718K6000o34414j067031q10255l79939j94319r6476j85849n42579p94893
4661c261037o47180j96801K51065M15210L48139L39458K91386R3182q2864j10176
4651b559618l876N5195j90739m93780m69002j84466J69029M21621O39585R29557
4641a686494J051767R00853M41877j00329k67430j14880M0539J12899L5687P9227
$$ y = [-1430466, -1244777, -1012173, -860513, -584099, -86025, 329311, 306463, -206632, -880016, -1399939, -1653439, -1755325, -1832686, -1850798, -1972457, -2211449, -2171027, -1717299, -1006004, -197746, 415594, 661083, 719612, 671458, 361458, -275433, -1037987, -1493889, -1511935, -1483125, -1573416, -1642772, -1543927, -1165549, -601010, -41531, 438536, 809387, 1121853, 1418718, 1444718, 810304, -256727, -1066982, -1446921, -1641240, -1737716, -1923565, -2466144, -3261037, -3908217, -4105018, -3853953, -3438743, -3090604, -2751146, -2459760, -2366578, -2449442, -2559618, -2563494, -2508299, -2699038, -3192818, -3661820, -3846286, -3677257, -3255636, -2616051, -1686494, -634727, 266126, 708003, 607674, 340244, 225364, 265903, 378802, 414489, 493716]
4631D93716K34575K73345J59579M3341J07759K35922K27431K2356l64163n99944
4621H33917m99714l43825l49695m16104n57910p04629m51592O0898L67345M20719
4611a640590L41241K64318K44816J89341L5328j32219l82690l92427l6422K90119
4601a219185N88530P79238O64833K34120p3134L0557L62974N18241L17316K1780
4591B225270k14370n17316p59426r23147j015479p70339k13629L54917O72886
4582a160633N91436J87717j30424n5505L48738P12747P05399L60856j07245m97556
4572I55530n76438l66267q8844J26934R7822j03413k08140k60171m57671n56977
4562a437635l65507l970L05867K84708J15041k1315j93030k68536o5399K02223
$$ y = [493716, 728291, 1001636, 1161215, 1204556, 1312315, 1548237, 1775668, 1798024, 1433861, 833917, 334203, -9622, -359317, -775421, -1333331, -2037960, -2489552, -2428654, -2061309, -1640590, -1299349, -1035031, -790215, -600874, -565546, -697765, -1080455, -1472882, -1509304, -1219185, -630655, 148583, 813416, 1047536, 974402, 1004959, 1367933, 1886174, 2203490, 2225270, 2010900, 1493584, 734158, -188989, -1204468, -1974807, -2188436, -1833519, -1160633, -569197, -381480, -511904, -567409, -218671, 494076, 1199475, 1560331, 1453086, 955530, 379092, 12825, -76019, 50915, 148737, 45324, -162816, -422987, -880658, -1437635, -1803142, -1807112, -1501245, -1216537, -1101496, -1122811, -1315841, -1584377, -1649776, -1447553]
4552a447553J17655k54714n38616k87950J88129N29712P52027P01962N12775L36806
4542F10233J17914m9473p1278q5507k80453k92314j38225k08230l49428m66736
4532a213497m67194j92817K90476L37679j41649k44229K44207N40012M39751M94254
4522H6993N61338K61789k15426m01862k42707m0828j89554m16555k31865L3772
4512g94905J00831J0495l1489J22Q0099L96897Q67492J188676J062359O88169
4502C568746M71563P8542n63511j036331j242807j332997j205782p38890k96775
4493b298242q3431L8811j02261j83203R9404L40013K45347J33571L92267P37895
4483f79829O83058J48547m48739p68770o29333k03240K27446M48367K78221m7060
$$ y = [-1447553, -1329898, -1584612, -2123228, -2411178, -2223049, -1693337, -941310, -239348, 273427, 610233, 728147, 678674, 607396, 521889, 241436, -50878, -189103, -397333, -746761, -1213497, -1680691, -1873508, -1583032, -1245353, -1387002, -1631231, -1387024, -847012, -407261, 86993, 648331, 910120, 694694, 292832, 50125, 9297, -180257, -596812, -828677, -794905, -694074, -683579, -715068, -714946, -634847, -237950, 629542, 1818218, 2880577, 3568746, 4040309, 4118851, 3555340, 2519009, 1276202, -56795, -1262577, -2001467, -2298242, -2381673, -2342862, -2445123, -2628326, -2528922, -2188909, -1943562, -1809991, -1417724, -679829, 3229, 151776, -296963, -1065733, -1695066, -1898306, -1670860, -1222493, -944272, -991332]
4473i91332k77918l51034p8151M64619P29074N64192L22516K49065K50401K8937
4463I10369m07492o30099n74642n82195p87746p72332l34297J99206O61795P96627
4453a520806P03052N15067J15940P83L45224O57279N53531l9035o28135q24037
4443a21137o86171n68737o39030p31285p73529p27827l92818P2077M19400P07686
4433c441371Q69748O65055J13718j20956K56301N08468K53643o7667j46810m8268
4423a158139J76169L13469J77152j25207k06201P9573K09452O5065p3872J43805
4413c98734O88651Q02722L91348j25814n57535p91059p51177m66756o1387L24198
4403i45543M69426L78274L02072K38606m7938l54262l56730k65449l43435k37851
$$ y = [-991332, -1269250, -1620284, -1698435, -1233816, -504742, 59450, 381966, 631031, 881432, 910369, 502877, -127222, -701864, -1284059, -2071805, -2844137, -3178434, -2979228, -2317433, -1520806, -817754, -302687, -186747, -185964, 159260, 816539, 1370070, 1331035, 702900, -121137, -807308, -1376045, -2015075, -2746360, -3519889, -4247716, -4640534, -4568457, -4149057, -3441371, -2571623, -1906568, -1792850, -1913806, -1657505, -1149037, -895394, -963061, -1109871, -1158139, -981970, -668501, -491349, -616556, -822757, -743184, -533732, -468667, -542539, -398734, 289917, 1092639, 1483987, 1358173, 800638, 9579, -741598, -1208354, -1269741, -945543, -476117, -97843, 204229, 442835, 394897, 40635, -316095, -581544, -924979, -1162830]
4393a162830P4488O4585r3078N6245K60154K06852Q0267J00509J57499K04141
4383e1168K48234K13816j28089n82443n19309P7987M41811K74874K2340j43723
4373a45670r1166K00401L50030K99768L28530L57698K48171o2449m67221p74260
4363B43832q81999p48734l28766n7257p2365n0238J822J55987M34296M79678K06969
4352f16775q7006k82991l22434k79870l21951L1212Q10477J319765J303291J092327
4342B646045P69239J90574k21228k82065j04450J22836r502n04469p05014o55847
4332A246119q29777r97943r41236q26458n51552k44056j85443j13656R1856J70382
4322c181764J48380R7849o8308j72474j758L58308N57247L91678O0520r6126J74629
$$ y = [-1162830, -1088342, -1023757, -1116835, -1060590, -800436, -593584, -513317, -412808, -255309, -51168, 197066, 410882, 282793, -299650, -818959, -740972, -299161, -24287, -1947, -145670, -236836, -36435, 313595, 613363, 941893, 1299591, 1547762, 1485313, 1018092, 243832, -638167, -1386901, -1715667, -1772924, -1845289, -1895527, -1893705, -1737718, -1303422, -823744, -616775, -703781, -986772, -1309206, -1589076, -1911027, -1879815, -1069338, 250427, 1553718, 2646045, 3415284, 3605858, 3384630, 3102565, 2998115, 3120951, 3111449, 2606980, 1901966, 1246119, 416342, -581601, -1522837, -2349295, -2900847, -3144903, -3330346, -3444002, -3352146, -3181764, -3033384, -2935535, -3003843, -3176317, -3178075, -2819767, -2262520, -1870842, -1810322, -1906448, -1731819]
4311a731819N14840L31275j06329m10855m52271m48119m80766k69204J53378M69633
4301b430237O92756Q61466Q89327P62221L98231M7528L3470M0383j58482k44481
4291H92182q2754L4377k27430m50574k91735p0567p5970K5377L28344N16050N43299
4280A140599N53429M94485J38133j99165j73880k5834O1220K40582L50280J3931
4270B593780m43779o62724p48191n79721j74295K22052J31327k70846l21305m2004
4260b95706K91666N94227Q87567J220047J480570J218237L34062o27023j177441
4251C926206j183381p45074l03989l24036o86278r99262q64142k18271L68521
4242a029706N85703L69433L3381m6231Q5365J90458J36618j9648l71020m42044
$$ y = [-1731819, -1216979, -885704, -992033, -1402888, -1855159, -2303278, -2784044, -3053248, -2899870, -2430237, -1737481, -876015, 13312, 775533, 1173764, 1221292, 1254762, 1295145, 1136663, 892182, 809428, 843805, 616375, 165801, -125934, -196501, -272471, -247094, 81250, 597300, 1140599, 1694028, 2188513, 2326646, 2127481, 1953601, 1927767, 1988987, 2229569, 2579849, 2593780, 2150001, 1487277, 739086, 159365, -14930, 207122, 338449, 67603, -253702, -295706, -4040, 590187, 1477754, 2697801, 4178371, 5396608, 5730670, 5103647, 3926206, 2742825, 1997751, 1693762, 1369726, 683448, -315814, -1179956, -1398227, -1029706, -444003, -74570, -41189, -87420, -2055, 188403, 325021, 305373, -65647, -507691]
4232e07691q432L24646M18988M11580L32651J32386m7210j41819j47601J22857
4222H90355M81519N29670J90067j29869j19317j9069J63503K51563K5744l06401
4212A957765m48351m49621n82676n22779P5216O52274O73070K45312m14353p57878
4202D27979l87641J92810L98299K83836P5000o5917j06554k02144m87277o95053
4192e66662l57112L62801R06276R59921N93930K68853J72966J23248J1669l92330
4182B083560r47444j103081o41033o2959O6866j85229k90117k40376j96310J23448
4172a392675N84529O62897M25818L32798K63892P43l02413n34599n41799k89144
4162g89953j24663r2851P3846L23383M29392L26477J52527J50870L44120M15963
$$ y = [-507691, -516123, -191477, 227511, 639091, 971742, 1104128, 1056918, 915099, 767498, 890355, 1371874, 1901544, 2091611, 1961742, 1842425, 1823356, 1986859, 2238422, 2264166, 1957765, 1509414, 1059793, 477117, -45662, 29554, 681828, 1354898, 1600210, 1185857, 427979, 40338, 233148, 631447, 915283, 990283, 924366, 817812, 615668, 128391, -566662, -923774, -560973, 345303, 1305224, 1899154, 2168007, 2340973, 2464221, 2475890, 2083560, 1136116, 33035, -607998, -670957, -604091, -789320, -1079437, -1319813, -1516123, -1392675, -808146, -145249, 280569, 613367, 877259, 878002, 575589, 40990, -500809, -789953, -914616, -1007467, -933621, -610238, -180846, 145631, 298158, 449028, 793148, 1209111]
4152A209111K77102M8623k31839m15877m04166l24183k81067m4810L53448L22212
4142E08554q684j40720m6108J57502L18426L83443K94920k8387l06266m60337
4132F72343o64987o01404M6388Q28954J044765Q29434N86237M50188M13097K09208
4122C814223j42322j96687K31508N72145K87378l67422p35090o98356n36734k36380
4112A992263P1914R2897q9124j32417K77397R33194J147221P83662J59950n02273
4102D734684p57863m93615j57287j81379k95555n9353J09677J1441j84893n45307
4092B180550q62103q34044m31059n0665L4467J205m1457j00909j10794L0792M74199
4081B90182R99995R18559K76714k35747m21727m87672m77303k84294o8786l4162
$$ y = [1209111, 1486213, 1534836, 1302997, 887120, 482954, 158771, -122296, -167106, 186342, 508554, 499870, 359150, 313042, 470544, 788970, 1172413, 1467333, 1438946, 1132680, 672343, 7356, -594048, -547660, 281294, 1326059, 2155493, 2741730, 3191918, 3605015, 3814223, 3671901, 3475214, 3706722, 4278867, 4566245, 4198823, 3463733, 2765377, 2228643, 1992263, 2064177, 2157074, 2067950, 1935533, 2212930, 3146124, 4293345, 5077007, 5236957, 4734684, 3976821, 3483206, 3325919, 3144540, 2848985, 2789632, 2899309, 2910750, 2725857, 2180550, 1318447, 484403, 53344, 2679, 37146, 38351, -3106, -104015, -214809, -184017, 290182, 1290177, 2208736, 2485450, 2249703, 1827976, 1340304, 863001, 578707, 509921, 475759]
4071D75759m5368o3017k04919m34459m42772j60677K17151M84141N59901M30772
4061H16512L44019M79350O00722M33624J92503j09277m45903l62265J37283L83753
4051B470321J20458k84132m26278k26297n54j11892m69567n08530j50963l1419
4041C81147k53265m21647l53903j53757R0353L04100K76720o588j40078r2153
4031c69071k39244m87733n61397m83919k82949K200N0109l26866o46469m22639
4021c767978O2258L73491L71952J23062N8635J59128M0084k62417m33998k97212
4011c572995j0152L86091Q12830J044956R17354N88536J67138k99494m69518k62574
4001f97828n1292j2017k33589n16325m22383j2338M54723Q16374Q58697N66469
$$ y = [475759, 430391, 367374, 162455, -272004, -714776, -875453, -658302, -174161, 385740, 816512, 1160531, 1639881, 2240603, 2674227, 2866730, 2757453, 2311550, 1949285, 2086568, 2470321, 2590779, 2306647, 1880369, 1654072, 1653518, 1541626, 1072059, 563529, 412566, 381147, 127882, -293765, -647668, -801425, -711072, -406972, -130252, -136840, -276918, -369071, -608315, -1096048, -1657445, -2141364, -2424313, -2422113, -2372004, -2698870, -3345339, -3767978, -3705720, -3332229, -2960277, -2837215, -2778580, -2619452, -2579368, -2841785, -3275783, -3572995, -3583147, -3197056, -2384226, -1339270, -421916, 166620, 333758, 34264, -435254, -697828, -749120, -761137, -994726, -1511051, -1933434, -1945772, -1491049, -674675, 184022, 750491]
3991G50491J78701k15264m51241k85119O8103K89658M66262O13608M35917P9745
3981A930861p0579q2009k13266m23675n00672n05017n65166o33395n15263q1555
3971a659736K56683K93958K45410Q0029n9745J9909J66802J91064K38146N09146
3961B81666O51404L33258n5416l77193o67215n00502q0475j35501o92982j055406
3951b298362q35331p1365Q09542J199758R82313N96086L52333J53293L1390J35392
3941A055049K67872J47297k26701o18611p54906n75211j34304K55403K33600r0316
3931d40828l39515j97978J35336J80068p9069k11599r1586m4322N1734L48416
3921f89343O53436Q06763P81031N95218L62961R9776k21784l20829l67532o23926
$$ y = [750491, 929192, 713928, 262687, -22432, 45671, 335329, 801591, 1415199, 1851116, 1930861, 1860282, 1778273, 1565007, 1141332, 640660, 135643, -429523, -1062918, -1578181, -1659736, -1403053, -1109095, -863685, -783656, -843401, -823492, -656690, -465626, -227480, 281666, 933070, 1266328, 1210912, 833719, 166504, -333998, -414473, -549974, -1242956, -2298362, -3133693, -3205058, -2395516, -1195758, -213445, 382641, 734974, 888267, 919657, 1055049, 1322921, 1470218, 1243517, 624906, -130000, -705211, -839515, -584112, -350512, -440828, -780343, -978321, -842985, -662917, -741986, -953585, -1045171, -1089493, -1037759, -689343, -35907, 770856, 1551887, 2147105, 2510066, 2609842, 2388058, 2067229, 1699697, 1075771]
3911A075771p87196o20474q4447M49290M95449J30203k55520n00628n30748j76815
3901h05115K16688O5124n46160r41868q87613n79231j59177K14443K27430n5348
3891c250827k91582k48300l4984K29988M40894L81779K55665K58393M72062P45007
3881a041905R33716Q93950N43917L22971M07231L65386j08817p76191j237869
3872C02389j265019q96939m83843j30314M5912P8223J41915J57935K46646N25445
3862a277650N75325L87670L34441K67146N8119N9493J72371J54387j1613j33727
3852E85962j5873J18403J68059J09459k16694o36062p48776l70038K85206Q47856
3842A27502R19362M74931r453j60513p4596J80796K32447k13987o71005n70972
$$ y = [1075771, 288575, -331899, -416346, 32944, 528393, 658596, 403076, -97552, -628300, -805115, -588427, -523303, -1069463, -2011331, -2898944, -3478175, -3637352, -3422909, -3195479, -3250827, -3542409, -3790709, -3825693, -3595705, -3154811, -2773032, -2517367, -2258974, -1786912, -1041905, -108189, 785761, 1329678, 1652649, 2059880, 2425266, 2316449, 1540258, 302389, -962630, -1859569, -2343412, -2473726, -2427814, -2349591, -2207676, -2049741, -1803095, -1277650, -702325, -314655, 19786, 286932, 345051, 404544, 576915, 731302, 719689, 585962, 570089, 688492, 856551, 966010, 749316, 113254, -635522, -1005560, -720354, 127502, 1046864, 1521795, 1512342, 1351829, 1277233, 1458029, 1690476, 1476489, 805484, 234512]
3832B34512k43290m14311p84224q64810m93651J15950O29299R41782R55188N55659
3822F32104L2371j65264O4302L59894M84597L79227n9059n13286o21198m50524
3812A43164j87848M0294J93568j10720o27875o50446m04698l19057l50549k52329
3802b526496m8513L69329R33815J083178O14151o1184m29203l04005j54925j51938
3792f75791j24638j52198k63843k69367j60541p1169P3715K30041K87902K70733
3782h55156J79671j6081o3925j7914j08555k80488m53465n03974k71485K30031
3772b161341P01682Q97306Q89379O24690K90985o5899l91212m13551k47304J7250
3762A41985L30901N11043O14981O31643L81273j16614n82771q80617j022608q13952
$$ y = [234512, -8778, -423089, -1207313, -2072123, -2565774, -2449824, -1820525, -878743, 76445, 632104, 664475, 499211, 563513, 923407, 1408004, 1787231, 1728172, 1214886, 593688, 143164, -44684, -4390, 189178, 78458, -549417, -1199863, -1604561, -1923618, -2274167, -2526496, -2575009, -2205680, -1271865, -188687, 425464, 364280, -64923, -368928, -523853, -675791, -800429, -952627, -1216470, -1485837, -1646378, -1717547, -1643832, -1413791, -1125889, -855156, -675485, -691566, -755491, -773405, -881960, -1162448, -1615913, -2119887, -2391372, -2161341, -1459659, -562353, 327026, 951716, 1242701, 1176802, 785590, 372039, 124735, 141985, 472886, 983929, 1598910, 2230553, 2611826, 2495212, 1912441, 1031824, 9216, -804736]
3752h04736j96236L92283O90688N86801J66205k19042k03919R4961r1466p78609
3742c63070j083977q70945m89588r402L89366N55107N82896M09623J59172J86835
3732e33983M79548P18052O63814K15374m65981q42194p16216l87085r4792N0323
3722i13140J12546K07692K22807O5714j54858l15618l80091l87726k63349J57799
3712a648224M53203K23870k7017L2766J62712J66151J82487L29080M63479M87720
3702H26227K88232l6248l13762n16186m94060l61737k94232l44M67102O30889
3692A95881M09609J34041N9476J01181R5031p7849l19344n48561q16457r77390
3682a744382q18002l53001J23632N20056P18290O67510N02579K74009M26297P83539
$$ y = [-804736, -1000972, -608689, 81999, 668800, 835005, 615963, 412044, 507005, 415539, -363070, -1447047, -2317992, -2807580, -2816982, -2427616, -1872509, -1289613, -879990, -720818, -533983, -54435, 663617, 1327431, 1542805, 1076824, 234630, -481586, -868671, -963463, -913140, -800594, -592902, -370095, -304381, -459239, -774857, -1154948, -1542674, -1806023, -1648224, -1195021, -971151, -998168, -965402, -802690, -636539, -454052, -124972, 338507, 826227, 1114459, 1078211, 764449, 248263, -245797, -607534, -901766, -902110, -435008, 195881, 605490, 739531, 799007, 900188, 995219, 917370, 598026, 49465, -766992, -1744382, -2562384, -2915385, -2791753, -2271697, -1553407, -885897, -383318, -109309, 316988, 1100527]
3672A100527N93660K87569J95263q3669o06753r34838o86166j40456M0702k03797
3662d37958l98893k84090P435J21919M8634R3928L40957O39581P52093O58443
3652A542049M79254R0122m58177o80316n35884k51496L7004K86378N59650O92795
3642A761379O13476N01923L71342J52855K9836K1381j16036k23880n5496R1772
3632C148552j06021m92416p33583o05402j90994O5065p5703k74064j65920l11
3622E69203J13129Q3147j34982k70094p6581K60942N13397N00892J34111r4568
3612A598596n7136n2091j59452l02233m79666n58218k88775j1797k5734Q2679
3602b53827M28630O19230L77365j93160q20821j103628r32112n40859j01466K09934
$$ y = [1100527, 1694187, 1981756, 2177019, 2093350, 1486597, 551759, -134407, -274863, -234161, -437958, -836851, -1120941, -1113506, -991587, -942953, -849025, -508068, 131513, 883606, 1542049, 2021303, 2111425, 1653248, 972932, 437048, 185552, 222556, 508934, 1068584, 1761379, 2374855, 2876778, 3248120, 3400975, 3430811, 3452192, 3336156, 3112276, 3056780, 3148552, 3042531, 2550115, 1816532, 1211130, 1020136, 1085201, 1009498, 735434, 569514, 569203, 682332, 765479, 630497, 360403, 283822, 544764, 1058161, 1559053, 1693164, 1598596, 1541460, 1489369, 1329917, 1027684, 548018, -10200, -298975, -310772, -336506, -253827, 174803, 794033, 1171398, 978238, 157417, -946211, -1878323, -2419182, -2520648, -2310714]
3592b310714K20758R0522j9598q2130k8285J82445M02783M60890L98153L7131
3582f48045o37669q76346m24109K27220P71151J150537J210193R93249N19304
3573B285485j84729p28380o14199k3579L78288L21010j1831j67956o3522l2018
3563A158569j12113j04622n7565j75463k68834l374K76757L39229J75721k42001
3553I86304m55192j41590L11879L77430J25551j96936m45353m77684l75661j22913
3543d14165L8890j04533k09303j09903q5214j97447l00867l48592n6122N25577
3533a261679P10154M29842J51405R9694R9276j63518o54965q60282n49541l5027
3523b034641L35712N19543M82707M28008P01275Q78084N55416L7408l55244m44057
$$ y = [-2310714, -2089956, -1999434, -2019032, -2101162, -2129447, -1947002, -1544219, -1083329, -685176, -648045, -1285714, -2162060, -2586169, -2358949, -1587798, -437261, 772932, 1766181, 2285485, 2100756, 1372376, 758177, 734598, 1112886, 1433896, 1422065, 1254109, 1190587, 1158569, 1046456, 941834, 884269, 708806, 439972, 436598, 713355, 1052584, 1228305, 986304, 531112, 389522, 701401, 1078831, 1204382, 1007446, 562093, 84409, -291252, -414165, -375275, -479808, -689111, -799014, -884228, -1081675, -1382542, -1731134, -1787256, -1261679, -551525, -121683, 29722, 129416, 228692, 65174, -589791, -1450073, -1999614, -2034641, -1698929, -1179386, -696679, -268671, 432604, 1310688, 1866104, 1903512, 1548268, 1104211]
3513A104211k18244j29937j77867j46222k20473l73045m19034j85520L41073Q07432
3503C82374J006799R68030M92521L6611R6479M40545N13189J92913j72485m14498
3493C542478m62770l32872k39217k59753l8159K16101J40109L993q8167l53637
3483B128106p37837j023784r99384o00741j7268L89082M35940M47345O31699Q26070
3473A479228P87549M95822J86793Q809j13051r6377l5546l63094r44678j119035
3463B86420o91962p0691K31461O740j57421L3895K49857K97268J93772O3536J45845
3452E88720N12943Q20021Q64369N95446k5147o97655r54404p78965n18360l52979
3442E3989l09625j66876J13010K41725K1626j28265j36669k54093j97106J85704
$$ y = [1104211, 885967, 756030, 578163, 431941, 211468, -161577, -580611, -766131, -425058, 382374, 1389173, 2357203, 2849724, 2886335, 2982814, 3423359, 3936548, 4129461, 3956976, 3542478, 3079708, 2746836, 2507619, 2247866, 2209707, 2425808, 2565917, 2569910, 2481743, 2128106, 1390269, 366485, -632899, -1233640, -1250908, -861826, -425886, 21459, 653158, 1479228, 2266777, 2762599, 2949392, 2958201, 2845150, 2748773, 2713227, 2350133, 1405455, 286420, -405542, -476233, -244772, -238032, -395453, -361558, -111701, 185567, 379339, 442875, 588720, 1101663, 1921684, 2786053, 3381499, 3356352, 2658697, 1704293, 925328, 406968, 53989, -255636, -422512, -309502, -67777, -46151, -174416, -311085, -565178, -762284, -576580]
3432e76580L16052k6620l33187l59238j43506J68861K03997n1290j89845k46936
3422a238292k69121k3816K79581K58555L6272N716R4715j17594m44872o39830
3412b058686o48063l44908l2446M2338K1414j18821l03292k69039R4064N33929
3402c083510Q04334P08790K35116j70161k14051k37193l91952m13892k59202j42083
3392c163804k55099m72329n26836k50870K31823N67215M99906L19563M35853M64186
3382b150392J71754q2820j59519n0034K52669N76007P24030N69654J85163j03950
3372f7438k64469n50053q36034o73627k48539j11283l69539p25868p83687l53638
3362d984175K75597O23633M86345J53079N2074P199k9875J86661N70400P82368
$$ y = [-576580, -260528, -287148, -620335, -979573, -1123079, -954218, -750221, -801511, -991356, -1238292, -1507413, -1531229, -1251648, -993093, -956821, -951105, -856390, -973984, -1418856, -2058686, -2706749, -3051657, -3084103, -3041765, -3020351, -3139172, -3442464, -3711503, -3617439, -3083510, -2279176, -1570386, -1335270, -1505431, -1719482, -1956675, -2348627, -2762519, -3021721, -3163804, -3418903, -3891232, -4418068, -4668938, -4437115, -3869900, -3369994, -3050431, -2614578, -2150392, -1978638, -2061458, -2220977, -2271011, -2018342, -1442335, -718305, -148651, 36512, -67438, -331907, -881960, -1717994, -2391621, -2640160, -2751443, -3120982, -3846850, -4630537, -4984175, -4708578, -4084945, -3598600, -3445521, -3393447, -3386248, -3416123, -3229462, -2659062, -1876694]
3352a876694O29005K96010Q0525j44373l93939l89997m81414r15231j084486p09101
3342d989695j59442J61373M27500O66033O59925O35547N63736J91115k24180j91620
3332b259708K47742O90985Q70832P05661M30840K97867K20645L2132k20745m75643
3322E40608o95073p68904p25043n11802j94844M0522J43357K53325M89613M85775
3312i42466J69589k49363m87471m45334l36849k25181j25806J34729N16113O52506
3302a339533L16579r5296r9496j14787m87510p30803p42709o25873k42162K01680
3292c959910J38839r9830Q9669M56158M60585J54622j36016k17358q2872P7405
3282c118708J75827L8920l7882J59715M38227N55763L60569J34046O0629K00919
$$ y = [-1876694, -1247689, -951679, -871154, -1015527, -1409466, -1799463, -2280877, -3196108, -4280594, -4989695, -5149137, -4987764, -4560264, -3894231, -3234306, -2598759, -2035023, -1843908, -2068088, -2259708, -2011966, -1320981, -450149, 255512, 686352, 984219, 1204864, 1236996, 1016251, 540608, -154465, -923369, -1648412, -2160214, -2355058, -2314536, -2171179, -1917854, -1428241, -942466, -772877, -1022240, -1509711, -1955045, -2291894, -2517075, -2642881, -2508152, -1992039, -1339533, -1022954, -1118250, -1217746, -1332533, -1820043, -2550846, -3293555, -3919428, -4161590, -3959910, -3821071, -3920901, -3831232, -3375074, -2914489, -2759867, -2895883, -3113241, -3196113, -3118708, -2942881, -2903961, -2941843, -2782128, -2343901, -1788138, -1427569, -1293523, -1232894, -1031975]
3272a031975M13495M64574M51690L75866J41890J3449J99570N43631N95819K61493
3262B429502l7049k34154l28703j79787l2933j6370j83018n08662o05685k78882
3252B4259J30525L15059L63570L86381L85192K89745K4977j81679j15248j95273
3242A427508n97352r42644j008540o92189k06302J28146M66752P32138O86275
3233f208L28664k57166o89549p13541m15916M0264M44762O53864N79004K83785
3223B47963l6004j42423j01100j57808K2464M10754M37518J86930M2171j03068
3213H07397m11749o28323m10641Q5311K25053j44271n86917n93648k61418J15454
3203a803752K16082L0069l6075O0375p996j63725k76097m41958m78824k19566
$$ y = [-1031975, -618480, -153906, 297784, 673650, 815540, 828989, 1028559, 1572190, 2168009, 2429502, 2392453, 2158299, 1829596, 1649809, 1616876, 1600506, 1417488, 908826, 303141, 24259, 154784, 469843, 833413, 1219794, 1604986, 1894731, 1919708, 1738029, 1622781, 1427508, 830156, -112488, -1121028, -1813217, -2019519, -1891373, -1424621, -692483, -6208, 322456, 65290, -624259, -1337800, -1753716, -1713452, -1268690, -614826, -35822, 247963, 211959, 69536, -31564, -189372, -166908, 243846, 681364, 868294, 910465, 807397, 395648, -232675, -643316, -558005, -332952, -477223, -1064140, -1657788, -1919206, -1803752, -1587670, -1557601, -1593676, -1533301, -1541297, -1705022, -1981119, -2423077, -2901901, -3121467]
3193c121467J17889K90590L75040M51610M44713M00181L39165L03730K98933J65787
3183F6171K31932M46390L95735K07576J07967Q4176R5743O9063j26831j73720
3173A404202M9361j8951n56294q19595l95126R2737J95004L05935M62046M05296
3163A124615L10158J94249q989j88120j06476O0724k09238q51288j064049p49215
3153a487629m73091l63777k69416r7288J89021M42692M06795J97461K6345j18975
3143a547862j74921L5849M15107N94231N14084K46082J04089K80470N68936P98507
3133A834572P07226L44375O3943l11194o61601p24793o02021l36948q5889M0359
3123B68029P6839k4419m09565p71243q55616p03585m20927r701N61371J036380
$$ y = [-3121467, -3003578, -2712988, -2337948, -1886338, -1441625, -1041444, -702279, -398549, -99616, 66171, 298103, 744493, 1140228, 1347804, 1455771, 1539947, 1635690, 1704753, 1577922, 1404202, 1453563, 1434612, 878318, 58723, -336403, -243666, -48662, 257273, 719319, 1124615, 1434773, 1629022, 1620033, 1431913, 1325437, 1386161, 1176923, 325635, -738414, -1487629, -1960720, -2324497, -2593913, -2691201, -2502180, -2059488, -1652693, -1455232, -1428887, -1547862, -1722783, -1686934, -1271827, -677596, -163512, 82570, 186659, 467129, 1036065, 1834572, 2541798, 2886173, 2950116, 2638922, 1977321, 1252528, 650507, 313559, 227670, 268029, 344868, 320449, -89116, -860359, -1715975, -2419560, -2840487, -2850188, -2288817, -1252437]
3113a252437Q84972J45135m11548l84145j4988L37081M12143K25911J5111l8807
3103h1572J66898N01340O36037M56645J67544o2020k29551k55984k63984k94419
3093G40934k09921j59627j48533r5565L079k1689j68145j84182j4463M0677o6627
3082b84062O324J91309K64765J18210j98865m24827n86516o32215l81002q9653
3072b016532Q2449Q2144j87386m56247m03860o9746L06053M89760L72974k5103
3062a825494j57526Q4061K52108M13915N76449N53199L01098j61962n23820m94248
3052i82220m40855m57239j82985J21239J18586r455p292K0077J6341J31596K11687
3041a460520L7029k03908l49617m80027n22860l58210k4538K60611J54796J5006
$$ y = [-1252437, -367465, -222330, -633878, -1018023, -1033011, -695930, -283787, -57876, -42765, -81572, 85326, 586666, 1222703, 1679348, 1846892, 1784872, 1555321, 1299337, 1035353, 740934, 531013, 371386, 222853, 127288, 130367, 108678, -59467, -243649, -258112, -217435, -284062, -277738, -86429, 178336, 296546, 97681, -327146, -913662, -1545877, -1926879, -2016532, -1934083, -1851939, -2039325, -2495572, -2899432, -2969178, -2663125, -2173365, -1800391, -1825494, -1983020, -1898959, -1646851, -1232936, -656487, -103288, 197810, 35848, -487972, -982220, -1423075, -1880314, -2063299, -1942060, -1823474, -1832929, -1840221, -1820144, -1803803, -1672207, -1460520, -1423491, -1627399, -1977016, -2457043, -2979903, -3338113, -3362651, -3102040, -2947244, -2932238]
3031b932238M17359R76323J092574Q03571M38615J97030J8368k04688k66665k31343
3021C08906k56859k07936m2670J95790L66630K34387j27729m03322l90182M5716
3011b77269N21288N46712L67606R9010k84951m63512k63885R1395K27954o2449
3001E01899l83705l46140l20386m26462m99160o48510o11381k22407R346R9538
2991b847368J09684j31120j88832o473J15583L12611O44308R36603J035471Q26619
2981H07086K68254m50004q15613p64940o48719l96914J34906O35541O93850N03035
2971c3518K88329k8373j95538j46784l60137r56972j291257q28146N9280O00371
2961b892745O31357L51981j452k05424k79330l67914k29529K30749N78877M87294
$$ y = [-2932238, -2514879, -1538556, -445982, 357589, 796204, 993234, 1011602, 806914, 540249, 308906, 52047, -155889, -198559, -2769, 363861, 598248, 470519, 67197, -322985, -277269, 244019, 790731, 1158337, 1257347, 972396, 508884, 244999, 336394, 564348, 501899, 118194, -227946, -548332, -974794, -1473954, -2122464, -2733845, -2956252, -2946906, -2847368, -2737684, -2868804, -3057636, -3064109, -2948526, -2635915, -1991607, -1055004, -19533, 807086, 1075340, 625336, -190277, -955217, -1603936, -2000850, -1865944, -1230403, -536553, -33518, 254811, 226438, 30900, -115884, -476021, -1432993, -2724250, -3552396, -3493116, -2892745, -2261388, -1909407, -1910859, -2116283, -2395613, -2763527, -2993056, -2762307, -2183430, -1696136]
2951a696136P4086j15678J23968L85985L95080L30256M39245O59980O91455N19486
2941A807727K90632l013m97327j087479j339809r20328j27523M73210O85408O98652
2931a9850O46762M94866J81015j04067j31608q056J57158L08892M10960M52845
2921B388917M64326K99289j0155m05794p49129q37742n80976j50160J03743K63837
2911G86156M01155M84478N99393N26760P1495m39715p14920o37225m02471l01328
2901C73778k28540o8260M3757O2725l0438k87300o63564q59767n42020o9841J45926
2890b123544K98301O24510Q88865P70401M33947R5098k29831l43221l44386o06389
2880e36249p38130l81516Q912J33673M789j07488k6461J5710M2929K89584M52330
$$ y = [-1696136, -1622050, -1737728, -1613760, -1227775, -832695, -502439, -63194, 596786, 1288241, 1807727, 2098359, 2095346, 1598019, 510540, -829269, -1749597, -1877120, -1403910, -718502, -19850, 626912, 1121778, 1302793, 1198726, 1067118, 1059062, 1216220, 1525112, 1936072, 2388917, 2853243, 3152532, 3142377, 2736583, 1987454, 1149712, 568736, 418576, 522319, 786156, 1187311, 1671789, 2271182, 2797942, 2869437, 2429722, 1714802, 1077577, 675106, 373778, 145238, 76978, 120735, 183460, 153022, -134278, -797842, -1657609, -2199629, -2269470, -2123544, -1825243, -1200733, -311868, 458533, 892480, 987578, 757747, 414526, 70140, -536249, -1274379, -1655895, -1646983, -1513310, -1508521, -1616009, -1642470, -1626760, -1583831, -1294247, -841917]
2869h41917K37557J672P1575J67050j51227o98318p02439j04432J90846K4123
2859a805510m0988J09926L78604O95096P77101N68832J09248l33888k99104Q8539
2849B47856M04817K63369j85184l81502k13176m8197J05438J20418r2111j59170
2839F2558J18546N58201P85706N77514p3198p72731r26902m60807J05839L75149
2829C49875M03985J51641l22471o16675m21884O7378L80065N34835M87536M5884
2819A060169l73184m26440n00476o38906o68320m25818j42183o4168Q1903K49171
2809a848252M13071N16271M24442J08774l87483o89770m96384k5430M55188O04480
2799i25093M16262P8083j84929k64204j20051K90748N27520M57482L01690J35701
$$ y = [-841917, -604360, -602688, -531113, -364063, -515290, -1213608, -1916047, -2020479, -1829633, -1805510, -1846498, -1736572, -1357968, -662872, 114229, 683061, 792309, 458421, 159317, 247856, 652673, 916042, 730858, 349356, 136180, 87983, 193421, 313839, 221728, 62558, 181104, 739305, 1525011, 2102525, 2029327, 1256596, 329694, -131113, -25274, 349875, 753860, 905501, 583030, -33645, -455529, -388151, -8086, 526749, 1014285, 1060169, 686985, 260545, -239931, -878837, -1547157, -1972975, -2115158, -2179326, -2097423, -1848252, -1435181, -918910, -494468, -385694, -773177, -1462947, -1959331, -1984761, -1529573, -925093, -508831, -430748, -615677, -879881, -999932, -709184, -181664, 275818, 577508, 713209]
2789G13209k6547j97323l24247k69482j24662j80905l17269l08076k74917k32003
2779a542222n7224P5229K43208L35590K90878L84574N68345M49290j49219p04654
2769a06205o73311l58871m05617n55218n01056m36513l43793k02288r4895J3563
2759c664204R2615J54655P9650j87125m64630n52920l11321J91579O84958R12340
2749c064403P11324K85133j9625j99233m899N72425J134032J389037J086839M41695
2739B332325r2534m16507o20372n64461j48719K55609L80878M4783n46868p66800
2729a42666m52332m1423K3279k02975k40442M8188K15509j17643n10957l80291
2719a801753j42564l04269n49254m12898K4555M14234O56983N15948Q9972q7718
$$ y = [713209, 686662, 489339, 165092, -104390, -229052, -409957, -727226, -1035302, -1310219, -1542222, -1599446, -1524217, -1281009, -945419, -654541, -269967, 298378, 747668, 598449, -106205, -779516, -1138387, -1544004, -2099222, -2600278, -3036791, -3380584, -3582872, -3677767, -3664204, -3571589, -3416934, -3337284, -3524409, -3989039, -4541959, -4853280, -4661701, -3976743, -3064403, -2353079, -2067946, -2087571, -2286804, -2291703, -1719278, -585246, 803791, 1890630, 2332325, 2239791, 1823284, 1202912, 638451, 489732, 745341, 1126219, 1171002, 624134, -142666, -594998, -636421, -613142, -816117, -1056559, -1008371, -792862, -910505, -1421462, -1801753, -1944317, -2248586, -2797840, -3210738, -3186183, -2771949, -2114966, -1599018, -1509046, -1596764]
2709a596764K5851K98420N70380O08199L77766R0959j55221j46934J99566M16201
2699F88423M87712N30305L40956P9957r5673k53536l47677l16530k91681k59237
2689E63019m1976K15075L71709O97810R93511Q75761L99270m3117k00624k50998
2679C579440l46164m68313o10830o97463p03180o22855m29755l50621m73480n76577
2669a699798l68378n8479R3371J76480K38473P9923k55848k72718Q15K950l02548
2658b365757k29367L78939Q18756Q21795O74858M33363K07237p2421k71219k23151
2648A73033j4345l4692l07544o24678p53073n44356j06344K61814J16243l38877
2638b172819n96348l07053M21172J039580J295944J055409L69455q3564j14303
$$ y = [-1596764, -1570913, -1272493, -702113, -93914, 283852, 374811, 219590, 72656, 272222, 688423, 1176135, 1706440, 2047396, 2127353, 2031680, 1778144, 1430467, 1113937, 822256, 563019, 521043, 736118, 1107827, 1805637, 2799148, 3674909, 4074179, 4031062, 3830438, 3579440, 3233276, 2764963, 2154133, 1456670, 753490, 130635, -299120, -649741, -1123221, -1699798, -2068176, -2126655, -2033284, -1856804, -1618331, -1538408, -1794256, -2066974, -2066159, -2063209, -2365757, -2595124, -2216185, -1397429, -575634, 99224, 532587, 739824, 667403, 396184, 173033, 158688, 123996, -183548, -808226, -1561299, -2105655, -2211999, -1950185, -1833942, -2172819, -2769167, -3076220, -2655048, -1615468, -319524, 735885, 1105340, 1021776, 907473]
2629I07473k60860l59091k08534l00787o15803p33151o62802m88416j32198L62625
2619b491544Q36339J166507J163367P78222L19423q5839n02711p59315p47816
2610c23367n96948m60928l28818L0358M18877M82474L36199N4883l72300o62898
2600a422468n89445m64220l31370J15801M72312L40062N4996j48392l39977m00653
2590b713354q3482L04124L25779J69066J16052Q6321J69537N77706Q52823O91327
2580D95899J65621n47378j025425j356364j535919j192270m53244J93869M86660
2571d768551O01571O96071M88387n1576m35096m09608k30325P8704M20413O27907
2561b982103P56022O39582K41537K0526N2351Q9137K01185L85872M47845K64975
$$ y = [907473, 646613, 287522, 78988, -221799, -837602, -1570753, -2233555, -2721971, -2854169, -2491544, -1655205, -488698, 674669, 1452891, 1772314, 1686475, 1183764, 424449, -323367, -920315, -1381243, -1710061, -1679703, -1260826, -778352, -442153, -387270, -759570, -1422468, -2011913, -2476133, -2807503, -2691702, -2219390, -1879328, -1824332, -1972724, -2312701, -2713354, -2796836, -2492712, -2166933, -1997867, -1881815, -1795494, -1625957, -1048251, -195428, 495899, 661520, 114142, -911283, -2267647, -3803566, -4995836, -5449080, -5255211, -4768551, -4166980, -3470909, -2982522, -3034098, -3469194, -3878802, -4109127, -4030423, -3610010, -2982103, -2226081, -1586499, -1344962, -1324436, -1272085, -1182948, -981763, -595891, -148046, 116929]
2551A16929N9419j47422k37406r8089K64549P95383J161637R42774J91861m97233
2541B552402p36583n58025l84399k31164L7936J94590J63299L4598k73301p04435
2531I4918r10196q19522o65191n56304j33550O94371J215655R78491M67965J21460
2521D88097j16920k11902l30695o04823p94778p16312k98596L17180P29185R91230
2511e48334R67129N64286K54495J76746J46763J271k35995l59949l95770m93066
2501G7576o53117p24928n41923k81436k05845k18916j17149J52318N27292O70749
2491a315379N89596N34780M21366R0450l47048m45028k27267k557K19099M11980
2481g0008N95532O54597N86071O14597P28427L86113l14793o30411n73861n02030
$$ y = [116929, 176348, 28926, -208480, -306569, -42020, 753363, 1915000, 2857774, 3049635, 2552402, 1815819, 1257794, 873395, 642231, 680167, 874757, 1038056, 1072654, 799353, 94918, -815278, -1634800, -2299991, -2856295, -2989845, -2295474, -1079819, -101328, 366637, 488097, 371177, 159275, -171420, -776243, -1571021, -2287333, -2585929, -2268749, -1539564, -548334, 418795, 983081, 1237576, 1414322, 1561085, 1562356, 1326361, 966412, 570642, 77576, -575541, -1300469, -1842392, -2123828, -2329673, -2548589, -2665738, -2513420, -1986128, -1315379, -725783, -191003, 230363, 320813, -26235, -471263, -698530, -701087, -481988, -70008, 525524, 1180121, 1766192, 2380789, 3109216, 3495329, 3180536, 2550125, 1976264, 1474234]
2471A474234o44111r88285j191415j196791r63348l67931L45599O84570N22522
2462b324956L24958L57669M26062L22755J39584L2523l2779O1569L11812M57092
2452G6289M56643M89360L84356M987l64734n01903l85808l6852K87967K43660
2442F53965j25202m36357m93499m72128o06750m60365J24732O40367N07295m5921
$$ y = [1474234, 830123, -158162, -1349577, -2546368, -3509716, -3877647, -3532048, -2847478, -2324956, -1999998, -1642329, -1216267, -893512, -753928, -721405, -754184, -692615, -380803, 76289, 532932, 1022292, 1406648, 1411635, 1046901, 544998, 159190, 122338, 410305, 653965, 528763, 92406, -401093, -873221, -1479971, -1940336, -1815604, -1175237, -667942, -713863]
$$ [...]
##END NTUPLES=NMR SPECTRUM
##END=
