##TITLE=C13_BABBF19-10-1
 D2O, 1350 sc

 12.11.2019
##JCAMPDX= 6.0         $$ Bruker NMR JCAMP-DX V2.0
##DATA TYPE= NMR SPECTRUM
##DATA CLASS= NTUPLES
##ORIGIN= UXNMR, Bruker Analytische Messtechnik GmbH
##OWNER= root
$$ XWIN-NMR		Version 3.5
$$ Tue Nov 12 16:13:18 2019 Russian Standard Time (UT+4h)  she@DPX200
##.OBSERVE FREQUENCY= 50.327896
##.OBSERVE NUCLEUS= ^13C
##.ACQUISITION MODE= SIMULTANEOUS
##.ACQUISITION SCHEME= undefined
##.AVERAGES= 1350
##.DIGITISER RES= 17
##SPECTROMETER/DATA SYSTEM= spect
##.PULSE SEQUENCE= zgpg30
##.SOLVENT NAME= CDCl3
##.SHIFT REFERENCE= (INTERNAL, CDCl3, 0, 222.624)
##AUDIT TRAIL= $$ (NUMBER, WHEN, WHO, WHERE, WHAT)
$$ ##TITLE= Audit trail, XWIN-NMR		Version 3.5
$$ ##JCAMPDX= 5.01
$$ ##ORIGIN= Bruker BioSpin GmbH
$$ ##OWNER= she
$$ F:/spectra/data/she/nmr/c13/1/pdata/1/auditp.txt
$$ ##AUDIT TRAIL=  $$ (NUMBER, WHEN, WHO, WHERE, WHAT)
(   1,<2019-11-12 16:12:11.53 +0400>,<she>,<DPX200>,
      <created by zg, POWCHK disabled, PULCHK disabled
       terminated by command 'halt'
       configuration hash MD5:
       00 E9 B6 7A A2 85 ED C7 34 08 36 98 17 FE 4E 26
       data hash MD5: 32K
       46 58 DE D0 E7 6F 16 AD 82 9B 6F B6 E4 EE 9A AC>)
(   2,<2019-11-12 16:12:15.03 +0400>,<she>,<DPX200>,
      <Start of raw data processing
       efp BC_mod = 2 LB = 1 FT_mod = 6 PKNL = 1 PHC0 = -239.6973 PHC1 = 20.20636 SI = 32K 
       data hash MD5: 32K
       99 CA 23 33 0D 3E 4F C8 18 27 89 12 D7 03 63 72>)
(   3,<2019-11-12 16:12:17.60 +0400>,<she>,<DPX200>,
      <abs ABSG = 5 
       data hash MD5: 32K
       D6 1D 91 EB 18 9E 12 5B 7B 3E EA D0 A0 72 0D FB>)
(   4,<2019-11-12 16:12:48.31 +0400>,<she>,<DPX200>,
      <pk PHC0 = 7.535495 PHC1 = -4 
       data hash MD5: 32K
       11 E5 CF B8 53 90 51 57 57 B6 D6 8D 78 AC 99 2B>)
(   5,<2019-11-12 16:12:51.87 +0400>,<she>,<DPX200>,
      <abs ABSG = 5 
       data hash MD5: 32K
       09 8E CA 8D A9 F8 AF 32 7E A5 CF 2D E8 39 39 A6>)
$$ ##END=
$$ 
$$ hash MD5
$$ 63 3D 43 E3 23 5B E7 43 C1 22 BD 74 FE DD A7 F5
##$RELAX= 
##$RELAX= 
##$RELAX= 
##$RELAX= 
##$RELAX= 
##$RELAX= 
##$RELAX= 
##$RELAX= 
$$ Bruker specific parameters
$$ --------------------------
##$DU= <F:/spectra>
##$EXPNO= 1
##$NAME= <c13>
##$PROCNO= 1
##$TYPE= <nmr>
##$USER= <she>
##$AMP= (0..31)
100 100 100 100 100 100 100 100 100 100 100 100 100 100 100 100 100 100 
100 100 100 100 100 100 100 100 100 100 100 100 100 100 
##$AQSEQ= 0
##$AQ_mod= 1
##$AUNM= <au_zg>
##$AUTOPOS= <>
##$BF1= 50.322709
##$BF2= 200.13
##$BF3= 50.322709
##$BF4= 500.13
##$BF5= 500.13
##$BF6= 500.13
##$BF7= 500.13
##$BF8= 500.13
##$BYTORDA= 1
##$CFDGTYP= 0
##$CFRGTYP= 5
##$CHEMSTR= <none>
##$CNST= (0..31)
1 1 145 1 1 1 1 1 1 1 1 1 1 1 1 1 1 1 1 1 1 1 1 1 1 1 1 1 1 1 1 1 
##$CPDPRG= <waltz16>
##$CPDPRG1= <>
##$CPDPRG2= <waltz16>
##$CPDPRG3= <>
##$CPDPRG4= <mlev>
##$CPDPRG5= <mlev>
##$CPDPRG6= <mlev>
##$CPDPRG7= <mlev>
##$CPDPRG8= <mlev>
##$CPDPRGB= <>
##$CPDPRGT= <>
##$D= (0..31)
$$ [...]
##$SUBNAM4= <"">
##$SUBNAM5= <"">
##$SUBNAM6= <"">
##$SUBNAM7= <"">
##$SUBNAM8= <"">
##$SUBNAM9= <"">
##$SW= 239.972175391363
##$SWIBOX= (0..15)
0 1 3 0 0 0 0 0 0 0 0 0 0 0 0 0 
##$SW_h= 12077.2946859903
##$TD= 32768
##$TD0= 1
##$TE= 0
##$TE2= 300
##$TE3= 300
##$TEG= 300
##$TL= (0..7)
120 120 120 120 120 120 120 120 
##$TP= (0..7)
150 150 150 150 150 150 150 150 
##$TP07= 0
##$TPNAME0= <>
##$TPNAME1= <>
##$TPNAME2= <>
##$TPNAME3= <>
##$TPNAME4= <>
##$TPNAME5= <>
##$TPNAME6= <>
##$TPNAME7= <>
##$TPOAL= (0..7)
0.5 0.5 0.5 0.5 0.5 0.5 0.5 0.5 
##$TPOFFS= (0..7)
0 0 0 0 0 0 0 0 
##$TUNHIN= 0
##$TUNHOUT= 0
##$TUNXOUT= 0
##$USERA1= <user>
##$USERA2= <user>
##$USERA3= <user>
##$USERA4= <user>
##$USERA5= <user>
##$V9= 5
##$VALIST= <valist>
##$VCLIST= <CCCCCCCCCCCCCCC>
##$VD= 0
##$VDLIST= <DDDDDDDDDDDDDDD>
##$VPLIST= <PPPPPPPPPPPPPPP>
##$VTLIST= <TTTTTTTTTTTTTTT>
##$WBST= 1024
##$WBSW= 4
##$XGAIN= (0..3)
0 0 0 0 
##$XL= 0
##$YL= 0
##$YMAX_a= 8128719
##$YMIN_a= -2495494
##$ZGOPTNS= <>
##$ZL1= 120
##$ZL2= 120
##$ZL3= 120
##$ZL4= 120
##$ABSF1= 222.624
##$ABSF2= -17.3728
##$ABSG= 5
##$ABSL= 3
##$ALPHA= 0
##$AQORDER= 0
##$ASSFAC= 0
##$ASSFACI= 0
##$ASSFACX= 0
##$ASSWID= 0
##$AUNMP= <proc_1d>
##$AZFE= 0.1
##$AZFW= 0.5
##$BCFW= 0
##$BC_mod= 2
##$BYTORDP= 0
##$COROFFS= 0
##$CY= -3
##$DATMOD= 1
##$DC= 0
##$DFILT= <>
##$DTYPP= 0
##$F1P= 0
##$F2P= 0
##$FCOR= 0.5
##$FTSIZE= 32768
##$FT_mod= 6
##$GAMMA= 0
##$GB= 0
##$INTBC= 1
##$INTSCL= 4.134877e-10
##$ISEN= 128
##$LB= 1
##$LEV0= 0
##$LPBIN= 0
##$MAXI= 10000
##$MC2= 0
##$MEAN= 0
##$ME_mod= 0
##$MI= 0.1934396
##$NCOEF= 0
##$NC_proc= -4
##$NLEV= 6
##$NOISF1= 120.0001
##$NOISF2= 80.00006
##$NSP= 0
##$NTH_PI= 0
##$NZP= 0
##$OFFSET= 222.624
##$PC= 1.4
##$PHC0= -232.1618
##$PHC1= 16.20636
##$PH_mod= 1
##$PKNL= yes
##$PPARMOD= 0
##$PSCAL= 0
##$PSIGN= 0
##$REVERSE= no
##$SF= 50.3227315989248
##$SI= 32768
##$SIGF1= 140
##$SIGF2= 120
##$SINO= 11.81781
##$SIOLD= 32768
##$SREGLST= <13C.CDCl3>
##$SSB= 0
##$STSI= 32768
##$STSR= 0
##$SW_p= 12077.2946859903
##$SYMM= 0
##$S_DEV= 0
##$TDeff= 32768
##$TDoff= 0
##$TI= <>
##$TILT= no
##$TM1= 0
##$TM2= 0
##$TOPLEV= 0
##$USERP1= <user>
##$USERP2= <user>
##$USERP3= <user>
##$USERP4= <user>
##$USERP5= <user>
##$WDW= 1
##$XDIM= 32768
##$YMAX_p= 536633783
##$YMIN_p= -37373584
$$ End of Bruker specific parameters
$$ ---------------------------------
##NTUPLES= NMR SPECTRUM
##VAR_NAME=  FREQUENCY,     SPECTRUM/REAL,   SPECTRUM/IMAG
##SYMBOL=    X,             R,               I
##VAR_TYPE=  INDEPENDENT,   DEPENDENT,       DEPENDENT
##VAR_FORM=  AFFN,          ASDF,            ASDF
##VAR_DIM=   32768,         32768,           32768
##UNITS=     HZ,            ARBITRARY UNITS, ARBITRARY UNITS
##FACTOR=    0.368581032318806, 1,           1
##FIRST=     11203.0474431902, 0,            0
##LAST=      -874.247242800138, 0,           0
##MIN=       -874.247242800138, -37373584,   0
##MAX=       11203.0474431902, 536633783,    0
$$ Real data points
##PAGE= N=1
##DATA TABLE= (X++(R..R)), XYDATA
$$ [...]
22022c924998k156424M304431Q790156l44847J692019L934138m920605m683172
22014B690698k806716j499133k653478n159084j076547l26310k657307q303102
22006b1790979n576669L977608O098169L315048L911154P079853P197741q85172
21998C326753j283836j969892m524659l680136j225592J990966K897449m122078
21990h591025L148175O599468J125482k549679m618351n03354j207499n645768
21982a2242551J801841K105982j12046n85641l95247M747901m81061k209153j799290
21973i169265L421555R320162J0941484R76934n070025k775985p04660m16625
21965F523575n676077q387080n37414L152939J080245O307480J839371m787991
$$ plain form
22022 -3924998 -6081422 -1776991 7013165 6668318 8360337 12294475 7373870 2690698
22014 2690698 -116018 -1615151 -4268629 -9427713 -10504260 -10830570 -13487877 -21790979
22006 -21790979 -27367648 -23390040 -17291871 -13976823 -10065669 -2985816 4211925 3326753
21998 3326753 2042917 73025 -4451634 -8131770 -9357362 -7366396 -4468947 -8591025
21990 -8591025 -5442850 1156618 2282100 -267579 -4885930 -5389284 -6596783 -12242551
21982 -12242551 -10440710 -8334728 -8446774 -9032415 -9427662 -4679761 -5160822 -7369975 -9169265
21973 -9169265 -5747710 3572452 14513936 15490870 10420845 7644860 6940200 6523575
21965 6523575 847498 -7539582 -8076996 -4924057 -3843812 2463668 4303039 -484952
21957d84952l417626k285326O60339M625697P658435K060784n277620m164942
21949f25211K257574l603611q172608L865842P409466M912617Q63859k280290
21941D627638j710603J535636J669766L74281L312205Q282986M144266m439671
21933A7796504n156957L589708m24093m556868l040459m937181n946998j16124
21925b792468L423338m632572l324397M591857M888300l569007p149014j179496
21917i743459P202833J5931776N237188k817777q043386p248320p239378q973165
21909a5693688n467881N59787L204373o28319j93405P266084R182954K842721
21901A072626l845205k790801M419449O870248j199803k192906m307627m218255
$$ plain form
21957 -484952 -3902578 -6187904 -5527565 -901868 6756567 8817351 3539731 -625211
21949 -625211 1632363 -1971248 -10143856 -6278014 1131452 6044069 6907928 4627638
21941 4627638 2917035 4452671 6122437 6496718 9808923 18091909 22236175 17796504
21933 17796504 12639547 16229255 15805162 11248294 8207835 3270654 -2676344 -2792468
21925 -2792468 630870 -4001702 -7326099 -2734242 2154058 -1414949 -8563963 -9743459
21917 -9743459 -2540626 13391150 18628338 15810561 7767175 518855 -6720523 -15693688
21909 -15693688 -21161569 -20601782 -17397409 -18025728 -18219133 -10953049 -1770095 1072626
21901 1072626 -2772579 -5563380 -1143931 5726317 4526514 2333608 -1974019 -6192274
21893f192274q0065l804890J886635K649716L797931k79808k36841J533783n68464
21884a294277m689129j51700M33530l417925J479238M690403j520726m400592
21876h871178j476268l120369m591387J147441N595932M228336N733973Q505063
21868G151543L355663m320646m583436j832652K689127K796812L275797M33183
21860H965391K77706K017155N76619j195899k726642j084081L461854j066798
21852I225305Q53795K856091k262746J346042o063652n929267j314680k786214
21844d075326K370584J737905o158723K44458O460434m84207l876620j114066
21836d895561R09791l506129o228859m777830L049686M106177O782499J1726273
$$ plain form
21893 -6192274 -6272339 -10077229 -8190594 -5540878 -1742947 -2022755 -2259596 -725813 -1294277
21884 -1294277 -5983406 -6135106 -5701576 -9119501 -7640263 -2949860 -4470586 -8871178
21876 -8871178 -10347446 -13467815 -18059202 -16911761 -11315829 -7087493 -1353520 7151543
21868 7151543 10507206 6186560 1603124 -229528 2459599 5256411 8532208 8965391
21860 8965391 9243097 11260252 11836871 10640972 7914330 6830249 10292103 9225305
21852 9225305 10079100 12935191 10672445 12018487 5954835 25568 -1289112 -4075326
21844 -4075326 -1704742 33163 -6125560 -5881102 579332 95125 -3781495 -4895561
21836 -4895561 -3985770 -7491899 -13720758 -18498588 -15448902 -11342725 -4560226 7166047
21828G166047N383596m081235l130567K299598n739744j3184962j0891993m519567
21820b6698827N444308O121734K91232k826140Q41432M63320J631000L774269
21812a0957672L977321N34429n56983l99782M445159J384581l481468j970099
21804g024514J112659p65671l460816K839871N26068m73182K716088j499476j372207
21795g401180K936223O347915J676297l03004j424096N361892O917330p17518
21787A3393859q57706j0530213q860957j137248r36515k386435p43630N223001
21779f835844J237374o222676l994417p57870J380771M356045L03572j974214
21771a2507259P0435N537965Q653510M950195L177830R2145J083933k530375k715029
$$ plain form
21828 7166047 12549643 8468408 5337841 7637439 1897695 -11287267 -22179260 -26698827
21820 -26698827 -21254519 -15132785 -14841553 -17667693 -16826261 -16362941 -14731941 -10957672
21812 -10957672 -6980351 -6445922 -7002905 -7402687 -2957528 -1572947 -5054415 -7024514
21804 -7024514 -5911855 -6677526 -10138342 -7298471 -6772403 -7245585 -4529497 -6028973 -7401180
21795 -7401180 -4464957 1882958 3559255 3256251 1832155 7194047 14111377 13393859
21787 13393859 12536153 2005940 -6855017 -7992265 -8928780 -11315215 -12058845 -6835844
21779 -6835844 -5598470 -11821146 -15815563 -16573433 -15192662 -10836617 -10533045 -12507259
21771 -12507259 -12436824 -6898859 1754651 6704846 9882676 9974821 11058754 8528379 5813350
21762E813350L696468J0639936l23751o674481q510511p391500K049332M370012
21754C668855j0448321j4332838n370494O412905P257717K700550M925024J2954073
21746G767471R300499L918228j613882q858082o489330k686112j982530J248214
21738F04476J72955N409730P657949l390540o978547N398884K552991j242509
21730A0185389l999114q58260J135203r43415j282059j850261P740146N460931
21722A5588560n529368r064559m406114J550817O147227O287178l216704k400460
21714D956577P60607k944900k854735J811907J647696n428501n635424J484553
21706f202220J049500o167812r708556j618296P856919P944729K369464M723253
$$ plain form
21762 5813350 9509818 20149754 19826003 13151522 4641011 -2750489 -701157 3668855
21754 3668855 -6779466 -21112304 -26482798 -20069893 -12812176 -10111626 -5186602 7767471
21746 7767471 17067970 20986198 19372316 10514234 4024904 1338792 -643738 604476
21738 604476 777431 6187161 13845110 10454570 3476023 8874907 11427898 10185389
21730 10185389 6186275 5328015 6463218 5519803 4237744 2387483 10127629 15588560
21722 15588560 10059192 994633 -3411481 -1860664 4286563 10573741 7357037 4956577
21714 4956577 5717184 2772284 -82451 1729456 3377152 -2051349 -7686773 -6202220
21706 -6202220 -5152720 -11320532 -21029088 -22647384 -14790465 -6845736 -4476272 246981
21698B46981O208501r30862j1671032q759001k50073J738971m29540K610222J596631
21689i639202k98805O957289O334106P252108Q24225K22434L325084J960808p8076
21680A6859971n536050k600534l69153l271153n463588q711631k835519N549368
21672f378289P001894Q57995M365141L249089m728817n811669J628235l209906
21664c026327p911908J682984K667225J980957j310644k377770M570054L912471
21656A87042l303095k920227q909402j543346N336790O90894k88334l928263J792365
21647a2885576N053297M380184j629744p971513q054448J89296Q131404J0511775
21639b275325J869165k97412l222016o081217l818842o51349Q072486N448059
$$ plain form
21698 246981 6455482 5524620 -6146412 -14905413 -15155486 -13416515 -13846055 -11235833 -9639202
21689 -9639202 -9938007 -2980718 3353388 10605496 11429721 11652155 14977239 16938047 16859971
21680 16859971 11323921 8723387 8354234 5083081 -380507 -9092138 -11927657 -6378289
21672 -6378289 623605 1481600 5846741 9095830 4367013 -1444656 183579 -3026327
21664 -3026327 -10938235 -9255251 -6588026 -4607069 -5917713 -8295483 -3725429 187042
21656 187042 -3116053 -6036280 -14945682 -16489028 -11152238 -10461344 -10749678 -14677941 -12885576
21647 -12885576 -7832279 -3452095 -5081839 -13053352 -21107800 -20918504 -12787100 -2275325
21639 -2275325 -406160 -703572 -3925588 -10006805 -13825647 -14476996 -6404510 -956451
21631i56451J727889K77253o242801q712878n65177M049439J734558L937567N617425
21622H66824K023517l957709J961858P50620j426358r67780L85362k985702j0941833
21613a4291201j0343508j443247K543896N400632m08652r53158P962215N118305
21605f414718L071983M81638n875524p442959k084025J1096534P838643k634567
21597a962995n750191L68384O478571N840762J392972J952291K058834P64010
21589A1142638J563849J413257k416620r849863j0734205j404807L27111j150724
21581a1109364k828211l326865J453339j647947m933445J133932P413045N040205
21573h805311K22382L960054R640083P172029k951055r593909l401670P151947
$$ plain form
21631 -956451 771438 1048691 -5194110 -13906988 -14472165 -10422726 -8688168 -4750601 866824
21622 866824 2890341 -1067368 894490 1645110 218752 -749028 -363666 -3349368 -14291201
21613 -14291201 -24634709 -26077956 -23534060 -18133428 -18542080 -19495238 -11533023 -6414718
21605 -6414718 -3342735 -2861097 -8736621 -16179580 -18263605 -7167071 671572 -1962995
21597 -1962995 -7713186 -7344802 -866231 4974531 6367503 8319794 10378628 11142638
21589 11142638 12706487 14119744 11703124 1853261 -8880944 -10285751 -9958640 -11109364
21581 -11109364 -13937575 -17264440 -15811101 -17459048 -22392493 -21258561 -13845516 -8805311
21573 -8805311 -8582929 -4622875 5017208 12189237 9238182 -355727 -3757397 3394550
21565C394550P672911n49043n189581p245127p437567k927050j859251K25449
21557a3914709P223535L725215m61748J645686m244323j37659M408374k229244
21549c984873o240288r60084J116525K335445O767229L324596n097767l250121
21541e989338o293973M504868J0963283L754254J216336Q38581k410641j352155
21533E231215k216710k378168j38948J16051J527903k185813k521785p07590L726796
21524D52951O08043m261942l060047N03594O20458L921701M595280Q221326M88380
21515A2089744p664554m44163J401537n863986o808290j488385O41774K552004
21507e584319N741524K240650k389416m76207O505603j849733K374748M112977
$$ plain form
21565 3394550 11067461 10518418 5328837 -1916290 -9353857 -12280907 -14140158 -13914709
21557 -13914709 -6691174 -2965959 -3427707 -1782021 -6026344 -6164003 -1755629 -3984873
21549 -3984873 -10225161 -11185245 -10068720 -7733275 -966046 2358550 -2739217 -5989338
21541 -5989338 -12283311 -7778443 3184840 6939094 8155430 8994011 6583370 5231215
21533 5231215 3014505 636337 497389 613440 2141343 -44470 -2566255 -3273845 452951
21524 452951 1060994 -3200948 -6260995 -5757401 -5136943 -1215242 3380038 11601364 12089744
21515 12089744 4425190 3981027 5382564 -481422 -7289712 -8778097 -8136323 -5584319
21507 -5584319 157205 2397855 8439 -467768 6037835 4188102 6562850 10675827
21499A0675827o174910j2683879k794552O220338J039372l161451J635710J24788
21491e118757q333553j0811906m296592N859823M166931j356799j210285L837031
21483a7264107M286370P598326Q007686M591578N294544P33754K63394j678633
21475A1832912j0819846o830896J987063N485444m310461p204896p566568k382714
21467a9809962J220762J159993K840316N65085j987150k227906J86577l51318
21459a8403603j704044K172959P015337P422449N931352K942190l93943m263498
21451G19199o52661j882702m169696j202926L417902j79215R94138K424696l608135
21442d139400J675752L721886j156603r57917m220412o785058j612338M060706
$$ plain form
21499 10675827 4500917 -8182962 -10977514 -4757176 -3717804 -6879255 -5243545 -5118757
21491 -5118757 -13452310 -24264216 -28560808 -22700985 -18534054 -19890853 -21101138 -17264107
21483 -17264107 -12977737 -5379411 2628275 7219853 12514397 13248151 13511545 11832912
21475 11832912 1013066 -5817830 -3830767 1654677 -2655784 -9860680 -17427248 -19809962
21467 -19809962 -18589200 -17429207 -14588891 -14023806 -16010956 -18238862 -18052285 -18403603
21459 -18403603 -20107647 -17934688 -10919351 -3496902 2434450 5376640 4982697 719199
21451 719199 66538 -1816164 -5985860 -7188786 -3770884 -3950099 -2955961 -531265 -4139400
21442 -4139400 -2463648 1258238 101635 -856282 -5076694 -11861752 -13474090 -9413384
21434i413384L700496K306791P18704L336347O387548J2288255K693853k515512
21426A9503098o524225q615261j721502J141206R93146m99865l03564J491513
21418E464546j107326J714341K866011M665886M02621l474060o880330m439543
21410g87854K60130L773133L433952q06204m776796J074273N845319K033085n156246
21401D892792n160586k727933j218239j110989m93528Q41530k860797k701578
21393a0539328J978398J533718N19199N743817K756776L1281k722740j349832
21385b048711j839240R45963M991658N087579K329827K198341K977665n465226
21377I177856m270638P774818M110518k476081m894151p132034r657866L666819
$$ plain form
21434 -9413384 -5712888 -3406097 -2687393 648954 7036502 19324757 22018610 19503098
21426 19503098 12978873 4363612 2642110 3783316 4776462 4276597 3973033 5464546
21418 5464546 4357220 6071561 8937572 13603458 14006079 10532019 3651689 -787854
21410 -787854 -527724 3245409 6679361 5873157 1096361 2170634 8015953 10049038 4892792
21401 4892792 -267794 -2995727 -4213966 -5324955 -5818483 -4976953 -7837750 -10539328
21393 -10539328 -8560930 -7027212 -6508013 -764196 1992580 2023861 -698879 -2048711
21385 -2048711 -3887951 -2941988 2049670 7137249 9467076 11665417 14643082 9177856
21377 9177856 4907218 12682036 16792554 14316473 9422322 2290288 -7367578 -3700759
21369c700759M414089M00398K212675K019324l330783k863230l59821L32386K209713
21360A333992k62233K291830K221548r80461Q50237M197627k335645m714715j443089
21351A159091P03829N542998J383890n173664k814356M403849N737747J204142
21343A2147526l004608m654072q031662k373112L021108K054311j51468k404799
21335c396776j56778K518735J584397O930648Q838587k878642l685858J181342
21327A0935655k832470k079352l260881p134955q54388P889494L191674O7729
21319E922506J680569l079444l711672l635513n643424l211814L094627R37779
21311g646386J071359O617471O907620J705903L37914K960189j312114m541996
$$ plain form
21369 -3700759 713330 1113728 3326403 5345727 2014944 -848286 -1208107 -875721 1333992
21360 1333992 1071759 3363589 5585137 4604676 5454913 9652540 7316895 2602180 1159091
21351 1159091 1862920 7405918 8789808 3616144 801788 5205637 10943384 12147526
21343 12147526 9142918 4488846 -3542816 -5915928 -2894820 -840509 -991977 -3396776
21335 -3396776 -3553554 -1034819 549578 7480226 16318813 13440171 9754313 10935655
21327 10935655 8103185 6023833 2762952 -4372003 -5226391 2663103 5854777 5922506
21319 5922506 7603075 4523631 811959 -2823554 -8466978 -11678792 -8584165 -7646386
21311 -7646386 -6575027 42444 6950064 8655967 8993881 11954070 10641956 6099960
21303F099960m281413l634166k873512o85602Q98747J355994p89637L247602P197141
21294F535114K476085L272362R17264k151K285632J026322r109655j3855164l200234
21285i654425N341442J523864L345035K118118O394837M474619p339618j1223147
21277e019275m402996J709872K779547M840570l192763r337196k066713J944902
21269a2744052k472338J8624R427622M269292q41049p610116r064750n536872
21261b4553639K635132Q933297r98322o939839k948665N526818M196634J189269
21253a2959315N90094K198066J694955L430735O15676l605243L090928Q311729
21245C367625J907014k644584k602487N846226M650747l664783r095789j1132979
$$ plain form
21303 6099960 1818547 -1815619 -4689131 -5374733 -4475986 -3119992 -3909629 -662027 6535114
21294 6535114 9011199 12283561 13200825 13198674 15484306 16510628 7400973 -6454191 -9654425
21285 -9654425 -4312983 -2789119 555916 2674034 9068871 13543490 6203872 -5019275
21277 -5019275 -9422271 -7712399 -4932852 -92282 -3285045 -12622241 -14688954 -12744052
21269 -12744052 -15216390 -15197766 -5770144 -1500852 -2341901 -9952017 -19016767 -24553639
21261 -24553639 -21918507 -12985210 -13983532 -20923371 -23872036 -18345218 -14148584 -12959315
21253 -12959315 -12369221 -10171155 -8476200 -5045465 -4429789 -8035032 -4944104 3367625
21245 3367625 5274639 2630055 27568 5873794 10524541 6859758 -2236031 -13369010
21237a3369010k878272N366055O933768M128348K049091P18750l582315l514816
21229d148401M771427k59923J33578L984144l493236o090088l787114R70749k792154
21220a0711018o581056l506894j729170L383369M580851K966530J0905152R929557
21212I237321J709831n701754k319716J727091K620713J060039l28213r4779l178043
21203D732490q907950l860488M069229J099426k09668K68879J215407J678195
21195H5520l843434m752964n80347j259045l271681m09586J636995K472497R214591
21186g07454J3265519J085400p138523m666331K790494J175264l743851o977338
21178d916820j0242529q625627j059431J3484982P723962j746546K850743L930835
$$ plain form
21237 -13369010 -16247282 -10881227 -3947459 180889 2229980 2948730 -633585 -4148401
21229 -4148401 623026 363103 496681 4480825 987589 -5102499 -8889613 -7918864 -10711018
21220 -10711018 -17292074 -20798968 -22528138 -19144769 -14563918 -11597388 -692236 9237321
21212 9237321 10947152 5245398 2925682 4652773 7273486 8333525 8005312 7910533 4732490
21203 4732490 -4175460 -8035948 -3966719 -2867293 -3076961 -2808082 -1592675 85520
21195 85520 -3757914 -8510878 -9091225 -10350270 -13621951 -14031537 -12394542 -9922045 -707454
21186 -707454 12558065 13643465 6504942 1838611 4629105 5804369 2060518 -4916820
21178 -4916820 -15159349 -23784976 -24844407 -11359425 -3635463 -5382009 -2531266 1399569
21170A399569j373313L982081K569555k224665P91064J016459n100842n530667
21162d470759p942619m664899L286884R589121Q782966K027834j081294o822670
21154a295436j1646142l810566R300680L075032r457701l343479L113878N320148
21146h743586N464345R67156O775779N994907R08363k656862K519405J479123
21138A2708630l445473j62581k265799m61231N987957P68578J424797K65286m069956
21129A0750208m314228n857276n439418O91920k023162m905824M56365M962638
21121e678777M714196M046267J420081k612892k601785J25210o85022k692638
21113c965360k387054m172852k262491N353514M886321k738880j169732J078255
$$ plain form
21170 1399569 26256 4008337 6577892 4353227 5144291 6160750 1059908 -4470759
21162 -4470759 -12413378 -17078277 -13791393 -4202272 4580694 6608528 5527234 -1295436
21154 -1295436 -12941578 -16752144 -7451464 -4376432 -13834133 -17177612 -14063734 -8743586
21146 -8743586 -3279241 -2312085 4463694 10458601 11366964 8710102 11229507 12708630
21138 12708630 9263157 9100576 6834777 6373546 12361503 13130081 14554878 14820164 10750208
21129 10750208 6435980 578704 -4860714 -4168794 -6191956 -11097780 -10641415 -5678777
21121 -5678777 -964581 3081686 4501767 1888875 -712910 -587700 -1272722 -3965360
21113 -3965360 -6352414 -10525266 -12787757 -7434243 -2547922 -5286802 -6456534 -5378279
21105e378279q179637j428507O006678N13346l682772n230297j894501M556097
21097a4717872M012221M094048J0269566P986021k190205m529951l703570l681458
21089b461200R67127j134479n29581J177351N232047J028851p716529o227636
21081i664049k294892M548457N266086M043065O1700o035353k816699J712321
21073e179364K474802l363697o621676l668255J412773m103378n24770R874506
21065i699059P890840R503798j850771j1236485q487440m60094K892548K282709
21057i163954N500269J2506935R491407j656713n321309q835940p931924m16776
21049e828005O995650J240709m665092J873019J724746m700579o154230n35468
$$ plain form
21105 -5378279 -13557916 -14986423 -8979745 -8466399 -12149171 -17379468 -19273969 -14717872
21097 -14717872 -10705651 -6611603 3657963 11643984 9453779 4923828 1220258 -2461200
21089 -2461200 -1494073 -2628552 -3158133 -1980782 3251265 4280116 -3436413 -9664049
21081 -9664049 -11958941 -7410484 -2144398 1898667 1960367 -4074986 -6891685 -5179364
21073 -5179364 -2704562 -6068259 -12689935 -16358190 -14945417 -19048795 -19573565 -9699059
21065 -9699059 -1808219 7695579 5844808 -5391677 -13879117 -14339211 -11446663 -9163954
21057 -9163954 -3663685 8843250 18334657 16677944 11356635 2520695 -5411229 -5828005
21049 -5828005 1167645 2408354 -2256738 -383719 1341027 -3359552 -9513782 -10049250
21041a0049250N127493r58811M74605P112491P378277O0915j332595l848485k737851
21032A226789J664480O539017N767008P299708N016102m391766j2147796j0582301
21024C91241p27532P541240M313323J349802o35356n812411o391756M11458j643107
21015a203098l111937M537395N292928o73827m569486m557076L167142O337025
21007E219066n757128r33926J0136643L975317K678608K944576r61023m23711
20999A6878422m218010p125214n879989J359981M426410R3628R66623L557674
20991A0059525M205445J098272J003191N293887K687355r11881k872347m213637
20983A6349810k83392p00142o074265k483800M065710J360643l35424K728J645331
$$ plain form
21041 -10049250 -4921757 -5880568 -5405963 1706528 9084805 9145720 7813125 3964640 1226789
21032 1226789 2891269 9430286 15197294 22497002 27513104 23121338 10973542 391241
21024 391241 -336291 7204949 11518272 12868074 12232718 6420307 28551 440009 -1203098
21015 -1203098 -4315035 222360 5515288 4841461 271975 -4285101 -1117959 5219066
21007 5219066 -538062 -1471988 8664655 12639972 15318580 18263156 17302133 16878422
20999 16878422 12660412 5535198 -344791 1015190 5441600 5535228 6501851 10059525
20991 10059525 14264970 15363242 16366433 21660320 24347675 23435794 20563447 16349810
20983 16349810 16066418 15366276 9292011 6808211 10873921 12234564 11899140 11901868 13547199
20974A3547199L841j820612L146564M004182j875470j790168k376255m008262
20966H831019r464320m905510M678953q862893r671294q40063J868280M875876
20958a3489952Q332250J623397J640939L185214O592917P337684K004324n162647
20950A2064126q543672o805180m242995m160892p753694l251213K397125J0291915
20942a0004480J2742707K468430j0201742n144509J610140j172804r03543J024869
20934i580932k480050j326144j259041p34711Q685922Q919197J990799l430074
20926G84966l975295J106280R93932l609290o972441k179228L898348m92195K445851
20917g999072O988661Q904646K741772k239215k492614n82662p714704q374639
$$ plain form
20974 13547199 13551040 11730428 14876992 18881174 17005704 15215536 12839281 8831019
20966 8831019 -633301 -5538811 -859858 -9722751 -19394045 -20234108 -18365828 -13489952
20958 -13489952 -5157702 -3534305 -1893366 1291848 7884765 15222449 17226773 12064126
20950 12064126 3520454 -3284726 -7527721 -11688613 -19442307 -22693520 -20296395 -10004480
20942 -10004480 2738227 5206657 -4995085 -10139594 -8529454 -9702258 -10605801 -9580932
20934 -9580932 -12060982 -13387126 -14646167 -15380878 -6694956 2224241 4215040 784966
20926 784966 -3190329 -2084049 -1090117 -4699407 -11671848 -13851076 -9952728 -10444923 -7999072
20917 -7999072 -1010411 7894235 10636007 8396792 5904178 5321516 -2393188 -10767827
20909a0767827N52822N236293N896626M987096J674960K980630J284928j371777
20901A0473751M449986J932001m304989q686039p879179o718929l96927J566828
20893i563497N910873M465586N398189J559092n355507q337093l105870j804861
20885a0833088L010387O948866J379581k391442J744511L712725k930540M668485
20877E309485O371149p07101M928944L365299m06740j848879o415274q642620
20869A954263m382252o57215l71380K850726R95564n525107j89811O026265N621322
20860F322375l211328J113231R391134N683388J16881n353415r816772m544637
20852b99143m582510l782683J431814r86970J087437j294880K09395N610174K211705
$$ plain form
20909 -10767827 -10215005 -4978712 917914 5905010 7579970 10560600 11845528 10473751
20901 10473751 14923737 16855738 12550749 3864710 -4014469 -10733398 -11130325 -9563497
20893 -9563497 -3652624 812962 6211151 7770243 2414736 -5922357 -9028227 -10833088
20885 -10833088 -7822701 -873835 505746 -1885696 -141185 3571540 641000 5309485
20877 5309485 11680634 10973533 15902477 19267776 18861036 17012157 10596883 1954263
20869 1954263 -2427989 -3085204 -3456584 -605858 389706 -5135401 -5325212 701053 6322375
20860 6322375 3111047 4224278 13615412 19298800 19415681 14062266 4245494 -299143
20852 -299143 -4881653 -8664336 -7232522 -8219492 -7132055 -8426935 -8217540 -2607366 -395661
20843c95661M09547o53143M034678Q72444j394395M027968k00102m86330L87239
20834F602245M23581M196901n35999m954240r52460j763300M676410K573081m40869
20825I825350k087851k631878k504039k648392k655918J331559j003054l956907
20817f331130r08175j648134q80741L946898j433861n721782j008103P144745
20809f840283P505284L517718N659837o20515l840988n93988Q86172J39019J549610
20800G361866K73838l453586m843020k107412M060627N013871J900717L828103
20792A2035004N464439j367361k076071k480623n155235j59125J429226K432194
20784A0122448k87721l620216m772734l083962Q93463P134975K671299o438369
$$ plain form
20843 -395661 13886 -639257 3395421 4267865 2873470 6901438 6701336 6215006 6602245
20834 6602245 7025826 11222727 10686728 5732488 4780028 3016728 7693138 10266219 9825350
20825 9825350 7737499 5105621 2601582 -46810 -2702728 -1371169 -2374223 -6331130
20817 -6331130 -7239305 -8887439 -9768180 -5821282 -7255143 -12976925 -13985028 -6840283
20809 -6840283 665001 4182719 9842556 9222041 5381053 4787065 5673237 5812256 7361866
20800 7361866 7635704 4182118 -660902 -2768314 1292313 6306184 8206901 12035004
20792 12035004 17499443 16132082 14056011 11575388 6420153 6261028 7690254 10122448
20784 10122448 9834727 6214511 1441777 -1642185 -748722 6386253 9057552 2619183
20776B619183n018836J8816J208024J102668n366621q934707j0453914o37324
20768b5462711M973960K350294M083441J925562j132043j621758m591273j686406
20760b1160934M309895N16558M012032M623471j817499J385102k064431n225671
20752a5421477O760148M335760l585322m494027J78736M975521R050846J391225
20744C191410n620703k956414J044990O468707L706276P01959l93616k996649
20736C145960m825577o653413K315781K421255k770725J559702R285060M204622
20728H682665J235471l161181k987632k264122K651419J385692m092481j437924
20720A1907N027300m698415m86100L872507M478735K324643m771962m240429n407761
$$ plain form
20776 2619183 -2399653 -2380837 -1172813 -70145 -5436766 -14371473 -24825387 -25462711
20768 -25462711 -20488751 -18138457 -14055016 -12129454 -13261497 -14883255 -19474528 -21160934
20760 -21160934 -16851039 -16334481 -12322449 -7698978 -9516477 -8131375 -10195806 -15421477
20752 -15421477 -8661329 -4325569 -7910891 -12404918 -12226182 -7250661 1800185 3191410
20744 3191410 -2429293 -5385707 -4340717 2127990 5834266 6536225 6142609 3145960
20736 3145960 -1679617 -8333030 -6017249 -3595994 -6366719 -4807017 4478043 8682665
20728 8682665 9918136 6756955 3769323 1505201 4156620 5542312 1449831 11907
20720 11907 5039207 340792 -145308 3727199 8205934 10530577 5758615 1518186 -3889575
20711c889575N681001R437178N79545J270260K608256l221001j192679j617262
20703I655723L987957Q109576J259208R4163k039820k162486J136896m25442p247396
20694A2368379o132479m188269n602453j464065n25226k907838l218451K86661
20686a1383741l47221K87824J677115k288744K87334m64173n145152o383406L165048
20677b0595116J0140118N412607n23334J469336K513585m72386o98382k009311
20669d762883o99482r46463k853183k012223J915500M086550L439677K796170
20661I63663p72949o925446o354010j351744L738350K397831K102757K803247
20653c398301j64515m214575p80596L689086P066331J894640q907778r718442
$$ plain form
20711 -3889575 1791426 11228604 11808149 13078409 15686665 12465664 11272985 9655723
20703 9655723 13643680 21753256 23012464 23106627 21066807 18904321 20041217 19615775 12368379
20694 12368379 6235900 2047631 -3554822 -5018887 -5544113 -8451951 -11670402 -11383741
20686 -11383741 -11730962 -11443138 -9766023 -12054767 -11767433 -12231606 -17376758 -23760164 -20595116
20677 -20595116 -10454998 -5042391 -5565725 -4096389 -1582804 -2055190 -2753572 -4762883
20669 -4762883 -5462365 -6408828 -9262011 -11274234 -9358734 -5272184 -1832507 963663
20661 963663 190714 -6734732 -13088742 -14440486 -10702136 -8304305 -6201548 -3398301
20653 -3398301 -3562816 -7777391 -8557987 -4868901 2197430 4092070 -4815708 -14534150
20645a4534150p641214j072235N261439O244528M448622N116632L318664O170219
20637G312505P395826K747712k189212o058743n099201k626776l136947k09219
20629a864055m51471N32409k300676m915277R16519J0486369P179920N205175
20621A4788913J0024839M114185n841826J72741J5441724K9387496M6444532P0699000
20613A85231604M1768904l2598120m7976848l3244915k4864220j7611975r370591
20606F1333839o321224r058900n196609n406256j2355074o295779k269367k730322
20598A1700308k624125j79647J621402p297324m660921J487327j180122l329028
20590d462130o74478Q92616n702945o670049m445062L815894J2962136K939945
$$ plain form
20645 -14534150 -22175364 -23247599 -17986160 -11741632 -7293010 -2176378 1142286 7312505
20637 7312505 14708331 17456043 15266831 9208088 4108887 1482111 -1654836 -1864055
20629 -1864055 -2315526 -1783117 -4083793 -8999070 -8082551 2403818 9583738 14788913
20621 14788913 24813752 28927937 23086111 23258852 38700576 68088072 114532604 185231604
20613 185231604 227000508 194402388 146425540 113180625 88316405 70704430 61333839
20606 61333839 55012615 45953715 40757106 35350850 22995776 16699997 14430630 11700308
20598 11700308 9076183 8896536 10517938 3220614 -1440307 47020 -1133102 -4462130
20590 -4462130 -5136608 -4243992 -9946937 -16616986 -21062048 -17246154 -4284018 -1344073
20582a344073l687345K700214o935244n167290M685125N212128o48490m348527
20574i533502k566546J949655M982774N368330j093031j752800K778673Q729685
20566H863238P51886m642950j016325r78743j459849j73497o535594l221407j250228
20557i663469l513120L06544P332399O408211p82615n33641n098831K9995M391538
20548a122989R18405O17788N2623J859000Q96863O45025L089226l126202J029875
20539D859614L417133K316238j94873o913378n731423k068285K657246k17278
20531a875006m657327J401998j828252m555210Q120667J3768734M821436o632185
20523H564855l702553m488390n813825k055135n283267L26485J269570K007180
$$ plain form
20582 -1344073 -5031418 -2331204 -9266448 -14433738 -9748613 -4536485 -5184975 -9533502
20574 -9533502 -12100048 -10150393 -5167619 200711 -892320 -2645120 133553 8863238
20566 8863238 9615124 4972174 3955849 2977106 1517257 1343760 -5191834 -8413241 -9663469
20557 -9663469 -13176589 -12870045 -5537646 870565 87950 -445691 -5544522 -5514527 -1122989
20548 -1122989 -204584 413204 465827 2324827 3221690 3866715 6955941 3829739 4859614
20539 4859614 8276747 10592985 10398112 3484734 -2246689 -4314974 -1657728 -1875006
20531 -1875006 -6532333 -5130335 -6958587 -11513797 -3393130 10375604 15197040 8564855
20523 8564855 4862302 373912 -5439913 -7495048 -12778315 -12451830 -11182260 -9175080
20515i175080J2582749O072619o159910j2147498n856747l472849m478488Q30942
20507b1804262J254388j697345j00911N026045P407131j410548L713114P562353
20499e0035j587893n691559m107128j963213o57497o595658Q3095J1886305J2582265
20490C898682K219860r489549p487570K07996Q745502J0690470L799910K097015
20482A4682316k950386j1067475j2783019n097007M081403M528956J481472K062485
20474e061255N049859K473906m350568k611562O61590L358121M569793M093989
20466H183873J349864r83176o022551p980199o89458J632649P069375Q767785
20458A1328162q2690p566950m907821k781185j730490m439276m69661K334644
$$ plain form
20515 -9175080 3407669 9480288 3320378 -8827120 -14683867 -18156716 -22635204 -21804262
20507 -21804262 -20549874 -22247219 -22348130 -17322085 -9914954 -11325502 -7612388 -50035
20499 -50035 -1637928 -7329487 -11436615 -13399828 -14057325 -20652983 -20569888 -8683583 3898682
20490 3898682 6118542 -3371007 -10858577 -10650581 -1905079 8785391 12585301 14682316
20482 14682316 11731930 664455 -12118564 -17215571 -13134168 -8605212 -7123740 -5061255
20474 -5061255 -11396 2462510 -1888058 -4499620 -3838030 -479909 4089884 8183873
20466 8183873 9533737 8550561 2528010 -5452189 -6141647 -4508998 2560377 11328162
20458 11328162 11245472 3678522 -1229299 -4010484 -5740974 -10180250 -10649911 -8315267
20450h315267M158327O43692j862329L936707Q476199K929107p25283J180073
20442A0421226q18127J648632n48867m455870j249496j749773m935872m599587
20434f287734j353928J63144N687382M309744l833032O92721K502728m378718
20426b497693m722701J512884P668553M834355L926959J427007j243232p98918
20418A0107214j050637n651948k499480K085258M734169K547849n443292p617885
20410b788752j532080R95464K688467n448555m069107M514353J157502k549358
20402g032066R66320m680634k594734J0469983J0149480J213869o445358o443839
20394d396979n556061l222970J577326L715487M408803k227198o476976j698333
$$ plain form
20450 -8315267 -4156940 -3513248 -5375577 -1438870 7037329 9966436 9241153 10421226
20442 10421226 9603099 11251731 10702864 6246994 4997498 3247725 -1688147 -6287734
20434 -6287734 -7641662 -7478518 -1791136 2518608 -1314424 -621703 1881025 -2497693
20426 -2497693 -7220394 -5707510 1961043 6795398 10722357 12149364 10906132 10107214
20418 10107214 9056577 3404629 905149 2990407 7724576 10272425 4829133 -2788752
20410 -2788752 -4320832 -3325368 -636901 -6085456 -10154563 -5640210 -4482708 -7032066
20402 -7032066 -6065746 -10746380 -13341114 -2871131 7278349 8492218 2046860 -4396979
20394 -4396979 -9953040 -13176010 -11598684 -7883197 -3474394 -5701592 -12178568 -13876901
20386a3876901r40543n847242j471968M058387K623029J493882l078855k284122
20378a9324333L752129N360879N417018R56054k845252K255709m190798n016902
20370a3635496j137495M570101N748782j817438l577372o533200j213423M130174
20362a3465367L211484N388421K625219r48931r43861N806832m8720r414555n085500
20353a2874978n75487M48830N515723K168466q546896l890556k26703o083613
20345b4065214J12038O179425K64685j229034P705292J0329322O083328Q20997
20337F200839m348557n662016l061359k740267n09901j071769J64718M15045K257547
20328h355720M610272R898050P852441J925305l042395k2916M11313k394796l414126
$$ plain form
20386 -13876901 -14817444 -20664686 -22136654 -18078267 -15455238 -13961356 -17040211 -19324333
20378 -19324333 -15572204 -10211325 -4794307 -3838253 -6683505 -4427796 -8618594 -13635496
20370 -13635496 -14772991 -10202890 -4454108 -6271546 -9848918 -16382118 -17595541 -13465367
20362 -13465367 -10253883 -4865462 -2240243 -3189174 -4133035 1673797 1625077 -7789478 -12874978
20353 -12874978 -13450465 -13001635 -7485912 -5317446 -13864342 -17754898 -17981601 -24065214
20345 -24065214 -23953176 -17773751 -17509066 -18738100 -11032808 -703486 5379842 6200839
20337 6200839 1852282 -3809734 -6871093 -9611360 -10121261 -11193030 -11028312 -10613267 -8355720
20328 -8355720 -3745448 6152602 14005043 15930348 12887953 12865037 13276350 10881554 7467428
20319G467428n619372R23283K384259K285858n072653k996891L4743n56050J81152
20310i68243j458906j127502m179483j350577K843545L267486P44057J816543
20302d13080M451801L832504N667705L860649M812797N533794k500819m600137
20294B0645214n823176q287737J204477N318370r01191l974825m380581k187439
20286A613112j362242K84468N994490M752233L156879r04427j0941382j6378457
20278a3785326p376810K858699L275017N084976k642322n425531K62933P825165
20270i923199P830181q92966j427057K88962L573304O707984M652124P10952m110817
20261G409468k634767j012096J132004M02103k177313k4401J762536N331181O37652
$$ plain form
20319 7467428 1848056 2771339 5155598 7441456 2368803 -628088 -593345 -1149395 -968243
20310 -968243 -2427149 -3554651 -7734134 -9084711 -6241166 -2973680 -2229623 -413080
20302 -413080 4038721 7871225 13538930 17399579 22212376 27746170 25245351 20645214
20294 20645214 14822038 6534301 7738778 13057148 12155957 8181132 3800551 1613112
20286 1613112 250870 535338 6529828 11282061 14438940 13534513 2593131 -13785326
20278 -13785326 -21162136 -18303437 -15028420 -9943444 -12585766 -18011297 -17748364 -9923199
20270 -9923199 -2093018 -2985984 -4413041 -4124079 -550775 6157209 10809333 11520285 7409468
20261 7409468 4774701 3762605 4894609 5296712 3119399 3094998 4857534 10188715 10826367
20252A0826367o600316m686210J42254n408170m924101J1899N825286N485843
20244F72852m518192l677561J586208J459667P183425P647136K36173n783307
20236D806401n389950m312033k902031M015256L829453J040302J307270q14404
20228A580264m215K179694K191859l872424m997452J93760L209804j092301j600693
20219b211704q35452N227329O026250K845971j210678j923350o77586L281115
20211A0521895O671580M785251O75605J3179339J8957034K4847912M2561755P7102579
20203A99302950J25835974J66377857M5117002j08737604j13598321q3547813
20197B30750045o0419863m4065774l0992506k3616320j6672567j4337890o121366
$$ plain form
20252 10826367 4226051 -460159 -317905 -5726075 -10650176 -10638277 -4812991 672852
20244 672852 -3845340 -7522901 -5936693 -4477026 2706399 10353535 10589708 4806401
20236 4806401 -583549 -4895582 -7797613 -3782357 47096 1087398 2394668 1580264
20228 1580264 1576049 3755743 5947602 2075178 -2922274 -2728514 481290 -611011 -2211704
20219 -2211704 -3047156 2180173 8206423 11052394 9841716 7918366 7240780 10521895
20211 10521895 17193475 21978726 22654331 35833670 54790704 79638616 122200371 199302950
20203 199302950 325138924 491516781 536633783 427896179 314297858 230750045
20197 230750045 170330182 126264408 95271902 71655582 54983015 40645125 34523759
20190C4523759L396351k157888j1088580j2685280j0785062j985201K564584P037860
20182H820543J440642J946834r31208j769603o714043k234348K650021k896011
20174C12827K077015N995321K890886m054856l492126K774356K307290J555066
20166A0365779q65328l87977k4872l291199L405885N368092R73138r86714k664575
20157A1892229m530907k641328k391847m065972k035941J468450o12446M16235
20149b501527N690325p1216k604544l751307N294870R589566l040962p602804
20141A002401j834527K760808N182250K366265n149863j760485j201240m476116
20133c110507j344976L651690J782798r02062K802822o729440o021457o10353
$$ plain form
20190 34523759 37920110 35762222 24673642 11988362 1203300 -781901 1782683 8820543
20182 8820543 10261185 12208019 11276811 9507208 2793165 558817 3208838 312827
20174 312827 2389842 8385163 11276049 7221193 3729067 6503423 8810713 10365779
20166 10365779 9500451 9112474 9087602 5796403 9202288 14570380 15543518 14556804 11892229
20157 11892229 7361322 4719994 2328147 -1737825 -3773766 -2305316 -2917762 -2501527
20149 -2501527 3188798 3117582 513038 -3238269 2056601 11646167 8605205 1002401
20141 1002401 -832126 1928682 7110932 9477197 4327334 2566849 1365609 -3110507
20133 -3110507 -4455483 -803793 979005 76943 2879765 -3849675 -9871132 -10481485
20125a0481485M181795M314835O13594p652473o342019L640245K988350m006298
20117a2743456n154881J202624O385549R193000Q384952O509291N307480m250612
20109A4833947j1205962l908705l78274j407134j950636k210686l205275o876486
20101a6309211n881708M257376J1867486R262401j138968N38453L697504l553095
20093B740238k748773K416150o57025p84242J299619n306806p656638n26270M915595
20084f308152P447794N137151j898393o015653J441469l388844q13497N323286
20076I25161L770796K195097n06696m922164m713482J219550L577647K019525
20068C565434j703028J815437o27946l880312l444373K386221L222290O54272
$$ plain form
20125 -10481485 -6299690 -1984855 -1371261 -9023734 -15365753 -11725508 -8737158 -12743456
20117 -12743456 -17898337 -16695713 -10310164 -1117164 7267788 13777079 19084559 14833947
20109 14833947 3627985 -280720 -658994 -2066128 -4016764 -6227450 -9432725 -16309211
20101 -16309211 -22190919 -17933543 -6066057 3196344 2057376 2595829 6293333 2740238
20093 2740238 -8535 2407615 1750590 966348 2265967 -3040839 -10697477 -11223747 -6308152
20084 -6308152 1139642 6276793 4378400 -1637253 -195784 -3584628 -4398125 925161
20076 925161 4695957 6891054 6384358 1462194 -3251288 -2031738 1545909 3565434
20068 3565434 1862406 3677843 3049897 -830415 -4274788 -1888567 1333723 1987995
20060A987995J226237J201198M59203o409363m462327k474199j782659L227471
20052g026444Q555333L025797m99981k267495q035081r302515m448703M22802
20044a9576287J176398L499854O189390N107807l641293n464749L726357J1665164
20036B682641O930193O96743n046244k837185J569130K450785K46771j455377
20028E237457j526722m492039o219921k175356K018102o1388J721835M563657
20020i34375L260139p46457k674387o35303j485379L251692J0460052K673674
20012A3169656l648520j552704l077941q272398J344341N849036O254424m43661
20004I622233p134645k099839K347603Q370575O137923l667168n417127q91327
$$ plain form
20060 1987995 3214232 4415430 4874633 -1534730 -5997057 -8471256 -10253915 -7026444
20052 -7026444 1528889 4554686 4054705 1787210 -6247871 -15550386 -19999089 -19576287
20044 -19576287 -18399889 -14900035 -8710645 -3602838 -7244131 -12708880 -8982523 2682641
20036 2682641 9612834 10309577 5263333 2426148 3995278 6446063 6692834 5237457
20028 5237457 3710735 -781304 -7001225 -9176581 -7158479 -7219867 -5498032 -934375
20020 -934375 2325764 1579307 -1095080 -1730383 -3215762 35930 10495982 13169656
20012 13169656 9521136 7968432 4890491 -3381907 -2037566 3811470 10065894 9622233
20004 9622233 2487588 387749 2735352 11105927 17243850 13576682 8159555 7268228
19996G268228J493669r21994j242584M896299K647782j1779879n637685L80362
19988b895802m693862j896945K948690K68859k282272J959078R62479l030709
19980h660484K608566L595648J9022m51483L347190M407525J31805o55791l247751
19971A094247j3017K964584M318452l494475o329125m628135l483362L16322L984789
19962e269720Q065256Q428432p47011n665493p71875m07489q595561o513757k579788
19953a4057006N946285O866120J93843j692976r30649q96792O545101J740012
19945C713938n764352Q9931P377478J1136276L583028n312074n401517K970486
19937A2393194O064205k499033p375681r647957k974834j536368l116450p91919
$$ plain form
19996 7268228 8761897 7839903 6597319 11493618 14141400 2361521 -3276164 -2895802
19988 -2895802 -7589664 -9486609 -6537919 -6269060 -8551332 -6592254 -5629775 -8660484
19980 -8660484 -6051918 -2456270 -2437248 -2888731 458459 4865984 4997789 4341998 1094247
19971 1094247 1081230 4045814 8364266 4869791 -1459334 -6087469 -9570831 -9254509 -5269720
19962 -5269720 2795536 11223968 10476957 4811464 4039589 3632100 -4963461 -11477218 -14057006
19953 -14057006 -8110721 -1244601 -1050758 -2743734 -3674383 -4571175 1973926 3713938
19945 3713938 -2050414 -1960483 5416995 16553271 20136299 14824225 9422708 12393194
19937 12393194 18457399 15958366 8582685 -1065272 -4040106 -5576474 -8692924 -9484843
19929i484843K620701N58499p053792o006202k317644M062757M278248K898587
19921a0443689L458694J766136L567314K067653R17740k776944J626490M080398
19913D263792j112679l169775J40983K618489L957891L468393n149091q408998
19905c390995o581560j81100M250381N292600K597806L949818N444001L374005
19897A4754956K404092k551541k543684K059362M021589n49540j0070610r771931
19889b247307m049871j72700M172600N39397q005430q032734k069803L524555
19881a6341293J0397638N553002P47040p167920l526388N206608R278706N957564
19873A0104957P306297K357870q690155r629695k558130L989072K936352q00501
$$ plain form
19929 -9484843 -6864142 -6305643 -13359435 -19365637 -21683281 -17620524 -13342276 -10443689
19921 -10443689 -6984995 -5218859 -1651545 416108 1333848 -1443096 183394 4263792
19913 4263792 3151113 -18662 122321 2740810 6698701 10167094 5018003 -3390995
19905 -3390995 -9972555 -10153655 -5903274 -610674 1987132 5936950 11380951 14754956
19897 14754956 17159048 14607507 12063823 14123185 18144774 17595234 7524624 -2247307
19889 -2247307 -6297178 -6469878 -2297278 -1757881 -9763311 -17796045 -19865848 -16341293
19881 -16341293 -5943655 -390653 356387 -6811533 -10337921 -5131313 4147393 10104957
19873 10104957 17411254 19769124 11078969 1449274 -1108856 2880216 5816568 5016067
19865E016067K03545l001526K443301M954680k788371p305556o225867l158212
19857i861939L18707L785189M627862O731363O952234M160892Q30034J875872
19849A9420214J961830l169344o467600m502559r602220j0567714r26265R780235
19841d073423N790910M598682k940943l950994o101780n652200j15468Q106920
19833d338296N696656L295593L9003O760139O447956m044468j0202305l062741
19825E91537N68980n739737J90946j125719k679977r62079o41717j420984Q38969
19816a0379781M468504L435152P47409O67003m615029m15355Q514157O289559
19808H711619N448518j783219o885260j146086m16737l059983l159073k046804
$$ plain form
19865 5016067 5219612 2218086 4661387 9616067 6827696 -477860 -6703727 -9861939
19857 -9861939 -9543232 -5758043 -1130181 5601182 12553416 16714308 17544342 19420214
19849 19420214 21382044 18212700 11745100 7242541 -2359679 -12927393 -13853658 -4073423
19841 -4073423 1717487 6316169 3375226 -575768 -6677548 -12329748 -12445216 -4338296
19833 -4338296 1358360 4653953 4692956 11453095 17901051 13856583 3654278 591537
19825 591537 1160517 -4579220 -4388274 -5513993 -8193970 -9156049 -9797766 -11218750 -10379781
19816 -10379781 -5911277 -2476125 -1728716 -1061713 -5676742 -6092097 2422060 8711619
19808 8711619 14160137 12376918 5491658 4345572 3928835 868852 -2290221 -4337025
19800d337025J390945L784934M909411K010859l464244n153890o641903k423190
19792i924103j489605q22895L093592J131782M006088L961160M31923j183649
19784g95707M42829M03163j346465l296206k644487K143621N920257M737357J103822
19775F668184J57568o178209l057408K591783l73113L4469J811476j616392m913106
19766d874748k637672m363984J049066o07090P89016J747641L4775K069981q72362
19757g665377K412592N992197P764657L912691m236115o335008m422405J531970
19749a044798p06483p3905M379030n96348j2173856j868487Q999321N149319k58609
19740A805184R97635J18002k301427m176576n151944n98245K323564L375657O898764
$$ plain form
19800 -4337025 -2946080 838854 5748265 7759124 4294880 -859010 -7500913 -9924103
19792 -9924103 -11413708 -12236603 -9143011 -8011229 -4005141 -43981 387942 -795707
19784 -795707 -352878 50285 -1296180 -4592386 -7236873 -5093252 827005 5564362 6668184
19775 6668184 6825752 647543 -2409865 181918 -191195 -156726 1654750 38358 -4874748
19766 -4874748 -7512420 -11876404 -10827338 -11434428 -10645412 -8897771 -8862996 -6793015 -7665377
19757 -7665377 -5252785 739412 8504069 12416760 8180645 1845637 -2576768 -1044798
19749 -1044798 -1751281 -1825186 2553844 1957496 -10216360 -12084847 -3085526 2063793 1805184
19740 1805184 2802819 2920821 619394 -3557182 -8709126 -9307371 -6983807 -3608150 3290614
19731C290614J554580l144249L384642L854012k11834l496068p354601P43815
19723a379089L423422J447268p58018j256004k574498m792688K762301L637636
19715E10330J690978m63062p89161J614307n221344l401104N0911L773763k88013
19706b522395n584107l384008l829122M56870J785593M096307L933772J240435
19698c806655j129603q78295j072892l019129j341135l686290n486845J526594
19690a8894250L479166N712675P67031N934758M575207j197019q736373k674192
19682a1032997Q610129M682564J558383O6740j753876k770985k548051k530446
19674e718539L135971L870584m81248j890357K131033k396131p037526o86651
$$ plain form
19731 3290614 4845194 1700945 5085587 8939599 8727765 5231697 -2122904 -1379089
19723 -1379089 2044333 3491601 2733583 1477579 -1096919 -5889607 -3127306 510330
19715 510330 2201308 1738246 949085 2563392 -2657952 -6059056 -6008145 -2234382 -2522395
19706 -2522395 -8106502 -11490510 -15319632 -14862762 -13077169 -8980862 -5047090 -3806655
19698 -3806655 -4936258 -5814553 -6887445 -9906574 -11247709 -14933999 -20420844 -18894250
19690 -18894250 -15415084 -9702409 -8935378 -3000620 1574587 377568 -8358805 -11032997
19682 -11032997 -2422868 2259696 3818079 3884819 2130943 -640042 -3188093 -5718539
19674 -5718539 -2582568 1288016 806768 -1083589 1047444 -1348687 -8386213 -9072864
19666i072864k728698K205680N737512L820719k309977n777145L27064O37325
19658g160384J835391R81028J557748Q53112o18993R54548j224540l020957K801718
19649c041329M558124N400595J27969n131306m302705n464429l893563m783837
19641a6530481M98961R089600J1962576R151754K214763j823000O462234L833719
19633B4860126p228119j1140302l594117O494832J256348r472444l832183m404084
19625g059943k099513L49459K863507N73379j776887P232316P698111m061904
19617C718525n971763l465790k278093j650568l901162K474488L717292M95574
19609f861497j056746l667678j365606Q144348R142065p242k954653k443996N730315
$$ plain form
19666 -9072864 -11801562 -9595882 -3858370 -37651 -2347628 -8124773 -7797709 -7160384
19658 -7160384 -5324993 -4343965 -2786217 -1933105 -2552098 -1597550 -2822090 -5843047 -3041329
19649 -3041329 1516795 6917390 7045359 1914053 -2388652 -7853081 -11746644 -16530481
19641 -16530481 -16031520 -6941920 5020656 14172410 16387173 14564173 21026407 24860126
19633 24860126 17632007 6491705 2897588 9392420 10648768 1176324 -2655859 -7059943
19625 -7059943 -9159456 -8809997 -5946490 -5373111 -7149998 82318 7780429 3718525
19617 3718525 -2253238 -5719028 -7997121 -9647689 -13548851 -11074363 -7357071 -6861497
19609 -6861497 -7918243 -11585921 -12951527 -4807179 4334886 4327644 1372991 -1071005 4659310
19600D659310R168176L433004l374254r319201m330616R33942k593405k436790
19592c859834M176444N951486p015726m659404P473J342227M743560k881453L274692
19583A079465L206331J08731M386386r34310l05848M452057j273253l591834n523223
19574A604502r660299m110243K691640O590798P954989K628423O935484M189689
19566A8824983J263525l169883j381288N105058J3019833R662064J0745036J9164905
19558G3234233J7758091J9384456L1348986N0945066P7077922Q7922872O5101843
19551D22773469P357543m7365452o5712226n9062969m9486981l8483924k8586761
19544A41432699k5101304k0605185j7518809r004416l158005j221109p088347
$$ plain form
19600 4659310 13827486 17260490 13886236 4567035 236419 1170361 -1423044 -3859834
19592 -3859834 316610 6268096 -747630 -5407034 -5399561 -4057334 686226 -2195227 1079465
19583 1079465 4285796 4394527 8780913 7846603 7540755 11992812 10719559 7127725 1604502
19574 1604502 -8055797 -12166040 -9474400 -2883602 5071387 7699810 14635294 18824983
19566 18824983 20088508 16918625 15537337 20642395 33662228 43324292 54069328 73234233
19558 73234233 90992324 110376780 141725766 192670832 269748754 357671626 422773469
19551 422773469 430131012 382765560 317053334 257990365 208503384 170019460 141432699
19544 141432699 116331395 95726210 78207401 69202985 66044980 64823871 57735524
19537E7735524j1097416q265619l780408n74637p44484J87584m247487j2010545
19529A7202512l652704L703637n443125j443780R394984N859619R2979K513968
19521B8228090k489877j1246773j1499261p663260R33667O808114M558329M694422
19513A2323451O745035K821387j563097n220145m496447k839345k348480J432282
19505F854641o186606m080087L253649K9923N432277j757079l299395p63926L889309
19496C372706K728196j723529L056976M027047J809453l78765n465430L771821
19488A1198475O465578j765752o527668m130684l758222o155037m072473N586797
19480c158986O205445l393320o891070N93872R055904L517466m89891k450497
$$ plain form
19537 57735524 46638108 38372489 34592081 34017444 33272960 33460544 29213057 17202512
19529 17202512 13549808 17253445 11810320 10366540 19761524 25621143 25714122 28228090
19521 28228090 25738213 14491440 2992179 -4671081 -3737414 3070700 7629029 12323451
19513 12323451 19068486 21889873 20326776 15106631 10610184 7770839 5422359 6854641
19505 6854641 668035 -3412052 -158403 -128480 5303797 3546718 247323 -516603 3372706
19496 3372706 6100902 4377373 7434349 11461396 13270849 12892084 7426654 11198475
19488 11198475 17664053 15898301 9370633 5239949 1481727 -4673310 -8745783 -3158986
19480 -3158986 3046459 -346861 -7237931 -6644059 2411845 5929311 5439420 2988923
19472B988923k568136q73483j965511r79177J102987R618136O005169l986325
19464I342583o946469k380717m293219q447612o035588O49371Q600999J1455783
19456A945131O372434j623427J602900k865831l017073L634462J928913l849416
19448D128093r3537L318714K492143J933721j968304k128820m516800m649474
19440a484264J62941k821523m140363K481414M264729L314296Q584166M738280
19432A5099676m744379l332190n507613q385226k294504j392148O189864O821890
19424B455370L687178M535927n54078l196378n427063m666610o51023N76943K614088
19415f25646L909016L37257k377365l778784p23745M798077K573305m85435o37695
$$ plain form
19472 2988923 420787 -452696 -2418207 -3397384 -2294397 7323739 13328908 9342583
19464 9342583 2396114 15397 -4277822 -12725434 -18761022 -18111651 -9510652 1945131
19456 1945131 8317565 6694138 8297038 5431207 2414134 6048596 7977509 4128093
19448 4128093 4034556 7353270 9845413 11779134 9810830 7682010 3165210 -1484264
19440 -1484264 -1321323 -4142846 -8283209 -5801795 -1537066 1777230 10361396 15099676
19432 15099676 10355297 7023107 1515494 -6869732 -9164236 -10556384 -4366520 2455370
19424 2455370 6142548 10678475 10124397 6928019 1500956 -3165654 -3816677 -3239734 -625646
19415 -625646 3283370 3620627 1243262 -2535522 -3259267 1538810 4112115 3626680 2988985
19406B988985k921653m08369m312255k832682n19838q01534O890467O837018P7465
19397D997604k753326k028584J207022L082913L174211L175271q44243n089050
19389D921818Q34038L792246k466130o540689m80394J814960k365405j906935
19381b396491m805752m815624j525529N881150N501646M534027L691482p87313
19373E277596N19157O9596l650757L92481L384449N303993L192669K89226n21385
19364A4257025o809658n103207R98246j377253K46590J716281P86375o7674L900402
19355H547127K901019q371276j0720533j772847K944436M960027L601797M487468
19347F577218j985567l828023n025169j235196J638317N526397R125922M650302
$$ plain form
19406 2988985 67332 -341037 -4653292 -7485974 -8005812 -8807346 -1916879 4920139 4997604
19397 4997604 2244278 215694 1422716 4505629 7679840 10855111 10010868 4921818
19389 4921818 5755856 9548102 7081972 541283 60889 1875849 -489556 -2396491
19381 -2396491 -7202243 -12017867 -13543396 -7662246 -2160600 2373427 6064909 5277596
19373 5277596 5796753 5866349 2215592 2608073 5992522 11296515 14489184 14778410 14257025
19364 14257025 7447367 2344160 3342406 1965153 2211743 3928024 4714399 4646725 8547127
19355 8547127 11448146 3076870 -7643663 -9416510 -6472074 -1512047 2089750 6577218
19347 6577218 4591651 763628 -4261541 -5496737 -3858420 1667977 10793899 15444201
19339A5444201q93830m773475m543611J640697K060190p891107j2074872p748867
19331a8780674O063154J31638k672806O175994M849206L29325l93621j158613
19323e456397j847334j378745K63333L227189K701822J709148N048283O721420
19315A0988719P291296j48138p516793l738392K237405j914781k993598l94229
19307C811489K350174j798646k401201k629390j310668J706708J616559N798094
19299G143119M225238Q23796q61575k010127l027963O91226N13057L520280O623493
19290A7640544J164669l035682l598456j0566581j0265519l29234L391394N974212
19282C75347N389562j740240k260488J110472N179745K023829L228144J786019
$$ plain form
19339 15444201 14550371 9776896 5233285 6873982 8934172 1043065 -11031807 -18780674
19331 -18780674 -12717520 -12585882 -15258688 -9082694 -4233488 -3904163 -4297784 -5456397
19323 -5456397 -7303731 -8682476 -8419143 -5191954 -2490132 -780984 4267299 10988719
19315 10988719 18280015 18131877 10615084 6876692 9114097 7199316 4205718 3811489
19307 3811489 6161663 4363017 1961816 -667574 -1978242 -271534 1345025 7143119
19299 7143119 11368357 12192153 11330578 9320451 6292488 6983714 7496771 11017051 17640544
19290 17640544 18805213 15769531 12171075 1604494 -8661025 -8990259 -5598865 375347
19282 375347 5764909 4024669 1764181 2874653 8054398 10078227 13306371 15092390
19274A5092390l372473n316489p72829k786325o12860R022023M877514n388714
19266A0742237r516138q902561n382887J411916P144201P892955j019245J751106
19258D121584J442636o400790n860611j444563N291957P680625J795733q320739
19250a694168n357927j468360j704459L634483J618749j831626N48014Q40283
19242e415011j092064N832958N898353l002116l991123L95282J227143J857591
19234A711013N414939j0379547o133204K047763K044639O226636O813345M026420
19226A1772004k038814l064945J209300M695778J02755L459013l130910o447530
19218F556651n287545o087114j834993o237793o166800j810002K190003J285104
$$ plain form
19274 15092390 11719917 6403428 5630599 2844274 2231414 11253437 16130951 10742237
19266 10742237 1226099 -7676462 -13059349 -11647433 -4503232 3389723 2370478 4121584
19258 4121584 5564220 -836570 -6697181 -8141744 -2849787 4830838 6626571 -1694168
19250 -1694168 -7052095 -8520455 -10224914 -6590431 -4971682 -6803308 -6255294 -5415011
19242 -5415011 -6507075 -674117 5224236 2222120 -1769003 -1373721 -146578 1711013
19234 1711013 7125952 -3253595 -9386799 -7339036 -5294397 932239 7745584 11772004
19226 11772004 9733190 6668245 7877545 12573323 12676078 16135091 13004181 6556651
19218 6556651 1269106 -4818008 -6653001 -12890794 -19057594 -20867596 -18677593 -17392489
19210a7392489o196055J669125Q584438O517133K480675l737886O56372N464693
19202a953994k088526n105791k623363L777841N103278j554639k748530J912872
19194e280852K198114N999416P854252L550941N35667J972752r18657n167089
19186A0744544q574604m338032M41574K539801r00543q377471r208999M070386
19178a3603344J0160823k752795p059994J90827j378383O608576J3262858L573125
19170I001693k372579l092638l514095n028886p335629n644913k533644O102367
19162a4418324N35676j104307O07245L115663O722019P183613P180257N686916
19154A5508758L293618m681459j0082643n241419j951525j849408l634785k82249
$$ plain form
19210 -17392489 -23588544 -21919419 -13334981 -6817848 -4337173 -8075059 -7418687 -1953994
19202 -1953994 -4042520 -9148311 -11771674 -7993833 -2890555 -4445194 -7193724 -5280852
19194 -5280852 -3082738 2916678 10770930 14321871 14857538 16830290 15911633 10744544
19186 10744544 2169940 -2168092 -1726518 813283 -87260 -8464731 -17673730 -13603344
19178 -13603344 -3442521 -6195316 -13255310 -13064483 -14442866 -7834290 5428568 9001693
19170 9001693 6629114 3536476 22381 -5006505 -12342134 -17987047 -20520691 -14418324
19162 -14418324 -13882648 -14986955 -14379710 -11264047 -4542028 2641585 9821842 15508758
19154 15508758 18802376 14120917 4038274 -1203145 -3154670 -5004078 -8638863 -8921112
19146h921112O767334M629689q53405M771615J793740r680804q997074j140831
19138a1630848N394150L036853J46366o18562k266316j613460j393629L449086
19130e496360K169581k510948m576028k353293J52857l187103J482313M013355
19122a0305626P772143J0485290R038842M579691K104952k775941m468526q373259
19114H057566p728240n565122Q88785J605895J897269K258917P61544O477320
19106H653934K973303p204462q764164j855220P391297N333388K320867j639470
19098G209473l857899l954444k673387J508204j682927K219920L679629o098027
19090c649458K825327J0102870J373830P42178k504079l564794L21883K623403
$$ plain form
19146 -8921112 -2153778 2475911 1622506 6394121 8187861 -1492943 -10490017 -11630848
19138 -11630848 -6236698 -3199845 -3053479 -3672041 -5938357 -7551817 -8945446 -5496360
19130 -5496360 -3326779 -5837727 -10413755 -12767048 -12614191 -15801294 -14318981 -10305626
19122 -10305626 -2533483 7951807 16990649 21570340 23675292 20899351 16430825 8057566
19114 8057566 329326 -5235796 -4347011 -2741116 -843847 1415070 2176614 8653934
19106 8653934 11627237 4422775 -4341389 -6196609 1194688 6528076 8848943 7209473
19098 7209473 3351574 -602870 -3276257 -1768053 -3450980 -1231060 2448569 -3649458
19090 -3649458 -824131 9278739 10652569 11394747 8890668 5325874 5647757 8271160
19082H271160M195389k553958p631339p575484r393204m222737K797091K82692
19074a5830390N812397O100996L223883k69805m139429r617537n373225J071130
19066a9021980N706177P108274K931938M659842L229308l474356r53072k167887
19058a981756k040507J090957M160493O11916k857713j917450l88428J965798
19050a356690K828443N634397M178046J854717L861503K852517J423964j563495
19042A9713402m260520n974522j223517p09195n974283q351844l427734N649499
19034d558714L630929m269146o080109p710370j791155j048590J590028P452597
19026a2784530L609065k291562j384696M751175Q083254N824341N520270N073324
$$ plain form
19082 8271160 12466549 9912591 2281252 -5294232 -14687436 -18910173 -16113082 -15830390
19074 -15830390 -10017993 -3916997 -693114 -962919 -5102348 -14719885 -20093110 -19021980
19066 -19021980 -13315803 -6207529 -3275591 1384251 4613559 1139203 186131 -1981756
19058 -1981756 -4022263 -2931306 1229187 1841103 -1016610 -2934060 -3322488 -1356690
19050 -1356690 1471753 7106150 11284196 13138913 17000416 19852933 21276897 19713402
19042 19713402 15452882 9478360 8254843 7545648 1571365 -6780479 -10208213 -4558714
19034 -4558714 -927785 -5196931 -11277040 -18987410 -20778565 -21827155 -20237127 -12784530
19026 -12784530 -9175465 -11467027 -12851723 -8100548 -17294 5807047 11327317 16400641
19018A6400641m219940l579883k355950k12610K937150K843544j073372j93975
19010A0545605J772478M302199k296720j0167305q711564j982466N334004N354735
19002D150966m920173q817042N458082O068524j73924K322373O577163Q638586
18994A9304555O721399o360200j4945803o402082j275082o07707J631795L399297
18986A466172L370395R23833m632790j872312M307542L397345m18460j436943
18978E104782j129493p556915n526399O256848K457417q281735n780470O13825
18970a3842140R2338L431259L418625j433141N37172l493579l326482N818492
18962h797456L946956n37117o821237P92135J653162O751831L787291k495774
$$ plain form
19018 16400641 12180701 8600818 6244868 6032258 8969408 11812952 10739580 10545605
19010 10545605 12318083 16620282 14323562 4156257 -4555307 -6537773 -1203769 4150966
19002 4150966 -769207 -9586249 -4128167 1940357 1766433 4088806 10665969 19304555
18994 19304555 26025954 19665754 4719951 -1682131 -2957213 -3564920 -1933125 1466172
18986 1466172 4836567 5760400 1127610 -744702 3562840 6960185 6541725 5104782
18978 5104782 3975289 -3581626 -9108025 -2851177 -393760 -8675495 -14455965 -13842140
18970 -13842140 -13749802 -10318543 -6899918 -8333059 -7795887 -11289466 -14615948 -8797456
18962 -8797456 -4850500 -5387617 -12208854 -11416719 -9763557 -3011726 775565 -1720209
18954a720209O404295M484547o106473l763423L101051L940011L520798J609984
18946A1470581l815037k366739l122115n165707k492927M316173L730768k150784
18938D04213j898030p35610m953432K398161j674301o165602n910714j571478
18930b0106793R549351P142766P50298j64911L177306K699217j624406K44213
18922A667041K266089j314536K493137Q553564J721903n370250N25525L454703
18914A3997176m92674k702932n843291o551906l995177k611710o186282o046904
18906b0433700L884403R304563K7733n101269R51938j331924P14436M539546L563030
18897c881244J45670q50800L602829N841673Q405451O819824j067882k435331
$$ plain form
18954 -1720209 4684086 9168633 3062160 -701263 2399788 6339799 9860597 11470581
18946 11470581 7655544 5288805 2166690 -2999017 -5491944 -1175771 2554997 404213
18938 404213 -1493817 -2229427 -7182859 -4784698 -6458999 -12624601 -18535315 -20106793
18930 -20106793 -10557442 -3414676 -2664378 -2829289 348017 3047234 1422828 1667041
18922 1667041 3933130 2618594 5111731 13665295 15387198 10016948 10542473 13997176
18914 13997176 13504502 10801570 4958279 -1593627 -5588804 -8200514 -14386796 -20433700
18906 -20433700 -16549297 -7244734 -7217001 -12318270 -11366332 -12698256 -11983820 -7444274 -3881244
18897 -3881244 -3735574 -4586374 -983545 4858128 13263579 20083403 19015521 16580190
18889A6580190k413970n100023o900582o20935P057737R389723N14354j0894601
18881G611893r337003L663213N339056J421233L233541L649877j655648o073431
18873G852731n164011m266012L799643P511446J211436k761343l923945l794059
18865D65886K312211P952970O230818n09172O26475M984819O925411P219079j15186
18856C6093311j1354839o141218N27046K498161K65170l245506o638838N58071
18848A2561358O77771n926720j756411j217821J273939O77330p11921j826047
18840C751478l25404j013726k18897k717217k989059J171041m82084j940780m535833
18831i300481n189261m011707k46975Q320353R861979L090155j74790J080600
$$ plain form
18889 16580190 14166220 9066197 2165615 1544680 8602417 17992140 18506494 7611893
18881 7611893 -1725110 1938103 7277159 8698392 11931933 15581810 13926162 7852731
18873 7852731 2688720 -1577292 2222351 9733797 10945233 8183890 4259945 465886
18865 465886 2778097 10731067 16961885 16452713 17079188 22064007 28989418 36208497 36093311
18856 36093311 24738472 18597254 19124300 21622461 21887631 18642125 12003287 12561358
18848 12561358 13239129 7312409 5555998 4338177 5612116 6289446 5577525 3751478
18840 3751478 3426074 2412348 2193451 -523766 -3512825 -2341784 -2823868 -4764648 -9300481
18831 -9300481 -14489742 -18501449 -18748424 -10428071 -566092 2524063 2349273 3429873
18823C429873l333089n330910m308539k737666k426889m532632J365547P916896
18815i957409M294229j506558k153711L617330Q343784J033184m604552m44759
18807a378462N452635L648653j385200n639582l119772K936203R26567j259098
18799A81944q85739l43731m191393K797362N412281k387092j2548409m375852
18791a6340629M757408L576756L752860P697213O367080l920347m396216Q25918
18783B320043K926872L531596j032207l296115o23296M470558O58221l808962
18775E146710J761698k569191n962517j275637K29660L304369j25033l154622
18767b644563l146672J417113K304285Q750J1017l83897m917601j236838K870529
$$ plain form
18823 3429873 96784 -5234126 -9542665 -12280331 -14707220 -19239852 -17874305 -9957409
18815 -9957409 -5663180 -7169738 -9323449 -5706119 2637665 3670849 -933703 -1378462
18807 -1378462 4074173 7722826 6337626 698044 -2421728 514475 1441042 181944
18799 181944 -703795 -1047526 -5238919 -2441557 2970724 583632 -11964777 -16340629
18791 -16340629 -11583221 -8006465 -4253605 3443608 9810688 5890341 1494125 2320043
18783 2320043 5246915 8778511 7746304 4450189 3826893 8297451 8955672 5146710
18775 5146710 6908408 4339217 -1623300 -2898937 -2669277 635092 510059 -2644563
18767 -2644563 -5791235 -4374122 -2069837 -2061087 -2050070 -2433967 -7351568 -8588406 -5717877
18758e717877L322322M315679j151830o261701j943331O05769K445468N610477
18750A224976J835552m383964K827390L468035l371620r30235M335491N201172
18742A0206797L744573k966581j0338172r573774k530740l784664L031481Q535368
18734c675712K918566J548490l484565k470235K23426o79372o9823K881536m462345
18725g270034j154311O174310L763913p221107n474448k417044j770012K552121
18717a2816612P70090J51391P0003M114538L729848m82411k686430j500152N456051
18708c193684R589606L011423l498662o79206M942639j619961o958397L445037
18700E038795N825883j08168p192072l523181j284783L991196L769252r5736N974999
$$ plain form
18758 -5717877 -2395555 1920124 768294 -5493407 -7436738 -6830969 -4385501 1224976
18750 1224976 3060528 -1323436 1503954 4971989 1600369 670134 5005625 10206797
18742 10206797 13951370 10984789 646617 -8927157 -11457897 -15242561 -12211080 -3675712
18734 -3675712 -757146 791344 -2693221 -5163456 -4940030 -5619402 -5689225 -2807689 -7270034
18725 -7270034 -8424345 -2250035 1513878 -5707229 -11181677 -13598721 -15368733 -12816612
18717 -12816612 -12046522 -11895131 -11825128 -7710590 -3980742 -4463153 -7149583 -8649735 -3193684
18708 -3193684 6395922 9407345 5908683 5229477 10172116 8552155 1593758 5038795
18700 5038795 10864678 10756510 3564438 41257 -1243526 2747670 6516922 6421186 12396185
18691A2396185O131184l693683j2348986j1632480k775467O530941Q419255K673359
18683E700308O7927M418229K506273l141406k278247N04759k104645l03108j37062
18674E233028j665560j97098K453796k648021p849457o747309j463154M669811
18666h213964J556741j024990L476902J96004l211201J144420m23541m436235
18658a0935864n155796p089310q91538O039018M023371Q858347O542590j846966
18650d56148l682088n57884J576079J205311n49596M569292L148759n242591l296151
18641c285017m424021m993104K154896L555752P164855k443759r727983J918277
18633a0080104J0097463M001393l966776l007717m85732n016788l175857J2452
$$ plain form
18691 12396185 18527369 14833686 2484700 -9147780 -11923247 -5392306 3026949 5700308
18683 5700308 5768235 10186464 12692737 9551331 7273084 7777843 5673198 5370090 5233028
18674 5233028 3567468 3370370 5824166 3176145 -4673312 -11420621 -12883775 -8213964
18666 -8213964 -6657223 -7682213 -4205311 -4009307 -7220508 -6076088 -6499629 -10935864
18658 -10935864 -16091660 -23180970 -24072508 -18033490 -14010119 -5151772 1390818 -456148
18650 -456148 -4138236 -4696120 -3120041 -1914730 -2464326 2104966 5253725 11134 -3285017
18641 -3285017 -7709038 -12702142 -10547246 -6991494 173361 -2270398 -11998381 -10080104
18633 -10080104 17359 4018752 51976 -2955741 -3441473 -8458261 -11634118 -11621666
18625a1621666Q504282J1331271L727860J43665p282420n429343J455875K221298
18617C050822o953095o615111n07299j81241M479178J843911r102887k962388
18609a6948110M901412O808996M255254m848856p762246m596846M514924N258006
18601h417466L70794M82106l649546M467875J0723175O164151q5003o073689l579894
18592D02503n325345l584874L653465L957635o273579q804313j445388K09341
18584a7210555j497835n00201M931364N904406K919005N894370P459396k97737
18576G602213L040678J230425m909008q845258k229023R99979l264573j757960
18568h132527o863566k472189O988320R605749K238499k233307J701040j991136
$$ plain form
18625 -11621666 -3117384 8213887 11941747 12085412 4802992 -626351 829524 3050822
18617 3050822 -3902273 -10517384 -11024683 -11205924 -6726746 -4882835 -13985722 -16948110
18609 -16948110 -12046698 -5237702 -982448 -5831304 -13593550 -18190396 -13675472 -8417466
18601 -8417466 -8046672 -7564566 -11214112 -6746237 3976938 10141089 10056086 3982397 402503
18592 402503 -4922842 -8507716 -4854251 -896616 -7170195 -15974508 -17419896 -17210555
18584 -17210555 -18708390 -19208591 -14277227 -8372821 -5453816 440554 7899950 7602213
18576 7602213 10642891 11873316 6964308 -1880950 -4109973 -3109994 -6374567 -8132527
18568 -8132527 -14996093 -17468282 -10479962 -874213 1364286 -869021 832019 -1159117
18560a159117Q86567J513139k917802J46281N846548L593225k743532N992472
18552A1157781P601239L53971Q45114N288595K54801j2212132o299691N625321
18544A2614999J92798m708065n66711J370506K257453j198926p536083o466373
18536d040402k214393l834724j774953K222744m74650q73109K132844j295680
18528a0152323m235867N558638n39107l467189k013532q422188j520731P46358
18520b4045941P528622N788334k518449J85543J1292077P137515L20777l452889
18512B235589p302259k556857O52360J935549m97907O24190L990550N703589K707664
18503G492468N058558J022448m304563k952234j035718l348571m948608J441595
$$ plain form
18560 -1159117 -272550 1240589 -1677213 -1530932 4315616 7908841 5165309 11157781
18552 11157781 18759020 19112991 19958105 25246700 25501501 13289369 6989678 12614999
18544 12614999 12807797 8099732 7533021 8903527 11160980 9962054 2425971 -4040402
18536 -4040402 -6254795 -10089519 -11864472 -9641728 -10116378 -10989487 -8856643 -10152323
18528 -10152323 -14388190 -8829552 -9368659 -12835848 -14849380 -23271568 -24792299 -24045941
18520 -24045941 -16517319 -10728985 -13247434 -13061891 -1769814 5367701 5688478 2235589
18512 2235589 -5066670 -7623527 -6971167 -5035618 -5533525 -4909335 -918785 4784804 7492468
18503 7492468 12551026 13573474 9268911 6316677 5280959 1932388 -3016220 -1574625
18495a574625k497940m987073J712119N225014O555297R089785Q870896P35365
18487B3128838o472491o719748n864408q227884j296338J446622K573165j928470
18479c360714m802592j851549l255049k30442J682708L402379L571506m03067
18471e246820N35381j550852m21105k116842l032604L497894O342565J59250p10410
18462b543543j573026k087963K009660m835866j562681M307206l698511l586369
18454a3571093k643103J199905K141934Q84166L302587K406940L53158r38976
18446f864482P536687Q70478l694528l901931n168150L493044J2368686M531896
18438I171700k810572N97889O790599J392101o355701n048756J918051N704927
$$ plain form
18495 -1574625 -4072565 -9059638 -7347519 -2122505 4432792 13522577 22393473 23128838
18487 23128838 16656347 9936599 4072191 -4155693 -5452031 -4005409 -1432244 -3360714
18479 -3360714 -8163306 -10014855 -13269904 -13500346 -11817638 -8415259 -4843753 -5246820
18471 -5246820 -4711439 -6262291 -6683396 -8800238 -11832842 -8334948 -1992383 -1833133 -2543543
18462 -2543543 -4116569 -6204532 -4194872 -9030738 -10593419 -6286213 -9984724 -13571093
18454 -13571093 -16214196 -15014291 -12872357 -11988191 -8685604 -6278664 -5925506 -6864482
18446 -6864482 672205 1542683 -2151845 -6053776 -11221926 -7728882 4639804 9171700
18438 9171700 6361128 6959017 13749616 15141717 8786016 3737260 5655311 11360238
18430A1360238n823581m881263l9679Q44726m068321j523119L545709m62326j830226
18421b877842J856817m097991J300944K291480p618394m808621L670650N990682
18413d292275K919633K677356l402570O38928K297901k454145j893090j439921
18405d948183m076222R41870O456896Q217115N672843K471297J147314m343154
18397A1539776o819677p831010J801243L749356l740057l380260K317359N326002
18389B962732j40752m329676m015645j536706L429579J41246k406769k060255
18381g956246j876362m418703j596808N077712L063638J874581P715259N940913
18373G823984K44480k260390p24720K918867K905586j863236k582074L071981
$$ plain form
18430 11360238 5536657 655394 615715 1460441 -2607880 -4130999 -585290 -1047616 -2877842
18421 -2877842 -1021025 -5119016 -3818072 -1526592 -9144986 -13953607 -10282957 -4292275
18413 -4292275 -1372642 1304714 -2097856 -1458928 838973 -1615172 -3508262 -4948183
18405 -4948183 -9024405 -8082535 -1625639 6591476 12264319 14735616 15882930 11539776
18397 11539776 4720099 -3110911 -1309668 2439688 -1300369 -4680629 -2363270 2962732
18389 2962732 2821980 -1507696 -5523341 -7060047 -3630468 -3489222 -5895991 -7956246
18381 -7956246 -9832608 -14251311 -15848119 -10770407 -7706769 -5832188 1883071 7823984
18373 7823984 8068464 5808074 5083354 8002221 10907807 9044571 6462497 9534478
18365I534478Q007528N238883o123983j4280854j0043815m748494m332098R25727
18357a5822628j547080k844559l43863J470237N253087Q815924J218728n985547
18349i785701m338505m966533k175225N441304N24428J725797M812947N292088
18341c469400K075537k824342J439176M406143M591627R265514J0055631M849055
18333C0388941K737874m478837j1079128l582201Q43184M71717M115608J971799
18325B1388957l545746m07782m835341o321001n245983n713225k25414O706810
18317A801275O519670j327549m772825j566221M94022l84131K098929M258267
18309G121437M333541r49020o371656p688862m790455j676409k661898Q564586
$$ plain form
18365 9534478 17542006 22780889 16656906 2376052 -7667763 -12416257 -16748355 -15822628
18357 -15822628 -17369708 -20214267 -20558130 -19087893 -13834806 -5018882 -3800154 -9785701
18349 -9785701 -14124206 -19090739 -21265964 -15824660 -15300232 -13574435 -8761488 -3469400
18341 -3469400 -1393863 -4218205 -2779029 1627114 6218741 15484255 25539886 30388941
18333 30388941 33126815 28647978 17568850 13986649 14829833 15301550 19417158 21388957
18325 21388957 17843211 17435429 12600088 6279087 1033104 -4680121 -4905535 1801275
18317 1801275 8320945 6993396 2220571 654350 1148372 764241 2863170 7121437
18309 7121437 11454978 10505958 4134302 -3554560 -8345015 -10021424 -12683322 -4118736
18301d118736J2833645L642552M154628k789574l203756l960943k891287k415863
18293A250666l014003J627410k06405q078601j48777O373980M77509J223821K470227
18284A975827K80889J153189K709125j0999088l459060O136807J404123O98603
18276i9585P085605R66257k577183p31889L115372J152661o221099m031987l085373
18267d427221K054703J023369l897335k369412K128654L189910L528477O286893
18259G518038J408443j865556q00769q163386r980995o928308M71250O803526
18251a1537757K885662K054833J464653M031842M860090K114783q59310l659381
18243A355415m221499m203095l039696k85248K358353K942769M976698K420651
$$ plain form
18301 -4118736 8714909 12357461 16512089 13722515 10518759 6557816 3666529 1250666
18293 1250666 -1763337 -135927 -342332 -8420933 -8569710 -2195730 -1718221 -494400 1975827
18284 1975827 2256716 3409905 6119030 -4880058 -8339118 -2202311 -798188 -99585
18276 -99585 6986020 7952277 5375094 4643205 7758577 8911238 2690139 -1341848 -4427221
18267 -4427221 -2372518 -1349149 -5246484 -7615896 -5487242 -2297332 1231145 7518038
18259 7518038 8926481 7060925 6260156 -1903230 -11884225 -18812533 -18341283 -11537757
18251 -11537757 -8652095 -6597262 -5132609 -1100767 3759323 5874106 5014796 1355415
18243 1355415 -2866084 -7069179 -10108875 -10394123 -8035770 -5093001 -116303 2304348
18235B304348M56733k875879J234197M461527J215875j01880k509098k290310
18227A895513K593851l8277j497527K163498M267801L414194J859617k827136
18219A1831534p197189j736105m90653n664221m066592K03577j073607J242700
18211f950556K347707R773920L187047j163066k601523k024531J81884j607558
18203A143324l924219O406223R364396Q70388l995582m396744k522329l822932
18195h77475N04413Q658293M622747k47743K989533L491134j125694l916506n659928
18186H438774m644066J119225j733440n13060j222681j93302n78209r89083o35902
18177i51744K707769j310441k896078K972411P64756m339821k038364M940513
$$ plain form
18235 2304348 2761081 -114798 1119399 5580926 6796801 6694921 4185823 1895513
18227 1895513 4489364 4451087 2953560 5117058 9384859 12799053 14658670 11831534
18219 11831534 4634345 2898240 2407587 -3256634 -7323226 -7119649 -8193256 -6950556
18211 -6950556 -4602849 5171071 8358118 7195052 4593529 2568998 2750882 1143324
18203 1143324 -2780895 3625328 12989724 13860112 9864530 5467786 2945457 -877475
18195 -877475 -373062 8285231 12907978 12660235 15649768 19140902 18015208 14098702 8438774
18186 8438774 3794708 4913933 3180493 2667433 1444752 1251450 673241 -315842 -951744
18177 -951744 1756025 445584 -2450494 521917 1286673 -3053148 -5091512 -150999
18169a50999O742128O905691l612416j5610828q147521k033768k058938J329617
18161a6637034N322123J125213O251118Q466405M132064k150102k717249m253134
18153d60596m609605L617330J341492q88642J893581k568513J106632P741325
18145G173004L709780o772773m196403q59232l587622M937242N514380k481937
18137C436439l314506l206693l197946J56279k53739p479968n556007K929296
18129a6486845Q262917J2543715M090297J171500J865947k855336n504757l278641
18121a91203k089738l596643M58487M274363P95739K209140M50058k129803j276300
18112a095900q52644L42069L557637O369884j006946n464327o523199k874373
$$ plain form
18169 -150999 6591129 13496820 9884404 -5726424 -13873945 -15907713 -17966651 -16637034
18161 -16637034 -11314911 -10189698 -3938580 4527825 8659889 6509787 3792538 -460596
18153 -460596 -5070201 -1452871 -111379 -1000021 893560 -1674953 -568321 7173004
18145 7173004 10882784 4110011 -86392 -945624 -4533246 403996 5918376 3436439
18137 3436439 121933 -3084760 -6282706 -6126427 -6380166 -13860134 -19416141 -16486845
18129 -16486845 -8223928 4319787 8410084 9581584 11447531 8592195 3087438 -191203
18121 -191203 -2280941 -5877584 -5419097 -1144734 -348995 1860145 2310203 180400 -1095900
18112 -1095900 -1948544 -1606475 1951162 8321046 7314100 1849773 -4673426 -7547799
18104g547799K219673L54727j0053733r606026N098551J4075503J0552181N669942
18096A0763019M682102N495742k094888k841338L03008n263060p011305L46032
18088D379312J812498l24563N049554M577014L43453n760204n789854j418792
18080B868418K125254N576309L099063l466946l040655K59753l371119j172445
18072B877632K333489k86160j647518J256378k63908l011791P78088j613278o264329
18063e841397j59370l187200m633193L635208M850183J321492K874623O985524
18055E845870P120338K241386l500460l508528q23880N47580L692938j353279
18047A0261965m220268O2662R15363o201745k047162K707812j174880m710648
$$ plain form
18104 -7547799 -5328126 -4973399 -15027132 -24633158 -19534607 -5459104 5093077 10763019
18096 10763019 15445121 20940863 18845975 16004637 16307645 11044585 4033280 4379312
18088 4379312 6191810 5867247 10916801 15493815 15837268 10077064 4287210 2868418
18080 2868418 4993672 10569981 13669044 10202098 7161443 7421196 4050077 2877632
18072 2877632 5211121 4924961 3277443 4533821 4269913 1258122 2036210 422932 -5841397
18063 -5841397 -6000767 -9187967 -13821160 -10185952 -5335769 -4014277 -1139654 5845870
18055 5845870 12966208 15207594 11707134 8198606 7374726 7922306 11615244 10261965
18047 10261965 6041697 6104359 7019722 817977 -1229185 1478627 303747 -4406901
18039d406901l146791P77107L105945M016216O709795O473077L900225M565160
18031B1993833M3610l935593m106254J933989K424969N95113l287124l971123
18023A1691420J541361L808671K889177J159344l367766p104878n541343K219025
18015G295011k177601l206141m854889m665345j804614J680777K774457k954932
18007g913277j758768L225630M212540L398030o378924m313867k296635L935499
17999g889772O656416q10787k178727J892629P533707P856635M134136K341674
17991A9535911M262797r77845j3797567j1634306n565473O7844M854518r35508
17983d189629l642826J668973O363629l49478q163240m407835j623595J420429
$$ plain form
18039 -4406901 -7553692 -6776585 -3670640 345576 7055371 13528448 17428673 21993833
18031 21993833 22037443 18101850 13995596 15929585 18354554 18949667 15662543 11691420
18023 11691420 13232781 17041452 19930629 21089973 17722207 10617329 5075986 7295011
18015 7295011 5117410 1911269 -2943620 -7608965 -9413579 -7732802 -4958345 -7913277
18007 -7913277 -9672045 -6446415 -2233875 1164155 -5214769 -9528636 -11825271 -7889772
17999 -7889772 -1233356 -2044143 -4222870 -2330241 5203466 13060101 17194237 19535911
17991 19535911 23798708 22820863 9023296 -2611010 -8176483 -8108639 -3254121 -4189629
17983 -4189629 -7832455 -6163482 200147 -149331 -8312571 -12720406 -14344001 -12923572
17975a2923572M069191M154585O185002j382232q667869m875472O8629L873791
17967i497947K568803j380478m33424M738337L828617J2866M153218L565242J513134
17958I068368J500782m564517k452146O709353L509571q868196q393635m359122
17950g849542l568411L639195Q428482K191284n350270r277913j445160O274042
17942f958293P52834J333193L286180K037082r16511J94379J73226L242764J282826
17933D427680k408740j598303k624756L21872j297569n518870j395819o022249
17925a6116754j533121M610170j107780K615112P143932k275892o383266M980779
17917h066820J2260810L445355p475892m838470K597080J689730l10017m036124
$$ plain form
17975 -12923572 -8854381 -4699796 1485206 102974 -8564895 -13440367 -13371738 -9497947
17967 -9497947 -6929144 -8309622 -8743046 -4004709 -176092 -163226 3989992 7555234 9068368
17958 9068368 10569150 6004633 3552487 10261840 13771411 4903215 -3490420 -7849542
17950 -7849542 -11417953 -7778758 649724 2841008 -2509262 -11787175 -13232335 -6958293
17942 -6958293 -6205459 -4872266 -1586086 450996 -465515 -271136 -97910 3144854 4427680
17933 4427680 2018940 420637 -2204119 -1882247 -3179816 -8698686 -10094505 -16116754
17925 -16116754 -17649875 -13039705 -14147485 -11532373 -4388441 -6664333 -13047599 -8066820
17917 -8066820 4193990 7639345 163453 -4675017 -2077937 -388207 -698224 -4734348
17909d734348l35383J56420l970401L978149R223276l36086n569000l541467k313181
17900g442021O696531R402275j857590M78830j125640n565336o009556L463765
17892a958742K742114l475900J670826R45801k560410j850748K06175O615715
17884B334831K334873l294156k789877k650007J168959p78016n35364K497553
17876a711204J278550L653683m501891l960028M555415p98702k848326L457030
17868h75473j255335j2154303l641707J1141700O849822l171340j488567J068557
17860c526646l980441m519648J333880O205298R195292j495756n145233L92139
17852a541115P398612L262698J425328l460614k693343j38949p36116J313371
$$ plain form
17909 -4734348 -5069731 -4913311 -8883712 -4905563 4317713 3981627 -1587373 -5128840 -7442021
17900 -7442021 -745490 8656785 6799195 7278025 6152385 587049 -5422507 -1958742
17892 -1958742 783372 -2692528 -1021702 -75901 -2636311 -4487059 -4280884 2334831
17884 2334831 4669704 1375548 -1414329 -4064336 -2895377 -3673393 -4208757 -1711204
17876 -1711204 -432654 3221029 -1280862 -5240890 -685475 -1484177 -4332503 -875473
17868 -875473 -2130808 -14285111 -17926818 -6785118 64704 -3106636 -4595203 -3526646
17860 -3526646 -7507087 -12026735 -10692855 -4487557 4707735 3211979 -1933254 -1541115
17852 -1541115 5857497 9120195 10545523 7084909 4391566 4252617 3516501 4829872
17844D829872L618206J169697j15954j282725k884554j586896j580380n529221
17836c361955q049430j540509L801277J896969J677237K09371J679193J471622
17828b216225r30130L40408j674124j653595N640329O285586k409802r065005
17820e682558J257881N869577Q75208l700040m601795o159112n242653j288790
17812a8672282l08100j302273r956002p134927J609315M324879N931826L985946
17804b1521618M969960O072007M577030J1419321L191398k794220o596169m473380
17796e155671n079850p978119K230808M824356J980089K846446J829936k356667
17788f858672k202054m952887M92074K678406J420925N565873P068440L204604
$$ plain form
17844 4829872 8448078 9617775 9501821 8219096 5334542 3747646 2167266 -3361955
17836 -3361955 -11411385 -12951894 -9150617 -7253648 -5576411 -5367040 -3687847 -2216225
17828 -2216225 -3146355 -2805947 -4480071 -6133666 -493337 5792249 3382447 -5682558
17820 -5682558 -4424677 1444900 2320108 -1379932 -5981727 -12140839 -17383492 -18672282
17812 -18672282 -18980382 -20282655 -30238657 -37373584 -35764269 -31439390 -25507564 -21521618
17804 -21521618 -16551658 -10479651 -5902621 5516700 8708098 5913878 -682291 -5155671
17796 -5155671 -10235521 -18213640 -15982832 -11158476 -9178387 -6331941 -4502005 -6858672
17788 -6858672 -9060726 -14013613 -13521539 -10843133 -9422208 -3856335 3212105 6416709
17780F416709O49286j112255k112740m219368p543467q095125J184547N815385
17772i017028q06447p368946l019522N346073L836319K07458O960652O919987
17764C058546j721589l143730L26971J841301L207830L044786k41888o52431n552061
17755A67735K38989K790026o597685j0329971l48338K737934O029852L985489
17747a325969L238051l886297r155562O20586J661412M633808j438243k254373
17739g906587r6483M028590J3636068J1010412J753655K886637n784283j1629497
17731G898512m944502j055244j657545L115578O058081R66312j544790m447389
17723D389013m885862O298332K689042l715732k449723j653213j472437m278276
$$ plain form
17780 6416709 7065995 5953740 3841000 -378368 -7921835 -16016960 -14832413 -9017028
17772 -9017028 -9823475 -17192421 -20211943 -14865870 -11029551 -10822093 -3861441 3058546
17764 3058546 1336957 -1806773 -1479802 361499 3569329 6614115 6372227 5719796 167735
17755 167735 406724 3196750 -3400935 -13730906 -14079244 -11341310 -5311458 -1325969
17747 -1325969 1912082 -1974215 -11129777 -10509191 -8847779 -4213971 -5652214 -7906587
17739 -7906587 -8003070 -3974480 9661588 20672000 22425655 25312292 19528009 7898512
17731 7898512 2954010 1898766 241221 3356799 9414880 10381192 8836402 4389013
17723 4389013 -496849 5801483 8490525 4774793 2325070 671857 -800580 -5078856
17715e078856o149350m13023Q347392Q178296R571289L476692k612282l226428
17707A2093730m853035r74850J572438L925490L531630J207725o88303k382892
17699A3431933o075069j470238j348267k016712N487560K321789o556088n368677
17691a593769j395822k438146m070786n185908n0752K344855K905689J713755
17683g770884P871158J712098m578369j065878m305145k328244O525846M637183
17675F97765P83348N412206M846995k494962J540374L473404n15121q160996m723681
17666H59332k30503K067646M009445K879268k061667m521811j471724j037927
17658D92059k233826m210699m728382n607700k952249L260155J374891K694982
$$ plain form
17715 -5078856 -11228206 -11641229 -3293837 4884459 14455748 17932440 15320158 12093730
17707 12093730 7240695 6265845 7838283 11763773 15295403 16503128 15814825 13431933
17699 13431933 7356864 5886626 4538359 2521647 8009207 10330996 3774908 -1593769
17691 -1593769 -2989591 -5427737 -9498523 -14684431 -14735183 -12390328 -9484639 -7770884
17683 -7770884 100274 1812372 -2765997 -3831875 -8137020 -10465264 -3939418 697765
17675 697765 1481113 6893319 11740314 9245352 10785726 14259130 13744009 5583013 859332
17666 859332 628829 2696475 6705920 9585188 7523521 3001710 1529986 492059
17658 492059 -1741767 -5952466 -10680848 -16288548 -19240797 -15980642 -14605751 -11910769
17650a1910769Q021014Q43575n130271n52689K816256K833089k346720o590539
17642a2017054n281860M77282J997065J584704K548414L694181j05303k654746
17634i757317J546400L480283M437913K669192L837532O378467P651117L521009
17626B3764596m02532r323190p149048k989450O270279L174619r619582r945638
17618f219946J236206P865959K994193n00641k332288o229569o617953K99666
17610i504373l125108o570864L07923L71922K571225P773485O416315O238998
17602D479523O960181M767421K030993r26341K12671o80674p780937l841797j768536
17593C452504n39316m238321o400484m108703l22252O020432M703915j258952
$$ plain form
17650 -11910769 -3889755 -3046180 -8176451 -8729140 -5912884 -3079795 -5426515 -12017054
17642 -12017054 -17298914 -16821632 -14824567 -13239863 -10691449 -6997268 -7102571 -9757317
17634 -9757317 -8210917 -4730634 -292721 2376471 6214003 12592470 20243587 23764596
17626 23764596 23362064 14038874 6889826 3900376 10170655 13345274 3725692 -6219946
17618 -6219946 -4983740 2882219 5876412 5375771 3043483 -3186086 -9804039 -9504373
17610 -9504373 -12629481 -19200345 -18892422 -18520500 -15949275 -8175790 -1759475 4479523
17602 4479523 11439704 16207125 18238118 17311777 17524448 16843774 9062837 5221040 3452504
17593 3452504 2913188 -1325133 -7725617 -11834320 -12156572 -6136140 -1432225 -2691177
17585b691177L939796K119814L53242L160675N684824l354858o544531k599204
17577F8581Q14564l864170q820638k049373J915372m144402K258134j253768k335518
17568a7411218O624915O37141k53395J009963K890878Q92695J441476j222847
17560e390392L60865M203050j134606J537974k999037n852725k096763J629482
17552i742152r69213L173651M382517k937215k62048N928310R501182Q258140
17544A7333172N718119k167357o093641o683573j0764370n058879k613183l194038
17536a3523750o042350m855756N104532Q595458l742010m321513M164393J660261
17528a2960735J378999J368838L180513O234646m16670k931265J013498j871174
$$ plain form
17585 -2691177 1248619 3368433 3721675 6882350 12567174 9212316 2667785 68581
17577 68581 883145 -2981025 -11801663 -13851036 -11935664 -16080066 -13821932 -15075700 -17411218
17568 -17411218 -10786303 -10149162 -10402557 -9392594 -6501716 -5609021 -4167545 -5390392
17560 -5390392 -5029527 -826477 -1961083 -423109 -3422146 -9274871 -11371634 -9742152
17552 -9742152 -10711365 -7537714 -3155197 -6092412 -6354460 -426150 9075032 17333172
17544 17333172 23051291 20883934 14790293 8106720 -2657650 -7716529 -10329712 -13523750
17536 -13523750 -19566100 -24421856 -19317324 -10721866 -14463876 -18785389 -14620996 -12960735
17528 -12960735 -11581736 -10212898 -7032385 -797739 -1214409 -4145674 -3132176 -5003350
17520e003350k348889K313859P83579K173821K064491R72352Q8112J661408O618838
17511I324221j230463l127396k180263p02312j452134r51337j194869M06942L438434
17502B330823m676680r567351p0582L308258n964321J72779N29014m25510q14617
17493a5178187j384673J145549N109224Q984400P066738L280093l839076n765775
17485e81707j92794Q246110P411359N45512p319008o955160p24480j200318o82733
17476a453219N932029M89537m722417n434518J805300P018422K015067j1347439
17468e697238q085744m260088J140554M058854R12542K960259M508692j088508
17460e550677J473956M593792O84568j776123K395782J721337j461936j783435
$$ plain form
17520 -5003350 -7352239 -5038380 -4254801 -2080980 -16489 955863 1043975 2705383 9324221
17511 9324221 8093758 4966362 2786099 2083787 631653 -319684 -1514553 -1107611 2330823
17502 2330823 -2345857 -11913208 -11983790 -8675532 -14639853 -14467074 -13938060 -14363570 -15178187
17493 -15178187 -16562860 -15417311 -10308087 -1323687 5743051 9023144 5184068 -581707
17485 -581707 -774501 7471609 14882968 15428480 8109472 1154312 429832 -770486 -1453219
17476 -1453219 4478810 4968347 245930 -5188588 -3383288 3635134 5650201 -5697238
17468 -5697238 -13782982 -18043070 -16902516 -12843662 -11931120 -8970861 -4462169 -5550677
17460 -5550677 -4076721 517071 1201639 -574484 1821298 3542635 2080699 297264
17452B97264L06222R82480K437514k338875m80500M170442N304552l81197q182555
17443B115347q498439j101389Q770066R347604J370751J395389Q99527k576065
17435A1722791l321246m109986r145393r315199N97953M903835k422134p389579
17427a8478958J79595P961652M832877L212440J032295M99364K90941j831246
17419b301040O53J652992L380802M809121K380775K263175K962349J431540J12718
17410A6693085r87200Q5009J995805l206455N0542O2737m714078k093105J057884
17401H944224P34879J246585l072754Q36546K255502n19685o322526m068680K173240
17392B207331J270182r06053k379163k892538m472756O031689P847465L528664
$$ plain form
17452 297264 603486 1585966 4023480 1684605 1204105 5374547 10679099 10297902 2115347
17443 2115347 -6383092 -7484481 1285585 10633189 12003940 13399329 14298856 11722791
17435 11722791 8401545 4291559 -4853834 -14169033 -13571080 -8667245 -11089379 -18478958
17427 -18478958 -18299363 -10337711 -5504834 -2292394 -1260099 -760735 -469794 -2301040
17419 -2301040 -2300387 -647395 2733407 7542528 9923303 12186478 15148827 16580367 16693085
17410 16693085 15705885 15790894 17786699 14580244 14630786 14693523 9979445 7886340 8944224
17401 8944224 9679103 10925688 7852934 8689480 10944982 10425297 4102771 34091 2207331
17392 2207331 3477513 2571460 192297 -2700241 -7172997 -1141308 6706157 10234821
17384A0234821j451021q121073p171904p576429q914507Q587486P394694q81221
17376g899154j090893k796401M331292Q628631M129271J595027k910063L74066
17368D361776k159532j142769j543711q282474l877400P517132M162065m451433
17360e416346P58037J97170L233926N89248J236069K366938j719766o223319p666010
17351a2644053M396987M131391L101410O839216M088386l340884o326337o65225
17343d19109j91657m929105j815374J444804M133170K369250R67443Q773271M168258
17334A4500951p65847K98401m955575o995663p15648K136254l691595K016210
17326A827488K581980L816689L490162J449998K77996j2463791j4479475l381713
$$ plain form
17384 10234821 8783800 662727 -6509177 -14085606 -23000113 -14412627 -7017933 -7899154
17376 -7899154 -8990047 -11786448 -7455156 1173475 5302746 6897773 3987710 4361776
17368 4361776 2202244 1059475 -484236 -8766710 -12644110 -5126978 -964913 -5416346
17360 -5416346 -4658309 -4461139 -1227213 -637965 598104 2965042 1245276 -4978043 -12644053
17351 -12644053 -8247066 -4115675 -1014265 5824951 9913337 6572453 246116 -419109
17343 -419109 -610766 -5539871 -7355245 -5910441 -1777271 591979 1559422 10332693 14500951
17334 14500951 13735104 14033505 9077930 2082267 1366619 3502873 -188722 1827488
17326 1827488 4409468 8226157 11716319 13166317 13444313 980522 -13498953 -16880666
17318a6880666J193388L236610J298985l316609K299523K476475j713549o077220
17310a7483063j88720P534831J822477J359533N121733P364978Q822542j195606
17302A3158705j0370211p184458j886104j42053n556252m416621J647957K258559
17294a2490478N663170J2002919P875746N608918k00397j0038693j0670014j4109908
17286a6358737n889001L341703L245802N136769N858472O415295j827127n270482
17278e347306l73335M039680L269945K341099j746503Q00372L826700R94570j493571
17269F311651l794455K986450L039119O79461r182068p167058P597703Q350495
17261H821298l578999m242501j787626j5220J749382J009277N10663k647962k924138
$$ plain form
17318 -16880666 -15687278 -12450668 -11151683 -14468292 -12168769 -9692294 -11405843 -17483063
17310 -17483063 -17671783 -10136952 -8314475 -6954942 -1833209 5531769 14354311 13158705
17302 13158705 2788494 -4395964 -6282068 -6424121 -11980373 -16396994 -14749037 -12490478
17294 -12490478 -6827308 5175611 13051357 18660275 18459878 8421185 -2248829 -16358737
17286 -16358737 -22247738 -18906035 -15660233 -10523464 -4664992 1750303 -76824 -5347306
17278 -5347306 -5720641 -1680961 1588984 3930083 2183580 2983952 6810652 7805222 6311651
17269 6311651 2517196 5503646 8542765 9222226 40158 -7126900 470803 8821298
17261 8821298 5242299 999798 -787828 -803048 946334 1955611 2466274 -181688 -3105826
17252c105826K865409k32779l357559p69088k83414L743449L730454N860814L830922
17243A2282382N95112P35963K37769k980669p513518l657347M595610M678542
17235H973844L084079J147438l375939n325485p246893n144006k614052k731126
17227a3232140J139860L47352O863217J0032443O489874N986051n59471l771448
17219A3295738L474073L48582P4789k931985p931901m831661m13338n440168k771198
17210g127069R438635O793767L483977M287689L306395l044468j822591m50052
17202A4866283m847429l303107o912590k528788K943342K939040m222794r09261
17194a975304K775262m189923j374288O883073P137532P748316L819317o545942
$$ plain form
17252 -3105826 -240417 -473196 -3830755 -4599843 -4883257 -1139808 2590646 8451460 12282382
17243 12282382 12877494 13613457 13851226 10870557 3357039 -300308 4295302 8973844
17235 8973844 12057923 13205361 9829422 4503937 -2742956 -7886962 -10501014 -13232140
17227 -13232140 -12092280 -11744928 -4881711 5150732 11640606 17626657 17067186 13295738
17219 13295738 16769811 17118393 17193182 14261197 6329296 1497635 1084297 -4355871 -7127069
17210 -7127069 2311566 9105333 12589310 16876999 20183394 17138926 15316335 14866283
17202 14866283 10018854 6715747 -196843 -2725631 217711 3156751 -1066043 -1975304
17194 -1975304 799958 -3389965 -4764253 2118820 9256352 17004668 20823985 14278043
17186A4278043q829972m999201J195183L710121r02917p494732q230523j476577
17178a2750575n933112j288220P111555N497159J0845365P532300j067301n32342
17170I414829r614952q526281q134914k390578P829759J300733q09553M265818
17162f665139K681113O69120K567519k515895q822971m102680N494274O148304
17154d546355Q98960K669087N087044n027930q135970j436642j645664O69505
17146a1467965j67759j698901J1705886R829667P66743K608448J600451n021115
17138H155455k726653k808661m409652p080472m633439M419694P034223R684797
17130G635292M258458L140146m427262p365385o515637j790266j846382n229812
$$ plain form
17186 14278043 5448071 448870 1644053 5354174 4451257 -3043475 -11273998 -12750575
17178 -12750575 -18683687 -19971907 -12860352 -7363193 3482172 11014472 9947171 9414829
17170 9414829 -200123 -8726404 -16861318 -19251896 -11422137 -10121404 -10930957 -6665139
17162 -6665139 -3984026 -3314906 -747387 -3263282 -12086253 -16188933 -10694659 -4546355
17154 -4546355 -3647395 -978308 4108736 -919194 -9055164 -10491806 -12137470 -11467965
17146 -11467965 -11635724 -13334625 -1628739 8200928 8967671 11576119 13176570 8155455
17138 8155455 5428802 2620141 -1789511 -8869983 -13503422 -9083728 -2049505 7635292
17130 7635292 11893750 15033896 10606634 3241249 -3274388 -5064654 -6911036 -12140848
17122a2140848j436290O377968O115750r60422m033496j722519L089996N323568
17114F13707Q703205K077027l343870m366184K9892l053945k229869k43891k584807
17105d398735o918580n638896K916345O695322L029663O078768P094025M244178
17097A3102090O69952k285602l706561r814209p247114K085192N178641Q210210
17089F192599K677148r165115m807064j770369j979914r95637N755369O969008
17081B876025M932302O831829o86687m337929l185013N061539N534024j397760
$$ plain form
17122 -12140848 -13577138 -7199170 -1083420 -2043842 -6077338 -7799857 -4709861 613707
17114 613707 9316912 11393939 8050069 3683885 3713777 659832 -1570037 -1813928 -4398735
17105 -4398735 -11317315 -16956211 -14039866 -7344544 -4314881 1763887 8857912 13102090
17097 13102090 13772042 11486440 7779879 -2034330 -9281444 -7196252 -2017611 6192599
17089 6192599 8869747 -295368 -5102432 -6872801 -8852715 -9848352 -4092983 2876025
17081 2876025 7808327 14640156 13953469 9615540 6430527 11492066 17026090 15628330
$$ [...]
##END NTUPLES=NMR SPECTRUM
##END=
