##TITLE=C13_ABBC1202
 CDCl3, 22200 sc

 14.2.2024
##JCAMPDX= 6.0         $$ Bruker NMR JCAMP-DX V2.0
##DATA TYPE= NMR SPECTRUM
##DATA CLASS= NTUPLES
##ORIGIN= UXNMR, Bruker Analytische Messtechnik GmbH
##OWNER= root
$$ XWIN-NMR		Version 3.5
$$ Wed Feb 14 15:23:09 2024 Russian Standard Time (UT+4h)  she@DPX200
##.OBSERVE FREQUENCY= 50.327896
##.OBSERVE NUCLEUS= ^13C
##.ACQUISITION MODE= SIMULTANEOUS
##.ACQUISITION SCHEME= undefined
##.AVERAGES= 1501
##.DIGITISER RES= 17
##SPECTROMETER/DATA SYSTEM= spect
##.PULSE SEQUENCE= zgpg30
##.SOLVENT NAME= CDCl3
##.SHIFT REFERENCE= (INTERNAL, CDCl3, 0, 222.646)
##AUDIT TRAIL= $$ (NUMBER, WHEN, WHO, WHERE, WHAT)
$$ ##TITLE= Audit trail, XWIN-NMR		Version 3.5
$$ ##JCAMPDX= 5.01
$$ ##ORIGIN= Bruker BioSpin GmbH
$$ ##OWNER= she
$$ F:/spectra/data/she/nmr/c13/1/pdata/1/auditp.txt
$$ ##AUDIT TRAIL=  $$ (NUMBER, WHEN, WHO, WHERE, WHAT)
(   1,<2024-02-14 15:22:05.98 +0400>,<she>,<DPX200>,
      <created by zg, POWCHK disabled, PULCHK disabled
       terminated by command 'halt'
       configuration hash MD5:
       00 E9 B6 7A A2 85 ED C7 34 08 36 98 17 FE 4E 26
       data hash MD5: 32K
       9A B4 EC 94 F6 83 1E 7D E7 C5 74 8B F2 1B 02 0A>)
(   2,<2024-02-14 15:22:25.09 +0400>,<she>,<DPX200>,
      <Start of raw data processing
       efp BC_mod = 2 LB = 2 FT_mod = 6 PKNL = 1 PHC0 = -359.464 PHC1 = -0.3811398 SI = 32K 
       data hash MD5: 32K
       AD 44 98 CE 8D 56 0D 2E 6E CE 6E 88 D6 A2 DD 5E>)
(   3,<2024-02-14 15:22:27.70 +0400>,<she>,<DPX200>,
      <abs ABSG = 5 
       data hash MD5: 32K
       33 27 E4 61 AF 1A FC 91 B2 D0 1A 5B 45 CF C1 08>)
$$ ##END=
$$ 
$$ hash MD5
$$ 56 A4 6E 4F 07 23 79 82 98 D6 F4 4A 2D E5 9E 1A
##$RELAX= 
##$RELAX= 
##$RELAX= 
##$RELAX= 
##$RELAX= 
##$RELAX= 
##$RELAX= 
##$RELAX= 
$$ Bruker specific parameters
$$ --------------------------
##$DU= <F:/spectra>
##$EXPNO= 1
##$NAME= <c13>
##$PROCNO= 1
##$TYPE= <nmr>
##$USER= <she>
##$AMP= (0..31)
100 100 100 100 100 100 100 100 100 100 100 100 100 100 100 100 100 100 
100 100 100 100 100 100 100 100 100 100 100 100 100 100 
##$AQSEQ= 0
##$AQ_mod= 1
##$AUNM= <au_zg>
##$AUTOPOS= <>
##$BF1= 50.322709
##$BF2= 200.13
##$BF3= 50.322709
##$BF4= 500.13
##$BF5= 500.13
##$BF6= 500.13
##$BF7= 500.13
##$BF8= 500.13
##$BYTORDA= 1
##$CFDGTYP= 0
##$CFRGTYP= 5
##$CHEMSTR= <none>
##$CNST= (0..31)
1 1 145 1 1 1 1 1 1 1 1 1 1 1 1 1 1 1 1 1 1 1 1 1 1 1 1 1 1 1 1 1 
##$CPDPRG= <waltz16>
##$CPDPRG1= <>
##$CPDPRG2= <waltz16>
##$CPDPRG3= <>
##$CPDPRG4= <mlev>
##$CPDPRG5= <mlev>
##$CPDPRG6= <mlev>
##$CPDPRG7= <mlev>
##$CPDPRG8= <mlev>
##$CPDPRGB= <>
##$CPDPRGT= <>
##$D= (0..31)
0 2 0.00345 0 0 0 0 0 0 0 0 0.03 2e-05 3e-06 0 0 0 0 0 0 0 0 0 0 0 0 0 
0 0 0 0 0 
##$DATE= 1707904664
##$DBL= (0..7)
120 120 120 120 120 120 120 120 
##$DBP= (0..7)
150 150 150 150 150 150 150 150 
##$DBP07= 0
##$DBPNAM0= <>
##$DBPNAM1= <>
##$DBPNAM2= <>
##$DBPNAM3= <>
##$DBPNAM4= <>
##$DBPNAM5= <>
##$DBPNAM6= <>
##$DBPNAM7= <>
##$DBPOAL= (0..7)
0.5 0.5 0.5 0.5 0.5 0.5 0.5 0.5 
$$ [...]
##$SUBNAM4= <"">
##$SUBNAM5= <"">
##$SUBNAM6= <"">
##$SUBNAM7= <"">
##$SUBNAM8= <"">
##$SUBNAM9= <"">
##$SW= 239.972175391363
##$SWIBOX= (0..15)
0 1 3 0 0 0 0 0 0 0 0 0 0 0 0 0 
##$SW_h= 12077.2946859903
##$TD= 32768
##$TD0= 1
##$TE= 0
##$TE2= 300
##$TE3= 300
##$TEG= 300
##$TL= (0..7)
120 120 120 120 120 120 120 120 
##$TP= (0..7)
150 150 150 150 150 150 150 150 
##$TP07= 0
##$TPNAME0= <>
##$TPNAME1= <>
##$TPNAME2= <>
##$TPNAME3= <>
##$TPNAME4= <>
##$TPNAME5= <>
##$TPNAME6= <>
##$TPNAME7= <>
##$TPOAL= (0..7)
0.5 0.5 0.5 0.5 0.5 0.5 0.5 0.5 
##$TPOFFS= (0..7)
0 0 0 0 0 0 0 0 
##$TUNHIN= 0
##$TUNHOUT= 0
##$TUNXOUT= 0
##$USERA1= <user>
##$USERA2= <user>
##$USERA3= <user>
##$USERA4= <user>
##$USERA5= <user>
##$V9= 5
##$VALIST= <valist>
##$VCLIST= <CCCCCCCCCCCCCCC>
##$VD= 0
##$VDLIST= <DDDDDDDDDDDDDDD>
##$VPLIST= <PPPPPPPPPPPPPPP>
##$VTLIST= <TTTTTTTTTTTTTTT>
##$WBST= 1024
##$WBSW= 4
##$XGAIN= (0..3)
0 0 0 0 
##$XL= 0
##$YL= 0
##$YMAX_a= 10275182
##$YMIN_a= -8034441
##$ZGOPTNS= <>
##$ZL1= 120
##$ZL2= 120
##$ZL3= 120
##$ZL4= 120
##$ABSF1= 222.646
##$ABSF2= -17.35081
##$ABSG= 5
##$ABSL= 3
##$ALPHA= 0
##$AQORDER= 0
##$ASSFAC= 0
##$ASSFACI= 0
##$ASSFACX= 0
##$ASSWID= 0
##$AUNMP= <proc_1d>
##$AZFE= 0.1
##$AZFW= 0.5
##$BCFW= 0
##$BC_mod= 2
##$BYTORDP= 0
##$COROFFS= 0
##$CY= -3
##$DATMOD= 1
##$DC= 0
##$DFILT= <>
##$DTYPP= 0
##$F1P= 0
##$F2P= 0
##$FCOR= 0.5
##$FTSIZE= 32768
##$FT_mod= 6
##$GAMMA= 0
##$GB= 0
##$INTBC= 1
##$INTSCL= 4.134877e-10
##$ISEN= 128
##$LB= 2
##$LEV0= 0
##$LPBIN= 0
##$MAXI= 10000
##$MC2= 0
##$MEAN= 0
##$ME_mod= 0
##$MI= 0.1934396
##$NCOEF= 0
##$NC_proc= -2
##$NLEV= 6
##$NOISF1= 120.0001
##$NOISF2= 80.00006
##$NSP= 0
##$NTH_PI= 0
##$NZP= 0
##$OFFSET= 222.646
##$PC= 1.4
##$PHC0= -359.464
##$PHC1= -0.3811398
##$PH_mod= 1
##$PKNL= yes
##$PPARMOD= 0
##$PSCAL= 0
##$PSIGN= 0
##$REVERSE= no
##$SF= 50.3227304925793
##$SI= 32768
##$SIGF1= 140
##$SIGF2= 120
##$SINO= 11.81781
##$SIOLD= 32768
##$SREGLST= <13C.CDCl3>
##$SSB= 0
##$STSI= 32768
##$STSR= 0
##$SW_p= 12077.2946859903
##$SYMM= 0
##$S_DEV= 0
##$TDeff= 32768
##$TDoff= 0
##$TI= <>
##$TILT= no
##$TM1= 0
##$TM2= 0
##$TOPLEV= 0
##$USERP1= <user>
##$USERP2= <user>
##$USERP3= <user>
##$USERP4= <user>
##$USERP5= <user>
##$WDW= 1
##$XDIM= 32768
##$YMAX_p= 375042449
##$YMIN_p= -9591525
$$ End of Bruker specific parameters
$$ ---------------------------------
##NTUPLES= NMR SPECTRUM
##VAR_NAME=  FREQUENCY,     SPECTRUM/REAL,   SPECTRUM/IMAG
##SYMBOL=    X,             R,               I
##VAR_TYPE=  INDEPENDENT,   DEPENDENT,       DEPENDENT
##VAR_FORM=  AFFN,          ASDF,            ASDF
##VAR_DIM=   32768,         32768,           32768
##UNITS=     HZ,            ARBITRARY UNITS, ARBITRARY UNITS
##FACTOR=    0.368581032318806, 1,           1
##FIRST=     11204.1544566776, 0,            0
##LAST=      -873.140229312654, 0,           0
##MIN=       -873.140229312654, -9591525,    0
##MAX=       11204.1544566776, 375042449,    0
$$ Real data points
##PAGE= N=1
##DATA TABLE= (X++(R..R)), XYDATA
$$ [...]
15584H30979j061278r39317p56371p88973q35198p25339m29460O4820N13293O35080
15574c491764M67444L80825M21708J93737l49861p94105o65549k7591N30741N72710
15564b761705L14169J94659K28340J69091N9668J90254N36688P59864P35902O43516
15554A070446M92370J59164o4611r1517j62039j52025l084N3286r3878l74206
15544H33906n48797n49003k63119K41796L34012o3555l31549k43602q6826L2454
15534f44283L24214N34116M43407L99564L79800L9948k62741l10526k56379j25640
15524E21480r0655j65123l79390n70678o45070p46841p62968n10798j20808K72343
15514c198508L62385J32123M4207J16492J48348K07968J88228R5991J01577K10060
$$ plain form
15584 830979 -230299 -1169616 -1925987 -2714960 -3550158 -4275497 -4704957 -4640137 -4126844 -3491764
15574 -3491764 -3024320 -2643495 -2221787 -2028050 -2377911 -3172016 -3837565 -3865156 -3334415 -2761705
15564 -2761705 -2447536 -2252877 -2024537 -1855446 -1795778 -1605524 -1068836 -308972 426930 1070446
15554 1070446 1562816 1721980 1657369 1565852 1403813 1251788 1248704 1301990 1208112 833906
15544 833906 285109 -263894 -527013 -285217 48795 -14760 -346309 -589911 -676737 -644283
15534 -644283 -320069 214047 657454 1057018 1436818 1476766 1214025 903499 647120 521480
15524 521480 430825 265702 -113688 -684366 -1329436 -2076277 -2839245 -3350043 -3470851 -3198508
15514 -3198508 -2836123 -2704000 -2659793 -2543301 -2394953 -2186985 -1998757 -1902766 -1801189 -1591129
15504a591129N45841R50362R44127N53720J40546j88375m64535n65331l68843
15495d3617O0347L80070N68055N57415J97345k83677m92213l30376R6306L76649
15485A086304O7487l07182l31643l18185l28908k01148q157r9173k97126k96592
15475a034323k80531k86939k46079l10631k22124J31140M40065N41818M60674
15466h06930L45265M09386N00201J95010l05834p16341j056709j199744r18630
15457c554326m54042N8033M51054K66369k53942l75316l7980K44225K14106R2126
15447c349693O1053j3685L0399K52916L22476R1719j70107j66892J1364n6855
15437b987305k39584k11475q372J53623K15778L13040N13113P07139N31233J11368
$$ plain form
15504 -1591129 -1045288 -94926 849201 1402921 1543467 1355092 890557 325226 -43617
15495 -43617 16730 396800 964855 1522270 1719615 1435938 943725 613349 709655 1086304
15485 1086304 1153791 846609 514966 196781 -132127 -333275 -341432 -440605 -737731 -1034323
15475 -1034323 -1314854 -1601793 -1847872 -2158503 -2380627 -2249487 -1809422 -1267604 -806930
15466 -806930 -461665 -52279 447922 642932 337098 -379243 -1435952 -2635696 -3554326
15457 -3554326 -4008368 -3950335 -3499281 -3232912 -3486854 -3862170 -3900150 -3655925 -3441819 -3349693
15447 -3349693 -3288640 -3302325 -3271926 -3019010 -2696534 -2604815 -2774922 -2941814 -2930450 -2987305
15437 -2987305 -3226889 -3438364 -3446736 -3293113 -3077335 -2764295 -2251182 -1544043 -1012810 -901442
15427i01442j9971J57166K41057l913l89158l99521o606K07322R9957j07173p9809
15416a202091L56555Q53134J001797N37055j74227m42272j61415L24135N48172
15407A640843J93118m85947q94955q34717n20372p5579P0989k89908o43415o83186
15397b523129m66402k92269k83011k73109k56080k10944K3306M64596Q57509J060853
15387a898680R04837M45126r2131m53971m59534j74086o0061k68541m12943r7820
15377b567804M78129P39918O49993N07046M62974N13012N71540M14772K62639
15368B032219L91795L38936k9497l85349o34119q22071q56778q35966p85169o77936
15358b263935m45740j89417j8778J5662k3041J291L6668L5131J48394M15775N55726
$$ plain form
15427 -901442 -921413 -764247 -523190 -527103 -916261 -1315782 -1322388 -1115066 -1015109 -1122282 -1202091
15416 -1202091 -845536 7598 1009395 1546450 1372223 929951 768536 1092671 1640843
15407 1640843 1833961 1348014 453059 -381658 -902030 -977609 -906620 -1196528 -1839943 -2523129
15397 -2523129 -2989531 -3281800 -3564811 -3837920 -4094000 -4304944 -4281638 -3817042 -2959533 -1898680
15387 -1898680 -993843 -548717 -640848 -1094819 -1554353 -1728439 -1788500 -2057041 -2469984 -2567804
15377 -2567804 -2089675 -1349757 -699764 -192718 270256 783268 1354808 1769580 2032219
15368 2032219 2424014 2762950 2733453 2348104 1713985 891914 35136 -800830 -1585999 -2263935
15358 -2263935 -2709675 -2899092 -2917870 -2902208 -2925249 -2923958 -2887290 -2852159 -2703765 -2287990 -1732264
15347a732264M54688K34259L6725p3713j23011j51533j67882l53615n37791n13462
15337b927599j34974M23880N47921K29967M74r5664j09541L5909J18399J33622
15327a777606K21429J92181J27122K31368K92112J96783M1553m3536j24825j63880
15317h07299J21148M99534M80245K23644J02894J38074J92130K19294Q3681l98950
15307H54395p38609n25401j76757K683M3723j59302l74396k88434j17755k33402
15297a713255n67729p04815n49128l37027k47822j11677J49491J50792J01476
15288c829694K37840K62974J15052l1018l6559p845M99P1985O6304j1615N2823
15277c109254K48529K84543J01074n5238j5487M9940j50260k49482k1053J82013
$$ plain form
15347 -1732264 -1277576 -1043317 -1006592 -1080305 -1203316 -1354849 -1522731 -1876346 -2414137 -2927599
15337 -2927599 -3062573 -2638693 -2090772 -1860805 -1860331 -1955995 -2065536 -2029627 -1911228 -1777606
15327 -1777606 -1556177 -1363996 -1236874 -1005506 -713394 -516611 -475058 -518594 -643419 -807299
15317 -807299 -686151 -186617 293628 517272 620166 758240 950370 1169664 1253345 854395
15307 854395 115786 -409615 -586372 -583689 -539966 -699268 -1073664 -1362098 -1479853 -1713255
15297 -1713255 -2280984 -2985799 -3534927 -3871954 -4119776 -4231453 -4081962 -3931170 -3829694
15288 -3829694 -3591854 -3328880 -3213828 -3244846 -3281405 -3289250 -3288751 -3216766 -3150462 -3162077 -3109254
15277 -3109254 -2860725 -2576182 -2475108 -2530346 -2545833 -2495893 -2646153 -2895635 -2916688 -2734675
15267b734675L27559L69026J67575k5026K1908P8921J0733J96418P36466J135407
15257B84312J124043Q46805M45618K4250m16203o09079n09510l85921m27741l74679
15247A895l7830K74244K64360O7323K8741Q2349O8291J16470K82634K99024m3518
15236A403983l57065l68355k65227j51204P3747K30625K68643J54536M4456J48292
15226A182431K02850O7572q5766J2354M37903O76129N55854L59703J52633q3685
15216C477978k86262l93189l96169j79786K51210L92973K4926l60183n87846p20453
15206A223199q75106p95445k61004K91168L27314n0649l36627k49079J40265M41298
15196a44666N66132Q32330R34634O73909K86597j53288o16411q29496n82744r1313
$$ plain form
15267 -2734675 -2407116 -2038090 -1870515 -1895541 -1873633 -1794712 -1783979 -1587561 -851095 284312
15257 284312 1408355 2255160 2700778 2725028 2308825 1699746 1190236 804315 376574 1895
15247 1895 -35935 238309 502669 569992 598733 681082 749373 865843 1148477 1447501 1403983
15236 1403983 1046918 678563 413336 262132 335879 566504 835147 989683 1034139 1182431
15226 1182431 1385281 1452853 1367087 1379441 1817344 2493473 3049327 3409030 3561663 3477978
15216 3477978 3191716 2798527 2402358 2222572 2473782 2866755 2891681 2531498 1943652 1223199
15206 1223199 348093 -447352 -708356 -417188 -89874 -140523 -477150 -726229 -585964 -144666
15196 -144666 421466 1253796 2188430 2862339 3148936 2995648 2379237 1549741 966997 875684
15186H75684K64558m190p37182j171880j067194m87400L6049J04609O2501J74861
15176a949584N14399Q10446Q58336P64795N29858L04672Q2469j54609l79892m72908
15166I07982m50724o32970q82950p48075l29145K8467L8243j73195l62634n37506
15156c142507n13411p6762L33731L77429K90511K51295L16079K99235K29884L56639
15146a277877N34065M04901O0m25132n64799k62089O4944K12121J94120j2123
15136a131809j74784k94859l62037q2368K51742L18652J71496l4021j71058k89901
15126a798947k67402j0657M04468O70268O82563O25933L71761J3775k15440m79567
15116c245o38642l95664R404K92651M28529K65649l5436k28816l25711m90474
$$ plain form
15186 875684 1140242 1136052 398870 -773010 -1840204 -2327604 -2291555 -2186946 -2124445 -1949584
15176 -1949584 -1435185 -624739 233597 998392 1528250 1832922 1915391 1760782 1380890 907982
15166 907982 457258 -175712 -1058662 -1806737 -2135882 -2107415 -2069172 -2242367 -2605001 -3142507
15156 -3142507 -3655918 -3732680 -3398949 -3021520 -2731009 -2479714 -2163635 -1864400 -1634516 -1277877
15146 -1277877 -743812 -338911 -338851 -763983 -1328782 -1590871 -1525927 -1313806 -1119686 -1131809
15136 -1131809 -1306593 -1601452 -1963489 -2045857 -1794115 -1475463 -1303967 -1337988 -1509046 -1798947
15126 -1798947 -2066349 -2077006 -1672538 -1002270 -319707 306226 677987 691762 476322 -3245
15116 -3245 -641887 -1037551 -1028147 -735496 -306967 -41318 -76754 -305570 -631281 -1121755
15106a121755p25435p96926p02666m53805J1222L54145L73908L28934L26515M02250
15096b003613M65211L67841J89759R0498O5070J16388M22799R83207J337163J130196
15086C164519N34221j68848p14153q06459m99762k03982P027K46618M85571O33509
15076B678261N19428Q1916l00936j91383M2729M3972r5862k00186l09392k67039
15066B001508k852J40136M8274k02029k91490k15211l05245m36742l72555j64660
15056A99134J22074L89500M79326M63028L94179K95092R502l95483m38153l3459
15046A484740M54702N61192K42981k32686m56979l31988j53416j0878J9665p9707
15036A497626k01281k39255j52763l9230j67248n65340q67943p99820n78731l57577
$$ plain form
15106 -1121755 -1847190 -2644116 -3346782 -3800587 -3789365 -3435220 -3061312 -2732378 -2405863 -2003613
15096 -2003613 -1538402 -1170561 -980802 -890304 -825234 -708846 -286047 697160 2034323 3164519
15086 3164519 3698740 3529892 2815739 2009280 1509518 1305536 1312563 1559181 2044752 2678261
15076 2678261 3197689 3279605 2978669 2787286 2830015 2873987 2778125 2577939 2268547 2001508
15066 2001508 1998656 2138792 2187066 1985037 1693547 1478336 1173091 736349 363794 199134
15056 199134 321208 710708 1190034 1653062 2047241 2342333 2351835 1956352 1518199 1484740
15046 1484740 1939442 2500634 2743615 2510929 2053950 1721962 1568546 1557668 1577333 1497626
15036 1497626 1296345 1057090 904327 865097 697849 132509 -735434 -1535254 -2113985 -2471562
15026b471562J4315N19076R76328Q74686K17501j89600o995K37216L02419J70764
15016F44148j41739m89849n97605n93727p38762r04005p82586n10998k93666M2153
15006d366636N25282P62955N86039M08576M11609L92225L95076M60580N96960
14997A72666O32629M53566R2599j74851j19764j05513j03143K18239M89147L66590
14987A922165M7063m09936o37941m13677j40856J0694k6063l02111n86903n35034
14977a072599j27208K19060K98104K53438K18263J55307l7628l69264m09845o3535
14967i35907m9412k99784k39134l8373N3427J17311N6486j59408k11731m3605
14957a750130J68701K12610R0423M0498P6191J90419L70432M60285M41863L13318
$$ plain form
15026 -2471562 -2457247 -1938171 -961843 -87157 130344 -59256 -66251 170965 473384 644148
15016 644148 502409 12560 -585045 -1178772 -1917534 -2821539 -3604125 -4115123 -4408789 -4366636
15006 -4366636 -3841354 -3078399 -2492360 -2083784 -1672175 -1279950 -884874 -424294 172666
14997 172666 805295 1258861 1351460 1176609 1056845 951332 848189 1066428 1555575 1922165
14987 1922165 1969228 1559292 921351 507674 366818 377512 351449 49338 -537565 -1072599
14977 -1072599 -1199807 -980747 -682643 -429205 -210942 -55635 -93263 -462527 -872372 -935907
14967 -935907 -985319 -1285103 -1524237 -1562610 -1509183 -1391872 -1335386 -1494794 -1706525 -1750130
14957 -1750130 -1581429 -1368819 -1278396 -1237898 -1161707 -971288 -600856 -140571 301292 614610
14947F14610K45785M44021N57438J38288n87129q12012m77196k36137j90403k42565
14937e45300k40131k33885l15664j78452J05883K16263J43997M1154J68328M34483
14927d03324O59186O50859L22021L7599l6153j87688m76126m87982j32327J40670
14917H6735R429l64785n22432k74738Q126O0864J45027K21728J82045J10894q1
14906c37188j51519m10869o13986n36314l40249n4526K77194M10885J61367m6270
14896a641475l1204j04830k62909l03964q7005J19022n5594k15401Q832L40604
14886b233924M49230J78709j72060k65570j93187j21032j24272j82746M037K60834
14876b399981K35461L9872j42760k11809L8596M83289O88902N53512J82340k16722
$$ plain form
14947 614610 860395 1304416 1861854 2000142 1413013 601001 123805 -112332 -302735 -545300
14937 -545300 -785431 -1019316 -1334980 -1513432 -1407549 -1191286 -1047289 -1006135 -837807 -403324
14927 -403324 255862 906721 1228742 1266341 1230188 1042500 566374 78392 -53935 86735
14917 86735 96164 -268621 -791053 -1065791 -1057665 -996801 -851774 -630046 -448001 -337107 -337188
14906 -337188 -488707 -899576 -1513562 -2049876 -2390125 -2444651 -2167457 -1756572 -1595205 -1641475
14896 -1641475 -1672679 -1777509 -2040418 -2344382 -2431387 -2312365 -2367959 -2583360 -2574528 -2233924
14886 -2233924 -1784694 -1605985 -1778045 -2043615 -2236802 -2357834 -2482106 -2664852 -2660815 -2399981
14876 -2399981 -2164520 -2124648 -2267408 -2479217 -2440621 -1957332 -1268430 -714918 -532578 -749300
14866g49300k87667l4944L08323N68402O50719O34073M80182Q7364k75838m47042
14856I34272m92585m99803m24834j52343L26160O47227M76074K94018N63559Q71812
14846B543557O80702N1602l26027k09000j50680k50958l39636m46298n29295l60052
14836F63915j87523k99025o63303q68126m68784J88784L22501R8401K15485N81121
14826d16554R32585J146414R25977Q6511q23119j083761o73535r4821K14427J68168
14816C82292o8141j90670j2843M50370P74046N47835R4522k02009l30584m61091
14806I83727n58228o13120o02086n58798l03150J97996L48505M064m62363p35302
14796b298755p08948k90341L63704O70109N39101L02930R0159r2900l2414K90831
$$ plain form
14866 -749300 -1036967 -1071911 -763588 -195186 455533 1089606 1569788 1657152 1381314 934272
14856 934272 441687 -58116 -482950 -635293 -309133 338094 814168 1108186 1671745 2543557
14846 2543557 3224259 3275861 2949834 2740834 2590154 2339196 1999560 1553262 1023967 663915
14836 663915 476392 177367 -485936 -1354062 -1822846 -1634062 -1311561 -1213160 -997675 -416554
14826 -416554 516031 1662445 2588422 2674933 1851814 768053 94518 -303 214124 382292
14816 382292 314151 123481 110638 561008 1335054 1882889 1977411 1775402 1444818 983727
14806 983727 425499 -187621 -789707 -1348505 -1651655 -1453659 -1105154 -1101090 -1563453 -2298755
14796 -2298755 -3007703 -3298044 -2934340 -2264231 -1725130 -1422200 -1332041 -1424941 -1457355 -1166524
14786a166524M54614J69197l32144n61028k22390K80504N34430N49199K54889
14777c9253j22817k39113l6440K39858K72727J38680J16991J57306N4826k53371
14767B89394o83719q16610m22561m3063N713m5180n1942K2788L59885O20336M02691
14756c62268j44792n43016n26484l06966j40383k2273J3039o1043j01457k9841
14746b225484J99793M21091N05567N13860L91106R8646j00343j58708k83230m99620
14736a137322o37525n24226l23383r5340K23536M62923M96422M40969K81747Q216
14726h03983l02030m75657m37505j82880L35502P84869P28388L76835o8693n38163
14716e83317m84519n7632j5781j05956K40031P97068J038568Q47818N25594J86056
$$ plain form
14786 -1166524 -711910 -542713 -874857 -1435885 -1658275 -1377771 -843341 -294142 -39253
14777 -39253 -162070 -401183 -437623 -197765 74962 213642 330633 487939 542765 289394
14767 289394 -394325 -1210935 -1633496 -1676559 -1670846 -1716026 -1767968 -1745180 -1385295 -764959 -362268
14756 -362268 -507060 -1050076 -1576560 -1883526 -2023909 -2046182 -2033143 -2094186 -2195643 -2225484
14746 -2225484 -2025691 -1604600 -1099033 -585173 -194067 -95421 -195764 -354472 -637702 -1137322
14736 -1137322 -1774847 -2299073 -2622456 -2717796 -2494260 -2031337 -1534915 -1093946 -812199 -803983
14726 -803983 -1106013 -1581670 -2019175 -2202055 -1866553 -1081684 -353296 23539 -45154 -583317
14716 -583317 -1067836 -1125468 -1141249 -1247205 -1007174 -210106 828462 1676280 2201874 2387930
14706B387930l8413r610P2484k27412p07060n86582J76602P09096M14039j70284
14696B020790m08539m83481m28273k73442k40284l37755l06573o7215j9128j92568
14686g36468l37687m73225p31880r71987j070511r60766n43484M1691N78805P39645
14676d465867M99384M17162N38460L42371j21559l82708l12587Q5363L96110L80379
14666b623492K84762L04469M36285N63038L31840k85613o14943m06174R352L20391
14656a680085L76163J75638J6295J35647L87683K30452m45717r48013q57091o32840
14646c241868o12329n83641l41286J08395M20437N50769Q05621J053857J058148
14637g81897N53807k43420o66073m11605J08047L44287J14867k40010m26768m96218
$$ plain form
14706 2387930 2349517 2339907 2412391 2184979 1477919 891337 1067939 1777035 2191074 2020790
14696 2020790 1612251 1128770 700497 427055 186771 -150984 -457557 -524772 -543900 -736468
14686 -736468 -1074155 -1547380 -2279260 -3251247 -4321758 -5282524 -5826008 -5784317 -5205512 -4465867
14676 -4465867 -3966483 -3549321 -3010861 -2668490 -2790049 -3172757 -3485344 -3399981 -3003871 -2623492
14666 -2623492 -2338730 -2034261 -1597976 -1034938 -703098 -988711 -1603654 -2009828 -2000476 -1680085
14656 -1680085 -1303922 -1128284 -1111989 -976342 -588659 -358207 -803924 -1751937 -2609028 -3241868
14646 -3241868 -3854197 -4437838 -4779124 -4670729 -4250292 -3699523 -2893902 -1840045 -781897
14637 -781897 -228090 -471510 -1137583 -1549188 -1441141 -1096854 -981987 -1221997 -1648765 -2144983
14627b144983n60025n47792l14681j7951L26205O80209Q68312R09827O96080L47237
14617B42438J68506K46901K05816J12093M2935k48633m05219k53222p7851O1897
14607I5661K29175L38225K27938J01480J45718K98170M71307M03989J83782M5018
14597B540463P1623J58378J77240J84233J78152J48323J45936j4911l60127o25425
14587B603885o61678n52217m15083l95929o79501r41827q71635n13598r1189J46747
14577b372025J95480J85664L08918M66632N20516N53751L83203n3734l02134r2959
14567b06688K77110M01920K54941R720j22908q8535K4650J67206L0083l80339
14557C67160o51872q05543q31070n56907j71635J49496M99326N61184K74170j29166
$$ plain form
14627 -2144983 -2705008 -3252800 -3567481 -3585432 -3259227 -2579018 -1710706 -800879 -104799 242438
14617 242438 410944 657845 863661 975754 1018689 770056 364837 111615 33764 95661
14607 95661 324836 663061 890999 992479 1138197 1436367 1907674 2311663 2495445 2540463
14597 2540463 2612086 2770464 2947704 3131937 3310089 3458412 3604348 3589437 3229310 2603885
14587 2603885 1942207 1389990 974907 578978 -100523 -1042350 -1913985 -2427583 -2518772 -2372025
14577 -2372025 -2176545 -1990881 -1681963 -1215331 -694815 -141064 242139 188405 -113729 -206688
14567 -206688 70422 472342 727283 737003 614095 525560 550210 717416 747499 367160
14557 367160 -284712 -1090255 -1921325 -2478232 -2649867 -2500371 -2001045 -1439861 -1165691 -1294857
14547a294857o24570j048473r90440l35551L98838Q11653R85058Q35305L94384
14538h68653J21645L8316K8226Q7269K92152L71857O6048J6254K81757L39975
14528G74846k4248n22226o26713l05194K05549N67401N22121K46298j25029m15511
14518B97294m39115n28557p44027p87096n78874k63385K9324K59319L51642N27407
14508a876068P36995O55868L93016J14859j39492l08910k72160j00498N4100L10023
14498d32267O04997N25260O907m61494o47519n37161k11279k2459k47148p03709
14488b125872r79212p45100o051P67137J151996J123507R62603P92186N55194
14479A496388M66993N12159M32065K17051J8701K9534J60167O0550k22760k87961
$$ plain form
14547 -1294857 -1919427 -2967900 -3958340 -4293891 -3895053 -3083400 -2098342 -1263037 -868653
14538 -868653 -747008 -708692 -680466 -593197 -301045 70812 136860 153114 434871 774846
14528 774846 750598 228372 -398341 -703535 -497986 69415 591536 837834 712805 297294
14518 297294 -141821 -670378 -1414405 -2201501 -2780375 -3043760 -3014436 -2755117 -2403475 -1876068
14508 -1876068 -1139073 -483205 -90189 24670 -114822 -423732 -695892 -796390 -742290 -432267
14498 -432267 172730 697990 704897 243403 -404116 -941277 -1152556 -1175015 -1422163 -2125872
14488 -2125872 -3105084 -3850184 -3856235 -3089098 -1937102 -813595 149008 941194 1496388
14479 1496388 1963381 2475540 2907605 3124656 3143357 3172891 3333058 3393608 3170848 2882887
14469B882887k05499l91278n26143l22061k21738k95618k92737k31773k7275K66551
14459F35316L31467J41420O4771J66489L5265j89543l24339l42855j17125K47006
14449F47872M64578K76845j19546m34787n99833o41937n48219m15626k64986k29977
14439a865616m20475m58597j79398J05121L10971M80763N15531L35717J13895
14430a062088Q7012K8303k87054o03281m67261p0939K17476K94161K08945J42918
14420a511808P6172j4581J2217R3615Q972k43884l70603j92257J38590M38146
14410a565421O51257P05530N24846J76244j18962k26776k31276k38761l32514
14401f55833n36666o62732m49925j70384k75011m98070n21115n18648j71973M06729
$$ plain form
14469 2882887 2677388 2286110 1759967 1437906 1216168 920550 627813 396040 368765 635316
14459 635316 966783 1108203 1172974 1339463 1374728 1185185 860846 517991 400866 647872
14449 647872 1112450 1389295 1269749 834962 235129 -406808 -955027 -1370653 -1635639 -1865616
14439 -1865616 -2286091 -2744688 -2924086 -2818965 -2507994 -2027231 -1511700 -1175983 -1062088
14430 -1062088 -975076 -946773 -1233827 -1837108 -2304369 -2375308 -2157832 -1863671 -1654726 -1511808
14420 -1511808 -1435636 -1450217 -1438000 -1344385 -1335413 -1579297 -1949900 -2142157 -2003567 -1565421
14410 -1565421 -914164 -208634 316212 492456 373494 146718 -84558 -323319 -655833
14401 -655833 -1192499 -1855231 -2305156 -2475540 -2750551 -3248621 -3769736 -4288384 -4460357 -4053628
14391d053628O93881N77116J79159j2038J81640N19043O59888O20474M00107k8260
14381b62618l70258l72860k14996j70546j80058j79162k80609k33422J69428O21958
14371a473143O72439M04508j6272m49130n77350m30853o1225K89184L22160L9935
14361a279747k32336l30073n88172q45822p96291p23294m39952K04339P59613
14352d271735Q51459O27921M50238O37830J161146J547415J381387Q29131L85570
14343C600362n5177n44134p24257o25171m30576k23158J03945O12731Q06263O10283
14333C131111L56901J10547k09183n50941o65590l55515J4987k5187j38997O2282
14323A730415K91973K60272J66555K06668J74653K43391L80446L35916N1444m28932
$$ plain form
14391 -4053628 -3359747 -2782631 -2603472 -2615510 -2433870 -1914827 -1254939 -634465 -234358 -262618
14381 -262618 -632876 -1005736 -1220732 -1391278 -1571336 -1750498 -2031107 -2264529 -2095101 -1473143
14371 -1473143 -800704 -396196 -412468 -861598 -1438948 -1869801 -1931026 -1641842 -1319682 -1279747
14361 -1279747 -1512083 -1842156 -2430328 -3276150 -4072441 -4795735 -5235687 -5031348 -4271735
14352 -4271735 -3420276 -2792355 -2342117 -1704287 -543141 1004274 2385661 3214792 3600362
14343 3600362 3545185 3001051 2276794 1651623 1221047 997889 1101834 1714565 2520828 3131111
14333 3131111 3488012 3598559 3389376 2838435 2172845 1817330 1832317 1807130 1668133 1730415
14323 1730415 2022388 2282660 2449215 2655883 2830536 3073927 3454373 3790289 3841733 3412801
14313C412801o41859m09691j48201o3418j39690k55316k02494j8505j59558m99957
14303H74112l97342q9662R2553L69007N98578L50344m5159k14319k56371l46697
14293I35044m13119m49174l77752j66997j46919k92407n39411q06095q03113n01213
14283c561156j97494N691L82201R74134J251151J108784R03212O23079K59230
14274A748832k72115j009924j519318j433491q46010k08739L2885l8546J24092
14265c422334M42987O40617P07056O21507N36838N49078M47851K43727K40956
14256A008283L90545M99179M64130J75933l83114p78010o95180l34027j19031
14247B28708k5154P3899J09116R1161M0310O9752J70227J52774m405k10964m35863
$$ plain form
14313 3412801 2770942 2361251 2213050 2149632 2009942 1754626 1552132 1533627 1374069 874112
14303 874112 476770 387108 479661 848668 1447246 1797590 1752431 1538112 1281741 935044
14293 935044 521925 72751 -305001 -471998 -618917 -911324 -1450735 -2256830 -3059943 -3561156
14283 -3561156 -3758650 -3752959 -3370758 -2396624 -1145473 -36689 866523 1489602 1748832
14274 1748832 1476717 466793 -1052525 -2486016 -3332026 -3540765 -3507880 -3546426 -3422334
14265 -3422334 -2979347 -2338730 -1631674 -1010167 -473329 75749 523600 767327 1008283
14256 1008283 1398828 1898007 2362137 2538070 2154956 1376946 681766 347739 228708
14247 228708 203554 277453 386569 477730 518040 587792 758019 910793 906388 695424 259561
14236B59561o23816o65801o16132m38363j28707J99855M08345M14502L28205J71626
14226f90725j5966j77526k83150l64787m52586m78766m30570l51264j012N32357
14216b713995P57225O30672L80240J39985r1719k70478k81812j28643p5407k18089
14206a872021k35738R2089L78345K33676k56344m77519n5254N56240Q46314N34585
14196b55627J8285j4140L58030L22657j88747m90396n17949n80043m27323J42409
14186a632844P14518Q73245N12350j01544n53563q32036r09299n14365j83883
14177b627421l14501n05530l55060N6462L63687L95112L79922M90209O93049P51587
14167f72484O58469N94119K78951l08198p13026n67396p4854L49891L26803k49782
$$ plain form
14236 259561 -364255 -1030056 -1646188 -2084551 -2213258 -2013403 -1605058 -1190556 -862351 -690725
14226 -690725 -706691 -884217 -1167367 -1532154 -1984740 -2463506 -2894076 -3245340 -3246352 -2713995
14216 -2713995 -1956770 -1326098 -945858 -805873 -897592 -1168070 -1449882 -1578525 -1653932 -1872021
14206 -1872021 -2107759 -2015670 -1637325 -1403649 -1659993 -2137512 -2192766 -1636526 -790212 -255627
14196 -255627 -237342 -251482 106548 429205 240458 -249938 -767887 -1347930 -1775253 -1632844
14186 -1632844 -918326 -45081 467269 365725 -187838 -1019874 -1929173 -2443538 -2627421
14177 -2627421 -2941922 -3447452 -3802512 -3746050 -3382363 -2987251 -2607329 -2117120 -1424071 -672484
14167 -672484 -14015 580104 859055 550857 -162169 -729565 -804419 -454528 -127725 -377507
14157c77507q14467r25812p69005o08170l18950K23461P04517Q25925O88142M96150
14147h75716M63756M74226M47312M59609N27164N46023M36844J10965m51165q07564
14137A331454p24522n23969k54111J36421K28469M2264K4221J71690M08840O66895
14127A507652Q04454O70383L31066N1718j49417j31540L3159k1437l81739n79975
14117B134324m52364k25721J8952K87253L93414N3565m61325q71160j089403j072067
14107a284532r04684n49194l43821k96003J9485M25938M09224L6757j01995N9895
14097b528930K30133L72602M92005M66028K66139k2501k69747k76760j90427k60782
14087a722240l95905l49143l12402k78083o0820J88193K98353K52355K83268M31011
$$ plain form
14157 -377507 -1191974 -2117786 -2886791 -3494961 -3813911 -3590450 -2885933 -2060008 -1371866 -875716
14147 -875716 -411960 62266 509578 969187 1496351 2042374 2479218 2590183 2139018 1331454
14137 1331454 606932 82963 -171148 -34727 193742 236006 260227 431917 840757 1507652
14127 1507652 2312106 2982489 3313555 3365273 3215856 3084316 3117475 3096038 2714299 2134324
14117 2134324 1681960 1456239 1475191 1762444 2155858 2209423 1748098 876938 -212465 -1284532
14107 -1284532 -2189216 -2738410 -3082231 -3378234 -3358749 -2932811 -2523587 -2486830 -2588825 -2528930
14097 -2528930 -2298797 -1926195 -1434190 -968162 -702023 -724524 -994271 -1271031 -1461458 -1722240
14087 -1722240 -2118145 -2467288 -2779690 -3057773 -3118593 -2930400 -2632047 -2379692 -2096424 -1665413
14077a665413N21927N61905O17462O27611N16742J97472q0135j63624k51091l92258
14067D90598n31507m83971j37593J47329P6718q8558j55703k60605k17165J48251
14057a012206L81559L84960K18134q2544l60383n54823l95006J37996N20010N18292
14047b44011K71358j54386n28753m67803p0021K11408L46854N74958O87095M36939
14037A063638J69011m0726k14221j83698J177K71758L36445J19626p8463j26499
14027A318048J38459N62704N53924j7458n13679m03382J63145O29641N88662K30441
14017C250505k79118q64353j045426n50545J30716M79750L22287q5147k72813
14008A085856j64404o5676j78212m31258o15869m08315J32084N19737L57416l7349
$$ plain form
14077 -1665413 -1143486 -581581 35881 663492 1180234 1377706 1297571 1133947 882856 490598
14067 490598 -40909 -524880 -662473 -515144 -438426 -526984 -682687 -943292 -1160457 -1012206
14057 -1012206 -630647 -245687 -27553 -110097 -470480 -1025303 -1420309 -1282313 -762303 -244011
14047 -244011 27347 -127039 -655792 -1123595 -1193616 -982208 -635354 -60396 626699 1063638
14037 1063638 1232649 1191923 977702 794004 795181 1066939 1403384 1523010 1444547 1318048
14027 1318048 1456507 2019211 2573135 2555677 2041998 1638616 1801761 2431402 3020064 3250505
14017 3250505 2971387 2107034 1061608 511063 641779 1121529 1443816 1358669 1085856
14008 1085856 921452 855776 677564 246306 -369563 -777878 -645794 -126057 231359 194010
13998A94010j01502J89559M98029N65412L38725j33873p64963j138405q15019
13989a168027j63455K24858J76929K2833R426q3846k40425k71918j41331J15448
13979a519508M21696M97940L31779O9779n4557K7535J4978j89319j21045K91143
13969b29579O84526P85791N45000p8021p52915p66109k85182j5360l33720q10424
13959a255993q13107l90569J75122L45100P9176M8212K01813J72427P1616M8571
13949a317632o0039j70153l04695m95532m87765j89666Q9883J54428K63846N80554
13939a936771P87417P64908N58287K71431J16691K04113K90634J19808j88927
13930I87591m14400m08482l29223k62976j33353j7534Q5081J03967L6518k6173
$$ plain form
13998 194010 92508 282067 780096 1345508 1684233 1550360 785397 -353008 -1168027
13989 -1168027 -1331482 -1106624 -929695 -906862 -897436 -981282 -1221707 -1493625 -1634956 -1519508
13979 -1519508 -1097812 -599872 -268093 -198314 -252871 -225336 -210358 -399677 -520722 -229579
13969 -229579 454947 1240738 1785738 1707717 954802 188693 -96489 -111849 -445569 -1255993
13959 -1255993 -2069100 -2459669 -2284547 -1939447 -1860271 -1812059 -1610246 -1437819 -1366203 -1317632
13949 -1317632 -1377671 -1547824 -1852519 -2348051 -2835816 -3025482 -2935599 -2781171 -2517325 -1936771
13939 -1936771 -1149354 -384446 173841 445272 561963 766076 1056710 1176518 987591
13930 987591 573191 164709 -164514 -427490 -560843 -578377 -493296 -389329 -352811 -378984
13920c78984N9927J50232P837k71947n34166m48332J42925P48671R05452Q58907
13910A240522P99605P52490O14928M01377K02994J5632j61350j68068K367q6472
13900C614025n51485p84381m71912n9617J64900K63716J39723n7020p8564M5283
13890B224668j9482l86538o87877o87283m70178k62211k75313m92905p42158q45203
13880b644480n71894n1993L66272N73002M79591M02971N00317N21951K95089K3165
13870a06009R2917L13738M09845L08099R6666k4165l3063J20373L15821J43531
13860A637753j96153j48707J20343K08274J7803l59998o27294o40025o87578o30367
13850a305949k65692L1134J11389J97933K21639L13811M63759M17676K19295p2689
$$ plain form
13920 -378984 -319057 -168825 -160988 -432935 -967101 -1415433 -1272508 -523837 381615 1240522
13910 1240522 2040127 2792617 3407545 3808922 4011916 4027548 3866198 3698130 3700497 3614025
13900 3614025 3062540 2278159 1806247 1746630 1911530 2175246 2314969 2257949 2179385 2224668
13890 2224668 2205186 1818648 1130771 443488 -26690 -288901 -564214 -1057119 -1799277 -2644480
13880 -2644480 -3216374 -3268367 -2902095 -2329093 -1849502 -1446531 -946214 -424263 -129174 -106009
13870 -106009 -13092 300646 710491 1018590 1115256 1091091 1058028 1178401 1494222 1637753
13860 1637753 1441600 1292893 1413236 1621510 1639313 1279315 652021 11996 -675582 -1305949
13850 -1305949 -1571641 -1540507 -1429118 -1231185 -1009546 -695735 -231976 185700 404995 332306
13840C32306l10299l87341j94939J97999M06552L92725M53029L52638n2013n00409
13830F90248o09289m59270l76677k45342r0168m6544j28966k93956j30276K38445
13820a451795J49111k10398k94251q0299k2478p6428m5823m9053K33274N22187
13810a325953L91820K35161K82313K29784J16437J40307K0315l11946n48414n15438
13800a285614l36503j12668K67017L86699j33884p56031q26181k51716N22242
13791b526639R70540R07127N63556Q3934n87343q75861m57812J82750O64603Q95530
13781a79615P89649N53631L66122N9106k33583l05874l30895n23970q46173q31785
13771a483387l22054M0892O2263L2281J42458J35238r5159j74666l0261J90364
$$ plain form
13840 332306 22007 -365334 -560273 -362274 44278 437003 890032 1242670 1190657 690248
13830 690248 80959 -378311 -754988 -1000330 -1090498 -1137042 -1266008 -1559964 -1690240 -1451795
13820 -1451795 -1302684 -1513082 -1807333 -1887632 -1910110 -1986538 -2032361 -2081414 -1848140 -1325953
13810 -1325953 -934133 -698972 -416659 -186875 -70438 69869 90184 -221762 -770176 -1285614
13800 -1285614 -1622117 -1734785 -1467768 -1081069 -1214953 -1970984 -2797165 -3048881 -2526639
13791 -2526639 -1556099 -648972 -85416 -1482 -588825 -1464686 -1922498 -1739748 -1075145 -179615
13781 -179615 610034 1163665 1529787 1588893 1355310 1049436 718541 194571 -651602 -1483387
13771 -1483387 -1805441 -1764549 -1702286 -1670005 -1527547 -1392309 -1487468 -1662134 -1692395 -1502031
13761a502031K31069j0944l45516n60727l68479K16589Q00463Q14520M02066J25963
13751a97027J19171K92594L40548K03964j02159l37048k56665J08574M97223N00169
13741A169344J64554k38925o61662p40362k90567K35681M61716K57171j52884
13732B04066m12714m59060k46269O8339L05418L34521K50604K07521L30611N00970
13722A084007N32926L00904l0499j65514k54274k51885L2533K44726P4458l30199
13712A237183o11340m24643j13985o1435j89783j21161K17050L83396P2994m44542
13702e6266p61312p25992l45022j0290j1897p1275J75760O34290Q28788N89067
13692B45851K57099q6946k83162k16491j73839l13887m13460l95950k03818K69870
$$ plain form
13761 -1502031 -1270962 -1281906 -1627422 -2188149 -2556628 -2340039 -1539576 -725056 -322990 -197027
13751 -197027 -77856 214738 555286 759250 657091 320043 63378 171952 669175 1169344
13741 1169344 1333898 1094973 433311 -307051 -597618 -361937 99779 356950 204066
13732 204066 -208648 -667708 -913977 -845638 -540220 -205699 44905 252426 583037 1084007
13722 1084007 1616933 1917837 1887338 1721824 1467550 1215665 1248198 1492924 1567382 1237183
13712 1237183 625843 201200 87215 25780 -164003 -285164 -68114 315282 388276 -56266
13702 -56266 -817578 -1543570 -1888592 -1898882 -1910779 -1982054 -1806294 -1172004 -343216 245851
13692 245851 502950 416004 132842 -83649 -257488 -571375 -984835 -1380785 -1584603 -1314733
13682a314733O27865N01611K1310m39463n52243l35576o7664J07443L03505M13430
13672g34515K77740K54194L86290K22746j10571j90049j18936j45576j50646q5683
13662c95006j85532n08476o44667l44215m1208j8213j26707j14506J90018M84610
13652a703902O71821P82606N80194K15566K59714O57705O49148Q8888m91193p36207
13642I74340m75820Q3333N75467P52452M20350j35452n54767n87744m09160m11109
13632B31890o65625o94369m60445k41790J5480K38535J53903j76121k11759K79237
13622a531064Q93285J090243P75797M27317L77464L91715N0152n44643p09038
13613A221228j97857K81419K02844r6529K2968L44388N28213N39851K62735j36309
$$ plain form
13682 -1314733 -686868 -185257 -163947 -603410 -1155653 -1491229 -1558893 -1451450 -1147945 -734515
13672 -734515 -456775 -202581 183709 406455 295884 105835 -13101 -158677 -309323 -395006
13662 -395006 -580538 -1089014 -1733681 -2077896 -2119104 -2137317 -2264024 -2378530 -2188512 -1703902
13652 -1703902 -1032081 -249475 330719 546285 805999 1463704 2112852 2201740 1710547 974340
13642 974340 498520 581853 1157320 1909772 2330122 2194670 1639903 1052159 642999 231890
13632 231890 -433735 -1128104 -1588549 -1830339 -1814859 -1576324 -1422421 -1598542 -1810301 -1531064
13622 -1531064 -637779 452464 1228261 1655578 2033042 2424757 2474909 1930266 1221228
13613 1221228 1023371 1304790 1507634 1411105 1434073 1778461 2306674 2846525 3109260 2972951
13603B972951m02165k36773O6166J91586J68798j62359o32175o21309k00814L0588
13593A174494M0621l3397o5711J00688N33334P92878L84471k46095o18337o04033
13583A458913r4594K29267j72323o22976n98441m68061l80557j94896J12236L02597
13573d28835J94272J3621l0192p646J69979K60608p0721m85396n46802k20186
13563a151298K64921O89442J032052J140084Q89504K69653n11229j007468r84284
13554F31377p11857l47014j30568m06258o02474m02252k17297j24640J64313O43426
13544a503244R32482Q10339M30521j8957l82552m30685l20401m21660o56863o70851
13534b231871l04151R0855L45569M46555L11882N8931l4032P0092M8934j28422
$$ plain form
13603 2972951 2570786 2334013 2400179 2591765 2760563 2598204 1966029 1344720 1143906 1174494
13593 1174494 1215115 1181718 1116007 1216695 1750029 2542907 2927378 2681283 2062946 1458913
13583 1458913 1364319 1593586 1421263 798287 199846 -268215 -648772 -843668 -731432 -428835
13573 -428835 -234563 -220942 -251134 -258780 -88801 171807 101086 -384310 -931112 -1151298
13563 -1151298 -886377 -196935 835117 1975201 2864705 3134358 2623129 1615661 631377
13554 631377 -80480 -427494 -558062 -964320 -1566794 -1969046 -2186343 -2310983 -2146670 -1503244
13544 -1503244 -570762 239577 670098 651141 268589 -162096 -482497 -904157 -1561020 -2231871
13534 -2231871 -2536022 -2445167 -2099598 -1653043 -1341161 -1282230 -1316262 -1246170 -1197236 -1325658
13524a325658l04928k99508j65173o5037j26039k77455k00790J07084O00139R61629
13514a095736P89354L43678l8806q2174J28026K10188K02270K80927L24753K93770
13504A356250J13687j43844k08439k72148m45997m92275k30840M6375J54188J56856
13494C3813j6138j43395m6084Q1415j7826m24335p55944o83401l72743k11555
13484b556193j65870j18238j23038j16273Q2737K15868Q1309p7724q3020J07103
13474b753339K98054L88901L85096K06795K7895J23343L57262K94963l5180j59444
13464h65654K3449K03059K91830K12044l984j88116k66321j60132J35391M08803
13454b09631L96799J92600J10352K1696j17207R0315N73764Q03594O56786L92467
$$ plain form
13524 -1325658 -1630586 -1930094 -2095267 -2160304 -2286343 -2563798 -2764588 -2657504 -2057365 -1095736
13514 -1095736 -306382 37296 -1510 -83684 44342 254530 456800 737727 1062480 1356250
13504 1356250 1469937 1326093 1117654 845506 399509 -92766 -323606 -277231 -123043 33813
13494 33813 17675 -125720 -171804 -90389 -108215 -532550 -1288494 -1971895 -2344638 -2556193
13484 -2556193 -2722063 -2840301 -2963339 -3079612 -2996875 -2781007 -2699698 -2777422 -2860442 -2753339
13474 -2753339 -2455285 -2066384 -1681288 -1474493 -1446598 -1323255 -965993 -671030 -706210 -865654
13464 -865654 -842205 -639146 -347316 -135272 -139256 -327372 -593693 -753825 -618434 -209631
13454 -209631 187168 379768 490120 511816 394609 484924 1058688 1862282 2519068 2911535
13444B911535P3772j55900k68102m33964n53374n08340l28756j49726K8808L49221
13434I65174M47849J83606L5426J81065J19352k97866n36195l88164q9121J46553
13424G67679K75318M34091N40836L78981J4828l71983o76065n40385l6114J69047
13414I56233j62366n86383n01089j11064q8046m88896p88327o16867k67346j0315
13404b664466M13029Q72412J065967J086819Q91237O25942N15959K51415m11108
13395B647206q97779p71432k45698L49291P08361M36608m14046j023590j015109
13386b26188p13812n44204n93474n63626m61667k24112J41253L06267M37959P43626
13376a697978J013974J001897O97756K43377j08571j49072J2821J09582j60040
$$ plain form
13444 2911535 2985307 2829407 2561305 2127341 1573967 1065627 736871 587145 615953 965174
13434 965174 1413023 1596629 1632055 1813120 1932472 1634606 1098411 710247 621126 767679
13424 767679 1042997 1477088 2017924 2396905 2411733 2039750 1363685 823300 787186 956233
13414 956233 793867 207484 -293605 -404669 -492715 -981611 -1769938 -2386805 -2654151 -2664466
13404 -2664466 -2251437 -1379025 -313058 773761 1664998 2290940 2806899 3058314 2647206
13395 2647206 1749427 977995 732297 1081588 1789949 2226557 1812511 788921 -226188
13386 -226188 -940000 -1484204 -2077678 -2641304 -3102971 -3327083 -3185830 -2879563 -2441604 -1697978
13376 -1697978 -684004 317893 1015649 1259026 1150455 1001383 1014204 1123786 963746
13367I63746p08128r25515n74085j40144m2800q3208j02990l5770J69306K59390
13357a220198n6259l86841k82455K31011O26840N14541K13773J80128L19375L92636
13347E32551L27355J07516j62379l39300k95512j74548n1747M7999L3376q8704
13337f3393j70174m2352J76104L86575L73690J39853K08480M64586M73658K23669
13327B170696j64094l97563m20107l78034l42215j58010K38606O27989P46025
13318A923293O99052M86873J46305j52234l51268k83600o6007K3646O6085P5066
13308B567211j04696n20123q25001p82227n98743m63652l20952q8010K69581O89897
13298a76715J060456J285659J062692N19355K76k84536l31542j82569J6539l8540
$$ plain form
13367 963746 255618 -669897 -1243982 -1384126 -1426926 -1510134 -1613124 -1648894 -1479588 -1220198
13357 -1220198 -1276457 -1663298 -1945753 -1714742 -1087902 -573361 -359588 -179460 139915 532551
13347 532551 859906 967422 805043 465743 170231 -4317 -56064 -8065 25311 -63393
13337 -63393 -233567 -275919 -99815 286760 660450 800303 1008783 1473369 1947027 2170696
13327 2170696 2006602 1609039 1188932 810898 468683 310673 549279 1177268 1923293
13318 1923293 2622345 3109218 3255523 3103289 2752021 2468421 2402414 2426060 2492145 2567211
13308 2567211 2462515 1942392 1117391 335164 -263579 -727231 -1048183 -1136193 -866612 -176715
13298 -176715 883741 2169400 3232092 3751447 3751723 3467187 3135645 2953076 2969615 2931075
13288B931075k41994j23405M38308Q43863O16247J80219j19465l65734m60891
13279C698223k58613L9684K17467M86123Q32079R11219P70495O37066P88349J314557
13269I436649J698209J471366J021727Q53627J108022J718462K465004L105354
13261B2878420L210326K923018K694265K215279J178733l43304j789087k553286
13253C0414364k942703l122930k808500k233009j799787j680777j762014j776044
13245A2288600j615316j417527j215832j166243j211062r56332n99937l13878
13237C792473M2074L49086L87755J05298j04542p3383J05109K88174K83510N8543
13227E234097k66221m67855o18082q42523j043835j145021j147946r00158l74901
$$ plain form
13288 2931075 2689081 2565676 3003984 3847847 4464094 4644313 4524848 4159114 3698223
13279 3698223 3439610 3479294 3696761 4182884 5014963 5926182 6696677 7333743 8122092 9436649
13269 9436649 11134858 12606224 13627951 14481578 15589600 17308062 19773066 22878420
13261 22878420 26088746 29011764 31706029 33921308 35100041 34756737 32967650 30414364
13253 30414364 27471661 24348731 21540231 19307222 17507435 15826658 14064644 12288600
13245 12288600 10673284 9255757 8039925 6873682 5662620 4706288 4106351 3792473
13237 3792473 3834547 4183633 4571388 4676686 4572144 4498761 4603870 4892044 5175554 5234097
13227 5234097 4967876 4500021 3881939 3039416 1995581 850560 -297386 -1197544 -1572445
13218a572445J32488N06307P70141P42222N03401M06017M30667K91035m3432j89655
13208A976746K3238N0826m65310o51247K5351O65834P13420M75484L55269M58054
13198C627665M72027L47106K66987K57702J55174j04674j37944J25913J76858
13189E186814j61149n14640n22016m53908n77860o94667o35556m15172j08175
13180A103671M5526j62793o55900j052197r18750m12852N1314L08104M27121N34918
13170g31838O37200M95695J64896j31996j58978J89950N30827N07057J27826l86414
13160A244225l19152K48714N88989M94791O8259k89938m51526n83912n24864j95436
13150B80150K12941L97378M39031O18279P96885P31289M15562j3282m69475o22078
$$ plain form
13218 -1572445 -1439957 -933650 -163509 578713 1082114 1488131 1918798 2209833 2166401 1976746
13208 1976746 1999984 2050810 1585500 934253 959604 1625438 2338858 2814342 3169611 3627665
13198 3627665 4099692 4446798 4713785 4971487 5126661 5021987 4884043 5009956 5186814
13189 5186814 5025665 4511025 3989009 3535101 2957241 2262574 1627018 1211846 1103671
13180 1103671 1149197 986404 330504 -721693 -1640443 -2053295 -2001981 -1693877 -1266756 -731838
13170 -731838 -94638 401057 565953 433957 274979 464929 995756 1502813 1630639 1244225
13160 1244225 925073 1173787 1762776 2257567 2325826 2035888 1584362 1000450 475586 280150
13150 280150 493091 890469 1329500 1947779 2744664 3475953 3891515 3878233 3408758 2786680
13140B786680m03724k56537l30578m44156l54679m7559K21707L54222K38198m0152
13130A723422j98145j01785P750k18020p93679j156019p58567J13641O11343N40709
13120b29350K76575J36980r0186k83912n4866N12276Q37834P09123N13686L72470
13110B700630K04254J45907K73494J98420m19790j168758j477275j262271o85623
13101a491012M7315P29570J226256J381280J071990M99058P9405j95771m46548
13092B901543o12607o38214n56019o36528q59767r28071p59761k32660N01648
13083a820436R23994R73347R77824J044346R10105N14141p3343p20140q40218
13074A889620k23287L89001M35168p6756o78158q98473m89391J86365N61322P32473
$$ plain form
13140 2786680 2382956 2126419 1795841 1351685 997006 949447 1171154 1525376 1763574 1723422
13130 1723422 1525277 1423492 1431242 1213222 419543 -736476 -1495043 -1381402 -770059 -229350
13120 -229350 47225 184205 94019 -189893 -244759 267517 1105351 1814474 2328160 2700630
13110 2700630 2904884 3050791 3324285 3522705 3102915 1934157 456882 -805389 -1491012
13101 -1491012 -1443697 -714127 512129 1893409 2965399 3464457 3543862 3348091 2901543
13092 2901543 2288936 1650722 1094703 458175 -401592 -1329663 -2089424 -2322084 -1820436
13083 -1820436 -896442 76905 1054729 2099075 3009180 3523321 3449978 2729838 1889620
13074 1889620 1666333 2055334 2490502 2413746 1735588 837115 347724 534089 1095411 1827884
13064A827884R17641J016187P38407J89294k34962m75571p20000r00977o07268
13055A750635r8456R9724O0653J10213J17883J9447j90992l62105j88465Q1290
13045A399827J25123M9235Q9700L53435O29958O35152N68044O20981O46182M58597
13035E576234K41159K93106R5627m66633n87878k06689K52050M50946K53632L4300
13025E935854K09138O36086P47572M51635J31018k3287j55346k58131q4526K82602
13015G872615N31159M90301K74241K10796L99668P49384J070767P65215j0270
13006A2353876l69060j86100J64084N28841O55495L47383J2894o0008L49459J017989
12996A4814853J180018R16288R88707J564673K408775L208074L626684L784563
$$ plain form
13064 1827884 2745525 3761712 4500119 4689413 4454451 3978880 3258880 2357903 1750635
13055 1750635 1652179 1751903 1812556 1922769 2040652 2060099 1869107 1507002 1318537 1399827
13045 1399827 1524950 1574185 1663885 2017320 2647278 3282430 3850474 4471455 5117637 5576234
13035 5576234 5817393 6110499 6206126 5739493 5151615 4944926 5196976 5647922 5901554 5935854
13025 5935854 6144992 6781078 7528650 7980285 8111303 8088016 7932670 7674539 7590013 7872615
13015 7872615 8403774 8894075 9168316 9379112 9778780 10528164 11598931 12364146 12353876
13006 12353876 11984816 11798716 11962800 12491641 13147136 13494519 13507413 13447405 13796864 14814853
12996 14814853 15994871 16911159 17899866 19464539 21873314 25081388 28708072 32492635
12988C2492635M160312M954224O060251P505703R009947J0495411J2310666J4491985
12980A01481134J6756479J9537743K3447644K8365039L3647930L8429368M0970520
12973C02635857L7623427K4116763J172924k2804573l8375748m2821883l9949702
12966B21597065l4463965k8576260k3118645j8562225j5058641j2523192j0583526
12959G8710611q971634p613725o402350n173049m051864l362117l241437l284980
12951C6609455l124467k915032k606208k308857k208329j833723j025094m71841
12943B0115904n61084p12894m83703k68502k72083m56084p47927q04996q06293
12934A5002338r75371r79078p96130n42109j28105L37369N77671N35704M09163
$$ plain form
12988 32492635 36652947 41607171 47667422 55173125 64183072 74678483 86989149 101481134
12980 101481134 118237613 137775356 161223000 189588039 223235969 261665337 302635857
12973 302635857 340259284 364376047 365548971 342744398 304368650 261546767 221597065
12966 221597065 187133100 158556840 135438195 116875970 101817329 89294137 78710611
12959 78710611 69738977 62125252 55722902 50549853 46497989 43135872 39894435 36609455
12951 36609455 33484988 30569956 27963748 25654891 23446562 21612839 20587745 20115904
12943 20115904 19554820 18841926 18358223 18089721 17817638 17361554 16613627 15808631 15002338
12934 15002338 14026967 13047889 12251759 11709650 11581545 11918914 12496585 13032289 13441452
12925A3441452K73077L51431M73220K02665q009L54136Q86074J301730J665689
12916A8941465J896382K059647K180330K096934J618450R99738N48056L59309
12908C0700311M66021P48103J177017J534003J786744K225912K872348L681727
12900D5192186M697912N812551O912740Q144459R849183J1959052J4312529J7282697
12892A24163309K0987626K5134442K9950450L5557270M0773331M2725626L6696580
12885C55988634J9053815o631479k9698664m2061353m3961066l9757508l3399120
12878A79533259k7317572k2328509j8007413j4412352j1880866j0080624q546508
12871F6959415p270752o399949n659207m634142l352099k248076j861833k065639
$$ plain form
12925 13441452 13714529 14065960 14539180 14741845 14733836 15087972 15974046 17275776 18941465
12916 18941465 20837847 22897494 25077824 27174758 28793208 29792946 30341002 30700311
12908 30700311 31166332 31914435 33091452 34625455 36412199 38638111 41510459 45192186
12900 45192186 49890098 55702649 62615389 70759848 80609031 92568083 106880612 124163309
12892 124163309 145150935 170285377 200235827 235793097 276566428 319292054 355988634
12885 355988634 375042449 368410970 338712306 296650953 252689887 212932379 179533259
12878 179533259 152215687 129887178 111879765 97467413 85586547 75505923 66959415
12871 66959415 59688663 53288714 47629507 42995365 39643266 37395190 35533357 33467718
12863C3467718k338203k229085j756341j378918j354659j495717j437568j307742
12855B0169485j358048j260013j084941r75149p27651n16738k99547r0420J06158
12846A3963136M84226P28012M94531k367l48846m63221m58842l04945n5596J25986
12836A4162074Q8159J06515K83617M14709M79998O47214P72610O40626K95016
12827A7890538L8829K74302O80656R27523J247375J582547J695392J713018J857162
12818B7907342K291221K785998K999926K964095L345047M742360O569494Q078066
12810F1683549R392400J1006635J3212468J5911834J8881872K2493388K6932822
12803A79514968L1840284L6633434M0275608L9968655L0955149J1217755j3582074
$$ plain form
12863 33467718 31129515 28900430 27144089 25765171 24410512 22914795 21477227 20169485
12855 20169485 18811437 17551424 16466483 15491334 14763683 14246945 13947398 13856978 13963136
12846 13963136 14447362 15175374 15669905 15667538 15318692 14855471 14396629 14091684 14036088 14162074
12836 14162074 14250233 14356748 14640365 15055074 15535072 16182286 16954896 17595522 17890538
12827 17890538 17929367 18203669 18884325 19811848 21059223 22641770 24337162 26050180 27907342
12818 27907342 30198563 32984561 35984487 38948582 42293629 47035989 53605483 61683549
12810 61683549 71075949 82082584 95295052 111206886 130088758 152582146 179514968
12803 179514968 211355252 247988686 288264294 328232949 359188098 370405853 356823779
12796C56823779l3387002m2557082m2479301l7520593l1457157k6118667k1557885
12789A21746092j7420311j4011740j1440007r461562p776868o184229m865921
12782E0585454m077135l720627l193761k658476k651716k792337k656791k520990
12774B6313621k568917k722105k709410j988458j043377o06594m76261p42656
12766A3455843j270022j480833j203811o21787k01932o4232p0258k56284l89912
12757G896772m61381m97899l89836k53922j11145K86863R09188J160017P95917
12748I334574J70677l41088o03131p35388p57327p18601p17995o30541m57759
12739D543421l48416k16813m2001j39930m56235n09945j90891j0669k66962n67273
$$ plain form
12796 356823779 323436777 280879695 238400394 200879801 169422644 143303977 121746092
12789 121746092 104325781 90314041 78874034 69412472 61635604 55451375 50585454
12782 50585454 46508319 42787692 39593931 36935455 34283739 31491402 28834611 26313621
12774 26313621 23744704 21022599 18313189 16324731 15281354 14674760 14198499 13455843
12766 13455843 12185821 10704988 9501177 8879390 8677458 8613226 8542968 8286684 7896772
12757 7896772 7435391 6937492 6547656 6293734 6182589 6469452 7378640 8538657 9334574
12748 9334574 9505251 9164163 8561032 7825644 7068317 6349716 5631721 5001180 4543421
12739 4543421 4195005 3978192 3936191 3796261 3340026 2830081 2639190 2628521 2361559 1794286
12729A794286n15613k52350R4569M66133O59999N70562L65167K19389O5578k85005
12719C182715n30924k20419M24702O54449K72222k89369q12371j014117p87656
12710H79232m09525j11453j35420k52555k24699k25393k88718k67234k38092k56478
12700a530335k47947l69568o40667m44949L43998R72875R67217O08501L34311
12691f564K81494K18653J18841J42330K4341j50815m3257J18598J10049K85253
12681A098923N67529N52502M09419K52979K4125j07600j08435r3008k33800m13823
12671A948811l92338l52565m44235l72629n9351R0762P0681K4893k35130n52102
12661b73203m88409k13088j82102l39240l85499k40056R0381N28646P06366N32022
$$ plain form
12729 1794286 1278673 1026323 1120892 1587025 2247024 2817586 3182753 3402142 3467720 3182715
12719 3182715 2651791 2431372 2856074 3510523 3782745 3493376 2681005 1666888 879232
12710 879232 469707 358254 222834 -29721 -254420 -479813 -768531 -1035765 -1273857 -1530335
12700 -1530335 -1778282 -2147850 -2788517 -3233466 -2889468 -1916593 -949376 -340875 -6564
12691 -6564 274930 493583 612424 754754 779095 628280 585023 703621 813670 1098923
12681 1098923 1666452 2218954 2628373 2881352 2905477 2797877 2689442 2596434 2362634 1948811
12671 1948811 1556473 1203908 759673 387044 327693 418455 489136 514029 278899 -273203
12661 -273203 -761612 -974700 -1156802 -1496042 -1881541 -2121597 -2031216 -1502570 -796204 -264182
12651b64182L67768J96251N9002R168k76921n15734k88576J82054N33638O17131
12641F19599K97936l58703p77213o68254m66127k64050j1534J75035K25328N2249
12631a175734k9490R4736J98221M40064M64124L22539L73913M20896K29928j71060
12621A168137l57913k00713L7493J84665K05659k8023k86230l00857l21398l32217
12611b31397k16592j25630k33445l63410j84044Q6741J66604K59437O39468Q70504
12601F68236N79830J72633j13986l21696m94187n09029j63120J75988K97017M84492
12591G76178O92885M78209J24246J23274J62647J28924J45347l1964l59622p45871
12581A494253q58008m65905N5028L22843J49871j79642l39489k42277J4274J50219
$$ plain form
12651 -264182 103586 299837 358839 368007 91086 -424648 -713224 -531170 2468 619599
12641 619599 917535 558832 -218381 -886635 -1352762 -1616812 -1628346 -1453311 -1227983 -1175734
12631 -1175734 -1205224 -1110488 -912267 -472203 -8079 314460 688373 1109269 1339197 1168137
12621 1168137 810224 609511 647004 831669 1037328 1009305 723075 422218 100820 -231397
12611 -231397 -447989 -573619 -807064 -1170474 -1354518 -1267777 -1101173 -841736 -202268 668236
12601 668236 1248066 1420699 1306713 985017 490830 -18199 -181319 -5331 291686 776178
12591 776178 1469063 1947272 2071518 2194792 2357439 2486363 2631710 2599746 2240124 1494253
12581 1494253 636245 170340 225368 548211 698082 518440 178951 -63326 -49052 101167
12571A01167r7351m90879n60564l69255k7545M98917Q59072O50126J39775l35115
12561C68348o38018p45103o01339j73731K47692L07609J81082J39758J7430j48299
12551a044571o2618J60532L18673M98764P10421P37637M07273J8524K514K00323
12541A947472M04016M51573M28276L37713J06727j15095k23300k38472l70142
12532B728768o91434j043632r24999n20932l12560l88025n66111n57015l12403
12523b588343O149K86182N78744Q13695Q47966O27377K44202J13595L44776O55635
12513A929978O44400J02039m74371o45673o62082n31865M025N12568O20150N09062
12503B008231J75509j70577k28724k07175k62229j76535j7843p1204l58891n81674
$$ plain form
12571 101167 3816 -487063 -1047627 -1416882 -1444427 -945510 -86438 563688 703463 368348
12561 368348 -269670 -1014773 -1616112 -1789843 -1542151 -1234542 -1053460 -913702 -896272 -1044571
12551 -1044571 -1107189 -946657 -627984 -129220 581201 1318838 1726111 1744635 1747149 1947472
12541 1947472 2351488 2803061 3231337 3569050 3675777 3560682 3337382 3098910 2728768
12532 2728768 2037334 993702 68703 -452229 -764789 -1152814 -1718925 -2275940 -2588343
12523 -2588343 -2582194 -2296012 -1717268 -903573 -55607 571770 815972 929567 1274343 1929978
12513 1929978 2574378 2676417 2202046 1556373 894291 362426 366451 879019 1499169 2008231
12503 2008231 2183740 2013163 1784439 1577264 1315035 1138500 1120657 1049453 690562 108888
12493A08888m36391P7499N62427M13309k3965j3604L12980L46783M088l62140
12483I89874n97103o59362n00969k02784L2582L10154O66489P49349N40217K15194
12473A543641o9137k41314l34000l50260k71387n2544K38450L36542J24056n4777
12463H69270J1060J35076J73810M6777j84262l28512k32740n5116p8185l1740
12453C25438J90699K11300M0102m3504l4008j0801k1773j69217l02108k17011
12443c0883j50425j72196j34971L8578J62408K51935M28913N88381M38572J11142
12433A531454o5241j98408k73403k96282m54101n00913j48041K00677J31953j51590
12423b23895k13482R8011M98487Q19599R23001N89486K49831L19216M53605K42682
$$ plain form
12493 108888 -327503 -250004 312423 725732 701767 688163 1001143 1347926 1352014 989874
12483 989874 392771 -266591 -767560 -970344 -937762 -627608 38881 788230 1328447 1543641
12473 1543641 1474504 1233190 899190 548930 277543 224999 463449 799991 924047 869270
12463 869270 880330 1015406 1189216 1235993 1051731 723219 490479 435363 357178 325438
12453 325438 516137 727437 767539 724035 690027 679226 657453 488236 186128 -30883
12443 -30883 -181308 -353504 -488475 -449897 -287489 -35554 393359 981740 1420312 1531454
12433 1531454 1466213 1267805 994402 698120 244019 -256894 -404935 -204258 -72305 -223895
12423 -223895 -437377 -339366 159121 978720 1901721 2491207 2741038 3060254 3513859 3756541
12413C756541k02815l59729j05741R1042j05169m24848o08390o70801o52013o00260
12403A17817n69173n30990m49172m35588k34496L24908P35325O98278M09069J47555
12393B13533J87453L62876M19660J80144l51758q60189j187422j400691j231846
12384c668240n08254J23346N26442Q74253J159637J185125O87934J57027j24221
12375D13049l85156m11885j88334R0465L95809O59634P63950O80625M66776J36234
12365B621167k73531m46493j99817J14789J76345j5944l00268n31473p89011r34415
12355e78651p03683m45486k99235j911N48535J031939J055665P70315N21037K45538
12345B144063o9152k86123m43473l07611K57560O49853M82617K31589K76785L76951
$$ plain form
12413 3756541 3553726 3193997 3088256 3179298 3074129 2649281 2040891 1370090 718077 117817
12403 117817 -451356 -982346 -1431518 -1867106 -2101602 -1776694 -1041369 -343091 65978 213533
12393 213533 400986 763862 1183522 1363666 1011908 151719 -1035703 -2436394 -3668240
12384 -3668240 -4176494 -4053148 -3526706 -2652453 -1492816 -307691 380243 537270 413049
12375 413049 27893 -383992 -572326 -481861 -86052 573582 1337532 2018157 2484933 2621167
12365 2621167 2347636 1901143 1701326 1816115 1992460 1976516 1676248 1144775 355764 -578651
12355 -578651 -1282334 -1727820 -2027055 -2028966 -1480431 -448492 607173 1377488 1898525 2144063
12345 2144063 2074911 1788788 1345315 1037704 1295264 1945117 2427734 2659323 2936108 3313059
12335C313059M67225L84686j93085o15984l76558O0539K62356J73223J0363j34910
12325C350914k62121l67181k64810M4637L06725L41239J19188k96428n16551m02260
12315B053352l37783m39454n73937n15961j66780J17933k5351l05502m06969l15840
12305i16292k83596l06202j41575J98818O34751R29348Q40136M21612j51007o80149
12295E45844j026512j139413q56664k63826K59684N02854M44621J87772M5713
12286a299927J18296L43195N08176L70043N1363q1183j25186j81888j27814J08
12276d24817J33914K81254M06618L16904J5105l03823n15025l28440J66031M20565
12266A68286K58145o8293m17752m16378n6795m728j95368K1637N77782P79694
$$ plain form
12335 3313059 3780284 4164970 3971885 3355901 2979343 3039882 3302238 3475461 3485824 3350914
12325 3350914 3088793 2721612 2456802 2501439 2808164 3149403 3268591 2972163 2455612 2053352
12315 2053352 1715569 1276115 702178 186217 19437 137370 112019 -193483 -600452 -916292
12305 -916292 -1199888 -1506090 -1647665 -1448847 -814096 115252 955388 1377000 1225993 545844
12295 545844 -480668 -1620081 -2476745 -2740571 -2480887 -1978033 -1533412 -1345640 -1299927
12286 -1299927 -1181631 -838436 -330260 39783 91146 9963 -115223 -297111 -424925 -424817
12276 -424817 -290903 -9649 396969 713873 728978 425155 -89870 -418310 -252279 168286
12266 168286 426431 358138 -59614 -475992 -532787 -537515 -732883 -711246 -133464 646230
12256F46230N34007K24973k7834j72011j86763j08991J7801P8121j2421j91427
12246H01685l95861o03629o24396l15236L27947Q84430Q27512K62676k26710l74776
12236E63642n35234q10365r31748q54436n50289o1106L97278O39567P63275Q31148
12226e48268P43078L71636l41766r92265j001163m09309K80428Q02990J278053
12217A83414J474425J157978O16987J55179k32548n71059q53191r54777n73373
12208D03035j1101K86688K98975J4648m43684n97005k89830Q0570L97660N47961
12198F87917L51760J7344k01539j92653L6514L23561M24589K57817m2001k00429
12188A462880j11860N2470J19309R0922Q6063n5138m36875p90936q53564p88903
$$ plain form
12256 646230 1180237 1405210 1377376 1205365 1018602 909611 927412 1005533 993112 801685
12246 801685 405824 -197805 -822201 -1137437 -809490 74940 902452 1165128 938418 563642
12236 563642 28408 -781957 -1713705 -2568141 -3118430 -3179536 -2782258 -2142691 -1379416 -548268
12226 -548268 194810 566446 224680 -767585 -1768748 -2178057 -1897629 -1094639 183414
12217 183414 1657839 2815817 3432804 3587983 3355435 2784376 1931185 976408 403035
12208 403035 391934 678622 977597 992245 548561 -48444 -338274 -257704 139956 687917
12198 687917 1039677 1057021 855482 662829 699343 1022904 1447493 1705310 1663309 1462880
12188 1462880 1351020 1403490 1522799 1613721 1699784 1644646 1207771 416835 -436729 -1225632
12178a225632q10672o95120k37793L47651O41949N04586K04473p201j08199j31662
12168a517620J8497M45493N71261L15409J55767J27007J50606K45608J79277Q4463
12158G75768o1928m04373m46742k20177k11922l98360l85234j04691Q8232J06887
12148a262540N6069m7956n0334j3905p5996j84890k92802l01723j56064q725J34937
12137b203929K83457M21462M79972L14549J47233K07053K51643P7677j50257k11456
12127c82596j94298R9074O12113O96438J34250l56701k49931P7792J1399k90643
12117A56897m25026k24719J21675K81696Q6442k86274l97151k38582q6515p6743
12107a088300r4286j29561k84594l89912p7791M62001N49481K80257J74701K46738
$$ plain form
12178 -1225632 -2036304 -2731424 -2969217 -2621566 -1979617 -1475031 -1270558 -1277759 -1385958 -1517620
12168 -1517620 -1499123 -1053630 -482369 -166960 -11193 115814 266420 512028 691305 775768
12158 775768 713840 309467 -137275 -357452 -569374 -967734 -1352968 -1457659 -1369427 -1262540
12148 -1262540 -1206471 -1254427 -1304761 -1318666 -1394662 -1579552 -1872354 -2174077 -2330141 -2338866 -2203929
12137 -2203929 -1920472 -1499010 -1019038 -704489 -557256 -350203 -98560 -20883 -171140 -382596
12127 -382596 -576894 -477820 134293 830731 964981 608280 358349 436141 447540 156897
12117 156897 -268129 -492848 -371173 -89477 -3035 -289309 -686460 -925042 -1011557 -1088300
12107 -1088300 -1182586 -1312147 -1596741 -1986653 -2064444 -1602443 -1052962 -772705 -598004 -351266
12097c51266K5770o55411j117412j047827p02986j92960K96087L36612J68602
12088c240791L91179N94887N05176N75231O90249K77790m06031r65228j363573
12079b941111j316632p46665j40968R7990M66478J119394J521062J654960J626012
12070A340520J178706M48433j58557m52940n97592o69883n01092k13571M5447
12061D19471K87998N04126M60218J04605j77001p3151K25346M37405M89944K70533
12051B949494l26320q03484r44476r66118n65355J87152Q05192J093194J022876
12042B452155N10587l09940q37882q17260n51596l07705q99K40446K02374J05169
12032F85449N0885j29508l45045k93339R7986N40459P03239L62450l29545q49157
$$ plain form
12097 -351266 -325496 -980907 -2098319 -3146146 -3849132 -4042092 -3746005 -3409393 -3240791
12088 -3240791 -2849612 -2254725 -1749549 -1174318 -484069 -206279 -612310 -1577538 -2941111
12079 -2941111 -4257743 -5004408 -5145376 -5047386 -4580908 -3461514 -1940452 -285492 1340520
12070 1340520 2519226 2967659 2809102 2356162 1758570 1088687 587595 374024 419471
12061 419471 707469 1211595 1671813 1776418 1599417 1526266 1751612 2189017 2678961 2949494
12051 2949494 2623174 1819690 875214 -90904 -656259 -469107 336085 1429279 2452155
12042 2452155 2962742 2652802 1814920 997660 446064 138359 137460 377906 580280 685449
12032 685449 736334 606826 261781 -31558 66428 606887 1310126 1672576 1343031 493874
12022D93874r68383r10274p68275n47249m07794m00996m87246m06975j26107J92619
12012d336806M47328M94168M00950M35037M45287K41890m2759k16942j32911J42330
12002b122428M50753P56826R46378R28881O59844J09173l01161k20529j84606
11993A023131k93876j49978J96539N72799P66286M14109k83920n91539m86485
11984A167066m08964m30128o25980p20371m80772j88803L7620M26373R55206J084798
11974H16045O32321J07120k82241m87895m58557l19129j64810j51225k75891k97014
11964h81276q2561J43439Q0722k00012m47541m66888k26726L09533P74701O84973
11954c11636L21424J14258L9359O8495Q2488J63491L08489L10486K17703P2303
$$ plain form
12022 493874 -474509 -1384783 -2153058 -2700307 -3108101 -3509097 -3996343 -4403318 -4529425 -4336806
12012 -4336806 -3889478 -3395310 -2994360 -2559323 -2114036 -1872146 -1914905 -2131847 -2264758 -2122428
12002 -2122428 -1671675 -914849 31529 960410 1620254 1729427 1428266 1207737 1023131
11993 1023131 729255 579277 775816 1348615 2114901 2529010 2245090 1653551 1167066
11984 1167066 758102 327974 -298006 -1018377 -1499149 -1687952 -1650332 -1223959 -268753 816045
11974 816045 1448366 1555486 1273245 785350 326793 7664 -157146 -308371 -584262 -881276
11964 -881276 -963837 -820398 -739676 -939688 -1387229 -1854117 -2080843 -1771310 -996609 -311636
11954 -311636 9788 124046 163405 231900 314388 477879 786368 1096854 1314557 1386860
11944A386860q0353k02737l85727m87562k99521j57079k79979l36520k19040M5933
11934a015725K48518L43167L71686K50869P8812j90197l98344m13168l22646j51305
11924a198333J66989L50528K85297L85671M77237L61301J99458J04002K4054k63491
11914H92713m66828l17769m1441L1144j19043l16025l30892j58945j34110k93361
11904a254557o12448j051034j175839q66440l41127J69891M90340N45985L52396
11895c742833K74929O18207R70227R05382O20318L06656L0938l1215J53691M78076
11885E84376O68972N67967K64813n7028k36889l93287n20210n26421n49264n14573
11875g11544m15263k85866J538L41257L48664P3046o7530L9560M44579Q01859
$$ plain form
11944 1386860 1306507 1103770 718043 230481 -69040 -226119 -506098 -842618 -1061658 -1015725
11934 -1015725 -767207 -424040 -52354 198515 277327 87130 -311214 -724382 -1047028 -1198333
11924 -1198333 -1031344 -680816 -395519 -9848 467389 828690 1028148 1132150 1156204 892713
11914 892713 425885 108116 66675 97819 -21224 -337249 -668141 -827086 -961196 -1254557
11904 -1254557 -1867005 -2918039 -4093878 -4960318 -5301445 -5131554 -4641214 -4095229 -3742833
11895 -3742833 -3467904 -2849697 -1879470 -974088 -353770 -47114 -16176 -47391 106300 584376
11885 584376 1253348 1821315 2086128 2029100 1792211 1398924 878714 352293 -196971 -711544
11875 -711544 -1126807 -1412673 -1411135 -1069878 -721214 -648168 -715698 -676138 -231559 570300
11865E70300O45127L20001J49869J19203Q3011o0234K3860K91268M37602L64192
11855B944199N811l68911l55427m3310Q6596L9204K00254L20719l1338o01935
11845B195862r00044p83193l91939O1081L40968M09911K88626J21798q210j31509
11835A203351j41759q289j7344j41842j68523k39057l12356k06799R2619M56278
11825E16279M87263J60396l70151p56809q29244p01776m27793M202L12970L80338
11815a224325L79447L08042L30784M67855N62292M67146N3849m21871o40621o74382
11805c91784p08760q53775r18624p45118l99572N5445M95858P78679P34423M43710
11795a509518J99747J23265J37819J28533J59702N1603m12936r34997r37662m52588
$$ plain form
11865 570300 1215427 1535428 1685297 1804500 1887511 1827277 1851137 2142405 2580007 2944199
11855 2944199 2950010 2581099 2225672 2182362 2268958 2308162 2508416 2829135 2797797 2195862
11845 2195862 1295818 512625 120686 181767 522735 932646 1221272 1343070 1334860 1203351
11835 1203351 1061592 1053303 1035959 894117 725594 486537 174181 -32618 60001 516279
11825 516279 1003542 1163938 793787 36978 -792266 -1494042 -1921835 -1917633 -1604663 -1224325
11815 -1224325 -844878 -536836 -206052 261803 824095 1291241 1345090 923219 282598 -391784
11805 -391784 -1100544 -1954319 -2872943 -3618061 -4017633 -3962188 -3466330 -2687651 -1953228 -1509518
11795 -1509518 -1309771 -1186506 -1048687 -920154 -760452 -708849 -1121785 -2056782 -2994444 -3447032
11785c447032J34254M92745N45585L73961J41411Q3235J72882K55798J86265N5143
11775a005753j594K07968N35674O20164N01713K64666j51911n01346n01072m38919
11765d70410l93077j92174J44364M27734L03250l9601j9139L50726P92264Q93058
11755A796995M86445o1447m74653p43616j015194j363040j454571j217222q32334
11746d878637m28739K05835P99459J029767R60890N47998K11426N541j09614j63452
11736a819526k49767j58335J37281K43882K49087K05677J09733N26146J238361
11727D82539J462651J072727L37351k85856m79857l00150k70341n83432p23219
11718G12413m32907k68856n50102p58516m27381K08988M64549J62235l38385o08644
$$ plain form
11785 -3447032 -3312778 -2820033 -2274448 -1900487 -1759076 -1675841 -1502959 -1247161 -1060896 -1005753
11775 -1005753 -1007347 -799379 -263705 356459 858172 1122838 970927 469581 -31491 -470410
11765 -470410 -863487 -1055661 -911297 -483563 -180313 -219914 -239053 111673 903937 1796995
11755 1796995 2283440 2221993 1747340 1003724 -11470 -1374510 -2829081 -4046303 -4878637
11746 -4878637 -5307376 -5101541 -4302082 -3272315 -2311425 -1763427 -1552001 -1546460 -1656074 -1819526
11736 -1819526 -2069293 -2227628 -2090347 -1846465 -1597378 -1391701 -1281968 -755822 482539
11727 482539 1945190 3017917 3355268 3069412 2589555 2289405 2019064 1435632 712413
11718 712413 279506 10650 -539452 -1297968 -1725349 -1516361 -1051812 -889577 -1227962 -1836606
11708a836606l92264J60670N72028O13597N41061O62235P95226O48681K02482
11699A967110k01230j85163j12425m22924n66101j03329M66737O43771O87979
11690B174425N64211J45334j37586R0329N88484O06222K20392j12461l67372o43508
11680C128470r21409r45738p82578o58274m69807k22791q0762k12406n31753p79078
11670b476126r08692q56201n83958k50316l4277J08737L38532M07826L13200K54687
11660c686588L28309K63975j81013n22872k93887K53912N70557N48644L98865
11651b320098K96480J43416j18093k85611k45246j70483j33954j5782M58327J057813
11641a333231J139114Q20522N12614O07891Q82577P12603K76765n131j28333j38606
$$ plain form
11708 -1836606 -2228870 -2068200 -1496172 -882575 -341514 320721 1115947 1764628 1967110
11699 1967110 1765880 1580717 1468292 1045368 479267 375938 842675 1486446 2174425
11690 2174425 2738636 2883970 2746384 2836713 3425197 4031419 4251811 4139350 3771978 3128470
11680 3128470 2207061 1261323 478745 -179529 -649336 -872127 -952889 -1165295 -1697048 -2476126
11670 -2476126 -3384818 -4241019 -4824977 -5075293 -5109570 -5000833 -4662301 -4254475 -3941275 -3686588
11660 -3686588 -3358279 -3094304 -3275317 -3798189 -4092076 -3838164 -3267607 -2718963 -2320098
11651 -2320098 -2023618 -1880202 -1998295 -2283906 -2529152 -2699635 -2833589 -2849371 -2391044 -1333231
11641 -1333231 -194117 626405 1139019 1746910 2629487 3342090 3618855 3613724 3485391 3346785
11631C346785k9830n0216l47780o60933o75387m01057m2165K77892O54879P98212
11621B870400N11241J91012m0401k30324k69604j03987j33930l73876m60061m79070
11611A481400o29415o16704l36780k01703k02288j73834k21799m20001o86811
11602b007935p66072n67178k31102J73711N36560P52718O84796M93322L35273
11593e95907K65930K89015K93250L40411N16908N96600L70868M6566j63732l06470
11583A653439m73630o48293n23038j64367N4324P6572J0966K2164J85850K76227
11573D70214O6532k70185m01556k88760Q71K06399M2359j83164p9392J83093M98044
11562B44455R10559J070898P79409M82050K82746j28936p04293j140325j195952
$$ plain form
11631 3346785 3316955 3266739 2918959 2258026 1582639 1181582 1139417 1417309 2072188 2870400
11621 2870400 3381641 3572653 3532252 3301928 3032324 2928337 2794407 2420531 1960470 1481400
11611 1481400 851985 235281 -101499 -303202 -505490 -679324 -901123 -1321124 -2007935
11602 -2007935 -2774007 -3341185 -3572287 -3398576 -2862016 -2109298 -1424502 -931180 -595907
11593 -595907 -329977 -40962 252288 592699 1109607 1706207 2077075 2123641 1959909 1653439
11583 1653439 1179809 531516 8478 -155889 -101565 -24993 -14027 8137 193987 470214
11573 470214 536746 266561 -134995 -423755 -422884 -216485 -174126 -357290 -436682 -253589 244455
11562 244455 1155014 2225912 3005321 3487371 3770117 3641181 2936888 1796563 600611
11553F00611q51862m18512j13364J83424M29003M69164L26678K00096J73997n4987
11543I44248n68640q80913q37366o56540m58275l04958k36158k24975q8238K78807
11533c033008O37135N85555L16347J27904J04470M15032P74854P10293M07677
11524A046259J87187N5151N2244j73908n42625n80536m77212n46613p16382n54487
11514b250922o5001L06154L86484K56497O2750O7375K84126M36188L87105J43374
11504A4130k18140m58263m60054m11699m08468l82737j48901K30307L56926L54063
11494a532836M98798L95291M4737k7570K12450L81055L01455K2776j19058j03923
11484G3175j73814j52619Q9343K47443M74810P69598O90270L50021j23358m66807
$$ plain form
11553 600611 -251251 -669763 -783127 -599703 -170700 298464 625142 825238 999235 944248
11543 944248 375608 -505305 -1342671 -1999211 -2457486 -2762444 -2998602 -3223577 -3311815 -3033008
11533 -3033008 -2395873 -1810318 -1493971 -1366067 -1261597 -846565 -71711 638582 1046259
11524 1046259 1233446 1288597 1340841 1166933 624308 43772 -433440 -980053 -1696435 -2250922
11514 -2250922 -2315923 -2009769 -1623285 -1366788 -1304038 -1236663 -952537 -516349 -129244 14130
11504 14130 -204010 -662273 -1122327 -1534026 -1942494 -2325231 -2474132 -2243825 -1886899 -1532836
11494 -1532836 -1034038 -638747 -594010 -621580 -409130 -28075 273380 296156 177098 73175
11484 73175 -100639 -253258 -163915 83528 558338 1327936 2018206 2368227 2244869 1778062
11474A778062l16008J62632O17233P59545M39853m2099l96244m66147j73295K12264
11464B575796L72318K23994o5055m16213p16050n41149K12980O28293J37801l48348
11454B064367m38419n34937p73786j037128j060805r51382r63381j061867j663562
11445f420900k234757r35868J475103K457041J798756P60090o5088k40213J03120
11436c302716L99115M88843N25558O33359O12933K65558k54781n33447l03751
11427a469329M9751J09341q5213j45653K5390R6787K67371O51124O89086L26490
11417E15145l6006k91453m82766o80498n34450P0770N21167O54163P47410O70946
11407A154428J46895m42640n70880m33961m23140n74078o69656o04748k81831
$$ plain form
11474 1778062 1462054 1624686 2241919 3001464 3441317 3399218 3002974 2536827 2363532 2575796
11464 2575796 2948114 3172108 3107053 2690840 1974790 1433641 1646621 2274914 2412715 2064367
11454 2064367 1625948 1091011 317225 -719903 -1780708 -2732090 -3695471 -4757338 -6420900
11445 -6420900 -8655657 -9591525 -8116422 -5659381 -3860625 -3100535 -3165623 -3405836 -3302716
11436 -3302716 -2903601 -2414758 -1889200 -1255841 -642908 -377350 -632131 -1165578 -1469329
11427 -1469329 -1419578 -1310237 -1395450 -1541103 -1515713 -1418926 -1151555 -500431 188655 515145
11417 515145 479139 187686 -295080 -975578 -1510028 -1439258 -918091 -263928 483482 1154428
11407 1154428 1301323 858683 287803 -146158 -569298 -1143376 -1813032 -2417780 -2699611
11398b699611K2876L71595Q93725J077670P66198K62548m1042n204J96354M86705
11388A331814N47871J98959k03198m34794n27307n33060m17735j73383R7844K31380
11378A18391J30935p83M5371L41766P36757P47271L63018J8796q7308J01509L04244
11367B819967J43391k46392m34878n09731o28824n09329p4259K89571J85810j86408
11357H48918n08483o23214m15968K247K72560J95498Q9179R3308R4520Q1434J28169
11346B58168K88470K76778p5386m45431m88168m19825n23813m61550M4478N76557
11336i69722O49608L72029R5972J8870O7556J62239K74528K84994M97345J035967
11326B489386J228905O60290m40832j335695j568573j471209j144766n49028O0742
$$ plain form
11398 -2699611 -2676735 -2305140 -1411415 -333745 432453 695001 653959 648755 845109 1331814
11388 1331814 1879685 2078644 1875446 1440652 913345 380285 -37450 -210833 -112989 118391
11378 118391 249326 248543 293914 635680 1372437 2119708 2482726 2501522 2414214 2515723 2819967
11367 2819967 2963358 2716966 2282088 1772357 1143533 634204 559945 849516 1035326 848918
11357 848918 340435 -282779 -698747 -696500 -423940 -228442 -139263 -45955 48565 129999 258168
11346 258168 546638 823416 748030 302599 -185569 -605394 -1129207 -1590757 -1546279 -969722
11336 -969722 -320114 51915 147887 166757 234313 396552 671080 956074 1453419 2489386
11326 2489386 3718291 4378581 3937749 2602054 1033481 -437728 -1582494 -2131522 -2070780
11317b070780N50860R46642J201153J059701N43011J32425j00291l94690o44986
11308A223045q14967o08414j14219K09531M63766N53451K13140l52848m93397
11299B79088j49800o4622k18375l50212n11913k24926M35015P16189O93950P44117
11289A348511O45278K22625k08039l37670l20577k96277k92823k60917p4200J70070
11279E95981J35184l22695p16219o88684o93437q06991n96226p4849L06780L18626
11269b542530K59525K82054J42074n0839r5047j60760l11352l26631k28698j19007
11259c151211n7503J4196J25182J36849M3639l3243l304j85856n40244n25867
11249d177362J363P54693J260156J350659R88839L22955j54545k05170Q1254M16775
$$ plain form
11317 -2070780 -1519920 -573278 627875 1687576 2230587 2363012 2262721 1868031 1223045
11308 1223045 408078 -200336 -314555 -105024 358742 912193 1125333 772485 279088
11299 279088 129288 64666 -153709 -503921 -1015834 -1240760 -805745 -89556 604394 1348511
11289 1348511 1993789 2216414 2008375 1670705 1350128 1053851 761028 500111 425911 595981
11279 595981 731165 408470 -307749 -996433 -1689870 -2496861 -3093087 -3167936 -2861156 -2542530
11269 -2542530 -2283005 -2000951 -1858877 -1909716 -2004763 -2165523 -2476875 -2803506 -3032204 -3151211
11259 -3151211 -3208714 -3194518 -3069336 -2932487 -2888848 -2922091 -2925395 -3111251 -3651495 -4177362
11249 -4177362 -4175999 -3421306 -2161150 -810491 178348 501303 346758 141588 222842 639617
11239F39617M26570L19739M06527L38861L443k99653l74153k72198j93532l07147
11229F88074p16030j066361n65113O25248J365905J314829Q54298L01644j67814
11220B634680l80273l48036k60279j97290k21149l04982j68025j6584k7949M8502
11210G58615L16926L73784p3945n60291m50799J17039N39416N72711K94134j4328
11200A873262l06076p56364r82465o03646j0650K98295K60107j0285k59979l13616
11190h11417k44562k10771j41545q0104l2847P3261J77415L38441M00297K92949
11180b38883J99134K56274L59447K17174j52803l40293q1953L07874L80840K81579
11170A188390K01284l2983m22448n71151n39821l04989J23087L56322K76024J66671
$$ plain form
11239 639617 1066187 1385926 1792453 2131314 2134757 1835104 1460951 1188753 995221 688074
11229 688074 -27956 -1094317 -1659430 -1034182 331723 1646552 2500850 2802494 2634680
11220 2634680 2254407 1906371 1646092 1448802 1227653 922671 754646 738062 710113 758615
11210 758615 1075541 1449325 1375380 815089 364290 481329 1020745 1593456 1887590 1873262
11200 1873262 1567186 810822 -171643 -775289 -785939 -487644 -227537 -237822 -497801 -811417
11190 -811417 -1055979 -1266750 -1408295 -1488399 -1521246 -1447985 -1270570 -932129 -531832 -238883
11180 -238883 -39749 216525 575972 793146 640343 300050 218097 525971 906811 1188390
11170 1188390 1389674 1356691 934243 363092 -176729 -481718 -358631 -2309 273715 440386
11160D40386J90218J48598k86186q08147o84170r5826J81232J18953J79678M51601
11150a63663P14827P38424K17684p61741j412720j162712n59146m51182n18271
11141c358500k47357M9188L08024O38137J007904J188464Q31529R2073o49037
11132a39575p25178J00356J017339J121505N30227k85747r14772r90880p62246
11123a048971n93116k18036K93746M78954M53893M27699L21167K65052L67845
11114G48233M45870M24048P9600o40562j048595q43458l94365j44155j72244j67448
11104a713076j38422j22697k72051l63548j15721K48848N06321M69870K48928
11095a251548L0660j43508j31651R9075L38031L35756J20279j25789l89451o79045
$$ plain form
11160 440386 630604 779202 493016 -315131 -999301 -1095127 -913895 -794942 -615264 -163663
11150 -163663 551164 1289588 1507272 745531 -667189 -1829901 -2389047 -2840229 -3358500
11141 -3358500 -3605857 -3556669 -3248645 -2610508 -1602604 -414140 417389 509462 -139575
11132 -139575 -864753 -764397 252942 1374447 1904674 1618927 704155 -286725 -1048971
11123 -1048971 -1642087 -1860123 -1566377 -1087423 -633530 -205831 115336 380388 748233
11114 748233 1194103 1618151 1697751 1057189 8594 -834864 -1229229 -1373384 -1545628 -1713076
11104 -1713076 -1851498 -1974195 -2246246 -2609794 -2725515 -2476667 -1970346 -1500476 -1251548
11095 -1251548 -1220888 -1364396 -1496047 -1396972 -1058941 -723185 -602906 -728695 -1118146 -1797191
11085a797191o79872k27890M63438P19321L65057O1453L7104J42931L49276L96126
11075a70247K08725M874M2871J50935M2459j00909J2204J11480p4614k29026j53108
11064a54356J87307L59771J63218R9555K70868J77517l25556p63856n78690p358
11054e71580M05267M51567L24322R7742j99140k29866k0305O7146J03007J15886
11044E44046M1875J21075M21942Q77503J139438P85020M1818o35588p22899k47507
11034B366723J71993K34687J62866n6338l79061m86459m92373m60539l32269k97156
11024D32074l26902j71406K4782K9985k31688n19010m82359k95226j45861N0636
11014a634975K57568O51075R26571P30547L56964j00764m58992k99753q417L736
$$ plain form
11085 -1797191 -2477063 -2704953 -2241515 -1522194 -1157137 -1095684 -1058580 -915649 -566373 -170247
11075 -170247 38478 43352 86223 237158 279617 178708 190912 302392 227778 -1248 -154356
11064 -154356 32951 392722 555940 655495 926363 1103880 778324 14468 -564222 -571580
11054 -571580 -166313 285254 609576 707318 508178 278312 258007 325153 428160 544046
11044 544046 585921 706996 1128938 2006441 3145879 3930899 3972717 3337129 2614230 2366723
11034 2366723 2538716 2773403 2936269 2879931 2500870 2014411 1522038 1061499 729230 432074
11024 432074 105172 -66234 -41452 -11467 -243155 -762165 -1244524 -1539750 -1685611 -1634975
11014 -1634975 -1377407 -726332 200239 930786 1287750 1186986 727994 428241 419824 423560
11004D23560q8625J01862K95927M1213l99435p22639q51530n29099J05779O18194
10994a004793Q41727P10329N52317N51621L85995J88550Q5069o3522j23801q3037
10984B040455k17797n30548o00588m58763k92831j03305J26544K46321J09079
10975C18567l507J15859M01208M82433J51347k46571m02165m25398n94271p43876
10965i46374n23748q0666K04871M35779N67843L90791J20051P5756L20447N38739
10955A103489L97098k8550k30133l2918J94118Q4092q7338m8519k03401k95623
10945H52315O405J23015l03125p41412p91948o61679o48609o02950l46351j66337
10935c280676J69560N68264O04980L53334J07474j7557o7893N6744L68586N96408
$$ plain form
11004 423560 334935 436797 732724 773937 374502 -348137 -1199667 -1728766 -1622987 -1004793
10994 -1004793 -163066 547263 1099580 1651201 2037196 2225746 2310815 2247293 2123492 2040455
10984 2040455 1822658 1292110 691522 232759 -60072 -163377 -36833 209488 318567
10975 318567 315060 430919 832127 1314560 1465907 1219336 817171 391773 -202498 -946374
10965 -946374 -1470122 -1550788 -1345917 -910138 -342295 48496 168547 244303 564750 1103489
10955 1103489 1500587 1472037 1241904 1208986 1403104 1487196 1399858 1351339 1147938 852315
10945 852315 858720 981735 678610 -62802 -854750 -1516429 -2165038 -2767988 -3114339 -3280676
10935 -3280676 -3111116 -2542852 -1937872 -1584538 -1477064 -1494621 -1562514 -1505770 -1137184 -540776
10925e40776N93085N44981M97149L23789L0480j01246Q8568L93410M23227k4879
10915B227788n92018n80747M2598N35176O29407O24827M52520J20107k08265m35941
10905B815452n69129p59014r79586j000411q65312m31202J76143N65006Q11556
10896b36497J030057R98218O00466L23617L36968J41171k71667m19439k99785
10887B203109l06502m21387l82668l80884n54969o59494n93653l17420K96642
10878a117226P16605N77187J99492R5876M99758Q72186Q25371M43603K6781l83838
10868B755795q03778q21158o07823m71802l80569l14958j08784K15160L77707
10859a60210M25612O44407R35000P98278L13292N226j85828l74177m48103m48580
$$ plain form
10925 -540776 52309 597290 1094439 1418228 1448708 1347462 1436030 1829440 2252667 2227788
10915 2227788 1635770 1055023 1097621 1632797 2262204 2887031 3339551 3459658 3251393 2815452
10905 2815452 2246323 1487309 507723 -492688 -1358000 -1789202 -1613059 -1048053 -236497
10896 -236497 793560 1791778 2392244 2715861 3052829 3194000 2922333 2502894 2203109
10887 2203109 1896607 1475220 1092552 711668 156699 -502795 -1096448 -1413868 -1117226
10878 -1117226 -400621 176566 376058 471934 971692 1843878 2669249 3112852 3139633 2755795
10868 2755795 1952017 1130859 523036 51234 -329335 -644293 -753077 -537917 -160210
10859 -160210 265402 909809 1844809 2643087 2956379 2961605 2775777 2401600 1953497 1504917
10849A504917m25586l41106k20452j08231j45834k73651k40634j77487k34018
10840f62082j07709K14005K73125N3562j82032k02665k4993K19153L90358J90240
10830A60962l71047n86607q3919M68048N11616J68593j71205j01398J11822J7230
10820A24095k63201l32942j38610l4764j65903l28885l36383k29625j14634J45907
10810a674945L83526M57160M99025M46865M15045M61626K17688k46750l08087
10801F51153M5617M41715N27261J80892j84959m41136n64599l67296l9221K10855
10791D60282K09280K09509L56447J54453k99149m87105l13450J4026J61417p2285
10781C93425m07554l00517K16057N61529N75511M40020N9131l29629m42669l54889
$$ plain form
10849 1504917 1079331 738225 517773 409542 263708 -9943 -250577 -428064 -662082
10840 -662082 -769791 -555786 -282661 -229099 -411131 -613796 -638789 -419636 -29278 160962
10830 160962 -210085 -796692 -880611 -412563 99053 267646 96441 -4957 106865 124095
10820 124095 -139106 -472048 -610658 -645422 -811325 -1140210 -1476593 -1706218 -1820852 -1674945
10810 -1674945 -1291419 -834259 -335234 111631 526676 988302 1205990 959240 651153
10801 651153 696770 1138485 1665746 1846638 1661679 1220543 655944 288648 249427 460282
10791 460282 669562 879071 1235518 1389971 1090822 603717 290267 304293 465710 393425
10781 393425 -14129 -314646 -98589 462940 1038451 1478471 1537602 1207973 765304 410415
10771D10415p8178K43837M38775K85815k97643p32825p16244l96874K8664J14982
10761f99276r6908j65477p5445j60603l15323j80612K38272O84150R41116P69622
10751I39516L63077J79907Q3099j74193m51122m38425k13373j64006l73954m62014
10741g11488k68539o7055j38530j94710J1970L41297N42078M09642O8448p4592
10731h1479j82K02283M05578L55485J11472r1623l32920n60548p67037q87049
10721a646020o40960k22576p646O1505P9385p6111j47533J3460R0076J50541L50650
10710a995229L53623J15739m0131O3687J24249l9715p2122J35475K04184r0034
10700a240274k60977m9360J58438K75092L54410L51916M66167P28091Q22914N13904
$$ plain form
10771 410415 332237 576074 1014849 1300664 1003021 270196 -446048 -842922 -814258 -699276
10761 -699276 -796184 -961661 -1037106 -1197709 -1513032 -1693644 -1455372 -771222 169894 939516
10751 939516 1302593 1482500 1565599 1391406 940284 501859 288486 124480 -249474 -711488
10741 -711488 -980027 -1047082 -1185612 -1380322 -1368352 -1027055 -484977 -75335 -6887 -81479
10731 -81479 -81661 120622 526200 881685 993157 901534 568614 8066 -758971 -1646020
10721 -1646020 -2286980 -2509556 -2517202 -2455697 -2376312 -2452423 -2599956 -2586496 -2496420 -2345879 -1995229
10710 -1995229 -1641606 -1525867 -1565998 -1502311 -1378062 -1417777 -1489899 -1354424 -1150240 -1240274
10700 -1240274 -1501251 -1550611 -1392173 -1117081 -762671 -410755 55412 783503 1606417 2120321
10690B120321J47311K20513O15332P10949K49497m81236q73539p82450p10690
10681A216008q45013p60730l71396J9887K14030L42834N09610N30098K45590l08210
10671G92708q31842r09628m64131q6104J5882O6341n031l22329n76070m82964
10661b803168j88864J5003L37282P58635R01053N22215j27657n15373o20394o09922
10651b331190m38376j67322N1856J79938K38320K23055J39061O5481J66442M81691
10641a391044P10253N45872N8102l87203o05332o93200p04249n38757j87206J72599
10631c020165N40685R28656J173092J066670O17001R7254j09025m8149N9155q2182
10621A222992n79679q05109m67850r3226R0756K28451L74863N05816M19497R4473
$$ plain form
10690 2120321 2267632 2488145 3103477 3814426 4063923 3582687 2709148 1926698 1216008
10681 1216008 370995 -389735 -761131 -741244 -527214 -184380 325230 855328 1100918 792708
10671 792708 -39134 -948762 -1412893 -1498997 -1483115 -1416774 -1421805 -1744134 -2320204 -2803168
10661 -2803168 -2992032 -2977029 -2639747 -1881112 -980059 -457844 -585501 -1100874 -1721268 -2331190
10651 -2331190 -2769566 -2936888 -2885032 -2705094 -2466774 -2243719 -2104658 -2039177 -1872735 -1391044
10641 -1391044 -680791 -134919 -76817 -464020 -1069352 -1762552 -2466801 -3005558 -3192764 -3020165
10631 -3020165 -2479480 -1550824 -377732 688938 1305939 1403193 1294168 1246019 1305174 1222992
10621 1222992 643313 -161796 -629646 -722872 -632116 -403665 -28802 477014 896511 990984
10611I90984l13943o53656o54954l47724j64261k23584k04044P9886L61077M93315
10601f36904M39060K26896M563k89014l96650j98834J03344L29123J49976o0094
10591c28534J12086K02828q6703n05312o51071n11369l23184q1173J94872L63950
10581a613610L56677K85990J54468j5705r159J61085J20505j1523J6626R4229
10571d60417K61784N66532P86057N57874j3727l40204j30190K69431K25325k61093
10561A461372m99346l99335k97158j15496L33025P07782O44789K35861n7306j70813
10551A843375l57898o90517r50907r31286n46702k7275J35207J13610L19079M68692
10541f24622K42060m6826p1007M1630J14695J02336J74384J56907j34840k80493
$$ plain form
10611 990984 677041 23385 -631569 -979293 -1143554 -1367138 -1571182 -1491296 -1130219 -636904
10601 -636904 -197844 29052 33615 -255399 -652049 -850883 -747539 -418416 -268440 -328534
10591 -328534 -216448 -13620 -100323 -605635 -1256706 -1768075 -2091259 -2172432 -1977560 -1613610
10581 -1613610 -1256933 -970943 -816475 -832180 -841339 -680254 -559749 -571272 -554646 -460417
10571 -460417 -198633 367899 1153956 1711830 1698103 1357899 1227709 1497140 1722465 1461372
10561 1461372 962026 562691 265533 150037 483062 1190844 1835633 2071494 2014188 1843375
10551 1843375 1485477 794960 -155947 -1087233 -1633935 -1661210 -1526003 -1412393 -1093314 -624622
10541 -624622 -382562 -429388 -500395 -458765 -344070 -241734 -67350 89557 -45283 -325776
10531c25776J3961N68341J053654J017927M25157j78056o03664p66380o51580
10522E53584m06764l24216o68322r02017o20398n9827M10820N93980O26843N61885
10512b34432L31186P8521j11141j73414j80706o9867J82570J43515k08573m75909
10502g18250o20811n06612q5799L9927j41162k31983j88016k1749P7696J09819
10492b286940L37006N06699M24770J95496o5396j89041p8040J24153K97776K38022
10482d95495j06043l51091l21905j46977n2905o7902J5669K9685j04024k46677
10472a847665k01582K98192R79861J303925J297160J094170P04493P4910o13099
10463C090365q19137m40821J84668M88563J80344j67635j72270j43579k60920
$$ plain form
10531 -325776 -311815 256526 1310180 2328107 2753264 2575208 1971544 1205164 553584
10522 553584 146820 -177396 -845718 -1747735 -2368133 -2427960 -2017140 -1423160 -796317 -234432
10512 -234432 96754 175275 64134 -109280 -289986 -359853 -177283 -33768 -242341 -718250
10502 -718250 -1339061 -1845673 -1931472 -1891545 -2032707 -2264690 -2452706 -2474455 -2396759 -2286940
10492 -2286940 -1949934 -1443235 -1018465 -822969 -888365 -1077406 -1155446 -1031293 -733517 -495495
10482 -495495 -601538 -952629 -1274534 -1421511 -1474416 -1542318 -1526649 -1496964 -1600988 -1847665
10472 -1847665 -2049247 -1751055 -771194 532731 1829891 2924061 3628554 3703464 3090365
10463 3090365 2271228 1830407 2015075 2503638 2683982 2516347 2344077 2200498 1939578
10454A939578m65863n35125l86800l18212m99207n70100l23180M4210K57107J70464
10444f87128M0905L2744M8732J08762K17240K33559J37008R3888J63155J25306
10434E14171j24086k70820l21363n32841p13584n39366l23232k09229o4113L2166
10424b552297K61980N36091N67930L95861K88956L76756N51654O01294N46683
10415A574908M28255O6123l15265m78778m80529m76871n75788o22921l91027J496
10405a270397K56149L01252K79149L49759M14998L62516K51735K9288j94550p5695
10395G04204L54433O89612Q38243Q38594N57747K87208K00021J57599q0390l23452
10385D223819k01519l7731k22173n35177o29235n14022n02792o79852p63615m95836
$$ plain form
10454 1939578 1473715 938590 551790 233578 -265629 -835729 -1158909 -1114699 -857592 -687128
10444 -687128 -646223 -613479 -564747 -455985 -238745 -5186 131822 225710 388865 514171
10434 514171 390085 119265 -202098 -734939 -1448523 -1987889 -2311121 -2520350 -2584463 -2552297
10424 -2552297 -2290317 -1754226 -1186296 -790435 -501479 -124723 426931 1028225 1574908
10415 1574908 2003163 2069286 1754021 1275243 794714 317843 -257945 -880866 -1271893 -1270397
10405 -1270397 -1014248 -712996 -433847 -84088 330910 693426 945161 974449 779899 704204
10395 704204 1058637 1748249 2586492 3425086 3982833 4270041 4470062 4627661 4547271 4223819
10385 4223819 4022300 3984569 3762396 3227219 2597984 2083962 1581170 901318 137703 -358133
10375c58133J7438K58922L62288P34634J014077Q93133N03043n0283l91446m20370
10365B563303m21485m71713m94475m15619k05081L6796K45301M14362M52058K58828
10355A962275j8602o5174p8632j25614m7778j2144r5888k21552n75551q39561
10345a18221m51545J97621L77159J21288j88427m46079o09811n01092j41140K44922
10335a515325N04617M68500J26448l55905p51739p90809m24694J91595P17648
10326a829664Q95461P35485L98716N5100N1100L76871N12034M67384N59862O25854
10316B848203M08170p7921l11780l03977n39386o80723m00877n8447J09774K23986
10306A217022M98838Q51804Q25369L08397k50086l39569o2034K22117L50864P5391
$$ plain form
10375 -358133 -340695 -81773 280515 1015149 2029226 2922359 3425402 3375119 2983673 2563303
10365 2563303 2141818 1670105 1175630 760011 554930 591726 837027 1251389 1703447 1962275
10355 1962275 1943673 1878499 1799867 1674253 1626475 1614331 1518443 1296891 721340 -118221
10345 -118221 -569766 -372145 5014 126302 -62125 -508204 -1118015 -1619107 -1760247 -1515325
10335 -1515325 -1010708 -542208 -415760 -771665 -1523404 -2314213 -2738907 -2547312 -1829664
10326 -1829664 -934203 -198718 199998 255098 306198 683069 1195103 1662487 2222349 2848203
10316 2848203 3256373 3178452 2866672 2562695 2023309 1342586 941709 883262 993036 1217022
10306 1217022 1715860 2567664 3393033 3701430 3451344 3111775 3049741 3271858 3622722 3698113
10296C698113l89892n58881n61513o51617p34622p07455n66509l86571k60550
10287a119497k67301k36866j0301K57570O89185J030828Q00780R3157o91833j132841
10277e87119r55055m16196M0209L68279O56964P13180O34264O28378M82979K35260
10267A801143J58028J06698r959k77617m55674k09444J14461K21321K65243K25074
10257A939274J4710m18978n68863j78692L93722N12407m501n94043p36395m30416
10247g1775l0983J14730l1312l85637p34265p25565m60900q4059M70172P34526
10237a205068L70920o0793j93932k50833l33586l13408k67871j41197J14452M12315
10227a869001N62958M90696K00022j67004n46267o80244m72311k7833L62120N58027
$$ plain form
10296 3698113 3308221 2749340 2187827 1536210 801588 94133 -472376 -858947 -1119497
10287 -1119497 -1386798 -1623664 -1633965 -1376395 -687210 343618 1144398 1237555 545722 -587119
10277 -587119 -1542174 -1958370 -1918161 -1549882 -892918 -179738 454526 1082904 1565883 1801143
10267 1801143 1959171 2065869 2055910 1778293 1322619 1113175 1227636 1448957 1714200 1939274
10257 1939274 1953984 1535006 966143 787451 1181173 1693580 1689079 1095036 358641 -71775
10247 -71775 -102758 11972 -19340 -404977 -1139242 -1864807 -2325707 -2409766 -1939594 -1205068
10237 -1205068 -834148 -894941 -1088873 -1339706 -1673292 -1986700 -2254571 -2395768 -2281316 -1869001
10227 -1869001 -1306043 -815347 -615325 -782329 -1328596 -2008840 -2481151 -2508984 -2146864 -1588837
10217a588837O87998P44130N83863J57718m80382r31894r31315o84059k54517
10208b697295J65573K95144J77482j34976m07778m28923k30832n6702j08376j18252
10198c544935l3982J29673K70297K13065L04768O08612P05872N07774J45284l3324
10188g26896J75584N11180O13144L77030m3968j96024j39605o6686r956j28883
10178C64920j84488J5703L08491O04567Q22892P20599M31744o1649o92943j104942
10168A224894j010510m90166k00581k92586l30308j83533L569N6904R1482K07465
10158i23370L12517J61743j71576j22104M48642Q98048R22245O23517J50953k62353
10148B038262n32239p64597q29132m36617M2876P1726j56980l48154l51136M280
$$ plain form
10217 -1588837 -900839 -156709 427154 584872 104490 -827404 -1758719 -2442778 -2697295
10208 -2697295 -2531722 -2236578 -2059096 -2194072 -2601850 -3030773 -3261605 -3318307 -3426683 -3544935
10198 -3544935 -3578917 -3449244 -3178947 -2965882 -2661114 -2052502 -1346630 -838856 -693572 -726896
10188 -726896 -551312 -40132 573012 950042 906074 710050 570445 503759 493803 364920
10178 364920 180432 196135 504626 1109193 1932085 2652684 3084428 3022779 2329836 1224894
10168 1224894 214384 -275782 -476363 -768949 -1099257 -1282790 -1279221 -1222317 -1130835 -923370
10158 -923370 -610853 -449110 -620686 -742790 -294148 603900 1526145 2149662 2300615 2038262
10148 2038262 1506023 741426 -87706 -524323 -481447 -409721 -566701 -914855 -1265991 -1261711
10138a261711M32208M16944q5488n24837m53445K0338L11224J42932k03767j86704
10128a392306K02761L63109J6563k62966p776L79174K53106k66597n12124l36230
10118a563286l36493n48615l01270M92901J076081R93806O41115L84897L05440
10109A144576L22359J55063r5671k02573j90033j99013j58649k7297Q8711Q0100
10099I17573k43504n72503n96599k34184K54803L88096L24449N62867Q37758P70619
10089B409375O42414N95769O11185O29848N95068M81821M23747L71383J28940
10080F889550m216J38676L56755O12079O77948M81996M31370P96708J529421K349343
10070A4259630K882687L098112L015310K803506K833178K811745K310952J304047
$$ plain form
10138 -1261711 -829503 -412559 -498047 -1022884 -1476329 -1455991 -1144767 -1001835 -1205602 -1392306
10128 -1392306 -1189545 -826436 -809873 -1072839 -1080615 -701441 -448335 -714932 -1227056 -1563286
10118 -1563286 -1899779 -2448394 -2749664 -2256763 -1180682 -186876 454239 839136 1144576
10109 1144576 1466935 1621998 1526327 1323754 1133721 934708 776059 748762 837473 917573
10099 917573 674069 101566 -495033 -729217 -474414 -86318 238131 800998 1638756 2409375
10089 2409375 3051789 3647558 4258743 4888591 5483659 5965480 6389227 6760610 6889550
10080 6889550 6885334 7024010 7380765 7992844 8670792 9152788 9584158 10380866 11910287 14259630
10070 14259630 17142317 20240429 23255739 26059245 28892423 31704168 34015120 35319167
10062C5319167k64971k005699l287827l777885l733245l463256k978746k468580
10054A3338958k137628j847340j462441j231531j116736q61339n48148k87136
10046C846659n0188J56843J36622k84039p50421r11361q21070o23151k25157L01588
10036G76325O36657O37320N34953K43190k60882p34013j003443q20108j87814
10027a77815M83149N78713J84933j09828o9588m0551n3307O1450q707l51781o53534
10016a56866m09545K06885N86746M57241j1262m09069m17223k04421N3222K55537
10006d8755J80631J2520q7943k38420l72865j94743K61231N48613L76512n2730
9996C84051l41385l89742j43969K79848M95674K62165k97461q01538q82974n49124
$$ plain form
10062 35319167 35054196 33048497 29760670 25982785 22249540 18786284 15807538 13338958
10054 13338958 11201330 9353990 7891549 6660018 5543282 4681943 4133795 3846659
10046 3846659 3796471 3953314 4089936 3805897 3055476 2144115 1323045 699894 474737 776325
10036 776325 1412982 2050302 2585255 2828445 2567563 1833550 830107 9999 -177815
10027 -177815 305334 884047 1068980 959152 889564 849013 795706 857156 848449 496668 -156866
10016 -156866 -566411 -359526 227220 684461 673199 264130 -153093 -357514 -304292 -48755
10006 -48755 131876 144396 56453 -181967 -554832 -749575 -488344 60269 436781 384051
9996 384051 42666 -347076 -491045 -211197 284477 546642 249181 -552357 -1435331 -1984455
9986a984455k04804j20121j83779Q796N99839R92265P28315K86594K49655M88328
$$ plain form
9986 -1984455 -2189259 -2309380 -2493159 -2484363 -1884524 -892259 -163944 122650 372305 860633
$$ [...]
##END NTUPLES=NMR SPECTRUM
##END=
