##TITLE=C13_ABBC0602
 CDCl3, 1900 sc

 9.2.2024
##JCAMPDX= 6.0         $$ Bruker NMR JCAMP-DX V2.0
##DATA TYPE= NMR SPECTRUM
##DATA CLASS= NTUPLES
##ORIGIN= UXNMR, Bruker Analytische Messtechnik GmbH
##OWNER= root
$$ XWIN-NMR		Version 3.5
$$ Fri Feb  9 16:25:54 2024 Russian Standard Time (UT+4h)  she@DPX200
##.OBSERVE FREQUENCY= 50.327896
##.OBSERVE NUCLEUS= ^13C
##.ACQUISITION MODE= SIMULTANEOUS
##.ACQUISITION SCHEME= undefined
##.AVERAGES= 1901
##.DIGITISER RES= 17
##SPECTROMETER/DATA SYSTEM= spect
##.PULSE SEQUENCE= zgpg30
##.SOLVENT NAME= CDCl3
##.SHIFT REFERENCE= (INTERNAL, CDCl3, 0, 222.756)
##AUDIT TRAIL= $$ (NUMBER, WHEN, WHO, WHERE, WHAT)
$$ ##TITLE= Audit trail, XWIN-NMR		Version 3.5
$$ ##JCAMPDX= 5.01
$$ ##ORIGIN= Bruker BioSpin GmbH
$$ ##OWNER= she
$$ F:/spectra/data/she/nmr/c13/1/pdata/1/auditp.txt
$$ ##AUDIT TRAIL=  $$ (NUMBER, WHEN, WHO, WHERE, WHAT)
(   1,<2024-02-09 16:24:32.32 +0400>,<she>,<DPX200>,
      <created by zg, POWCHK disabled, PULCHK disabled
       terminated by command 'halt'
       configuration hash MD5:
       00 E9 B6 7A A2 85 ED C7 34 08 36 98 17 FE 4E 26
       data hash MD5: 32K
       E9 F0 B0 B2 58 25 8D C2 DD F2 87 AE 1D B9 D5 1F>)
(   2,<2024-02-09 16:24:34.51 +0400>,<she>,<DPX200>,
      <Start of raw data processing
       efp BC_mod = 2 LB = 2 FT_mod = 6 PKNL = 1 PHC0 = -382.528 PHC1 = 35.01886 SI = 32K 
       data hash MD5: 32K
       6C 28 91 8E 47 56 9A 33 E5 5B D6 F8 3A CE A6 73>)
(   3,<2024-02-09 16:24:37.46 +0400>,<she>,<DPX200>,
      <abs ABSG = 5 
       data hash MD5: 32K
       D2 5C 3B 31 FC 59 31 67 46 09 19 B9 1B 19 43 D8>)
(   4,<2024-02-09 16:25:10.28 +0400>,<she>,<DPX200>,
      <pk PHC0 = 3.919927 PHC1 = -8.799998 
       data hash MD5: 32K
       C2 7C F2 DA 10 78 94 4A 32 8A 2D 71 B1 AF 0D EF>)
(   5,<2024-02-09 16:25:14.21 +0400>,<she>,<DPX200>,
      <abs ABSG = 5 
       data hash MD5: 32K
       98 AA F2 87 42 99 87 44 ED 0B B1 9C DA 9A 36 C6>)
$$ ##END=
$$ 
$$ hash MD5
$$ E8 9F 7F 9D 4A B8 7F 55 C7 9A EC F1 55 4D 7B C7
##$RELAX= 
##$RELAX= 
##$RELAX= 
##$RELAX= 
##$RELAX= 
##$RELAX= 
##$RELAX= 
##$RELAX= 
$$ Bruker specific parameters
$$ --------------------------
##$DU= <F:/spectra>
##$EXPNO= 1
##$NAME= <c13>
##$PROCNO= 1
##$TYPE= <nmr>
##$USER= <she>
##$AMP= (0..31)
100 100 100 100 100 100 100 100 100 100 100 100 100 100 100 100 100 100 
100 100 100 100 100 100 100 100 100 100 100 100 100 100 
##$AQSEQ= 0
##$AQ_mod= 1
##$AUNM= <au_zg>
##$AUTOPOS= <>
##$BF1= 50.322709
##$BF2= 200.13
##$BF3= 50.322709
##$BF4= 500.13
##$BF5= 500.13
##$BF6= 500.13
##$BF7= 500.13
##$BF8= 500.13
##$BYTORDA= 1
##$CFDGTYP= 0
##$CFRGTYP= 5
##$CHEMSTR= <none>
##$CNST= (0..31)
1 1 145 1 1 1 1 1 1 1 1 1 1 1 1 1 1 1 1 1 1 1 1 1 1 1 1 1 1 1 1 1 
##$CPDPRG= <waltz16>
##$CPDPRG1= <>
##$CPDPRG2= <waltz16>
##$CPDPRG3= <>
##$CPDPRG4= <mlev>
##$CPDPRG5= <mlev>
##$CPDPRG6= <mlev>
##$CPDPRG7= <mlev>
##$CPDPRG8= <mlev>
##$CPDPRGB= <>
##$CPDPRGT= <>
##$D= (0..31)
$$ [...]
##$SUBNAM4= <"">
##$SUBNAM5= <"">
##$SUBNAM6= <"">
##$SUBNAM7= <"">
##$SUBNAM8= <"">
##$SUBNAM9= <"">
##$SW= 239.972175391363
##$SWIBOX= (0..15)
0 1 3 0 0 0 0 0 0 0 0 0 0 0 0 0 
##$SW_h= 12077.2946859903
##$TD= 32768
##$TD0= 1
##$TE= 0
##$TE2= 300
##$TE3= 300
##$TEG= 300
##$TL= (0..7)
120 120 120 120 120 120 120 120 
##$TP= (0..7)
150 150 150 150 150 150 150 150 
##$TP07= 0
##$TPNAME0= <>
##$TPNAME1= <>
##$TPNAME2= <>
##$TPNAME3= <>
##$TPNAME4= <>
##$TPNAME5= <>
##$TPNAME6= <>
##$TPNAME7= <>
##$TPOAL= (0..7)
0.5 0.5 0.5 0.5 0.5 0.5 0.5 0.5 
##$TPOFFS= (0..7)
0 0 0 0 0 0 0 0 
##$TUNHIN= 0
##$TUNHOUT= 0
##$TUNXOUT= 0
##$USERA1= <user>
##$USERA2= <user>
##$USERA3= <user>
##$USERA4= <user>
##$USERA5= <user>
##$V9= 5
##$VALIST= <valist>
##$VCLIST= <CCCCCCCCCCCCCCC>
##$VD= 0
##$VDLIST= <DDDDDDDDDDDDDDD>
##$VPLIST= <PPPPPPPPPPPPPPP>
##$VTLIST= <TTTTTTTTTTTTTTT>
##$WBST= 1024
##$WBSW= 4
##$XGAIN= (0..3)
0 0 0 0 
##$XL= 0
##$YL= 0
##$YMAX_a= 11769909
##$YMIN_a= -10934802
##$ZGOPTNS= <>
##$ZL1= 120
##$ZL2= 120
##$ZL3= 120
##$ZL4= 120
##$ABSF1= 222.7558
##$ABSF2= -17.24104
##$ABSG= 5
##$ABSL= 3
##$ALPHA= 0
##$AQORDER= 0
##$ASSFAC= 0
##$ASSFACI= 0
##$ASSFACX= 0
##$ASSWID= 0
##$AUNMP= <proc_1d>
##$AZFE= 0.1
##$AZFW= 0.5
##$BCFW= 0
##$BC_mod= 2
##$BYTORDP= 0
##$COROFFS= 0
##$CY= -3
##$DATMOD= 1
##$DC= 0
##$DFILT= <>
##$DTYPP= 0
##$F1P= 0
##$F2P= 0
##$FCOR= 0.5
##$FTSIZE= 32768
##$FT_mod= 6
##$GAMMA= 0
##$GB= 0
##$INTBC= 1
##$INTSCL= 4.134877e-10
##$ISEN= 128
##$LB= 2
##$LEV0= 0
##$LPBIN= 0
##$MAXI= 10000
##$MC2= 0
##$MEAN= 0
##$ME_mod= 0
##$MI= 0.1934396
##$NCOEF= 0
##$NC_proc= 0
##$NLEV= 6
##$NOISF1= 120.0001
##$NOISF2= 80.00006
##$NSP= 0
##$NTH_PI= 0
##$NZP= 0
##$OFFSET= 222.7558
##$PC= 1.4
##$PHC0= -378.6081
##$PHC1= 26.21886
##$PH_mod= 1
##$PKNL= yes
##$PPARMOD= 0
##$PSCAL= 0
##$PSIGN= 0
##$REVERSE= no
##$SF= 50.3227249666721
##$SI= 32768
##$SIGF1= 140
##$SIGF2= 120
##$SINO= 11.81781
##$SIOLD= 32768
##$SREGLST= <13C.CDCl3>
##$SSB= 0
##$STSI= 32768
##$STSR= 0
##$SW_p= 12077.2946859903
##$SYMM= 0
##$S_DEV= 0
##$TDeff= 32768
##$TDoff= 0
##$TI= <>
##$TILT= no
##$TM1= 0
##$TM2= 0
##$TOPLEV= 0
##$USERP1= <user>
##$USERP2= <user>
##$USERP3= <user>
##$USERP4= <user>
##$USERP5= <user>
##$WDW= 1
##$XDIM= 32768
##$YMAX_p= 483719136
##$YMIN_p= -2235915
$$ End of Bruker specific parameters
$$ ---------------------------------
##NTUPLES= NMR SPECTRUM
##VAR_NAME=  FREQUENCY,     SPECTRUM/REAL,   SPECTRUM/IMAG
##SYMBOL=    X,             R,               I
##VAR_TYPE=  INDEPENDENT,   DEPENDENT,       DEPENDENT
##VAR_FORM=  AFFN,          ASDF,            ASDF
##VAR_DIM=   32768,         32768,           32768
##UNITS=     HZ,            ARBITRARY UNITS, ARBITRARY UNITS
##FACTOR=    0.368581032318806, 1,           1
##FIRST=     11209.6787745874, 0,            0
##LAST=      -867.615911402871, 0,           0
##MIN=       -867.615911402871, -2235915,    0
##MAX=       11209.6787745874, 483719136,    0
$$ Real data points
##PAGE= N=1
##DATA TABLE= (X++(R..R)), XYDATA
$$ [...]
11681 -1114737 -1260718 -1350579 -1331156 -1217063 -1069145 -935380 -844368 -827891 -875864 -916662
11671 -916662 -911441 -865923 -792226 -707601 -653122 -619675 -593938 -592071 -589004 -542551 -452416 -370037
11659 -370037 -324345 -273978 -214290 -206662 -265823 -349210 -363788 -259227 -62243 108291 126487
11648 126487 -23044 -275903 -521572 -630496 -613970 -562204 -540105 -559035 -528904 -390400
11638 -390400 -171584 35565 112810 47404 -56757 -106380 -85167 -42775 -7007 46702 91916
11627 91916 43194 -112848 -319273 -500880 -589636 -566965 -484078 -422949 -415596 -453515 -509537
11616 -509537 -576255 -610831 -555330 -432726 -333823 -348714 -454014 -483490 -321689 -30302 223713
11605 223713 334583 312646 243052 204449 236365 354925 443218 354092 170089 65172 119678
11594 119678 333947 621593 850334 929103 870128 760252 640494 507126 328186 100420
11584 100420 -89289 -123242 -52662 -30584 -68581 -62727 5364 69784 90358 57440 31645
11573 31645 68488 161397 314659 500134 668027 789932 821072 721613 547360 380070
11563 380070 244223 162744 115051 74690 80755 129714 149434 169363 202167 200502 148966 84002
11551 84002 25455 -71727 -213999 -323884 -359148 -367441 -390148 -461786 -610877 -798766 -948720
11540 -948720 -1009918 -1026413 -1013801 -939911 -812017 -646105 -467953 -279281 -120534 -88681
11530 -88681 -195979 -370358 -536551 -618787 -611408 -542301 -394937 -219490 -83986 8630 83210
11519 83210 151206 217929 237223 163732 4482 -156810 -222422 -167850 -53102 -11902 -89048
11508 -89048 -227577 -378027 -463011 -510682 -619369 -749907 -788749 -749000 -680502 -640751 -696061
11497 -696061 -771771 -753967 -652044 -511346 -331367 -156597 -90275 -206081 -418008 -551623
11487 -551623 -578646 -555059 -503514 -474572 -525811 -639339 -758457 -810343 -723502 -502741 -222398
11476 -222398 -33087 -12695 -46194 -50103 -33806 28511 117816 205443 295636 365897 359519 252171
11464 252171 72691 -106067 -195785 -177035 -98710 -11958 42057 40612 -20358 -157635 -344725
11453 -344725 -532236 -674849 -721989 -683748 -648919 -634445 -575069 -411492 -181431 86732
11443 86732 268708 247108 178481 210738 293063 356023 411747 424365 369844 307747 307496 332993
11431 332993 299273 206927 146604 188941 322076 509049 659895 663348 590876 602102 759311
11420 759311 974873 1088529 1136106 1229778 1341343 1407430 1420764 1412634 1362445 1226989 1044445
11409 1044445 888634 778401 728911 752148 817647 868504 902413 966876 1017692 935842 754244
11398 754244 629958 601700 552881 405745 266298 263327 318452 315027 264508 241517 281890
11387 281890 320392 290207 168896 5012 -78315 -48949 84132 330958 649381 887340
11377 887340 904889 775577 646290 558914 501420 511893 592785 636506 595414 475325 292637
11366 292637 81890 -155895 -374964 -479528 -407480 -201371 -10971 86134 140746 177108
11356 177108 172713 110874 -15039 -155326 -263501 -369582 -457248 -441455 -275146 -218
11346 -218 257428 393031 398555 282698 97931 -114710 -329068 -492452 -573219 -531785 -366094
11335 -366094 -208928 -129793 -69329 11218 128981 284615 416106 449935 421379 363702 255851
11324 255851 132350 28511 -71063 -203805 -341727 -406540 -404079 -388645 -406926 -427911 -414247
11313 -414247 -351724 -263816 -255703 -318458 -324686 -180524 70536 278414 308688 219260 231100
11302 231100 419291 623753 679812 551170 339493 242148 348809 478489 453698 336092
11292 336092 218053 136545 114225 155322 229387 281546 261339 209860 185849 196344 225289
11281 225289 222917 170780 120746 112786 159418 251133 346471 371060 287471 127236 -29479
11270 -29479 -126906 -156487 -95165 65278 266935 422230 489555 476555 441912 456672 527197
11259 527197 609846 683112 730718 761872 759776 696256 625150 594709 573631 541055 493071 419755
11247 419755 273967 67594 -59316 -75056 -93860 -197789 -329523 -376442 -339388 -263234
11237 -263234 -196268 -182232 -194451 -192210 -184085 -138919 -17749 134444 285891 489684 777287
11226 777287 1031449 1144230 1176774 1213692 1196596 1120825 1041438 934613 821515 706893
11216 706893 533978 335882 193497 59470 -92333 -189603 -175560 -108587 -87524 -104198
11206 -104198 -92321 -54098 -31980 -32182 12248 141642 277831 311666 300366 375301 552062
11195 552062 775427 997985 1173862 1297846 1354540 1327130 1235902 1060371 821691 613706
11185 613706 538226 576870 628639 637685 558013 352238 113983 -118241 -345263 -516804 -605313
11174 -605313 -615361 -593019 -616259 -647729 -609572 -525708 -437555 -353379 -267509 -200463 -141922
11163 -141922 -57478 24442 78541 104040 114217 181032 303755 436079 546908 579078 496838
11152 496838 312376 64772 -192844 -363041 -408896 -378193 -310353 -192954 -77465 -31107
11142 -31107 -10261 64601 191121 268031 257857 256809 311008 361144 382366 426615 520866 578716
11130 578716 548534 513238 588545 819206 1130249 1358097 1343273 1042387 595276 190936
11120 190936 -98968 -252867 -221355 -63085 104222 217726 255619 190972 -2483 -234180
11110 -234180 -397227 -477737 -513426 -533521 -534535 -537242 -604416 -736541 -853884 -942250 -1039939
11099 -1039939 -1123858 -1168465 -1152217 -1021335 -826397 -665719 -547748 -456234 -384564 -232853
11089 -232853 30866 250630 296459 165113 -78644 -346641 -544835 -651021 -713547 -711879
11079 -711879 -620648 -563604 -605917 -664606 -655009 -536167 -349194 -222740 -205621 -268487 -348581
11068 -348581 -398579 -454644 -547994 -614294 -581630 -457035 -301022 -144050 3440 127054
11058 127054 194716 177054 102126 39955 9630 26615 110328 268129 438454 540305 569280
11047 569280 474936 233538 -52333 -298746 -506009 -658842 -726011 -724220 -724108 -757312 -757887
11036 -757887 -665660 -503685 -361922 -290084 -274609 -326584 -474404 -683236 -844950 -864658
11026 -864658 -710782 -426128 -142677 -13892 -103688 -341513 -545699 -617594 -638239 -718390
11016 -718390 -862441 -1013225 -1115182 -1102241 -968165 -792525 -658555 -601505 -556710 -493544
11006 -493544 -461412 -509525 -615282 -730133 -793984 -765055 -724241 -712865 -701411 -673735 -632000
10995 -632000 -595166 -566564 -544385 -565949 -670806 -841011 -991042 -1016474 -872431 -595664
10985 -595664 -308497 -111550 9112 110229 164230 144626 114885 124701 162142 213411 257816
10974 257816 253320 155584 -34044 -263471 -420658 -449760 -402489 -329844 -286491 -300924 -347782
10963 -347782 -395985 -414346 -392451 -326940 -201705 -2381 199461 304654 325586 336773 391556
10952 391556 498688 597357 603855 476776 215740 -133326 -471797 -694596 -747662 -645441
10942 -645441 -488519 -404373 -373463 -333710 -311310 -292390 -197180 -33183 122471 204275 206912
10931 206912 168237 48315 -158785 -365089 -517272 -616431 -667465 -659019 -599408 -567276 -639995
10920 -639995 -784803 -914295 -949143 -884790 -820505 -877387 -1023688 -1123577 -1161254 -1234399 -1323687
10909 -1323687 -1332132 -1276474 -1237187 -1247235 -1249485 -1176626 -1016958 -800013 -620887 -554173 -563918
10898 -563918 -538186 -439748 -312988 -190698 -97159 -99790 -195648 -276955 -226527 -38787 166522
10887 166522 277733 308324 284863 199509 101535 32683 29197 111907 230424 334282 415990
10876 415990 476445 477192 366385 197403 72790 21092 -25140 -123325 -294273 -509501 -754511
10865 -754511 -1008893 -1204619 -1305062 -1272325 -1110798 -878177 -612692 -363615 -136693 68624
10855 68624 238998 376393 501905 567298 582279 646722 803884 1004833 1104889 1041432
10845 1041432 896236 709604 441342 108002 -203865 -441309 -591544 -675357 -734901 -769543
10835 -769543 -755872 -679552 -518998 -280533 5334 311894 564086 650976 563348 422621
10825 422621 325258 291236 298387 270363 173665 64689 26183 54016 47599 -65007 -230224
10814 -230224 -344526 -389873 -429566 -523332 -656421 -734520 -731826 -729117 -741707 -728254 -658221
10803 -658221 -540128 -432020 -361753 -313387 -218830 -53289 100898 155200 107834 33113 47485
10792 47485 199624 382477 449802 427130 410813 388683 333498 271783 254702 282143 264492
10781 264492 164027 31789 -89907 -164151 -182478 -173490 -132198 -51869 21665 119441 243321
10770 243321 273005 174231 35867 -46954 -12970 55510 43355 -26080 -66829 -62862 -24987
10759 -24987 33381 58674 -30284 -241027 -502257 -814748 -1147118 -1406692 -1500387 -1362519
10749 -1362519 -1088835 -894471 -869526 -924422 -919875 -814545 -690519 -634369 -604116 -491828
10739 -491828 -268132 -41160 55682 32000 -5587 5396 42280 49271 -40346 -247821 -471464
10728 -471464 -614108 -675319 -686282 -719293 -806062 -880556 -872538 -750369 -579957 -452999 -358045
10717 -358045 -221086 21020 287565 387930 292699 109579 -47051 -73573 34162 222462
10707 222462 369197 355892 224856 120685 135334 214176 266485 285501 324259 415863 482870
10696 482870 436788 299579 100241 -138127 -319998 -399071 -451944 -543168 -686988 -822118
10686 -822118 -866660 -847493 -809220 -696230 -528654 -418434 -391375 -401350 -399920 -339923 -234441
10675 -234441 -133307 -42446 -10047 -99962 -231311 -275489 -215642 -91786 37291 111391 135039
10664 135039 130919 121113 124239 139522 151693 151249 117090 32222 -40917 832 140645 265475
10652 265475 276550 143571 -20192 -21830 189924 494032 775308 973681 1048851 1010440
10642 1010440 884092 657021 336288 9734 -198735 -206864 -57200 89737 151494 213084
10632 213084 355746 519928 569760 482818 381495 319953 258720 138635 -22988 -152846
10622 -152846 -231920 -242662 -178022 -121306 -97192 -48838 36838 118575 133942 40256 -83212
10611 -83212 -132749 -148764 -222679 -311348 -337068 -313400 -206480 2461 219337 360843 402514
10600 402514 361174 301290 298587 340398 311304 158938 -28110 -135522 -107821 32032 249320
10589 249320 477081 589441 587099 605500 656191 639398 501644 243602 -92334 -421482
10579 -421482 -679868 -897401 -1078129 -1110770 -936079 -641814 -380729 -214774 -111834 -113078
10569 -113078 -250270 -456822 -636861 -738438 -768922 -749883 -707350 -682080 -701435 -738860 -685495
10558 -685495 -493198 -209686 173670 583696 867723 969417 896567 699195 448545 147943
10548 147943 -165197 -398288 -480414 -411986 -281192 -244335 -334387 -413380 -399517 -330001 -251821
10537 -251821 -170552 -94678 3240 127241 175220 79977 -88240 -254182 -353688 -383420 -423698
10526 -423698 -473182 -451620 -370115 -323534 -372104 -491413 -601954 -645295 -594309 -492648 -386401
10515 -386401 -324539 -340198 -389545 -395143 -382276 -452790 -612536 -779533 -869771 -864995 -814744
10504 -814744 -737468 -571210 -305391 -54655 52165 19916 -41061 -100440 -190352 -288436 -362738
10493 -362738 -443833 -572836 -763399 -980637 -1179647 -1283117 -1207001 -1008463 -833855 -742888
10483 -742888 -685814 -610509 -511539 -394856 -260565 -163078 -111214 -51537 15776 117001 277793
10472 277793 443993 550535 571823 490329 360317 292160 294627 295496 268609 262124 304183 340740
10460 340740 332720 280932 173461 64239 79883 252960 444378 541026 545044 426823 171610
10449 171610 -115540 -306334 -310366 -139110 42094 88311 -2348 -196692 -455745 -701187
10439 -701187 -841144 -866529 -845786 -811453 -764930 -703519 -640859 -571843 -441786 -222719 48956
10428 48956 298617 497532 705333 904603 982438 889326 652384 360916 86441 -114725
10418 -114725 -212180 -249602 -269997 -287766 -289734 -224166 -116999 -23820 27023 716 -95185
10407 -95185 -191704 -200909 -110257 11186 128024 236374 331474 344999 261878 184230 146089
10396 146089 137215 143654 150902 173085 212982 220216 153030 19736 -136555 -221771 -228491 -251536
10384 -251536 -283897 -256405 -172511 -100249 -130858 -237485 -331812 -399983 -404031 -311963 -149325
10373 -149325 13397 144511 226660 203484 116180 58111 17757 -42662 -78518 -63590 -44707
10362 -44707 -101912 -222248 -291435 -245726 -143234 -65583 1648 139679 305128 366931 266750
10351 266750 110888 52074 72509 77954 49952 -11260 -50667 10052 128072 194019 158890
10340 158890 67050 -23750 -82163 -68376 -9004 23200 -5921 -60761 -73380 -32601 -10308
10329 -10308 -45468 -92506 -144796 -197506 -228097 -200809 -91461 84439 276751 488083 762343
10318 762343 1060862 1302989 1417774 1335927 1044006 683399 407362 266033 254680 289282
10308 289282 315459 309551 248996 142055 53780 74810 210150 399400 581852 752065 899255
10297 899255 946185 812437 573223 347149 110252 -183406 -468575 -652079 -731508 -721026
10287 -721026 -619630 -471316 -370801 -349586 -332174 -238143 -46451 163406 299495 349780
10277 349780 359140 372502 393000 388122 315588 181010 1843 -202567 -358864 -473471 -604502
10266 -604502 -778197 -963383 -1012968 -914661 -779055 -628614 -457243 -278020 -88578 48368
10256 48368 62354 -169 -47038 -75067 -106587 -132803 -143540 -172610 -244677 -329577 -475223
10245 -475223 -704642 -884119 -892327 -705303 -371408 -15338 220733 283902 256388 224982
10235 224982 224304 286821 391152 439970 350525 91514 -270743 -618244 -892203 -1067892 -1160900
10224 -1160900 -1206358 -1194700 -1084857 -844913 -539087 -268394 -90160 -3409 8822 1565
10214 1565 54394 202349 392220 495866 427319 222120 12121 -75840 13300 141359 218329
10203 218329 316011 484212 687955 832375 866725 814088 716401 602454 470986 353905
10193 353905 271054 203941 160057 134479 83643 -15374 -97727 -100045 -34831 15809 -16219 -85352
10181 -85352 -108201 -94183 -51624 -9289 8693 35992 92800 147740 106270 -4046 29219
10170 29219 308704 641425 795553 716880 498494 292618 139281 -28929 -247432 -525407
10160 -525407 -790326 -925307 -898058 -842647 -876487 -943996 -918344 -746980 -556301 -528867 -658090
10149 -658090 -733405 -586959 -356327 -256463 -281191 -304296 -269975 -197246 -125252 -91136 -128323
10138 -128323 -284712 -491217 -576411 -518670 -453813 -415215 -333185 -186552 -1851 204495
10128 204495 422883 660131 875478 958259 886696 718599 475575 173470 -114133 -248275
10118 -248275 -206106 -129707 -107938 -76974 10587 84141 52320 -60691 -139585 -132583 -51699
10107 -51699 60628 192591 380545 595944 735072 766081 682330 461692 208174 45568
10097 45568 -18865 -2885 63230 127528 131025 33579 -167150 -365726 -427373 -369305 -304279
10086 -304279 -284826 -251505 -135589 -40325 -77431 -160435 -147905 -43642 65184 142535 184748
10075 184748 201979 191053 158283 113903 116539 221741 367253 467072 550957 669776 832096
10064 832096 1032668 1250633 1485164 1752996 2100138 2604434 3240994 3906383 4532874 5142439
10054 5142439 5790905 6446226 6944152 7132484 7045565 6811602 6471359 5998058 5382129 4740112
10044 4740112 4243699 3893740 3529615 3082097 2623067 2179162 1763835 1334165 855285
10035 855285 454048 286697 364089 580505 806630 1006059 1242804 1498721 1637464 1647474
10025 1647474 1617794 1572515 1501171 1352377 1137046 939706 812834 739441 622952 416402
10015 416402 210676 138522 191281 249981 244091 191117 102379 -20208 -140364 -243749 -322392
10004 -322392 -375635 -422348 -462091 -521720 -592996 -622839 -631569 -683733 -765000 -814300 -832398 -815363
9992 -815363 -805535 -846734 -928169 -1007155 -991720 -814282 -602315 -563704 -695203 -793823 -790054
9981 -790054 -744776 -679503 -620089 -607015 -617900 -648260 -725288 -777756 -734639 -621311 -481190
9970 -481190 -373296 -362430 -439928 -520465 -551397 -491548 -310671 -58038 159320 218216 110666
9959 110666 -40603 -149615 -262752 -477567 -730476 -886729 -902876 -752582 -464674 -135953
9949 -135953 173884 466617 672491 681143 573154 481351 396046 255212 85745 -25868
9939 -25868 -68152 -72392 -62970 -89332 -195543 -348599 -482231 -552239 -494412 -309906 -141661
9928 -141661 -90043 -106392 -115303 -133302 -143238 -99844 -1193 163183 314968 367401 364631 383975
9916 383975 440410 469554 378105 169103 -42244 -209720 -282904 -253437 -253086 -348164 -463881
9905 -463881 -517065 -463245 -292126 -99105 -12408 -92553 -290883 -514584 -703530 -798708 -822230
9894 -822230 -822092 -801332 -770089 -732777 -707637 -687708 -640524 -576941 -568552 -602945 -604005 -559712
9882 -559712 -501455 -450481 -434359 -484223 -541182 -525478 -475362 -479407 -513700 -502002 -431900 -348152
9870 -348152 -274965 -241481 -250956 -267513 -267980 -242126 -149742 57834 377195 720377 999598
9859 999598 1220650 1410138 1512929 1420787 1182680 960536 844544 832357 835817 799854 725993
9848 725993 575450 373019 190811 82952 98328 240030 448365 631013 698088 613402
9838 613402 441938 281360 147036 16581 -106611 -193522 -186389 -61523 150821 345029
9828 345029 430523 454436 450310 375771 214021 42234 -12783 38045 85584 112514 121800 77264
9816 77264 -28712 -110138 -89589 -50906 -95839 -180250 -198099 -130295 -74423 -116416 -228805
9805 -228805 -287268 -198645 653 187864 258952 211417 65285 -111125 -307692 -529528
9795 -529528 -745282 -921474 -1019256 -1046768 -1031974 -980097 -920167 -864191 -788221 -671969 -508110
9784 -508110 -335652 -175970 -25565 74568 93019 80973 86004 61456 -9391 -75576 -141651
9773 -141651 -188584 -135438 -21533 53524 116301 214334 317990 402937 438488 401612 311059
9762 311059 203762 88762 -32571 -102659 -125877 -198970 -306023 -410054 -555867 -693148
9752 -693148 -732721 -693621 -620135 -496329 -293935 -96304 -10097 -19660 -26894 22214 113853
9741 113853 249995 361334 358530 282658 218605 214334 313921 445619 498325 460666 385034
9730 385034 309367 263518 227682 135038 12720 -75500 -141393 -196119 -260380 -360807 -485189
9719 -485189 -572556 -529812 -348948 -106371 132967 308335 338065 203369 -18471 -203036
9709 -203036 -337442 -523851 -776548 -981615 -1040774 -995183 -947961 -953290 -959971 -927023 -875566
9698 -875566 -810860 -665324 -409980 -148087 -2592 -39523 -217239 -395086 -496667 -506387
9688 -506387 -449912 -386208 -359048 -344966 -322656 -286916 -247046 -216197 -169186 -106377 -99169 -131491
9676 -131491 -118722 -94449 -104405 -173971 -309654 -411495 -390103 -249086 -58662 116102 224555
9665 224555 239530 166277 -13418 -212000 -281287 -209730 -75259 37627 92445 56544 -98645
9654 -98645 -272744 -336846 -302896 -235382 -115047 84672 281580 321385 153865 -128926 -375849
9643 -375849 -515611 -546011 -513820 -454134 -321376 -100263 92472 138099 53232 -52128 -86888
9632 -86888 -58578 9131 126440 300838 459983 518101 485367 407975 389628 524354 760037
9621 760037 965181 1009872 860884 612221 368767 163936 17580 -72022 -154075 -216713
9611 -216713 -201122 -92835 37724 172241 305870 354772 275375 88334 -179081 -478231
9601 -478231 -699746 -795360 -839988 -881304 -866988 -690701 -347246 5647 177506 123987 -55687
9590 -55687 -234124 -313789 -289227 -221947 -132281 -21787 103849 207387 265715 314114 352665
9579 352665 344473 292547 217782 155207 199550 332159 438483 532715 670760 781233 694124
9568 694124 394278 19108 -346325 -600356 -697102 -738236 -835922 -982826 -1055337 -922795
9558 -922795 -633268 -365980 -187855 -52419 69996 151937 194010 247401 297519 276285 184625
9547 184625 26778 -157087 -293071 -369226 -431293 -473039 -458996 -394710 -262935 -55429 147747
9536 147747 243920 200382 53886 -83085 -167190 -249484 -322335 -365728 -467722 -655404 -831938
9525 -831938 -883162 -786995 -655605 -565230 -495256 -397219 -277395 -214362 -226955 -234212 -207315
9514 -207315 -175247 -130539 -64339 -34670 -86667 -168806 -199277 -141479 -73859 -82446 -126394 -140040
9502 -140040 -139785 -177145 -242059 -297688 -347671 -387042 -411747 -420405 -374550 -240795 -38007 171514
9490 171514 285825 247328 92433 -84452 -187863 -257111 -410929 -620233 -706105 -542008
9480 -542008 -226824 24613 119507 77227 -61593 -178259 -134107 14090 91234 80579 65140
9469 65140 44838 2757 -74649 -175636 -262883 -324912 -395082 -486704 -579006 -610987 -557848 -465271
9457 -465271 -367940 -262618 -119615 58799 253341 420870 494848 455319 323726 162483
9447 162483 100814 211876 402239 490174 400572 217958 42192 -75447 -103925 -30323 147080
9436 147080 355057 481528 485090 384685 245600 145792 87843 27615 -15316 -4179 35710
9425 35710 109995 201563 262751 301271 349645 407854 456155 449102 397912 364372 333495 273566
9413 273566 144494 -54807 -271052 -451622 -557088 -598636 -633366 -661462 -636258 -599227 -572980
9402 -572980 -495311 -356829 -185094 50997 363649 645178 740687 647345 492958 354557
9392 354557 288658 341301 478635 618737 696072 673532 537702 339466 233045 264378 315814
9381 315814 287931 147544 -49345 -224301 -338001 -359050 -291914 -149262 36139 201775
9371 201775 314521 338438 289783 253846 263675 317812 421969 573926 713305 741012 621459
9360 621459 406357 144095 -147903 -388234 -474283 -370845 -168882 35936 153416 69878
9350 69878 -172848 -377972 -393532 -280401 -169177 -54259 130928 344160 506681 588263
9340 588263 594958 605825 672565 800601 945462 1018640 1001011 955455 925856 882556 803526
9329 803526 695699 549575 414609 342034 298052 240334 206408 223391 252288 320411 491378
9318 491378 636730 603660 420550 202750 62154 26829 33105 -7260 -124976 -307124 -520358
9307 -520358 -661030 -626376 -425903 -113416 180523 292180 212590 96417 82082 201340
9297 201340 386172 498061 490533 477181 496844 440513 290209 139085 51834 80236 214789
9286 214789 357804 470210 547937 515062 337302 130693 33060 88725 196725 213960 96487
9275 96487 -26155 -53866 -41102 -23409 -973 34226 130685 299770 460848 516231 422075
9264 422075 207320 -41422 -227344 -340509 -384377 -351195 -299801 -276442 -306222 -416338 -585989
9253 -585989 -757468 -884303 -964022 -1040987 -1120909 -1163853 -1160020 -1121284 -1046710 -938062 -852266
9242 -852266 -835892 -847166 -869777 -895579 -880761 -839781 -771668 -639200 -439496 -227242 -61257
9231 -61257 77320 214521 382421 596741 749454 750613 701486 755889 870453 913434 870787
9220 870787 849237 906278 969815 965049 912908 889110 938413 1035609 1101203 1095563 1052277 1024356
9208 1024356 1047955 1053316 942402 780931 699161 678489 610995 500748 452789 441031 345079
9197 345079 177284 48166 65229 193254 369507 614174 876878 1042910 1074778 1022090
9187 1022090 908010 806747 821133 907598 933678 862443 782660 786534 836669 851931 827009
9176 827009 794379 741718 641369 549669 524287 538207 577505 629490 644450 629597 603142
9165 603142 568995 525777 456568 391977 356446 277057 120036 -85863 -278702 -390971 -454424
9154 -454424 -457745 -414413 -401805 -354662 -206354 26024 344573 682884 932032 1057348 1069047
9143 1069047 986543 893237 868433 920608 975499 938668 738813 461432 256021 126639 15116
9132 15116 -117168 -219908 -175606 1122 170375 322649 492296 617345 608464 451799
9122 451799 243287 87436 -465 -50668 -83685 -109561 -132183 -160735 -267673 -509944 -745192
9111 -745192 -865618 -909686 -890410 -796096 -647182 -541644 -592969 -766011 -918195 -924505 -727638
9100 -727638 -450645 -269369 -201821 -139936 -7226 140346 240263 293514 350826 413730 419582
9089 419582 364541 344829 434465 606447 758151 807291 768337 722090 767327 849971 871304
9078 871304 870104 828643 659557 447263 343336 340012 259494 39644 -174369 -270029 -254921
9067 -254921 -164347 -65582 -22108 -8699 28427 118137 241742 332270 345056 284783 213049
9056 213049 196203 231371 237638 173739 74201 4860 44898 165045 258870 297865 305647 281399
9044 281399 215448 102227 -26909 -96946 -98953 -79613 -71688 -70941 -43287 -1670 24109 -2904
9032 -2904 -102988 -287896 -546149 -783279 -861012 -726756 -475775 -256756 -145970 -136863 -189791
9021 -189791 -216223 -129292 15455 92361 62422 -66094 -249754 -390200 -442701 -410225 -308930
9010 -308930 -159230 -12957 92485 148692 63361 -118460 -184312 -67619 76168 103171
9000 103171 15772 -96316 -179126 -278286 -436507 -565676 -629251 -713878 -819496 -857812 -815738
8989 -815738 -806132 -872803 -935397 -929340 -848271 -717204 -542700 -352239 -240260 -242394 -257894
8978 -257894 -176332 -20076 94558 98593 55155 91011 199753 254787 138582 -134264 -421880
8967 -421880 -647593 -775423 -792119 -759665 -706137 -573903 -377069 -157126 126759 395188
8957 395188 498966 483446 473459 451874 333036 114595 -71803 -136167 -76409 105845 408463
8946 408463 775774 1065126 1173278 1081217 838854 584681 468267 500022 585990 616250
8936 616250 562081 486274 460846 482095 474502 456247 524119 623184 601186 479502 326236
8925 326236 124055 -119846 -316302 -397250 -378935 -307253 -286988 -351121 -391598 -306815 -139157
8914 -139157 -14928 13647 28675 107114 232740 308673 281435 215007 159901 61116 -115142
8903 -115142 -257466 -303553 -271655 -168288 -31878 12388 -66378 -166502 -276410 -389326
8893 -389326 -433104 -390353 -310492 -209772 -70738 61053 134029 173606 247323 316655 293932
8882 293932 207275 96861 -46065 -202625 -334449 -426078 -499880 -577342 -662548 -731041 -725704
8871 -725704 -656437 -563027 -415525 -183547 57223 181962 192124 206657 248171 221173 101057
8860 101057 19576 38449 104287 222539 438112 682200 806928 777562 646170 488774
8850 488774 333972 184769 63660 -49358 -146834 -169362 -94264 58023 262621 441483
8840 441483 507694 468085 385721 305503 309282 360917 287487 118755 -42801 -179899 -274850
8829 -274850 -341504 -377453 -362224 -300903 -219364 -162011 -168941 -167756 -74400 121989 401809 645901
8817 645901 697935 543304 308620 61573 -140077 -245536 -293226 -374689 -484644 -562531
8807 -562531 -606435 -630695 -656160 -683822 -674373 -621211 -500894 -284141 -52034 109683 195916
8796 195916 172126 45216 -109824 -255165 -381460 -440585 -360282 -143066 116241 299144
8786 299144 327707 297800 341067 423712 485693 509164 510931 522511 568634 585245 500795 357054
8774 357054 231135 150050 48899 -116155 -292348 -424825 -559002 -712226 -788821 -734709
8764 -734709 -601561 -446500 -307956 -185524 -83128 -65023 -149517 -263686 -298809 -240553
8754 -240553 -195461 -211594 -216558 -182412 -144861 -165372 -289550 -420194 -430911 -354995 -245391
8743 -245391 -59704 233389 573010 798713 810982 678680 492353 326191 258887 243874
8733 243874 164724 -35582 -303373 -566571 -780562 -851358 -725156 -498221 -302990 -163231
8723 -163231 -81066 -83241 -155063 -222126 -242927 -220648 -141654 10413 180547 281988 310686
8712 310686 272020 172877 24116 -166005 -352569 -536977 -725565 -917846 -1130768 -1273173
8702 -1273173 -1251162 -1086967 -802962 -405002 -28626 146362 95981 -53581 -257003 -530060
8692 -530060 -730023 -669745 -413151 -184370 -81197 -41267 15781 60404 78827 105055 139572
8681 139572 190005 215934 150999 40457 -32302 -48535 -37446 -52997 -122055 -196646 -257440
8670 -257440 -371457 -546255 -684289 -705390 -617022 -519097 -520953 -666335 -897053 -1110704 -1204528
8659 -1204528 -1121472 -945859 -808797 -739019 -728535 -738712 -756499 -822589 -910807 -942786 -935456
8648 -935456 -942943 -970398 -1025471 -1160623 -1349345 -1456957 -1412157 -1292815 -1240327 -1301881 -1404807
8637 -1404807 -1491024 -1521149 -1454199 -1248490 -926445 -586248 -307378 -83302 72144 94808
8627 94808 -30034 -293538 -624054 -923754 -1141634 -1264599 -1288099 -1195383 -1002916 -779813
8617 -779813 -560588 -395952 -345150 -378410 -430226 -472843 -499219 -459877 -320933 -151910 -670
8606 -670 114190 152205 45745 -207713 -502981 -703491 -708388 -590767 -488516 -453500 -390905
8595 -390905 -227985 -37567 89934 124535 126384 144501 109617 -81951 -407755 -721290 -903628
8584 -903628 -916448 -848369 -849133 -928718 -1034377 -1163824 -1232788 -1135140 -913897 -700933 -558288
8573 -558288 -444994 -310469 -151102 444 83205 66017 -6569 -127739 -281714 -408052
8563 -408052 -447718 -392968 -313235 -252106 -165856 -48815 -3607 -99295 -248305 -324030 -322934
8552 -322934 -274649 -193456 -123619 -148839 -245010 -273155 -188124 -76218 -10498 612 -2367 64489
8540 64489 173867 230465 222473 195796 166950 183782 261368 329758 367333 373073 303319 179150
8528 179150 91599 89601 132617 135558 82337 34492 43937 90836 142707 193996 261830 340362
8516 340362 361494 227248 30520 -49248 -22892 57697 190011 343336 480843 591467
8506 591467 638006 587481 436342 248427 72800 -101373 -257489 -310822 -197936 -34237
8496 -34237 57997 124559 209113 310785 449079 592397 691633 746820 714349 540208 326760
8485 326760 234470 250184 236442 170539 145969 232918 404519 538906 598734 622643 586957
8474 586957 486803 331354 144366 23581 18066 65010 105443 153930 207098 254100 280444
8463 280444 265209 220454 169838 133031 122828 86213 -52742 -275240 -481002 -541280 -431102
8452 -431102 -271506 -177170 -176670 -210164 -183979 -70879 94171 267732 416084 525299 600761
8441 600761 627863 590029 478964 330529 215292 157090 131389 136563 171390 183286 122191
8430 122191 -55996 -354464 -708477 -960248 -1032274 -1015074 -942530 -797464 -658959 -556020
8420 -556020 -418256 -253225 -160472 -153014 -132256 -42920 89741 177543 197880 230439 300901
8409 300901 324073 260672 158585 48038 -68279 -133886 -110295 -10286 122726 215608 202238
8398 202238 116954 53773 60260 157074 304727 396991 396328 384432 439489 575237 746645 824649
8386 824649 748811 594072 452798 309882 133745 6017 3099 121205 278259 404678
8376 404678 509623 568069 552270 519857 468164 365707 303961 365130 475092 531415 526392
8365 526392 522498 590623 675776 652886 548125 462786 434804 453445 493705 486092 396349 280599
8353 280599 154576 32528 -39806 -53809 -43909 -45858 -36544 57746 269745 517231 719527
8342 719527 888086 1018352 1043195 938558 773571 592489 426884 361484 424007 571991
8332 571991 721053 814065 834071 835091 829101 753077 580846 362321 183220 75043 60885
8321 60885 149010 267398 349226 364836 292538 154379 -8976 -109140 -81672 -8237 831
8310 831 -37125 -90394 -189065 -332347 -447793 -473338 -466410 -516216 -586633 -636359 -659931 -598690
8298 -598690 -510760 -538130 -613559 -609627 -595988 -606288 -569418 -516842 -537088 -598846 -649669 -728459
8286 -728459 -828476 -909073 -987014 -1091109 -1187979 -1209114 -1079189 -836091 -631507 -562144 -641192
8275 -641192 -771182 -788198 -622283 -369861 -126553 80390 193250 178729 79925 -31372
8265 -31372 -142409 -294045 -481180 -657371 -799875 -888599 -894121 -784053 -553952 -299562
8255 -299562 -122972 8467 159600 301462 398772 448921 430007 321145 233510 271515 384063
8244 384063 462481 385869 127027 -213708 -489652 -622231 -597987 -426757 -244508 -190889
8234 -190889 -257288 -340717 -364976 -348385 -323584 -295695 -273834 -254400 -235644 -214456 -140429 55701
8222 55701 323437 519349 536403 458661 402935 345322 260664 216012 233051 217466 103535
8211 103535 -70642 -235906 -383613 -527097 -696650 -893789 -1027126 -1028666 -933632 -830670
8201 -830670 -773816 -706181 -552776 -359661 -237619 -203402 -164487 -50188 132383 327280
8191 327280 451750 497353 533452 610137 720034 769798 705433 582393 428704 261895 137548
8180 137548 93451 163493 337097 534369 678744 731891 732296 674884 516801 311658 149121
8169 149121 77060 57169 33547 -2931 12293 95553 224935 372163 442375 427795 397783
8158 397783 359330 255015 91035 -66061 -205100 -346508 -439321 -435742 -342188 -192337 -45530
8147 -45530 52054 53674 -121409 -417410 -609644 -568424 -383437 -177557 49542 259884 328520
8136 328520 249843 172907 160404 166565 225315 354607 479923 522010 485073 440864 413930
8125 413930 335014 222101 133035 9615 -166461 -334278 -434119 -413875 -280955 -114098
8115 -114098 -25878 -92863 -284633 -486944 -629344 -691856 -654227 -553754 -467282 -430219 -386954
8104 -386954 -313273 -266494 -269297 -288133 -284532 -299696 -337545 -323325 -260879 -204204 -138709 -52740
8092 -52740 42584 116243 146673 174504 236510 287995 285424 251663 229055 213652 178365 142365
8080 142365 154043 235307 331306 390331 456988 568260 670817 696371 583976 399219 277709
8069 277709 270449 325891 392255 443433 453851 425756 341507 123157 -167809 -336713 -351905
8058 -351905 -349501 -392024 -396505 -282500 -53292 247994 527258 702530 715905 540760 298737
8047 298737 125560 22421 -37489 -20113 28388 66602 144192 284598 356001 164843 -248610
8036 -248610 -624429 -756877 -617378 -367946 -194747 -130035 -122215 -111109 -39554 89045 242569
8025 242569 396493 527851 621505 634083 540716 379442 224843 157916 208234 319797 386406
8014 386406 354366 301057 267611 244973 241430 214806 118158 3201 -26668 43530 132071 119694
8002 119694 43435 55817 213905 416322 523449 494542 357142 169865 1823 -144709
7992 -144709 -289832 -433806 -563988 -627133 -625760 -615363 -581314 -456139 -319608 -282141 -289197
7981 -289197 -262654 -187053 -119020 -127497 -219375 -362693 -498812 -612988 -753045 -936607 -1076538
7970 -1076538 -1068384 -885182 -546749 -156121 147370 345231 492994 606878 650417 609594
7960 609594 537761 479043 428851 376765 362282 381060 348067 173157 -96854 -315043 -417406
7949 -417406 -456972 -511400 -601516 -650913 -569955 -407507 -310584 -342356 -374799 -273480 -59728
7938 -59728 129881 183199 122286 66194 61445 43071 -56055 -261890 -468113 -495465 -316787
7927 -316787 -84022 59774 81862 -21794 -165811 -188731 -62386 58315 82249 32239
7917 32239 -67756 -192390 -326196 -410804 -374506 -266225 -160028 -75821 -77658 -163450 -252033
7906 -252033 -295511 -319524 -316204 -207636 47724 382807 708138 953916 1034591 930752 717017
7895 717017 526132 431937 384096 308048 164829 -47285 -218685 -257742 -180518 -28596 160109
7884 160109 297264 314575 251726 183748 140881 114753 121507 140939 140140 129079 115300 137914
7872 137914 250412 404032 467789 436710 359386 189533 -88412 -373159 -630347 -843627
7862 -843627 -967357 -995302 -952392 -875238 -789466 -678550 -513620 -339041 -235277 -215908 -236150
7851 -236150 -241747 -236702 -254912 -290679 -315377 -285965 -211132 -113622 -43053 -72736 -201657 -364683
7839 -364683 -470677 -451254 -335847 -201852 -67977 45182 96741 135112 203716 308107
7829 308107 445307 575832 594189 428081 154118 -126647 -326979 -380664 -300451 -139972
7819 -139972 44116 211266 320876 381516 453221 516728 515253 465320 440638 449901 397938
7808 397938 229230 25383 -109721 -166949 -170486 -187208 -304029 -480509 -610943 -709623 -787334
7797 -787334 -752295 -579666 -357780 -177943 -85932 -94031 -135574 -132905 -64244 56540 178951
7786 178951 284197 400035 492830 570018 642114 643982 585484 491421 343244 182619 112061
7775 112061 103071 63217 -7941 -41652 6751 102577 167671 132595 34020 -3141 49989 149191
7763 149191 252432 342224 401955 430265 449968 480249 470479 375408 218381 76957 -4671
7752 -4671 -31751 43051 187063 294335 304601 220326 90437 1186 -15841 11781 88923
7741 88923 221628 388348 522395 592304 668725 818710 1009486 1156481 1187638 1105768 1008726
7730 1008726 974757 1001189 1053137 1102057 1122886 1129435 1174007 1278459 1389737 1439714 1439641 1398576
7718 1398576 1276193 1058514 783822 516210 294643 94703 -107290 -289834 -427459 -459144
7708 -459144 -394603 -275098 -122140 45532 225873 432030 604856 668639 620447 479288
7698 479288 318329 207543 154811 146656 136438 85244 -6012 -119352 -196183 -204120 -223812
7687 -223812 -307235 -382804 -356151 -232151 -67094 59771 68699 3380 -29572 17205 83287
7676 83287 111705 120564 139958 186380 271571 374165 437334 402209 259556 56679 -127921
7665 -127921 -202336 -144536 20623 233401 410928 529781 648894 807209 939734 954244
7655 954244 847503 698433 563176 433684 298267 147253 -1935 -92264 -127482 -171980
7645 -171980 -205616 -162926 -79116 -45007 -79848 -144994 -169853 -159022 -197399 -298735 -394748
7634 -394748 -431215 -388728 -269125 -107470 -10399 -35600 -160674 -286288 -339977 -379199 -448832
7623 -448832 -517157 -585520 -682611 -701878 -553207 -248770 109547 387755 530587 596967 685168
7612 685168 811982 961572 1108833 1165938 1050603 809536 540392 300158 91753 -82032
7602 -82032 -223636 -274233 -178534 -35215 -3880 -141034 -339761 -454343 -448575 -389168 -276670
7591 -276670 -77653 151322 320912 430473 477945 425191 332257 333170 430683 531407 591685
7580 591685 591330 482520 253501 717 -102862 -60271 -25778 -29412 -53354 -116844 -177224
7569 -177224 -171099 -105875 -44066 -22426 29650 182287 387569 579810 693776 681426 568161
7558 568161 427817 271056 59310 -140048 -225071 -177574 -31172 155523 342987 518808
7548 518808 610761 578051 524843 535724 598943 687857 754797 729838 580260 307155 -75049
7537 -75049 -521774 -898056 -1080226 -1030281 -778881 -455951 -233465 -196925 -348644 -608343
7527 -608343 -829764 -922563 -874459 -744414 -644423 -560913 -476309 -471965 -536864 -571356 -511540
7516 -511540 -386724 -244981 -98352 22709 98662 136993 133680 105926 78810 60743 38828
7505 38828 -38957 -140091 -197414 -190966 -193555 -282807 -414405 -513883 -504305 -336442 -36898 277885
7493 277885 522937 689089 780376 820552 851820 876209 856683 775667 666204 614922 634612
7482 634612 611996 517374 435506 334540 139599 -82523 -176596 -114735 -31865 -4913 -48704
7471 -48704 -152491 -244468 -294133 -307137 -283357 -265640 -285187 -297197 -257250 -176788 -65610
7460 -65610 96081 345285 683559 1016232 1235471 1320061 1318076 1255004 1161602 1104749 1106342
7449 1106342 1086741 979413 816380 689422 656060 722365 822773 866160 884868 966969 1147825
7438 1147825 1361310 1449449 1386984 1268052 1139281 970825 721705 414431 117835 -126080
7428 -126080 -303164 -394746 -423552 -441862 -467809 -464994 -459715 -466258 -450666 -400538 -341752 -325911
7416 -325911 -382475 -440448 -396305 -296523 -232098 -171483 -61407 93771 256822 369722 380414
7405 380414 324676 265969 165840 14207 -152857 -358222 -582760 -738314 -796793 -813130
7395 -813130 -814101 -773509 -674786 -513966 -276432 -15826 232934 556153 943773 1218606 1286911
7384 1286911 1249287 1195080 1098711 1018073 1042479 1141682 1293997 1464865 1583087 1592698 1502503
7373 1502503 1352201 1118881 848864 623108 433613 205325 -77876 -331326 -478791 -491574
7363 -491574 -394621 -268187 -162437 -93682 -92067 -165932 -268936 -336026 -334874 -280266 -169144
7352 -169144 2344 139725 102207 -141206 -496339 -818036 -969607 -913315 -745613 -610345
7342 -610345 -604939 -710985 -822320 -893000 -910730 -834265 -652369 -375183 -77632 129160 259256
7331 259256 415197 558419 591938 482979 252180 71700 50209 74703 41349 -11111 -37723
7320 -37723 -1037 145190 367433 595387 756657 786289 687670 520936 306865 49878
7310 49878 -182439 -314093 -292409 -117977 164588 488985 772267 909065 846478 669236
7300 669236 487072 346162 284587 309914 360208 382557 335964 247984 165124 107975 105258
7289 105258 137465 157509 138503 86976 81459 186932 344125 442939 462747 399758 219839
7278 219839 -24227 -168015 -161788 -123521 -63232 79707 232731 318457 303131 240239 257333
7267 257333 291115 235582 168703 183418 323082 567114 752423 760772 634762 401024 112940
7256 112940 -131359 -301611 -402680 -418545 -363942 -304813 -287254 -273061 -215269 -136915 -40775
7245 -40775 75439 133172 91171 17960 -17219 -3815 17163 27864 74337 138564 192914 271148
7233 271148 372258 473235 595513 705359 692525 485977 143750 -158230 -326102 -387323
7223 -387323 -360467 -204097 52646 270247 329355 263096 153847 61603 46154 131338 256691
7212 256691 319881 274176 188158 238798 458826 700862 862501 985209 1108005 1153715 1099988
7201 1099988 1006288 891399 804574 766684 741127 681070 567184 463381 405448 352392 306232
7190 306232 281400 272253 290195 371430 534527 781028 1031976 1161906 1120205 926217 632659
7179 632659 329657 104727 -45463 -135010 -148664 -121253 -130803 -232638 -398172 -508697 -542312
7168 -542312 -569304 -570267 -456433 -227133 6876 138172 184494 157866 41327 -116331 -273512
7157 -273512 -412283 -529444 -649208 -794236 -942371 -1032959 -1033616 -909982 -650810 -335517
7147 -335517 -49052 174394 348296 453028 466986 432280 353130 230427 81445 -48074
7137 -48074 -139816 -249763 -390690 -526952 -652335 -769501 -858794 -898634 -866616 -724362 -467135
7126 -467135 -157330 39649 -6719 -143215 -196320 -196447 -236036 -321969 -402988 -440762 -431599 -432539
7114 -432539 -436765 -395383 -422682 -601044 -800795 -912218 -953395 -958327 -957838 -971376 -983369 -967722
7102 -967722 -932555 -875906 -763831 -564905 -314588 -118869 -31033 -33074 -125156 -309006 -514892
7091 -514892 -684153 -817785 -950897 -1026538 -930315 -674609 -389994 -196544 -168633 -289299
7081 -289299 -484443 -697635 -808296 -736768 -562762 -373903 -199026 -71410 -37137 -75413
7071 -75413 -163125 -301118 -424122 -473536 -485761 -469208 -429706 -406662 -399925 -402388 -424392 -524891
7059 -524891 -711170 -828545 -769865 -571673 -288047 33507 370130 658485 768271 696690
7049 696690 572304 459719 305568 43416 -212509 -309767 -219300 -17295 144251 187932
7039 187932 164242 70116 -142978 -409866 -586477 -573572 -405832 -218524 -81176 -14436
7029 -14436 -11532 -11295 -2928 11518 84322 192245 282817 362959 417091 377334 283945 270881
7017 270881 341252 399421 345727 213748 106464 25749 -54479 -109964 -177464 -329629 -497161
7006 -497161 -530471 -410352 -231102 -87517 -15120 -22045 -74640 -111216 -102316 -92432 -130327 -198842
6994 -198842 -299412 -414793 -485561 -466339 -287135 43889 396573 666875 837866 918922
6984 918922 898450 816894 743334 698862 709372 783432 859654 810831 603116 399667 294527
6973 294527 150933 -68694 -223583 -197766 5924 324425 670424 929665 938084 650577
6963 650577 282233 62646 -18362 -35185 -759 30226 -13501 -105021 -177284 -204026 -202568
6952 -202568 -177437 -132628 -87630 -84304 -136642 -217302 -280418 -339579 -437181 -541557 -601060 -613329
6940 -613329 -562239 -387989 -127222 88324 184321 164498 91915 30161 1350 11265 -5567
6929 -5567 -64064 -97269 -46722 85878 219370 222140 66660 -64828 -75300 -25877 12473
6918 12473 -17565 -112128 -176577 -146785 -90185 -25390 92911 251333 359501 376849 292490
6907 292490 148107 -5704 -180828 -362409 -454248 -407026 -294774 -222300 -193268 -170062 -166605
6896 -166605 -159762 -79192 65960 156200 164945 179739 254826 424457 680436 908718 995613
6885 995613 934475 790884 628864 500113 390695 269348 164409 134989 194998 322792
6875 322792 509778 733661 968764 1130995 1167672 1147491 1084102 910040 635792 380320
6865 380320 250571 209288 159514 24883 -190148 -376026 -509067 -641471 -737634 -765471
6855 -765471 -753493 -717954 -673065 -618827 -544891 -483902 -420297 -308548 -136262 37004 147620
6844 147620 154597 98360 20890 -99841 -195859 -188691 -72849 118573 334455 501256 592624
6833 592624 669310 749743 767521 688143 589483 550719 595178 678219 729944 709082 568362
6822 568362 290312 -27351 -291050 -534536 -769831 -952721 -1061304 -1043071 -864557 -641361
6812 -641361 -529258 -547862 -575704 -526333 -435550 -385165 -384251 -326899 -151049 114812 431580
6801 431580 770425 1086052 1309849 1396714 1329717 1170594 1019765 895765 787199 676720
6791 676720 559687 431816 321270 290284 393153 561790 699506 783580 796810 748415
6781 748415 660794 567000 492973 385234 173686 -63467 -210971 -220749 -107436 51329 184728
6770 184728 212281 127689 48762 27504 14363 -1062 22928 82527 121916 111413 64909 54575
6758 54575 103168 133534 72947 -78422 -241243 -335448 -385839 -440652 -474852 -463811 -395469
6747 -395469 -285458 -143327 60662 258606 344777 318666 255748 227794 270877 371485 483587
6736 483587 579294 629297 618467 610179 626854 582587 458889 282366 73774 -90081 -113118
6725 -113118 23409 230808 408095 540961 683930 799958 814027 738963 679577 681447 713047
6714 713047 727331 688352 639659 620571 569422 501909 524205 609773 634482 560092 443737
6703 443737 320999 223846 170237 151666 175931 256148 345739 410175 441603 437355 444232 541932
6691 541932 741901 943230 1081861 1155672 1202067 1293138 1407445 1461898 1376996 1140149 861013
6680 861013 680122 609253 605765 688027 836890 927614 909022 809203 649877 515468 441105
6669 441105 433246 446537 380580 244412 131125 74755 39246 74481 264217 550951 821930
6658 821930 982123 985420 868638 664621 390337 92416 -166576 -370124 -537283 -651478
6648 -651478 -618813 -381987 -94708 66121 127035 181379 247769 358809 536532 682212
6638 682212 670714 528443 336312 141311 -29752 -153404 -239207 -327729 -428807 -538785
6628 -538785 -692151 -924255 -1184105 -1321963 -1237657 -970206 -576422 -164475 132381 268609
6618 268609 378436 612335 936746 1184804 1219374 1046991 790253 579417 434956 300357
6608 300357 202435 149327 40034 -132575 -251984 -203382 -51101 54622 64067 38237 21990
6597 21990 -26487 -109922 -215431 -349362 -465104 -501081 -433169 -292907 -131369 -14469 24471
6586 24471 55981 146190 295992 452444 611897 811671 996591 1043935 941809 774508
6576 774508 600618 449694 321160 183338 37497 -84001 -100955 23385 161596 178254
6566 178254 47036 -123479 -175762 -67767 90568 217567 300142 332790 379364 487497
6556 487497 669167 877001 1049886 1101261 967213 739387 553134 413598 260984 108771
6546 108771 69889 186153 355706 519204 657802 740198 810212 858359 773857 538121 274379
6535 274379 63228 -84140 -161069 -161867 -65856 89273 194586 214029 209330 232230 287248
6524 287248 337125 384790 486703 674625 892645 1057184 1191205 1333867 1426601 1395583
6514 1395583 1293784 1223140 1199013 1195183 1261424 1417128 1572703 1636720 1592288 1449279 1256236
6503 1256236 1094722 986688 921769 934046 989144 989353 895723 742830 623742 619060 690896
6492 690896 765707 844920 894155 869950 789161 675480 540142 452717 463443 504105 479911
6481 479911 455841 524576 613525 665482 709676 727885 649723 476179 356638 460816 731543
6470 731543 1006848 1189559 1233213 1195987 1173382 1129331 1010517 851436 709091 635306 629865
6459 629865 620734 580062 518217 434420 333216 226958 141813 98584 106762 167140 269413
6448 269413 331978 290174 179102 91969 33159 -9745 46000 177304 277276 345203 446650
6437 446650 548160 618038 697734 786394 835854 813659 668468 438573 245479 111462 6824
6426 6824 -66858 -111456 -118638 -101217 -39430 73902 189177 303282 433398 578327 750027
6415 750027 884274 937112 949652 886176 741367 585884 510480 574930 731141 884818 994758
6404 994758 1048948 1022015 938704 879734 945433 1131934 1345669 1556472 1729719 1741940 1567158
6393 1567158 1339990 1136360 921204 667368 439308 347104 375247 409237 386189 320668
6383 320668 250853 243916 366498 574160 757947 829006 772146 696991 742103 930871 1196896
6372 1196896 1471871 1701843 1853608 1907181 1779961 1447160 997502 552488 265508 231064
6362 231064 331110 444680 625343 897324 1145426 1272993 1282438 1207411 1130378 1120156 1171339
6351 1171339 1200745 1124002 935742 683179 432298 274411 249302 311049 400287 487983 529221
6340 529221 485050 373418 241304 140153 110724 134454 182927 231384 237740 225736 218041
6329 218041 238676 326330 432373 506077 600058 787913 1041182 1303774 1543536 1698915
6319 1698915 1785637 1879518 2004826 2094043 2099911 2012340 1845384 1692109 1641255 1653671 1666029
6308 1666029 1719198 1874207 2104781 2314846 2395297 2344233 2268742 2233251 2264784 2354074 2448602
6297 2448602 2530119 2622086 2781329 3005012 3247751 3466466 3660617 3875782 4058258 4147525
6287 4147525 4182065 4239164 4328515 4375910 4301969 4143848 4095663 4282068 4604811 4937990 5297452
6276 5297452 5703730 6130646 6508349 6701313 6641085 6470018 6319420 6218365 6221023 6276806
6266 6276806 6308606 6398660 6637922 6974418 7309247 7636647 8009363 8462675 8952139 9425653
6256 9425653 9863798 10309228 10855877 11603379 12610391 13930219 15576345 17489965 19603071
6247 19603071 21969886 24691716 27933070 31837163 36523533 42154416 48978716 57308718
6239 57308718 67554238 80111666 94853362 109979068 121501013 126018069 124983173
6232 124983173 123130058 124157378 129772988 140706360 157528148 181114063 212723737
6225 212723737 254311924 308212923 374324041 442336704 483719136 468290015 402762334
6218 402762334 322492566 251773237 196653531 155315242 124434123 101046261 83041793
6211 83041793 69022740 58064423 49389554 42441088 36783347 32192735 28516364 25526017
6203 25526017 22933328 20544342 18302447 16376313 14782840 13356867 12026790 10893926
6195 10893926 10036036 9392158 8766668 8046830 7267361 6545996 5953222 5541968 5321020
6186 5321020 5231476 5209284 5175455 4998332 4681379 4360767 4146286 4023773 3901299 3726972
6176 3726972 3531615 3339978 3161121 2978559 2826995 2761623 2781099 2894326 3125866 3385953
6166 3385953 3532119 3431819 3031522 2461189 1920447 1496174 1230105 1126840 1139516 1202251
6156 1202251 1211231 1118578 1043378 1063732 1156374 1233208 1193416 1027939 814787 635139 572805
6145 572805 576781 530192 452439 405563 404854 459960 553710 627376 623281 466782 177645 -21740
6133 -21740 -19582 75299 189189 320818 445744 527401 571436 605537 627574 621241 551422 461751
6121 461751 462979 549197 636314 704582 762364 802902 799385 780196 839754 1039263 1341315 1635480
6109 1635480 1800138 1828665 1834486 1880770 1916859 1868321 1644031 1261998 867829 522102 235271
6098 235271 65698 -13550 -74059 -109048 -115999 -90580 -32836 26952 123353 247406 375220
6087 375220 507396 636019 706883 687059 681211 737920 787029 781464 716882 625825 512614
6076 512614 347810 143669 -43401 -153807 -197374 -220498 -227114 -215949 -171164 -129024 -103027
6065 -103027 -58558 15978 146694 323104 423748 356688 163963 -2007 5073 151161 327488
6054 327488 497567 645541 733964 697347 524559 312360 109641 -53523 -117135 -57751
6044 -57751 37212 77562 67692 23147 -19933 12781 92994 164791 242695 339671 395090 322091
6032 322091 184778 163938 296094 508715 732504 852804 858448 878322 899070 835416 684212
6021 684212 486518 327522 288463 341953 369086 286386 143443 4349 -104954 -138612 -100578
6010 -100578 -124389 -357892 -783963 -1243951 -1541430 -1573166 -1385458 -1109083 -895013 -842390
6000 -842390 -907482 -985245 -979709 -882876 -763798 -650641 -587653 -568408 -454993 -179271 151738
5989 151738 495916 855073 1152056 1256100 1140904 972536 907610 931738 967745 960223 889579
5978 889579 784828 676637 547838 389830 246017 126201 22558 -56716 -103945 -78846
5968 -78846 -8806 10434 -76975 -241453 -438246 -605656 -678664 -626422 -488124 -339376 -248008
5957 -248008 -181754 -89623 -8836 56347 101635 80729 -7469 -102463 -163645 -202495 -214170 -200993
5945 -200993 -239205 -382911 -523523 -521749 -377102 -157429 74621 250272 375207 454494
5935 454494 476324 449822 413795 377212 318015 264889 261044 291355 328881 359421 313551 132156
5923 132156 -155623 -427732 -566561 -494537 -274124 -57478 60455 91546 134641 231370
5913 231370 394335 596822 720894 726170 707925 709562 639861 479640 319056 221751 201683
5902 201683 159779 28230 -118533 -207881 -248933 -308930 -398250 -426132 -382691 -299291 -112169
5891 -112169 193175 539610 840074 970351 884745 735330 646891 662584 800399 925086
5881 925086 885311 703048 510164 428226 457536 499728 493764 429272 350200 312614 287235
5870 287235 169262 3719 -77508 -64521 -21192 -54168 -177516 -261049 -235658 -154418 -91171
5859 -91171 -47592 14667 126910 252594 370220 450673 428523 315350 238214 288302 414979
5848 414979 509486 517239 467971 380367 220440 -52461 -302472 -349268 -236982 -114160 2470
5837 2470 176934 404308 596012 588227 317828 -67694 -365979 -483052 -475981 -403902 -214825
5826 -214825 99496 442040 718050 916203 1081778 1281335 1586352 1939395 2168490 2169158
5816 2169158 1974501 1661993 1265427 875665 596993 498297 509377 492662 416660 341996
5806 341996 324293 367614 429638 446909 420816 381507 367853 420721 531001 607040 611782 590242
5794 590242 584228 561067 491784 400019 349397 390916 471650 521483 524381 466162 358103 253591
5782 253591 216148 202225 106216 -95217 -341349 -555236 -678045 -666457 -473340 -132655
5772 -132655 261975 626187 887952 1037163 1084188 1016620 863605 693403 540571 412596
5762 412596 280666 132119 -51793 -225677 -274165 -148830 14892 23277 -85419 -180798
5752 -180798 -187839 -87866 37919 82642 20482 -110522 -194032 -139013 43486 279002 472274
5741 472274 584182 669935 757147 768680 716848 718753 785152 819865 786267 692772 500682
5730 500682 234959 -54606 -328267 -537318 -633251 -612170 -481511 -253410 -15671 158454
5720 158454 324457 483560 586696 632767 609206 529013 425976 340027 262984 183559 97923
5709 97923 -13137 -118862 -144353 -76299 14329 31373 -108806 -384955 -632741 -689833 -568668
5698 -568668 -408852 -301025 -268802 -298571 -314777 -230340 1936 378721 789581 1072428
5688 1072428 1135565 980668 689658 376351 108607 -70196 -137214 -187385 -312735 -455154
5678 -455154 -510849 -450235 -300867 -106165 92053 257856 355339 388511 388783 350731 219868
5667 219868 22276 -141596 -253499 -349420 -400656 -367457 -316077 -325988 -371126 -361623 -288345
5656 -288345 -195140 -70703 90186 246758 326026 298693 238002 229327 277863 325033 284045
5645 284045 161064 69729 100448 194239 186958 -11221 -293283 -467137 -502071 -502687 -504524 -497667
5633 -497667 -453848 -290198 23118 363469 531139 452348 199066 -132564 -434936 -625056
5623 -625056 -722068 -770940 -788069 -811740 -797427 -651377 -412106 -186738 -4756 167188 306167
5612 306167 420322 513426 478782 236162 -104371 -346107 -416895 -375269 -293045 -224228 -234375
5601 -234375 -317815 -380222 -351329 -281495 -295829 -383683 -412806 -307434 -100872 107861 252561
5590 252561 343475 375090 360594 316361 202509 40142 -162309 -434571 -703739 -819111
5580 -819111 -702270 -411791 -27278 326047 529599 600697 560114 378768 52850 -303151
5570 -303151 -505243 -515504 -452124 -385500 -328556 -305734 -326824 -338000 -247193 -60796 146096
5559 146096 288133 322880 317496 339176 390860 423888 390900 332681 370897 523780 686059
5548 686059 757477 692347 576037 489651 437071 382039 279144 98793 -88250 -201301 -252815
5537 -252815 -232803 -140497 -35703 5910 -34125 -60599 -2272 56508 4412 -123378 -236497
5526 -236497 -342452 -509249 -746180 -973345 -1032215 -829254 -513853 -302986 -266657 -347364
5516 -347364 -464304 -589739 -719931 -798292 -798719 -756553 -687323 -617985 -564892 -490815 -376483
5505 -376483 -274709 -209296 -142315 -75594 -35267 15092 36802 -27389 -168874 -375537 -568215
5494 -568215 -635056 -539558 -360715 -194943 -90379 -104184 -185065 -230654 -230288 -162322 12711
5483 12711 272523 481159 536055 470569 412502 417938 380904 173600 -162458 -498113 -726630
5472 -726630 -810479 -746699 -565734 -336117 -114619 53585 118440 72615 -5732 -21688 31095
5461 31095 80391 76238 21826 -43356 -78781 -48825 24542 47537 -19498 -124149 -226341 -262378
5449 -262378 -188930 -83798 -57143 -112629 -256893 -493923 -716800 -804021 -735336 -560319 -373024
5438 -373024 -272711 -236814 -176960 -59788 105198 294384 494644 695490 811493 744874
5428 744874 564478 412792 343289 336400 380088 433390 441437 377060 232438 22496 -191327
5417 -191327 -322395 -360458 -394017 -463616 -552800 -674677 -783988 -808144 -706934 -505415 -255328
5406 -255328 -1129 177733 265619 286242 216746 80101 -23100 -47327 -60080 -107692 -175537
5395 -175537 -227693 -248060 -231388 -214769 -222185 -166510 -26152 61805 51389 52200 105634 113425
5383 113425 60280 69511 174848 277282 324554 370061 423410 419698 342750 270217 210821 120128
5371 120128 81185 165827 295317 410336 522097 599249 600542 517607 434315 449231 552432
5360 552432 679101 740305 684744 512417 257817 22045 -39905 126709 386068 573846
5350 573846 653782 647293 582809 544635 575089 584782 483204 323498 201130 194835 290130 454745
5338 454745 645904 825885 985658 1067037 1025651 925396 866198 820181 708087 528336
5328 528336 333304 218930 234396 338600 452996 503954 452058 343317 328187 523546
5318 523546 899730 1316896 1548889 1527237 1418802 1372559 1380576 1409365 1464310 1502153 1468255
5307 1468255 1355933 1218811 1105116 1028435 1002674 997607 988355 965657 962506 1021721 1089271
5296 1089271 1088624 980543 837147 742125 673903 589721 558563 684166 898122 1067422 1163966
5285 1163966 1229196 1271352 1268362 1220796 1177974 1213288 1378400 1620540 1828991 1982209 2142990
5274 2142990 2342664 2572138 2829437 3136840 3464283 3659374 3686050 3637847 3510624 3327707
5264 3327707 3171592 3078372 3037563 2967495 2806213 2634223 2544200 2499361 2473466 2462911 2447419
5253 2447419 2443659 2415086 2266082 2019148 1761827 1532921 1337774 1139467 959759 860106
5243 860106 802298 690980 507448 334118 279890 349299 438965 505170 579499 650955 652336
5232 652336 589497 586180 676214 745022 734875 675009 570572 430130 340489 403957 607332
5221 607332 817114 920686 885722 760707 606939 468255 371556 311536 245975 215146 252185
5210 252185 246428 139932 -4490 -167356 -379132 -596117 -792730 -1013945 -1251863 -1460490
5200 -1460490 -1553678 -1479565 -1329496 -1202635 -1138100 -1085810 -996746 -860660 -687780 -549701
5190 -549701 -514286 -554975 -604802 -599579 -540865 -470484 -402097 -307563 -114806 105342 208794
5179 208794 196944 201131 266442 346581 527545 907346 1454596 2031703 2462589 2611194 2500966
5168 2500966 2242388 1868513 1420099 1006287 762742 695707 715651 734158 672580 561808
5158 561808 481165 446445 496390 632193 721599 651621 501146 406726 432892 530076 620068
5147 620068 648869 551978 378725 276956 320881 438376 461314 262882 -92328 -404964
5137 -404964 -541610 -528076 -456791 -369762 -308922 -311653 -386258 -518799 -617148 -594365 -456380
5126 -456380 -213847 51338 192890 222922 276803 413687 560230 563919 403105 152200
5116 152200 -79743 -169051 -97643 20742 78536 78355 10332 -101383 -221825 -361662 -483905
5105 -483905 -556353 -616803 -709196 -756935 -732851 -712824 -690513 -629225 -540724 -449680 -354435 -244799
5093 -244799 -125109 18600 160923 252331 285075 255890 161873 13713 -143687 -233691 -233877
5082 -233877 -182396 -102886 33086 219486 371021 389943 305455 260963 311665 395286 400124
5071 400124 339266 327429 384125 448302 492478 454855 244046 -71341 -331477 -380481 -165779
5060 -165779 155298 390959 544264 675724 715403 613247 453679 360549 404240 510477
5050 510477 573067 578808 584598 582039 489647 323893 164996 11040 -168113 -333384 -450108
5039 -450108 -493031 -424288 -302089 -217258 -178754 -188585 -249685 -302903 -306375 -285598 -251651 -248355
5027 -248355 -331306 -392881 -347316 -288248 -309985 -436541 -639421 -833883 -954664 -980101 -890175
5016 -890175 -715532 -519015 -345233 -217868 -87104 113406 317318 426911 414715 283376
5006 283376 105533 11855 72591 202814 273030 311730 398882 497412 517474 416128 231000
4995 231000 24198 -155816 -273324 -336659 -418258 -540257 -640039 -740816 -885092 -1045071
4985 -1045071 -1180157 -1290914 -1366614 -1377185 -1311747 -1186808 -1029283 -808295 -537459 -336467
4975 -336467 -276823 -300428 -246524 -94723 20365 37201 7922 -45193 -110552 -105111 -46576
4964 -46576 -56201 -170364 -285497 -303678 -205797 -33862 172503 358080 434197 419826 404571
4953 404571 404713 395222 362191 287696 141242 -46310 -176119 -188985 -113419 9327 152537
4942 152537 268451 316960 298741 264706 246198 240829 248285 261187 265369 291867 369767 445481
4930 445481 470091 458200 422167 374644 340614 307608 258465 217938 194091 167657 135587 116149
4918 116149 121803 145252 149191 125156 66540 -56678 -268744 -493554 -648607 -730058 -749138
4907 -749138 -724071 -669923 -573090 -485274 -497725 -609448 -739884 -843604 -945434 -1070997 -1133219
4896 -1133219 -1056941 -916999 -780696 -653574 -527233 -414496 -376010 -434387 -530493 -615765
4886 -615765 -685336 -705698 -681467 -637057 -546774 -389567 -166164 108702 374254 565438 719050
4875 719050 824489 825193 754171 683771 631621 547936 327326 -22516 -378021 -590831 -548215
4864 -548215 -274818 32077 158500 12303 -338671 -666638 -810429 -818892 -835713 -890051
4854 -890051 -919126 -900971 -833456 -736498 -663554 -638206 -614567 -578822 -579205 -661056 -777976 -830225
4842 -830225 -772622 -615317 -364678 -22017 311164 499117 496920 327561 82275 -140376
4832 -140376 -303061 -346004 -297124 -277053 -317933 -360115 -336855 -227650 -93460 17602 84577
4821 84577 114337 147689 217060 301350 312616 208830 62637 -74542 -188860 -221424 -97365
4810 -97365 109886 193069 86016 -86774 -227712 -299173 -300393 -324459 -431599 -540584 -573472
4799 -573472 -532042 -451326 -360990 -244470 -86691 32718 20208 -57500 -128484 -264544 -458830
4788 -458830 -580576 -628932 -635907 -596596 -555382 -523535 -445685 -314805 -196823 -65580 145245
4777 145245 377177 538131 644196 729490 714648 519829 238653 32635 -62535 -69868 -14413
4766 -14413 60063 47792 -147388 -404059 -523624 -554875 -666594 -805800 -842769 -779248 -691415
4755 -691415 -606644 -476035 -272707 -59796 80341 125786 121097 155698 244523 331488 420913
4744 420913 518222 611891 702609 752254 756923 771016 812382 878087 961981 987881 943790 848955
4732 848955 687131 502164 319259 114082 -112664 -324081 -503016 -641560 -678341 -615357
4722 -615357 -511504 -370206 -201219 -54491 6048 -22078 -39588 -50612 -183647 -469186
4712 -469186 -826117 -1119473 -1266780 -1278535 -1203724 -1080860 -930727 -768740 -610912 -467276
4702 -467276 -332373 -248246 -238350 -264825 -323234 -393029 -412590 -392088 -405834 -420727 -340344 -229618
4690 -229618 -213493 -297657 -372678 -380206 -329446 -248347 -228175 -296204 -336045 -281447 -206734 -219019
4678 -219019 -357563 -579376 -816755 -991387 -1070015 -1070387 -1037518 -1036463 -1050785 -996125 -837311
4667 -837311 -647083 -496263 -368779 -281372 -275915 -360541 -465511 -481215 -381655 -185735 32804
4656 32804 160250 166947 96026 -12774 -141302 -281703 -417381 -571147 -768582 -964269
4646 -964269 -1109917 -1180840 -1085719 -861883 -684844 -625419 -612007 -567571 -450953 -324335 -305653
4635 -305653 -391044 -477037 -518108 -558087 -613568 -658619 -662275 -626347 -613928 -689322 -838311 -936916
4623 -936916 -890641 -730606 -557383 -434788 -336201 -231984 -147856 -58069 94278 265934
4613 265934 411368 536880 622795 596977 475174 366332 311401 317717 373312 421861 419864
4602 419864 398984 412625 411593 292248 95633 -19299 24205 203501 452495 651007 692782
4591 692782 580948 395522 226697 118258 63417 20740 -39270 -98441 -155697 -244411 -305523
4580 -305523 -286343 -208817 -140659 -181137 -312462 -488555 -699161 -901967 -1025347 -1050412 -1000833
4569 -1000833 -901779 -803597 -756174 -727726 -646301 -496192 -309278 -115069 53730 186979
4559 186979 321437 472932 612528 732075 874883 1059238 1222748 1282649 1251104 1130949
4549 1130949 947848 779121 683799 643989 557498 384503 190885 69370 36780 33211 -4833
4538 -4833 -80602 -129406 -119250 -110034 -135177 -114266 -66935 -78404 -62905 68343 253343 387780
4526 387780 368938 212354 109470 168795 302779 357200 283982 162295 -25289 -300678
4516 -300678 -499891 -514152 -446501 -367129 -202345 27735 202376 304783 362994 400957 438528
4505 438528 491903 616679 808722 962734 1009121 950574 818417 617801 363989 69785
4495 69785 -196388 -395321 -560447 -622528 -491684 -256359 -4175 235983 361838 329835
4485 329835 168495 -43926 -136499 -10336 237759 433418 512976 495497 398030 234509
4475 234509 17102 -222723 -378250 -414037 -422369 -409688 -384960 -439251 -546323 -593048 -514954
4464 -514954 -355026 -235858 -194741 -162636 -156187 -253761 -398917 -493302 -542597 -633455 -777913
4453 -777913 -923621 -1031981 -1042520 -948557 -841319 -732261 -532618 -249934 -2364 160665
4443 160665 236375 216598 95733 -82584 -266207 -411660 -463121 -471529 -499993 -488954 -390615
4432 -390615 -257820 -132586 -27209 73678 190879 268063 303539 373669 495397 646494
4422 646494 780954 847979 868709 863669 844488 803460 726918 639299 578406 601385 672038 705196
4410 705196 704089 711772 720228 678371 602664 552050 478731 359249 283573 281244 320191 387089
4398 387089 423323 388264 307235 268273 297860 335503 321530 218151 77352 -52973 -133245
4387 -133245 -176128 -273410 -452753 -637608 -737040 -696687 -545554 -374663 -246793 -141715
4377 -141715 -4848 160053 252137 215116 52968 -225277 -528023 -745875 -839312 -828548
4367 -828548 -775157 -682540 -504002 -282586 -79140 80393 173265 217187 228781 206925 150828
4356 150828 105666 160318 326297 500003 552501 476411 316129 106603 -61291 -108378 -88662
4345 -88662 -83566 -73942 -49862 -64924 -140413 -221844 -263838 -225029 -90493 77766 204726 300586
4333 300586 356062 315404 181473 58607 45172 118445 266552 492043 740100 990255
4323 990255 1242572 1423728 1478067 1446806 1358288 1263466 1215521 1216623 1217846 1182740 1121797 1040431
4311 1040431 917580 753141 603130 513071 433812 330369 271838 274508 249574 116236 -73637
4300 -73637 -214945 -298306 -362300 -373788 -303926 -199338 -95872 -8627 15756 -71377 -269528
4289 -269528 -490910 -603573 -524246 -311243 -70315 143586 309212 439314 564282 651095
4279 651095 680775 714756 803570 901735 927352 836227 679820 596046 678144 869042 1010429
4268 1010429 1025687 936115 782552 668985 674142 785909 1002015 1261637 1420395 1472978
4258 1472978 1474643 1413904 1243019 994368 818899 801611 882171 901785 773294 558713 343627
4247 343627 166120 71974 41960 48228 74663 53649 -45800 -157564 -254778 -366211 -425055
4236 -425055 -346130 -178719 -50013 -97125 -317679 -549073 -667992 -661022 -616270 -621040 -661940
4225 -661940 -667830 -622441 -556458 -548013 -668179 -887187 -1114573 -1313935 -1507201 -1654398 -1679403
4214 -1679403 -1595248 -1435203 -1232367 -1050818 -944775 -874177 -802189 -773005 -846407 -971672
4204 -971672 -1036681 -993820 -918828 -922224 -985559 -1029961 -1022620 -981335 -962763 -1034349 -1153872 -1188462
4192 -1188462 -1121258 -991393 -777857 -497415 -223841 33415 239838 350855 432230 534607
4182 534607 578685 530938 493799 485387 427117 349054 301406 227996 91517 -53597 -138284
4171 -138284 -193416 -293154 -469855 -680546 -778150 -703728 -573282 -450272 -253933 36264
4161 36264 308750 474157 515891 468488 369016 279537 243091 183937 17825 -165005 -279792
4150 -279792 -368089 -413850 -379734 -284915 -164862 -99608 -122827 -176342 -193321 -174838 -117403
4139 -117403 -25153 65020 126346 169216 231679 354129 513828 622520 605512 490248 349245
4128 349245 243811 214885 215856 201927 199489 269727 396163 444444 341373 145677 -19533
4117 -19533 -79239 -60952 -21519 5611 31508 98869 152509 75546 -112121 -263404 -298329
4106 -298329 -227480 -139511 -122216 -164545 -187144 -143118 -74998 -4143 38839 -32042 -185082
4095 -185082 -300857 -327830 -322698 -301359 -248414 -138335 12495 95684 42987 -132278 -336100
4084 -336100 -470729 -540192 -568875 -515182 -386701 -329612 -471296 -702962 -834231 -819384 -704020
4073 -704020 -574012 -542242 -614943 -713752 -805699 -881176 -890422 -847054 -816180 -767167 -702474 -713416
4061 -713416 -822453 -987023 -1157550 -1259013 -1242991 -1140848 -978320 -774771 -582416 -448428
4051 -448428 -363503 -252320 -46736 184649 358506 478961 542374 534360 473292 347264 190589
4040 190589 103359 124290 170413 154736 62258 -117410 -349411 -589625 -847176 -1079772 -1189622
4029 -1189622 -1180491 -1124669 -1079944 -1005386 -813609 -484516 -34137 434788 725820 711100 459199
4018 459199 202467 101233 112114 155125 155519 81384 -17933 -72361 -80320 -98408 -132811 -125026
4006 -125026 -29694 134759 279000 324460 222704 -7227 -276810 -494244 -569966 -499305
3996 -499305 -382224 -321357 -358864 -470595 -568898 -551457 -439014 -301683 -127711 43552
3986 43552 141667 205560 294621 370519 392191 403668 459784 484276 426183 307806 141483
3975 141483 -31646 -194721 -348395 -468192 -539240 -550846 -419022 -114938 202404 443822
3965 443822 616266 678855 624684 513486 339585 75415 -212848 -452424 -639012 -750996
3955 -750996 -791855 -722269 -491047 -225796 -52411 -21607 -111328 -194065 -197640 -177516 -176643 -210024
3943 -210024 -309151 -424617 -474821 -502949 -604813 -777878 -928916 -1015891 -1086974 -1187463 -1303478
3932 -1303478 -1349496 -1292688 -1187663 -1100464 -1036321 -906519 -677832 -466639 -414277 -513736 -678797
3921 -678797 -837831 -937116 -954617 -907656 -835144 -776502 -753626 -742323 -667576 -526022 -446597
3910 -446597 -559586 -818171 -1063543 -1156988 -1048011 -830641 -635275 -491673 -356842 -187156
3900 -187156 4394 161727 254894 301061 308649 305651 345414 431791 521785 566108 552852 537797
3888 537797 547869 578322 596328 574114 515260 468154 462640 457601 437327 391871 251416 7754
3876 7754 -241503 -385748 -368549 -239817 -72864 108553 261392 338148 371884 427567 489254
3865 489254 503891 429895 315460 277462 334564 409547 409189 298874 102502 -119042 -272620
3854 -272620 -228051 -11567 164881 184457 153833 193342 205298 53586 -201918 -397498 -462158
3843 -462158 -444393 -366517 -245330 -165108 -176177 -274600 -444380 -619512 -682062 -579819 -449126
3832 -449126 -391805 -381537 -331840 -210739 -31278 180301 350263 470296 563963 593599 522414
3821 522414 340956 95948 -111961 -226581 -202588 -132158 -186815 -385178 -586666 -699432
3811 -699432 -767090 -840918 -898320 -891022 -810492 -674540 -558225 -521253 -578629 -707831 -814339
3800 -814339 -823880 -766442 -648951 -453769 -228677 -60777 22497 3313 -131303 -269383 -318027
3789 -318027 -285755 -178262 -26428 89529 148515 221883 340454 419155 397493 273102 38379
3778 38379 -201436 -396200 -641647 -908062 -1060133 -1058402 -956586 -804770 -676720 -674835 -793694
3767 -793694 -964161 -1146821 -1232562 -1136710 -934438 -748160 -623157 -522375 -432590 -366773
3757 -366773 -277838 -101966 89229 162453 104785 -51426 -257331 -448609 -568755 -583985
3747 -583985 -493238 -303656 -30547 234434 401098 494921 563058 596145 587820 509354 332336
3736 332336 112975 -33787 -70128 -53353 -49429 -64118 -45457 -26730 -73217 -192980 -351213
3725 -351213 -483237 -516526 -496833 -497154 -419702 -204506 -16321 -20561 -190354 -347494 -379271
3714 -379271 -283821 -125763 -9729 -2400 -82071 -192657 -275684 -279044 -219097 -186434 -271311
3703 -271311 -477075 -711352 -883824 -1014077 -1110765 -1176838 -1184291 -1035146 -750205 -511557
3693 -511557 -431031 -460515 -501049 -471181 -379223 -311166 -343700 -445412 -545282 -580655 -534435
3682 -534435 -468663 -414892 -376689 -344373 -255820 -47153 255559 507039 573444 500378 392417
3671 392417 295776 220086 191495 235179 339109 440803 477631 480423 495624 485220 351606
3660 351606 88450 -143651 -210938 -160904 -81928 -2775 56865 60475 -8553 -83932 -115186
3649 -115186 -74252 9503 30053 -94471 -307772 -445171 -468630 -456629 -452153 -472359 -513514
3638 -513514 -524719 -473062 -390043 -320473 -259379 -161818 -20468 155242 330625 476408 569474
3627 569474 569619 510334 443429 392178 364842 337457 279126 167783 11473 -119707 -164545
3616 -164545 -160377 -174521 -216526 -283432 -388302 -557452 -804526 -1090814 -1361870 -1582492 -1673061
3605 -1673061 -1565356 -1331997 -1099679 -928196 -831170 -732709 -545257 -354217 -304073 -418255
3595 -418255 -591408 -666230 -593903 -424518 -223286 -90712 -91918 -150120 -159532 -103473 -12855
3584 -12855 63220 94851 97465 94402 80322 60456 25858 -80870 -214854 -270185 -224260 -137684
3572 -137684 -44815 125302 372340 606306 803232 963210 1083248 1153071 1139707 1033879
3562 1033879 926839 950041 1124448 1314065 1425507 1444199 1326088 1091663 842800 678047
3552 678047 595795 494507 336867 162209 -28363 -199739 -323861 -424604 -518516 -591797
3542 -591797 -631369 -586622 -383469 -99834 83089 79121 -53910 -208124 -345972 -442662 -455368
3531 -455368 -438778 -471366 -558806 -622020 -600254 -490016 -316250 -146763 -47576 -58032 -159100
3520 -159100 -319035 -561117 -880922 -1123301 -1180861 -1194492 -1275291 -1334544 -1289283 -1099465 -767498
3509 -767498 -438532 -307741 -433093 -745744 -1095464 -1345037 -1526493 -1662715 -1642742 -1448337
3499 -1448337 -1201350 -1015568 -909933 -817087 -661764 -441362 -228097 -44497 105059 141894
3489 141894 -10760 -322682 -598703 -677679 -596081 -386534 -103067 85377 79971 -67758
3479 -67758 -195316 -188933 -85728 -17157 -75862 -181878 -216147 -173763 -163249 -260590 -424075
3468 -424075 -546064 -585145 -567385 -535151 -522324 -491952 -421344 -358286 -392325 -481798 -515011
3457 -515011 -520336 -555053 -572587 -541308 -460230 -328401 -202976 -103157 46879 267930 523548
3446 523548 758126 934655 1045945 1115017 1119470 963903 655509 344078 142655 73356
3436 73356 49896 -11225 -99305 -215310 -417187 -686914 -907794 -989814 -927419 -792286 -616679
3425 -616679 -410819 -221065 -96912 -46194 -33349 -33312 -12535 76470 209498 295322 299295 283486
3413 283486 255446 172021 75398 -4115 -116648 -266917 -387340 -474069 -550631 -531169 -420060
3402 -420060 -374025 -375480 -315290 -191431 -25786 167619 338482 463963 636488 862345
3392 862345 989588 908577 673384 448873 355913 398835 477759 474549 402914 303286 184611
3381 184611 105648 114985 232912 456574 735544 991663 1104283 1032733 857095 678124
3371 678124 536939 426805 339013 301325 322901 406480 555250 728551 887634 1009387
3361 1009387 1023741 864829 618977 403809 257199 204607 222869 327206 555721 837856
3351 837856 1066470 1173830 1127851 950819 713176 472522 250787 33216 -198043 -422800
3341 -422800 -613686 -749699 -789586 -740063 -665846 -560678 -430327 -333644 -268133 -222277 -169189
3330 -169189 -70464 75905 205849 253749 207607 108462 77281 170915 272732 247935 76020
3319 76020 -128360 -220238 -169858 -111883 -144799 -275748 -446146 -569644 -649606 -710056 -762609
3308 -762609 -836426 -925771 -960100 -957112 -941805 -854683 -637855 -325960 -49131 119654 263571
3297 263571 457656 651958 788279 867846 886660 811600 644461 436346 216065 23507
3287 23507 -94835 -125554 -150103 -242736 -397512 -580857 -737690 -854422 -937007 -964154 -941543
3276 -941543 -881496 -756180 -634578 -600477 -600354 -517536 -302490 18840 350281 593204 686876
3265 686876 710798 772913 829953 831704 789880 737732 705095 678451 598756 415953 217637
3254 217637 92880 -34370 -179495 -293259 -380325 -420845 -422290 -436861 -462686 -460378 -406126
3243 -406126 -296505 -164074 -103280 -169582 -318870 -487161 -618577 -694756 -725565 -744726 -796761
3232 -796761 -815484 -703878 -468601 -219331 -53879 31360 48228 -20259 -83686 -78772 -41374
3221 -41374 -5301 20830 33594 35104 21288 -34158 -129640 -245641 -348641 -400885 -379349 -308824
3209 -308824 -248298 -168530 -11844 154799 211128 93996 -105359 -214767 -217208 -184961 -160565
3198 -160565 -182665 -223388 -242860 -242614 -262040 -344570 -443155 -487431 -480568 -469028 -505051 -611175
3186 -611175 -727131 -830659 -913240 -918704 -827721 -670553 -580027 -682072 -915787 -1136981 -1285457
3175 -1285457 -1353536 -1367410 -1317043 -1156697 -911769 -642292 -433140 -310774 -166653 73566
3165 73566 346908 496185 491919 444726 390051 280401 126404 18607 44553 233873 515051
3154 515051 733059 761253 604315 346555 24267 -295979 -507346 -604184 -624751 -599129
3144 -599129 -598567 -686304 -846852 -1030626 -1182738 -1267902 -1279579 -1232748 -1137476 -998778 -845168
3133 -845168 -719485 -658114 -658863 -723884 -790169 -771526 -660421 -465151 -199194 78243 316726
3122 316726 485025 612297 717700 751412 703465 643686 601237 580355 585537 610542 680083
3111 680083 781778 878715 978341 1069405 1128477 1185842 1243276 1209806 1046994 791886 512139
3100 512139 347246 359939 496610 591065 549755 427002 316497 290375 355079 437291 508814
3089 508814 546996 510922 487075 561137 673419 702252 585443 343993 54827 -228318 -472839
3078 -472839 -605015 -600245 -489264 -348442 -262581 -193039 -80785 92517 256648 254280 55562
3067 55562 -173412 -272584 -246178 -172334 -150846 -248159 -390830 -429626 -279692 7276 271300
3056 271300 412906 419710 357817 273251 152248 -1754 -156133 -272282 -283502 -195126 -127260
3045 -127260 -183358 -281702 -275946 -159044 36311 235310 344330 327701 260749 214311 166117
3034 166117 67260 -52756 -89652 -18185 44304 35099 69316 213485 405457 633503 881748
3023 881748 1076178 1118504 987337 790087 601396 402224 223030 165844 204125 248860
3013 248860 316043 406232 441865 405735 341368 292281 309182 414723 574523 674070 644928
3002 644928 573349 526724 427508 248220 85343 9114 -14179 1291 19580 18894 33399 42403
2990 42403 42890 60328 70228 32742 -17731 -40743 -40403 -23822 -24122 -62588 -103847 -124512 -110892
2977 -110892 -80919 -44272 11777 73212 96832 26287 -123497 -272579 -374084 -433906 -484463
2966 -484463 -559235 -627430 -625531 -542870 -387975 -207956 -33119 169206 366456 446347 406454
2955 406454 352292 342377 435096 642080 839708 885857 776453 645681 601335 642566 661207
2944 661207 589948 438449 183498 -142524 -407775 -528513 -525717 -424949 -263778 -106199
2934 -106199 -8198 43671 27738 -65515 -153602 -172181 -131707 -73076 6811 62625 1499 -112848
2922 -112848 -148072 -81510 13158 70971 72333 25325 -45461 -125467 -237167 -346407 -401363
2911 -401363 -400763 -357344 -270934 -185209 -153539 -132788 -88956 -50123 -78950 -203091 -398701 -600965
2899 -600965 -762496 -896927 -1048274 -1159309 -1147695 -1028534 -875016 -742952 -607578 -429707
2889 -429707 -227537 -72088 -13343 34701 136497 249062 393177 587890 767140 883633
2879 883633 970652 1064486 1179622 1297963 1355039 1301807 1147575 954767 776647 666266
2869 666266 621650 551694 423404 284410 172235 93203 43687 -2378 -40965 -25670 76875
2858 76875 238653 387631 509766 605445 646119 683431 753590 799897 756752 614659 394685
2847 394685 117239 -174350 -400685 -549668 -726374 -928121 -1053028 -1060282 -944239 -702220
2837 -702220 -382494 -66809 187373 346649 373768 290463 188729 108141 66353 69490 34412
2826 34412 -73655 -181605 -208795 -149611 -28299 86082 127741 141381 190230 249196 245862
2815 245862 175985 158833 254074 385575 435478 370991 287216 270970 253511 125619 -82360
2804 -82360 -286975 -476394 -625402 -657397 -546330 -427136 -463995 -624901 -748179 -753555 -681329
2793 -681329 -601475 -562381 -546686 -533944 -537611 -549309 -507871 -407496 -293939 -184333 -89060
2782 -89060 -33314 -42946 -85947 -77634 24318 145348 205486 189241 134671 20928 -197023
2771 -197023 -425636 -520502 -488895 -412795 -305840 -191428 -128839 -150568 -248821 -404055 -551646
2760 -551646 -615929 -571945 -449724 -286169 -118481 10811 87040 129205 155200 161950 136742
2749 136742 83433 -11300 -157702 -260491 -265246 -226668 -134050 -1741 59114 15091 -39607
2738 -39607 -55581 -34294 -8691 -63360 -154056 -157607 -75257 2065 -11059 -126921 -276180 -375932
2726 -375932 -412023 -407704 -365251 -265243 -109854 46110 174977 279092 327149 296106 188764
2715 188764 54108 -14550 -18073 -53380 -168984 -260078 -244626 -203621 -220396 -262611 -280354
2704 -280354 -340064 -429855 -427792 -343328 -331673 -427743 -473600 -389747 -246025 -78001 83411
2693 83411 132548 50285 -61022 -139091 -190996 -205925 -196329 -183667 -129849 -22945 66018 19897
2681 19897 -178701 -359189 -384083 -278976 -128506 -31387 -19124 -14582 60880 216327 374060
2670 374060 456884 452946 375495 227251 80656 -7389 -57597 -127776 -255476 -427615 -550364
2659 -550364 -541232 -450058 -317515 -111397 166382 453782 706499 927401 1073631 1073337 920556
2648 920556 635626 280934 -64092 -352089 -558893 -665511 -591619 -315351 61110 409120
2638 409120 635037 774732 870352 919628 945193 948645 914891 836411 770320 803123 919785
2627 919785 1032799 1089481 1100933 1050117 874121 607917 443169 514072 718007 878839
2617 878839 966090 995468 1001598 1035768 1050491 969018 808958 650602 517927 387134 257181
2606 257181 168927 177785 309356 529201 702670 754486 727309 710552 763187 848667 905800
2595 905800 955134 1007391 1017038 943417 827197 766765 795086 906910 1067479 1164009 1121177
2584 1121177 1013620 983810 1079706 1184134 1184545 1135881 1081663 1038976 1054261 1062356 998185 935854
2572 935854 918506 870117 793418 725052 606209 430981 264787 132609 54189 17677 -89287
2561 -89287 -343453 -677310 -919110 -972197 -919199 -817751 -624804 -348494 -70448 125976
2551 125976 252314 355172 421544 460984 510764 568614 567324 455101 315889 237215 165349
2540 165349 64027 12321 21686 1255 -101839 -222953 -307461 -387005 -415470 -307158 -103112
2529 -103112 121512 338132 519533 635219 649713 559366 366370 134539 -32618 -96770
2519 -96770 -66774 7472 99223 207584 255326 239939 215575 140199 -6739 -166974 -269235
2508 -269235 -281454 -237199 -125165 61577 179964 136125 19245 -48315 -42441 -32799 -60410
2497 -60410 -88203 -100020 -82561 -14311 112944 289097 464061 557535 550322 503681 443148
2486 443148 354311 298235 319408 378537 446346 526706 636591 776663 959935 1181444 1392027
2475 1392027 1562552 1675533 1687161 1530844 1254255 996266 792699 574631 288666 9828
2465 9828 -206924 -378559 -485692 -464312 -310203 -125755 -60123 -120558 -196181 -211020 -198791
2454 -198791 -219076 -269537 -349876 -452504 -538730 -570786 -519684 -353676 -173416 -88446 -9883
2443 -9883 145333 316701 409575 426309 456978 501488 467677 355156 193805 -18171 -195660
2432 -195660 -276504 -298459 -321662 -337057 -307897 -263871 -219499 -136988 -60147 -88954 -195546
2421 -195546 -300818 -401436 -497541 -553346 -545495 -436663 -178629 189528 567455 908704
2411 908704 1174599 1291758 1240974 1092092 955583 861578 761155 620106 450755 315912
2401 315912 237254 149813 38541 -14577 19761 63199 63450 41039 -22158 -169466 -347982
2390 -347982 -438999 -448793 -439550 -404656 -365649 -417838 -575040 -721592 -791546 -862679 -978155
2379 -978155 -1080791 -1141196 -1151929 -1100991 -1019838 -992165 -1007289 -931453 -688765 -335252 2517
2368 2517 252880 465882 702065 1006037 1421452 1862354 2092927 1963101 1573571 1150156
2358 1150156 808969 530374 238581 -61780 -294866 -448159 -554431 -626075 -709862 -844746
2348 -844746 -919111 -817720 -613027 -422021 -307296 -257230 -188586 -119325 -64411 -10306 13285
2337 13285 -3492 -52685 -98392 -133007 -181940 -197754 -136918 -77619 -145970 -304493 -424276
2326 -424276 -477841 -438764 -259887 -78395 -31193 -55856 -71564 -35174 74565 176900 205910
2315 205910 188595 173335 185967 193754 167295 124705 54040 -36137 -107549 -166516 -262151 -369349
2303 -369349 -409890 -379928 -306505 -199413 -85195 10432 116300 227688 241144 174768 114406
2292 114406 22298 -152090 -341182 -469208 -555967 -604903 -557283 -418747 -302420 -307898 -395520
2281 -395520 -437117 -354809 -137856 150942 409023 553559 566993 479016 334923 181639
2271 181639 90075 33707 -33493 -131314 -320394 -534351 -643624 -630929 -526153 -380034 -231756
2260 -231756 -54992 159452 290186 303545 298198 299348 315984 388236 542853 720593 808319
2249 808319 797613 738252 675836 646282 576733 384906 142348 -31818 -89133 -46972 43955
2238 43955 146431 284638 413163 453703 433491 377518 287999 172248 117473 209658 370698
2227 370698 466480 487967 502117 510088 477556 350833 111609 -109522 -176883 -129866 -70370
2216 -70370 -35987 -54860 -137260 -228679 -269533 -225967 -143955 -88422 -77557 -139668 -210644 -188445
2204 -188445 -95508 -20281 -8216 -38501 -125186 -309099 -528685 -677867 -685088 -542955 -382086
2193 -382086 -280629 -149189 10410 102073 75417 -25266 -152921 -312936 -461357 -528065
2183 -528065 -543916 -598672 -695766 -745457 -680959 -570210 -465075 -331237 -102212 171947 346959
2172 346959 400640 394603 306974 197937 239189 385626 401924 248256 89432 10224 -9566
2161 -9566 -14230 -39561 -62898 -72146 -128868 -207518 -234118 -188976 -72067 87522 306837 582245
2149 582245 812990 920803 931789 918455 880543 796896 640774 411210 148774 -106235
2139 -106235 -270096 -315555 -284138 -203883 -90218 55382 182571 263565 297702 273315 218430
2128 218430 190346 203208 179543 90026 -15539 -22821 128638 329203 439739 449965 435905
2117 435905 399748 291760 120471 -60065 -206546 -350455 -554546 -848004 -1120211 -1190661
2107 -1190661 -1080833 -973547 -967658 -1012785 -1035455 -1057178 -1090214 -1092515 -1080158 -1030781 -873269
2096 -873269 -633835 -372314 -101716 123716 238772 313052 405493 470039 495273 546343 652368
2085 652368 704548 628869 503679 435444 406542 346530 255358 210417 234234 197176 44278
2074 44278 -96301 -125568 -91553 -19451 153400 374652 472422 401597 306808 325319 435478
2063 435478 574021 759187 958067 1056502 976767 785786 631579 556745 549589 576919 558187
2052 558187 491038 440504 508291 737436 1046311 1319170 1473016 1496349 1450863 1404192 1379509
2041 1379509 1383518 1393881 1351206 1253446 1127617 951813 767508 701409 744015 765197 727813
2030 727813 680085 665713 747457 935483 1146608 1256758 1193174 995902 773287 628399
2020 628399 557502 520982 524950 530397 489025 437392 415072 428592 423775 345221 224363 167790
2008 167790 229580 352862 447681 465724 387802 245117 161861 210835 318610 392778 437975
1997 437975 464280 471781 463392 427514 366726 290191 209360 140218 83431 4662 -134448 -304126
1985 -304126 -413336 -422114 -360096 -285169 -273032 -263236 -156391 3434 155410 252093 243882
1974 243882 145111 26946 -54005 -92815 -113587 -143138 -184157 -207680 -158636 -71946 -70378 -170364
1962 -170364 -261118 -292303 -318644 -314755 -214573 -16000 253252 541376 756838 800102 670740
1951 670740 466377 251947 68504 -76958 -160751 -176952 -167485 -114239 3461 121560 112699
1940 112699 -28391 -181651 -292748 -358035 -367212 -360289 -411040 -543322 -647052 -619142 -467434
1929 -467434 -272112 -102190 -18494 -42366 -109972 -171111 -233567 -308232 -328905 -249754 -90019
1918 -90019 102755 249269 267405 146171 14493 -26927 -22514 -1622 56875 139137 209543
1907 209543 255761 290724 301896 251918 149107 25635 -77011 -113394 -132484 -163730 -137280
1896 -137280 -31584 144441 361381 513741 558999 577391 592426 564104 512427 415536 241185
1885 241185 72464 -18421 -14195 96494 245649 355274 410501 366587 221966 80309 13509
1874 13509 51804 187939 366875 525307 652108 725047 689716 552706 383741 270180
1864 270180 251107 259156 225414 173364 183491 327369 540834 696953 729714 670686 605841
1853 605841 565293 514818 421000 276626 157495 143339 183385 204947 224321 261289 314463
1842 314463 335876 355385 452292 593345 731059 866717 914292 777491 506987 220956
1832 220956 30963 15728 188257 409150 478678 337937 131387 11997 35971 194736
1822 194736 391680 531697 627163 703087 734219 729289 695075 558809 280441 -61381 -415155
1811 -415155 -712866 -843210 -802298 -685336 -592849 -590634 -691404 -825387 -910500 -963809 -1015085
1800 -1015085 -1057761 -1094140 -1096037 -1043528 -979674 -918036 -829041 -738287 -715729 -772952 -868849 -948384
1788 -948384 -985741 -967214 -861213 -666417 -424937 -223660 -102246 7310 156553 296106
1778 296106 324775 224464 107614 47357 -11343 -146024 -328608 -452470 -455996 -347258 -167277
1767 -167277 43711 233985 334749 332585 255021 167741 184901 307194 434796 554941 689868
1756 689868 795541 819265 752362 640579 538040 478253 426161 315828 190896 97785 -13114
1745 -13114 -200411 -402237 -502245 -492305 -395795 -216402 -21972 94341 64339 -92274 -256412
1734 -256412 -348885 -346079 -234549 -35694 166511 265454 231918 162822 153475 245403 412782
1723 412782 551419 566411 454581 279152 140371 67104 -9667 -85356 -95475 -22950 86335
1712 86335 145618 119226 53652 1595 1217 -9465 -92656 -180998 -256886 -345322 -423644 -461356
1700 -461356 -431711 -367240 -330818 -315566 -268110 -177379 -102003 -14335 99246 143349 110549
1689 110549 64467 7687 -63724 -124872 -196095 -322320 -463841 -515115 -494748 -470551 -480988
1678 -480988 -553985 -666660 -737075 -734018 -684700 -644323 -613850 -564468 -498938 -382300 -232570
1667 -232570 -158657 -195555 -250062 -261328 -285015 -306074 -212965 8364 242027 411593 549512
1656 549512 678175 781843 805738 692442 534539 400425 214716 -14315 -193619 -283933
1646 -283933 -288554 -225820 -105540 51842 266575 486038 583742 529672 351253 103640 -147407
1635 -147407 -350593 -490670 -592522 -676871 -717689 -732501 -779897 -808208 -707586 -527812 -374480
1624 -374480 -264317 -185839 -154342 -175478 -190210 -144874 -105439 -210504 -394977 -464801 -396142
1613 -396142 -290851 -218460 -231052 -386040 -608970 -754301 -767655 -658192 -511393 -403702
1603 -403702 -358423 -370091 -410007 -446566 -428098 -334490 -222939 -155787 -166080 -248775 -291882
1592 -291882 -236949 -130428 -32426 3335 -9497 6181 29237 1857 -60636 -142275 -269857
1581 -269857 -413625 -544330 -650361 -684554 -673844 -699869 -763940 -813614 -837647 -802679 -679767
1570 -679767 -514934 -370733 -267143 -179665 -85579 -17735 -2853 -31056 -96431 -169915 -245931
1559 -245931 -336275 -372682 -311791 -242272 -224569 -264268 -396267 -589691 -800647 -964481 -934151
1548 -934151 -669358 -247328 201014 510255 585057 450353 215466 -19405 -188195 -254834
1538 -254834 -260274 -259587 -236149 -144046 -1819 144966 294942 421938 491771 459275 297392
1527 297392 153562 121370 157925 263840 417125 547940 648922 791285 993956 1176382
1517 1176382 1227654 1142292 954170 693800 398593 105993 -142325 -327525 -448790 -522753
1507 -522753 -528548 -427311 -194345 85240 248858 224924 57125 -176398 -417374 -621520
1497 -621520 -727134 -722321 -671467 -635744 -616011 -605634 -595431 -543888 -437190 -335717 -258231
1486 -258231 -166109 -58835 74198 221398 347790 428999 443289 386351 286507 193488 108246
1475 108246 5553 -91436 -136841 -113625 -18067 151211 333369 480491 578825 550486 414859
1464 414859 265778 90694 -127064 -323548 -434248 -397623 -197700 103023 420306 658704
1454 658704 744337 701939 608200 509310 442599 407395 397158 391101 339556 237303 188467 202711
1442 202711 220371 273413 387835 508280 533027 392173 137684 -78623 -189268 -212438
1432 -212438 -142982 -15332 108077 213294 275721 215131 19192 -218680 -368545 -419388
1422 -419388 -467177 -506358 -475651 -384048 -281680 -211144 -139572 -10272 119059 170163 79648
1411 79648 -109989 -239520 -236949 -114162 109011 331910 425287 346293 195316 70781 -21414
1400 -21414 -50939 -19260 39474 102667 132693 126944 102596 132581 265532 400449 512716
1389 512716 634230 686467 600609 382285 142784 59092 120708 193863 204086 144263 2610
1378 2610 -146366 -144517 23008 242114 403987 440434 417529 508550 724555 939688 1087167
1367 1087167 1182292 1292513 1410415 1371782 1093528 737491 462158 245201 65311 -35659
1357 -35659 -97780 -214444 -377878 -506525 -549225 -512134 -433284 -387065 -409337 -457697 -490754
1346 -490754 -457247 -302139 -76204 82133 98359 33100 -60567 -175857 -294963 -386243 -377658
1335 -377658 -297969 -309678 -468123 -667919 -785532 -793362 -739772 -671650 -577209 -420385 -222646
1324 -222646 -58766 68682 220561 390672 560834 703854 746767 675376 617476 651531
1314 651531 688215 644850 574237 555326 584323 598199 536259 406941 243790 88744 23011
1303 23011 117968 272076 298645 144370 -98194 -300350 -388467 -382289 -336937 -285265 -254915
1292 -254915 -227932 -181920 -121273 -51901 25515 74582 49678 -46659 -167172 -216304 -160061
1281 -160061 -103722 -71319 4465 91382 137956 199316 308607 401690 391899 267506 96437
1270 96437 -81505 -190282 -106481 118751 289337 308037 223505 88964 -68772 -190026
1260 -190026 -243475 -232239 -113860 147953 474544 712707 832622 876154 831761 687029
1250 687029 492530 361559 343606 388531 397231 310366 168948 44352 -75881 -252084 -452672
1239 -452672 -568324 -508910 -288088 -27666 184447 306249 331259 266282 131366 55202
1229 55202 99846 147607 75830 -116741 -321224 -418563 -379127 -266653 -149050 -45732 4415
1218 4415 -50966 -200874 -395492 -579209 -760301 -939916 -1032228 -992058 -882397 -788852 -791441
1207 -791441 -910757 -1086233 -1238507 -1372601 -1484776 -1512422 -1412442 -1212025 -989404 -801550
1197 -801550 -596505 -358675 -192287 -140405 -147798 -230883 -419065 -623304 -760662 -801034 -789179
1186 -789179 -797631 -886077 -1070798 -1221431 -1136703 -853819 -577345 -422597 -356745 -276893 -162372
1175 -162372 -38577 117546 284576 359232 273706 138482 122940 191321 251177 290581 319777
1164 319777 370605 402598 378391 329581 341157 464715 609468 667710 644694 612067 630700
1153 630700 693328 734060 697855 589744 475159 366646 252204 206854 238580 276576 266487
1142 266487 229538 190822 155488 159907 225387 270519 175785 -24628 -160202 -141319 6138
1131 6138 208222 381356 472812 483445 467909 460628 419034 263542 55336 -29707 40660
1120 40660 135085 139723 90888 60653 44514 -10370 -129422 -239885 -273247 -240467 -177739 -150701
1108 -150701 -164386 -198969 -308635 -463252 -578283 -638573 -599672 -421555 -218721 -114864
1098 -114864 -108906 -135836 -138572 -125455 -102780 -70444 -116842 -309348 -553486 -733901 -871230
1087 -871230 -974803 -1000774 -897257 -652862 -342697 -67849 136745 274825 335073 363456
1077 363456 414126 410626 222850 -97391 -303016 -304363 -285645 -378421 -503690 -531442 -453570
1066 -453570 -353363 -242238 -103495 2280 10789 -45283 -92511 -124640 -173830 -198093 -144234
1055 -144234 -84952 -135693 -289884 -436784 -481235 -369835 -135791 59939 107555 30718 -78797
1044 -78797 -155491 -191764 -159418 104 200591 232287 28213 -275560 -504300 -580121 -547349
1033 -547349 -473181 -361892 -208422 -51578 87171 182700 215201 209542 213557 309031 472939
1022 472939 621372 703773 702820 671256 653094 625181 543562 366891 152453 27759 6504
1011 6504 77922 206287 307742 347761 384566 439948 489421 508648 480854 426586 337300 192021
999 192021 38180 6195 119277 221292 198361 123929 106164 147355 196740 206866 138997
988 138997 -4324 -191165 -404226 -589740 -735093 -842114 -890392 -900148 -913376 -907252 -830038
977 -830038 -661853 -444277 -284269 -223065 -227862 -196897 -25649 263482 613140 1015822 1429241
966 1429241 1741559 1811579 1624804 1317579 1047840 853113 667619 451288 200739 -50544
956 -50544 -263150 -416539 -437580 -308633 -100139 106752 245339 271742 246210 270818 394411
945 394411 566638 701141 738803 702032 649689 617325 614739 619184 603158 514811 354072 202653
933 202653 175777 313378 475803 588647 689710 743001 702587 660983 744816 862498 833412
922 833412 656255 393111 52268 -357283 -786744 -1113537 -1231961 -1159302 -964791 -722536
912 -722536 -572256 -577694 -622498 -576808 -466882 -395736 -393355 -395133 -372506 -324351 -256555 -161383
900 -161383 4959 217938 389787 480220 557711 678350 763659 686469 433337 176147 66359
889 66359 76870 66390 -74627 -286840 -425373 -449126 -387146 -324880 -311323 -313829 -291197 -260618
877 -260618 -252937 -284369 -328578 -354814 -359595 -319105 -245976 -137496 8569 109447 172440 333482
865 333482 568555 746686 819133 823129 806330 779936 777232 812401 790668 647314 448034
854 448034 251554 40970 -176100 -311374 -292388 -99101 203506 490868 659772 687180
844 687180 602704 488552 385288 295190 283618 383475 489064 495293 386929 249150 233659
833 233659 368054 490551 481267 389685 282646 236979 273087 323088 327921 228372 8597
822 8597 -273231 -522558 -646985 -627434 -516307 -361619 -187928 -34758 12002 -80696 -286140
811 -286140 -559776 -816870 -1012678 -1122341 -1152459 -1166627 -1155249 -1031541 -831438 -717177
801 -717177 -729974 -748385 -672441 -497590 -293206 -82748 189787 523356 787200 859874 725930
790 725930 500761 322052 249168 236433 194058 96107 -58008 -240262 -398902 -489504 -487439
779 -487439 -407404 -273249 -156427 -126472 -235548 -483575 -755758 -971561 -1073202 -1015210
769 -1015210 -885481 -762492 -590894 -310715 29181 298278 412757 329720 96674 -142140
759 -142140 -269472 -337865 -437339 -534287 -545855 -447023 -338707 -327577 -409537 -485252 -505027
748 -505027 -510339 -553915 -611877 -608419 -472954 -253265 -65008 66937 137040 187213 238428
737 238428 255509 199381 53373 -119582 -243804 -302348 -332761 -366746 -366512 -304771 -236619 -186348
725 -186348 -151456 -140251 -114010 -28626 71025 92829 32846 -60058 -143855 -207795 -230171 -170859
713 -170859 -45206 66207 68910 -22880 -118184 -222960 -360310 -470442 -519234 -507674 -473852
$$ [...]
##END NTUPLES=NMR SPECTRUM
##END=
