##TITLE=C13_2PEPA1907
 D2O,  20300 sc

 23.08.2021
##JCAMPDX= 6.0         $$ Bruker NMR JCAMP-DX V2.0
##DATA TYPE= NMR SPECTRUM
##DATA CLASS= NTUPLES
##ORIGIN= UXNMR, Bruker Analytische Messtechnik GmbH
##OWNER= root
$$ XWIN-NMR		Version 3.5
$$ Tue Aug 24 09:08:25 2021 Russian Standard Time (UT+4h)  she@DPX200
##.OBSERVE FREQUENCY= 50.327896
##.OBSERVE NUCLEUS= ^13C
##.ACQUISITION MODE= SIMULTANEOUS
##.ACQUISITION SCHEME= undefined
##.AVERAGES= 20304
##.DIGITISER RES= 17
##SPECTROMETER/DATA SYSTEM= spect
##.PULSE SEQUENCE= zgpg30
##.SOLVENT NAME= CDCl3
##.SHIFT REFERENCE= (INTERNAL, CDCl3, 0, 222.785)
##AUDIT TRAIL= $$ (NUMBER, WHEN, WHO, WHERE, WHAT)
$$ ##TITLE= Audit trail, XWIN-NMR		Version 3.5
$$ ##JCAMPDX= 5.01
$$ ##ORIGIN= Bruker BioSpin GmbH
$$ ##OWNER= she
$$ F:/spectra/data/she/nmr/c13/1/pdata/1/auditp.txt
$$ ##AUDIT TRAIL=  $$ (NUMBER, WHEN, WHO, WHERE, WHAT)
(   1,<2021-08-24 09:05:15.50 +0400>,<she>,<DPX200>,
      <created by zg, POWCHK disabled, PULCHK disabled
       terminated by command 'halt'
       configuration hash MD5:
       00 E9 B6 7A A2 85 ED C7 34 08 36 98 17 FE 4E 26
       data hash MD5: 32K
       90 68 CE 81 6E EA 9E D0 CC CD 31 61 67 F4 CE BD>)
(   2,<2021-08-24 09:05:36.25 +0400>,<she>,<DPX200>,
      <Start of raw data processing
       efp BC_mod = 2 LB = 1 FT_mod = 6 PKNL = 1 PHC0 = -350.5693 PHC1 = 34.56238 SI = 32K 
       data hash MD5: 32K
       9E 42 DC 6C E8 D4 FF 83 1D BE 36 00 E1 97 B7 DA>)
(   3,<2021-08-24 09:05:39.14 +0400>,<she>,<DPX200>,
      <abs ABSG = 5 
       data hash MD5: 32K
       CC 4B D0 DB 7F 3F 02 FC 67 A4 7E 7C 49 0A D1 75>)
(   4,<2021-08-24 09:06:05.14 +0400>,<she>,<DPX200>,
      <pk PHC0 = -1.687943 PHC1 = 2.799999 
       data hash MD5: 32K
       6D DF 2D 06 E8 A5 20 BC EA D3 07 D5 A0 B7 1C 2D>)
(   5,<2021-08-24 09:06:08.60 +0400>,<she>,<DPX200>,
      <abs ABSG = 5 
       data hash MD5: 32K
       84 C3 23 CB 21 00 C7 F0 8B 14 34 CD 8B 8F 5C F6>)
$$ ##END=
$$ 
$$ hash MD5
$$ 80 4F 5B 3A A5 57 DD 81 A0 D9 27 20 49 C2 3E 1F
##$RELAX= 
##$RELAX= 
##$RELAX= 
##$RELAX= 
##$RELAX= 
##$RELAX= 
##$RELAX= 
##$RELAX= 
$$ Bruker specific parameters
$$ --------------------------
##$DU= <F:/spectra>
##$EXPNO= 1
##$NAME= <c13>
##$PROCNO= 1
##$TYPE= <nmr>
##$USER= <she>
##$AMP= (0..31)
100 100 100 100 100 100 100 100 100 100 100 100 100 100 100 100 100 100 
100 100 100 100 100 100 100 100 100 100 100 100 100 100 
##$AQSEQ= 0
##$AQ_mod= 1
##$AUNM= <au_zg>
##$AUTOPOS= <>
##$BF1= 50.322709
##$BF2= 200.13
##$BF3= 50.322709
##$BF4= 500.13
##$BF5= 500.13
##$BF6= 500.13
##$BF7= 500.13
##$BF8= 500.13
##$BYTORDA= 1
##$CFDGTYP= 0
##$CFRGTYP= 5
##$CHEMSTR= <none>
##$CNST= (0..31)
1 1 145 1 1 1 1 1 1 1 1 1 1 1 1 1 1 1 1 1 1 1 1 1 1 1 1 1 1 1 1 1 
##$CPDPRG= <waltz16>
##$CPDPRG1= <>
##$CPDPRG2= <waltz16>
##$CPDPRG3= <>
##$CPDPRG4= <mlev>
##$CPDPRG5= <mlev>
##$CPDPRG6= <mlev>
##$CPDPRG7= <mlev>
##$CPDPRG8= <mlev>
##$CPDPRGB= <>
##$CPDPRGT= <>
##$D= (0..31)
$$ [...]
##$SUBNAM4= <"">
##$SUBNAM5= <"">
##$SUBNAM6= <"">
##$SUBNAM7= <"">
##$SUBNAM8= <"">
##$SUBNAM9= <"">
##$SW= 239.972175391363
##$SWIBOX= (0..15)
0 1 3 0 0 0 0 0 0 0 0 0 0 0 0 0 
##$SW_h= 12077.2946859903
##$TD= 32768
##$TD0= 1
##$TE= 0
##$TE2= 300
##$TE3= 300
##$TEG= 300
##$TL= (0..7)
120 120 120 120 120 120 120 120 
##$TP= (0..7)
150 150 150 150 150 150 150 150 
##$TP07= 0
##$TPNAME0= <>
##$TPNAME1= <>
##$TPNAME2= <>
##$TPNAME3= <>
##$TPNAME4= <>
##$TPNAME5= <>
##$TPNAME6= <>
##$TPNAME7= <>
##$TPOAL= (0..7)
0.5 0.5 0.5 0.5 0.5 0.5 0.5 0.5 
##$TPOFFS= (0..7)
0 0 0 0 0 0 0 0 
##$TUNHIN= 0
##$TUNHOUT= 0
##$TUNXOUT= 0
##$USERA1= <user>
##$USERA2= <user>
##$USERA3= <user>
##$USERA4= <user>
##$USERA5= <user>
##$V9= 5
##$VALIST= <valist>
##$VCLIST= <CCCCCCCCCCCCCCC>
##$VD= 0
##$VDLIST= <DDDDDDDDDDDDDDD>
##$VPLIST= <PPPPPPPPPPPPPPP>
##$VTLIST= <TTTTTTTTTTTTTTT>
##$WBST= 1024
##$WBSW= 4
##$XGAIN= (0..3)
0 0 0 0 
##$XL= 0
##$YL= 0
##$YMAX_a= 102872994
##$YMIN_a= -102797412
##$ZGOPTNS= <>
##$ZL1= 120
##$ZL2= 120
##$ZL3= 120
##$ZL4= 120
##$ABSF1= 222.7851
##$ABSF2= -17.21175
##$ABSG= 5
##$ABSL= 3
##$ALPHA= 0
##$AQORDER= 0
##$ASSFAC= 0
##$ASSFACI= 0
##$ASSFACX= 0
##$ASSWID= 0
##$AUNMP= <proc_1d>
##$AZFE= 0.1
##$AZFW= 0.5
##$BCFW= 0
##$BC_mod= 2
##$BYTORDP= 0
##$COROFFS= 0
##$CY= -3
##$DATMOD= 1
##$DC= 0
##$DFILT= <>
##$DTYPP= 0
##$F1P= 0
##$F2P= 0
##$FCOR= 0.5
##$FTSIZE= 32768
##$FT_mod= 6
##$GAMMA= 0
##$GB= 0
##$INTBC= 1
##$INTSCL= 4.134877e-10
##$ISEN= 128
##$LB= 1
##$LEV0= 0
##$LPBIN= 0
##$MAXI= 10000
##$MC2= 0
##$MEAN= 0
##$ME_mod= 0
##$MI= 0.1934396
##$NCOEF= 0
##$NC_proc= -1
##$NLEV= 6
##$NOISF1= 120.0001
##$NOISF2= 80.00006
##$NSP= 0
##$NTH_PI= 0
##$NZP= 0
##$OFFSET= 222.7851
##$PC= 1.4
##$PHC0= -352.2573
##$PHC1= 37.36238
##$PH_mod= 1
##$PKNL= yes
##$PPARMOD= 0
##$PSCAL= 0
##$PSIGN= 0
##$REVERSE= no
##$SF= 50.3227234934394
##$SI= 32768
##$SIGF1= 140
##$SIGF2= 120
##$SINO= 11.81781
##$SIOLD= 32768
##$SREGLST= <13C.CDCl3>
##$SSB= 0
##$STSI= 32768
##$STSR= 0
##$SW_p= 12077.2946859903
##$SYMM= 0
##$S_DEV= 0
##$TDeff= 32768
##$TDoff= 0
##$TI= <>
##$TILT= no
##$TM1= 0
##$TM2= 0
##$TOPLEV= 0
##$USERP1= <user>
##$USERP2= <user>
##$USERP3= <user>
##$USERP4= <user>
##$USERP5= <user>
##$WDW= 1
##$XDIM= 32768
##$YMAX_p= 365182761
##$YMIN_p= -17016976
$$ End of Bruker specific parameters
$$ ---------------------------------
##NTUPLES= NMR SPECTRUM
##VAR_NAME=  FREQUENCY,     SPECTRUM/REAL,   SPECTRUM/IMAG
##SYMBOL=    X,             R,               I
##VAR_TYPE=  INDEPENDENT,   DEPENDENT,       DEPENDENT
##VAR_FORM=  AFFN,          ASDF,            ASDF
##VAR_DIM=   32768,         32768,           32768
##UNITS=     HZ,            ARBITRARY UNITS, ARBITRARY UNITS
##FACTOR=    0.368581032318806, 1,           1
##FIRST=     11211.1527449562, 0,            0
##LAST=      -866.14194103415, 0,            0
##MIN=       -866.14194103415, -17016976,    0
##MAX=       11211.1527449562, 365182761,    0
$$ Real data points
##PAGE= N=1
##DATA TABLE= (X++(R..R)), XYDATA
$$ [...]
##PAGE= N=2
##DATA TABLE= (X++(I..I)), XYDATA
4707A64034502j684902o49080K407229N89863J987942J895126l084917m10958
4699A65084805j320340j06269j504131k348214L156251J554697j106059l93618
4691A63017122J985496L082504j221160k038487k135058j983025K126665M326943
4683A67161000J12005j209126O40138M18452o56402j178732k053709J265595K971485
4674A67470706k260519j492335M73247J589062J414552N76469J51425k7039j604075
4665A66291493j235654j466026k759743j196965Q50864J149312K972419L21905
4657A64927605k860149j138941N85256O27293n00404j330912L72617K135138K500065
4648A65317568J550513l448784l000129K956758M086593J781208Q774l98846j623572
$$ y = [164034502, 162349600, 161700520, 164107749, 164697612, 166685554, 168580680, 165495763, 165084805, 163764465, 163658196, 162154065, 159805851, 162962102, 164516799, 163410740, 163017122, 165002618, 168085122, 166863962, 164825475, 162690417, 160707392, 162834057, 167161000, 167273005, 166063879, 166704017, 167122469, 166466067, 165287335, 163233626, 164499221, 167470706, 165210187, 163717852, 164191099, 165780161, 167194713, 167771182, 167922607, 167895568, 166291493, 165055839, 163589813, 160830070, 159633105, 160483969, 161633281, 164605700, 164927605, 162067456, 160928515, 161513771, 162141064, 161640660, 160309748, 160682365, 162817503, 165317568, 166868081, 163419297, 160419168, 163375926, 167462519, 169243727, 169252501, 168853655, 167230083]
4639A67230083k547017J034328J691616M58982Q4105j092502j081315K458756
4631A68237036J797185j445913k42066K055542J439714j169803P30812L454386
4623A74856893K070439J041249j187321k3516L843151L74699k293054m72619M303267
4614A82513188L515914K553125J711548J91563j255868n44912l406664j1183865
4606A74094029j2787750o695580j804538L056313M093744K757729K753283J428220
4598A66895450J799984J44720R31568L097782j80671j717513O65621P084982N749936
4589A84471859k38336m078119l213272m231589o674967j0831791j2999401r899599
4581A32304785m998455K094722M448143M890594L630450J211216k905651k598607
$$ y = [167230083, 164683066, 165717394, 167409010, 167867992, 167952097, 166859595, 165778280, 168237036, 170034221, 168588308, 168346242, 170401784, 171841498, 170671695, 171402507, 174856893, 176927332, 177968581, 176781260, 176757744, 180600895, 180975594, 178682540, 178209921, 182513188, 186029102, 188582227, 190293775, 190485338, 189229470, 188684558, 185277894, 174094029, 161306279, 154610699, 152806161, 155862474, 159956218, 162713947, 165467230, 166895450, 168695434, 168840154, 169771722, 172869504, 172688833, 170971320, 171636941, 178721923, 184471859, 184233523, 180155404, 176942132, 172710543, 166035576, 155203785, 142204384, 132304785, 127306330, 129401052, 133849195, 138739789, 142370239, 143581455, 140675804, 138077197]
4573A38077197P69816K083676q74195k552115m30978J057289J048903j065728
4565A38113865p46693L920130L261806J001737J843688J810357J151176K587289
4557A52943355N34291q86677j291489j771859L14985p68870Q27302K006818m95385
4548A51412471j205805j862817k639225j678784J012158j583368j465415O39633
4540A42628848K057377J263374q9008j481882J165322L176762N705916M153670
4532A58580379j735135j818218O06036k020862m274559n080429L39880M512745
4524A49109837L973341J471243m26623k455063N31391L560379K823408P87167
4516A59375080n99092j701976k316809N39168J957227l14941M11086O87418M6966
$$ y = [138077197, 138847013, 140930689, 140056494, 137504379, 137073401, 138130690, 139179593, 138113865, 137367172, 141287302, 144549108, 145550845, 147394533, 149204890, 150356066, 152943355, 153477646, 152590969, 151299480, 149527621, 149842606, 149073736, 149901038, 151907856, 151412471, 150206666, 148343849, 145704624, 144025840, 145037998, 143454630, 141989215, 142628848, 144686225, 145949599, 145860591, 144378709, 145544031, 148720793, 154426709, 158580379, 156845244, 155027026, 155633062, 153612200, 149337641, 144257212, 144597092, 149109837, 153083178, 154554421, 154127798, 151672735, 152204126, 155764505, 158587913, 159375080, 158775988, 157074012, 154757203, 155296371, 157253598, 156938657, 157349743, 158037161, 158084127]
4507A58084127P74545k300663l644516l199712n42009l49624Q76038m51659j933222
4498A47313305L781014N927163Q94051k675613q18997J260123K048122o26513
4490A57102655Q98540L498624K989706K59013m319206m141652j443882J316434
4482A56160232J562336P92379J026719L580420K594411j996896m11645q77031
4474A62430925k959483r96351J25754K469476K713884J306307k484991j129612
4466A61475909J987305l007841k635128P05989J537300J816311J284016O45915
4458A63809776J038558J064370L26507q75399j887917p49538j015881k542434
4450A59168042j481485M48334K584155K079494J080130O51436K569024j235384
$$ y = [158084127, 158858672, 156558009, 152913493, 149713781, 149171772, 148822148, 149698186, 149246527, 147313305, 151094319, 157021482, 157915533, 155239920, 154420923, 155681046, 157729168, 157102655, 158001195, 161499819, 164489525, 164748538, 160429332, 156287680, 154843798, 156160232, 157722568, 158514947, 159541666, 163122086, 165716497, 163719601, 163307956, 162430925, 159471442, 158475091, 158600845, 161070321, 163784205, 165090512, 162605521, 161475909, 163463214, 160455373, 157820245, 158526234, 160063534, 161879845, 163163861, 163809776, 164848334, 165912704, 166239211, 165363812, 163475895, 162726357, 161710476, 159168042, 157686557, 158134891, 160719046, 162798540, 163878670, 164530106, 167099130, 165863746]
4442A65863746l323382m95124J75635M77679k98908j632620j749661P13807M147274
4433A63878446J805244m52961m64932l015084L36175M923376O295402L444922
4425A76750588M126544M891483j864785p462445o827836m014329K37318J719330
4417A67555868j776650k466024j148997J40661J5885J253170K163342J264778
4409A67002033J714095J698797L700574K896334O94888J458433J731054J759636
4401A82655844J610014l28755J594391L509795M896513M161425J347721K923332
4393B02370280L579438k390746j1112263j6438826j1795366l565476J884807M17582
4385A62949430l463280r333151j5078737j3852194q446650J65934R57785K58953
$$ y = [165863746, 162540364, 162045240, 162220875, 162698554, 162399646, 160767026, 159017365, 159731172, 163878446, 165683690, 165230729, 164765797, 161750713, 162086888, 167010264, 173305666, 176750588, 180877132, 185768615, 183903830, 176441385, 169613549, 165599220, 165836538, 167555868, 165779218, 163313194, 162164197, 162304858, 162320743, 163573913, 165737255, 167002033, 168716128, 170414925, 174115499, 177011833, 177706721, 179165154, 180896208, 182655844, 184265858, 183937103, 185531494, 189041289, 193937802, 198099227, 199446948, 202370280, 205949718, 203558972, 192446709, 176007883, 164212517, 160647041, 162531848, 162949430, 159486150, 150152999, 135074262, 121222068, 112775418, 112941352, 113899137, 114158090]
4377A14158090K695240O80743J479948M600779Q002273P874445K430691j12824
4369A41809385L70257K591414J744211k67543k31403n51676j692495k790372j036096
4360A39945682J277235K303214J008017l52803N9475L049240L361231R22636k458426
4351A49115501P25628L164348j915278l899266L822761L159157j571889k180568
4343A50420394j02665M554633L966076o42491q518Q23039J364878J248967k50943
4334A61373370j080071J54810J312872K97571K576259J681176k180941k342819
4326A61792227j371209J194173r42011J38056o98649j999384k71740K82385J559289
4317A59683137K386324J88103k365266j552550Q48075q52079k247176O49914L277993
$$ y = [114158090, 116853330, 117534073, 119014021, 123614800, 131617073, 139491518, 141922209, 141809385, 142179642, 144771056, 146515267, 146247724, 146016321, 145464645, 143772150, 140981778, 139945682, 141222917, 143526131, 144534148, 144181345, 144240820, 147290060, 150651291, 151573927, 149115501, 149841129, 153005477, 151090199, 147190933, 151013694, 154172851, 152600962, 150420394, 150317729, 154872362, 158838438, 158195947, 158187429, 159010468, 160375346, 161624313, 161373370, 160293299, 160448109, 161760981, 162058552, 164634811, 166315987, 164135046, 161792227, 160421018, 161615191, 160673180, 160811236, 160112587, 158113203, 157841463, 158123848, 159683137, 162069461, 162257564, 159892298, 158339748, 159187823, 158335744, 156088568, 156738482, 160016475]
4308A60016475N22966m82743J593705j6159N12973J878732k908591m567510j030184
4299A55519664L445074K996724k21140Q1870k598212k494654J827790L876015
4291A62433131K233935J773599J095514K271109L217975J193644k436272k477521
4283A69305114Q02195K887254K395780k56832j868529j716239n36196j991043
4275A69021504J749663M378828M354476M845542M858934K457121n51171k87535
4267A90827362M694861N224230L329991M176686L110156L327111K36296J551882
4259B16478575O372795J0178037J1492635R929479N428353M98474q535263k3291761
4251B28551324m1711807n2965959m1908520k0677816l903894Q086647J0457447
$$ y = [160016475, 160539441, 160056698, 161650403, 161634244, 162147217, 164025949, 161117358, 156549848, 155519664, 158964738, 161961462, 161740322, 161822192, 159223980, 156729326, 158557116, 162433131, 164667066, 166440665, 167536179, 169807288, 173025263, 174218907, 171782635, 169305114, 170107309, 172994563, 175390343, 175133511, 173264982, 171548743, 171012547, 169021504, 170771167, 175149995, 179504471, 184350013, 189208947, 191666068, 191114897, 190827362, 195522223, 200746453, 204076444, 208253130, 211363286, 214690397, 214926693, 216478575, 222851370, 233029407, 244522042, 254451521, 259879874, 260378348, 251843085, 228551324, 186839517, 133873558, 91965038, 71287222, 67383328, 75469975, 85927422]
4244H5927422Q544944Q429995O206700L211045K963945J668466q17847k091179
4236A14043491q70565p62303q82932r72833k240231k537562k169723Q58526M417314
4227A08883182L301026M106038M543879j246359k132952k72473L581539L123193
4219A23887073O18543J631583M888152M128987J466140N21495K095063n22868
4211A38714168j740198J328686j17843j488348j41809N07185K88755K440873J378557
4202A41170026o3977O4304R07165L067272M503957r69582l581400j806265l236448
4193A40055052l591111J051418J595052R168P8324m80m68310K872137J292110
4184A42893360q05385J311877K92363k305264r97201J600604K649396J972767
$$ y = [85927422, 94472366, 102902361, 109109061, 112320106, 115284051, 116952517, 116134670, 114043491, 113172926, 112410623, 111527691, 110554858, 108314627, 105777065, 103607342, 104465868, 108883182, 112184208, 116290246, 120834125, 119587766, 117454814, 117182341, 120763880, 123887073, 124505616, 126137199, 131025351, 135154338, 136620478, 137141973, 139237036, 138714168, 136973970, 138302656, 138184813, 136696465, 136554656, 137061841, 137350596, 139791469, 141170026, 141106049, 141170353, 142077518, 145144790, 149648747, 148679165, 145097765, 143291500, 140055052, 136463941, 137515359, 139110411, 139119579, 139197903, 139197423, 138729113, 141601250, 142893360, 142087975, 143399852, 143692215, 141386951, 140389750, 141990354, 144639750, 146612517]
4176A46612517J442059j287587n798737j767305N2026j399677j150177j87156
4168A36515963J573968j881867r44425L530168N806339K042574K216427J128433
4160A49987580j417413n69398p74704j101107k718767N45165J838986L233252
4152A49023594L500683L322822M793262L4384m947033n293758J565845J667161
4144A53666960j976577l722482l927982j526048k60796r32785J480217K247093
4136A45047600r26672L31650M673043j142216n151028k499782r10740R78084L197200
4127A43597139J624326j90824O57516R16599L17627j572565l119345Q70413O827167
4118A49928053P249787L092781j311673k454296n46819m42296j90039j98356j537471
$$ y = [146612517, 148054576, 146766989, 140968252, 139200947, 139252973, 137853296, 136703119, 136515963, 138089931, 136208064, 135263639, 138793807, 144600146, 146642720, 148859147, 149987580, 148570167, 148000769, 147226065, 146124958, 143406191, 143951356, 145790342, 149023594, 152524277, 155847099, 160640361, 160674745, 155727712, 150433954, 151999799, 153666960, 151690383, 147967901, 144039919, 142513871, 142253075, 141320290, 142800507, 145047600, 144120928, 144452578, 149125621, 147983405, 142832377, 140332595, 139421855, 140399939, 143597139, 145221465, 145030641, 145688157, 146604756, 146922383, 145349818, 142230473, 143100886, 149928053, 157177840, 160270621, 158958948, 156504652, 155957833, 155515537, 155325498, 155127142, 153589671]
4109A53589671l994307j173321l38109j261512J066979L430305J234789j492860
4101A51061635K141607J708814Q72242P30041k769853J334446K682132j32283
4093A57628781j111240k89156k491015m13413L805743j18175O70741M88555j784748
4084A56386073K48456J799622j176023j309617l346402k286597r01255Q01088
4076A50215345N15838K9799J208748J045804J37335L46104M32978K653999K290366
4067A58876316n15362m8611o06050k475698R16627J776292j593486k508531j989845
4058A51831652l83051j670013J55907L398323J948800j243392r87672J030282
4050A54080836K507939K250605R42412J530421M00716j991137m469473l006178
$$ y = [153589671, 149595364, 148422043, 148083934, 146822422, 147889401, 151319706, 152554495, 151061635, 153203242, 154912056, 155784298, 156514339, 153744486, 155078932, 157761064, 157628781, 156517541, 156228385, 153737370, 153323957, 157129700, 157011525, 157682266, 158170821, 156386073, 156634529, 158434151, 157258128, 155948511, 152602109, 150315512, 149414257, 150215345, 150731183, 150760982, 151969730, 153015534, 153152869, 153498973, 153931951, 156585950, 158876316, 158360954, 158312343, 157706293, 155230595, 156147222, 157923514, 156330028, 153821497, 151831652, 151448601, 149778588, 149934495, 153332818, 155281618, 154038226, 153050554, 154080836, 156588775, 158839380, 159781792, 161312213, 161712929, 159721792, 155252319, 152246141]
4042A52246141l84902O12639L836740K177297N54222k200367m691258k772742
4034A49377770j391221O07078j199344Q45351N287423J571392j258745J755711
4026A55595415K983082j486197k627980J944173K836427j60251L8578j559267
4018A57563980k766211j486278k697416O5644J386530L95201j068010j575146
4010A49818294K109435K568952k38672l79339j049668j50302M589052K428861
4002A59696613l059102m131563r09950O58013m88335P32961K162573M045794K761319
3993A61468323p20656k402098j477986K53623k54513J110806J307107j296192
3985A57988414l727248l474319q2630J234766K415077J405367K7027j755009K16162
$$ y = [152246141, 151861239, 152473878, 156310618, 158487915, 159042137, 156841770, 152150512, 149377770, 147986549, 148593627, 147394283, 148239634, 153527057, 155098449, 153839704, 155595415, 158578497, 157092300, 154464320, 156408493, 159244920, 159084669, 159123247, 157563980, 154797769, 153311491, 150614075, 150679719, 152066249, 152461450, 151393440, 149818294, 151927729, 154496681, 154258009, 153878670, 152829002, 152678700, 157267752, 159696613, 156637511, 152505948, 151595998, 152254011, 151765676, 152498637, 154661210, 158707004, 161468323, 160747667, 158345569, 156867583, 157121206, 156866693, 157977499, 159284606, 157988414, 154261166, 150786847, 150704217, 151938983, 154354060, 155759427, 155786454, 154031445, 154247607]
3976A54247607k30950J607620K471323Q90514j180950j370413q85821O90694L330125
3967A59569749J05458q91285P7569j135014j029843n78111J249607K526482P65758
3958A60660370k112106n48979J233147J160173M87480J030807J083127O06896
3950A63600915K523309R2876k091436j566184k428856j184579M022915M919457
3942A67888417K409947j700994o026005l684494j755549J068679K354517L714465
3934A64268983L311747K08456j489775r23571P15234j544757m565231n5518M84198
3925A60409766K506939M249305K219363o63223N97434K212431r82221j353597
3917A69196197k67349j257201K78629l69802j870671l527503l693381K509310
$$ y = [154247607, 154016657, 155624277, 158095600, 158986114, 157805164, 156434751, 155548930, 156239624, 159569749, 159675207, 158783922, 158861491, 157726477, 156696634, 156118523, 157368130, 159894612, 160660370, 158548264, 157999285, 159232432, 160392605, 160880085, 161910892, 162994019, 163600915, 166124224, 166217100, 164125664, 162559480, 160130624, 158946045, 162968960, 167888417, 170298364, 168597370, 162571365, 158886871, 157131322, 158200001, 160554518, 164268983, 167580730, 167789186, 166299411, 165375840, 166091074, 164546317, 159981086, 159925568, 160409766, 162916705, 167166010, 169385373, 168722150, 169319584, 171532015, 170549794, 169196197, 168928848, 167671647, 167950276, 167580474, 165709803, 162182300, 158488919, 160998229]
3909A60998229M996291N379087L703472J487310R22954r57201n898154l805483
3901A66826505J568852J42280O00255M077415J271933j397318M74833L941548
3893A77506303L338802L254006K854647K691691J715855L584021L465542N02460
3885A98913327J753317L375092L812738L980157L215041L848111J248966k386139
3877B17760610j0532552j9892861k5863180k6271136j9250172j0254867n44644
3870A05151198J733479J817337L889901L254362L867608J857028M43038J170210
3862A23184161N491384P456631O872162J839329j986921J89305K995929L57077
3854A46399057j04533M374953L108856J626692L959006K368305K612370O690661
$$ y = [160998229, 165994520, 171373607, 175077079, 176564389, 177487343, 176530142, 170631988, 166826505, 168395357, 168537637, 169137892, 173215307, 174487240, 173089922, 173564755, 177506303, 180845105, 184099111, 186953758, 189645449, 191361304, 194945325, 198410867, 198913327, 200666644, 204041736, 207854474, 211834631, 215049672, 218897783, 220146749, 217760610, 207228058, 187335197, 161472017, 135200881, 115950709, 105695842, 105151198, 106884677, 108702014, 112591915, 115846277, 119713885, 121570913, 122013951, 123184161, 128675545, 136132176, 143004338, 144843667, 142856746, 143046051, 146041980, 146399057, 146294524, 150669477, 153778333, 155405025, 159364031, 161732336, 164344706, 171035367]
3846A71035367N209124L763602K955120K088135M456568K687631m68689J114554
3838A92841412M86520o911097k3308966l2735571k3514643q177287j560119j70500
3830I6949749L316291L804679K698246N103898M989771n72160m44339O808472
3822A22654607O195024j816986m044491j158583J765453L083020L875171n34429
3814A30018786k636586L33744J354815K166928L506253J277306J054429J744047
3806A38819722j284212k907942k265878K055824J400363n17540p80380k141062
3798A32378895m339673J18684J859401J647027L313816K205679j794749o263325
3790A29125755j945056L303257M384325L49210J949318N097795O34273o52723
$$ y = [171035367, 176244491, 180008093, 182963213, 185051348, 189507916, 192195547, 191726858, 192841412, 193327932, 186416835, 163107869, 130372298, 106857655, 98680368, 97120249, 96949749, 100266040, 104070719, 106768965, 111872863, 116862634, 116290474, 115846135, 122654607, 128849631, 127032645, 122988154, 121829571, 123595024, 126678044, 130553215, 130018786, 127382200, 127715944, 129070759, 131237687, 134743940, 136021246, 137075675, 138819722, 137535510, 134627568, 132361690, 134417514, 135817877, 135300337, 134519957, 132378895, 128039222, 128157906, 130017307, 131664334, 134978150, 137183829, 135389080, 129125755, 127180699, 130483956, 134868281, 135217491, 137166809, 142264604, 142898877, 142246154]
3782A42246154L88776k250764o165818m688398J105605L122714K084363M22537
3774A36265169m40374J031058J513256K891965K609400J593927O69658M60362
3766A46594421Q68529j361983j049283k210888O29031O94936R65844n14221l107196
3757A41509190J923902N991917P79536m399332J142491K452425P91077j245572
3749A48945634m883672n72976M469820K640187M76612R70020o9700j081708j450165
3740A49444052j858228J94322M01575K34447l69141j36056m547959o223463K99646
3731A37439195L706223K684212K567743K569405K122949J976527L641562K214949
3723A58922765j003061m972309l059702r01534J468159L144436l61219l180180
$$ y = [142246154, 142634930, 140384166, 134218348, 129529950, 130635555, 133758269, 135842632, 136265169, 135824795, 136855853, 138369109, 141261074, 143870474, 145464401, 146134059, 146594421, 147462950, 146100967, 145051684, 142840796, 143469827, 144164763, 145130607, 144616386, 141509190, 143433092, 149425009, 150204545, 145805213, 146947704, 149400129, 150191206, 148945634, 144061962, 143488986, 147958806, 150598993, 151075605, 152045625, 151975925, 150894217, 149444052, 147585824, 147780146, 148181721, 148416168, 148047027, 147910971, 143363012, 137139549, 137439195, 141145418, 143829630, 146397373, 148966778, 151089727, 153066254, 156707816, 158922765, 157919704, 152947395, 149887693, 148986159, 150454318, 153598754, 153237535, 150057355]
3715A50057355J11640K529520J115613J389522J035222j084657n466529k270767
3707A47416919L83175J934213M129673K120491q21993k642037j350366l148521
3699A48021554q44103L157233K841021L268902J541113l036377m120453j718709
3691A49110181j662156l74109K52859n90354l76198R85558n15830l664644k311982
3682A40853325L207162L855769j534095j929055K615250L148453J685000j284255
3674A50617554j527787J032398J991672J67088k82193j968961j611483j09721
3666A48308567p04998l89068O97924K470537P18662o70918K60396q7968m03998
3657A50199136k161652l341J310838j247610K26243J948557k54617j239676L983927
$$ y = [150057355, 150168995, 152698515, 153814128, 155203650, 156238872, 155154215, 149687686, 147416919, 147800094, 149734307, 153863980, 155984471, 155162478, 152520441, 151170075, 148021554, 147177451, 150334684, 153175705, 156444607, 157985720, 154949343, 150828890, 149110181, 147448025, 147073916, 147326775, 146736421, 146360223, 147345781, 146829951, 143165307, 140853325, 144060487, 147916256, 146382161, 144453106, 147068356, 150216809, 151901809, 150617554, 149089767, 150122165, 152113837, 152280925, 151998732, 150029771, 148418288, 148308567, 147603569, 147214501, 147912425, 150382962, 151101624, 150430706, 150691102, 150603134, 150199136, 148037484, 148034143, 149344981, 148097371, 148323614, 150272171, 150017554, 148777878, 152761805]
3648A52761805L948661j63388k043061k666209m724699m246091J198070L767915
3640A47833003K490853O17470P5791N44026K06413j177516j207978k727105K76909
3631A46931866K642697J933033K378709M258835K371208k753683l286659m774688
3623A49701318l938862k203281J885779K648868K517951o88008j623275m0600
3615A48259890K115407K165211N9727N37248J19877m464825m201028J216774M058736
3606A49867017K859801O00747o12339j16241l055651m248537j392097Q97714L272730
3597A48073144L725358N15806J96074j265789l99689P27814n69317q35993R7459
3588A50264867J364858K761707o53673o680115j372888L410630K114695J116748
$$ y = [152761805, 156710466, 156547078, 154504017, 151837808, 147113109, 142867018, 144065088, 147833003, 150323856, 150941326, 151017117, 151561143, 151767556, 150590040, 149382062, 146654957, 146931866, 149574563, 151507596, 153886305, 158145140, 160516348, 157762665, 154476006, 149701318, 145762456, 143559175, 145444954, 148093822, 150611773, 149923765, 148300490, 148259890, 150375297, 152540508, 152600235, 153137483, 153257360, 148792535, 144591507, 145808281, 149867017, 152726818, 153327565, 152715226, 152598985, 149543334, 145294797, 143902700, 144800414, 148073144, 151798502, 152314308, 152510382, 151244593, 150844904, 151572718, 151003401, 150167408, 150264867, 151629725, 154391432, 153737759, 147057644, 145684756, 149095386, 151210081, 152326829]
3580A52326829K090170j073886J85135J705248J050183J344203l66611m190672
3572A53070599k464533P19618K725141L336324L620329M371217j296559j056130
3564A63026006q63817j999055j374872n148169o566618k486557P01973J345585
3556A46634476J189730r30486J80427K710704K071987J010027Q45514j040618
3548A52671761p65180j46428J058171M288687L395375l236684l335130n42121
3540A53388451j622390k374785k06288J251104j84238r49354J839383J156153
3532A52298036j868294p59248L095944q89871j965740l37343N13124J807521K428288
3523A54322417J264209k164366j509078L033679L262102J0215k219541k024912
$$ y = [152326829, 154416999, 153343113, 153528248, 155233496, 156283679, 157627882, 157261271, 153070599, 150606066, 151325684, 154050825, 157387149, 161007478, 165378695, 164082136, 163026006, 162162189, 160163134, 158788262, 153640093, 147073475, 144586918, 145288891, 146634476, 147824206, 146893720, 147074147, 149784851, 151856838, 152866865, 153712379, 152671761, 151906581, 151760153, 152818324, 157107011, 160502386, 157265702, 153930572, 153388451, 151766061, 149391276, 149184988, 150436092, 150251854, 149302500, 151141883, 152298036, 150429742, 149670494, 152766438, 151876567, 149910827, 149573484, 150086608, 151894129, 154322417, 155586626, 153422260, 151913182, 154946861, 158208963, 158219178, 155999637, 153974725]
3515A53974725l557140j359823L303506K107498k709918j820060R87903K655400
3507A53582091L659188j455890p74676J6517o08245Q2761r1223j234194j677160
3498A51499169J927153L578252L277779K190875j700266j835804j305688l128208
3490A54503262n130259j842900L406419J496704j111180j016922L34706J942445
3482A52582275K920478J080048j66969K216436j398760k969693j917745J62894
3474A52508964L139467M162078m73405j159417l072432n15695J411822m280720
3466A51720662n190393k57897M298803J967135L443176N119558l239639m018865
3458A53842540m23801j839816k502770k984750J306618K104417K828517L615876
$$ y = [153974725, 150417585, 149057762, 152361268, 154468766, 151758848, 149938788, 150926691, 153582091, 157241279, 155785389, 155010713, 155027230, 154418985, 154501746, 154410523, 153176329, 151499169, 153426322, 157004574, 160282353, 162473228, 160772962, 158937158, 157631470, 154503262, 149373003, 147530103, 150936522, 152433226, 151322046, 150305124, 150639830, 152582275, 155502753, 156582801, 156415832, 158632268, 157233508, 154263815, 152346070, 152508964, 155648431, 159810509, 159337104, 158177687, 155105255, 154589560, 156001382, 151720662, 146530269, 146272372, 150571175, 152538310, 155981486, 161101044, 157861405, 153842540, 153418739, 151578923, 149076153, 146091403, 147398021, 149502438, 152330955, 155946831]
3450A55946831J789895J107585n77428l145589m172862j2807K092337q26393k069822
3441A50131747J15744K673688M538249J989254J3226j627813k878297k212369
3433A52743429q2963K091688p26257K22199P150R48372K491926J203365Q12257
3424A59711166K237243q41136j721607m648891l828927k207857j291079q31760
3416A46577152J629003K76144R0010k06135K374571N298358J733263k423688l387597
3407A51961081j769940j504017j018660O31941L801379M500816K253759o06111
3399A58250248k471188l467442k411573k014807j250169J652881L921988K248000
3391A54457938j426753k231737J167086J172400k424252J624790L322272K77617
$$ y = [155946831, 157736726, 158844311, 158266883, 155121294, 150948432, 150935625, 153027962, 152201569, 150131747, 150247491, 152921179, 157459428, 159448682, 159461908, 157834095, 154955798, 152743429, 152660466, 154752154, 154025897, 154248096, 154255246, 155203618, 157695544, 158898909, 159711166, 161948409, 161107273, 159385666, 154736775, 150907848, 148699991, 147408912, 146577152, 148206155, 148482299, 148572309, 148366174, 150740745, 156039103, 157772366, 155348678, 151961081, 150191141, 148687124, 147668464, 148300405, 152101784, 156602600, 158856359, 158250248, 155779060, 152311618, 149900045, 147885238, 146635069, 148287950, 152209938, 154457938, 153031185, 150799448, 151966534, 153138934, 150714682, 152339472, 155661744, 155939361]
3383A55939361M146925J940398k289054j628893n48557k198097k543496k756444
3375A50062143q3385J113813P64174K301614n70631j187285K691417L042171Q07065
3366A58941096J847285N60448l709279j839581K261072K677601K404006O45047
3358A63787695k834984l901622l367163J224131M51911j884759j605919j391036
3350A50478254l58213l03596j127045P32144K868654K515203J504273j757821
3342A54551853o08716J528879J11657M55689j765147j839009J077006J575351
3334A55087563O432k735337l37656j5252M69393M62199q57118j87091K44477K385158
3324A54522768L259276P49087m50177k245544j469382K838160J959254J560105
$$ y = [155939361, 160086286, 162026684, 159737630, 158108737, 157560180, 155362083, 152818587, 150062143, 149978758, 151092571, 151856745, 154158359, 153587728, 152400443, 155091860, 158134031, 158941096, 160788381, 161348829, 157639550, 155799969, 158061041, 160738642, 163142648, 163787695, 160952711, 157051089, 153683926, 154908057, 155359968, 153475209, 151869290, 150478254, 150120041, 149816445, 148689400, 149421544, 152290198, 154805401, 156309674, 154551853, 153943137, 155472016, 155583673, 156039362, 154274215, 152435206, 153512212, 155087563, 155093995, 152358658, 152021002, 152005750, 152475143, 152937342, 152080224, 151893133, 152137610, 154522768, 157782044, 158531131, 158080954, 155835410, 154366028, 157204188, 159163442, 160723547]
3316A60723547L49893n119o2907R37854N54894l970111m012196o51198j905430
3307A51959227M80119K691809M272485L071513K0567P4894p50943l366888J236417
3298A59689200M227877n75392p116989l153635N520329N637935k942868l346332
3290A57940125j214071k593603m265294m134615K748929L472343J176500L207266
3282A56337580M185342J442299q12455k710422p97752J47382q17980r07397K76565
3273A56343162L6519l201332n92889J997484O0747J979129K865104J245900J182509
3264A61916333M21151k156503J310807K378604k433631Q04062j085232l520317
3256A57635274j923857J417033R00425k441861j096559P16578M50326k227632
$$ y = [160723547, 161073440, 161068321, 161005414, 161943268, 162498162, 158528051, 154515855, 153864657, 151959227, 152439346, 155131155, 159403640, 162475153, 162495720, 162570614, 161819671, 158452783, 159689200, 163917077, 163341685, 156224696, 153071061, 158591390, 164229325, 161286457, 157940125, 156726054, 154132451, 149867157, 145732542, 148481471, 151953814, 153130314, 156337580, 160522922, 161965221, 161152766, 158442344, 157644592, 157791974, 156973994, 156066597, 156343162, 156379681, 153178349, 152585460, 154582944, 154643691, 156622820, 159487924, 160733824, 161916333, 162337484, 160180981, 161491788, 163870392, 161436761, 162240823, 161155591, 157635274, 155711417, 157128450, 158028875, 155587014, 154490455, 155207033, 155657359, 153429727]
3248A53429727l054688L40915k91859Q31770L555571M707600L243218k610772
3240A60151482k956282j798738J460579J949175J813253J053738j344151O86373
3232A61015429N96667k461442o851005q794947N52405O583097K125314p75400
3224A51990118j916707l769267r50799L582866L443747L956673L690326P69512
3216A60796469N30319j806107q64514L75828j846414k743074o48562J940796J842978
3207A57577719K847444J335796k692993k507180P22447J730915L161672K462863
3199A64638683O08643o31733m013101m293227j751362J831902J924545Q548q32322
3190A57490576p03929j526141k696069l39152J588381l26204O78602K059581K110327
$$ y = [153429727, 150375039, 150715954, 150424095, 151255865, 154811436, 159519036, 162762254, 160151482, 157195200, 155396462, 156857041, 158806216, 160619469, 161673207, 160329056, 161015429, 161612096, 159150654, 152299649, 143504702, 144057107, 150640204, 152765518, 151990118, 150073411, 146304144, 145353345, 148936211, 152379958, 156336631, 160026957, 160796469, 161326788, 159520681, 158656167, 159031995, 157185581, 154442507, 153793945, 155734741, 157577719, 160425163, 161760959, 159067966, 156560786, 157283233, 159014148, 162175820, 164638683, 165247326, 164615593, 160602492, 156309265, 154557903, 156389805, 158314350, 158322898, 157490576, 156786647, 155260506, 152564437, 152225285, 153813666, 153487462, 154166064, 156225645, 158335972]
3181A58335972K48340j065389J048358L14726l791402l671972M61169L534176
3173A55413978J770497m80380P98126M008634n13931k433710J718152Q08314J393314
3164A62482994K719832K619648l715747m097231O52137Q28165K44453j083118
3156A60651133o86466l7535L48647l75836k23705j72048J158626p17354k227039
3147A57718423k80724k80655p54831o34543K741641L081745J220990J666548l680255
3138A60798339k319226J735719O23372q86353J18867M093702K019933n19044j233557
3129A64431752J539183n39338k327520j658500k825872j364621J785735Q03533
3121A59844352j303366k25404j956972m458117l614279k169692L190262Q483493
$$ y = [158335972, 158584312, 157518923, 158567281, 158882007, 155090605, 151418633, 151879802, 155413978, 157184475, 156704095, 157502221, 161510855, 160996924, 158563214, 160281366, 161089680, 162482994, 165202826, 167822474, 164106727, 160009496, 160661633, 161489798, 161734251, 160651133, 159964667, 159927132, 160275779, 159899943, 159676238, 159504190, 160662816, 159945462, 157718423, 157437699, 157157044, 156402213, 155767670, 158509311, 161591056, 162812046, 164478594, 160798339, 158479113, 160214832, 160838204, 159951851, 160070718, 164164420, 166184353, 165665309, 164431752, 165970935, 165431597, 163104077, 161445577, 158619705, 157255084, 159040819, 159844352, 158540986, 158315582, 156358610, 151900493, 148286214, 146116522, 149306784, 157790277]
3113A57790277O347347K223254J11214k563512j149880j283232m707105k048474
3105A54719889J995721M859699J982839k599360j84749q12150k542150k7501J138669
3096A58530907J831372m62137j273899r56241K442199L564136M51232m24515K511642
3087A66214696m49108j744349o98060k401964k23554k33916k246726m014933k240944
3078A51961142O81737j608345o30649j201022P03258j13768r30461J901190K652659
3069A53415741K607145J732512J898934P06278N93032j03212k714618j032163
3061A57103649J698470M20391r29531j269689j698966k566370m039297k464288
3053A46254369q35606l18245M355414M304115J351200l73578L75772n33874J448474
$$ y = [157790277, 164137624, 166360878, 166472092, 163908580, 162758700, 161475468, 156768363, 154719889, 156715610, 161575309, 163558148, 160958788, 160774039, 159961889, 157419739, 157392238, 158530907, 160362279, 159900142, 158626243, 157670002, 160112201, 163676337, 164127569, 163703054, 166214696, 165765588, 164021239, 163323179, 160921215, 160697661, 160463745, 158217019, 154202086, 151961142, 152642879, 151034534, 150403885, 149202863, 149906121, 149792353, 148861892, 150763082, 153415741, 156022886, 157755398, 159654332, 160360610, 160953642, 160850430, 158135812, 157103649, 158802119, 159222510, 158292979, 157023290, 155324324, 152757954, 148718657, 146254369, 145418763, 145100518, 149455932, 153760047, 155111247, 154737669, 155113441, 154579567, 156028041]
3044A56028041j618194l851415l378073l21242J038893K319888O212655K687216
3036A59117769j223927k891034l781263j35382M586428K475350k9514L85762K81524
3027A58785713m63948O54949j02552j375843K91334j103405l682286m91377R16676
3018A53429261M73038J337373K313482J287478j335753P86923L885420L304268
3010A65481490Q14695k297794r91891k366169l029535k612954j340327J074261
3002A54731776M068692L445317m31545j483316J823548J775998J171885J476853
2994A66579208k284756l441467o07506J705557k41305l591668o016016o287333
2986A45814714j587105J474637K671703K239091K472738P85550K813460L102732
$$ y = [156028041, 154409847, 150558432, 147180359, 146859117, 147898010, 150217898, 156430553, 159117769, 157893842, 155002808, 151221545, 151086163, 155672591, 158147941, 158118427, 158504189, 158785713, 158321765, 158976714, 158874162, 157498319, 157789653, 156686248, 153003962, 152512585, 153429261, 153902299, 155239672, 157553154, 158840632, 157504879, 158291802, 162177222, 165481490, 166296185, 163998391, 163006500, 160640331, 157610796, 154997842, 153657515, 154731776, 158800468, 162245785, 161814240, 160330924, 162154472, 163930470, 165102355, 166579208, 164294452, 160852985, 160245479, 161951036, 161709731, 158118063, 152102047, 145814714, 144227609, 145702246, 148373949, 150613040, 153085778, 153871328, 156684788, 159787520]
2978A59787520j23032P12276q00313k126070j171036R87487K442104k278355m103941
2969A53326640l379862j644304J233266K491297M597976L755554p38379k888090
2961A56754098l35728K71323J73338j513100j393380K918310N446679K460342
2953A64781882N48205j341607l826429m124814q44549M101197K293836J091646
2945A62679367j347379m040641n16465o14407r75742p70615L60414O79505N25665
2936A55979702K250254L114574L281676j47643j692566k838953j844978P98811
2928A58900877K75142K29068j773860l964775j47812k14893m312723o76549O29113
2919A48943588r32294J410019N574988M411377N72039q73585K414379M84649o720470
$$ y = [159787520, 159664488, 160376764, 159576451, 157450381, 156279345, 157266832, 159708936, 157430581, 153326640, 149946778, 148302474, 149535740, 152027037, 156625013, 160380567, 159642188, 156754098, 156418370, 156689693, 156863031, 155349931, 153956551, 156874861, 162321540, 164781882, 165330087, 163988480, 160162051, 156037237, 155192688, 159293885, 161587721, 162679367, 161331988, 157291347, 156774882, 156160475, 155184733, 154414118, 154774532, 155454037, 155979702, 158229956, 161344530, 164626206, 164478563, 162785997, 159947044, 158102066, 158900877, 159176019, 159405087, 157631227, 153666452, 153518640, 153303747, 148991024, 148314475, 148943588, 148011294, 149421313, 154996301, 159407678, 159979717, 159106132, 161520511, 162005160, 155284690]
2910A55284690m080510O54153M06967P53275J223961J271506q05229m981211j589438
2901A48138164M662089J721813k928524K878271M168568K950212J899880r09331
2893A62581142j756299j282088K689941L681230J951566J194318j903336l727224
2885A63429250k731360L92289J229663k249608p0821L06539L508056K170780k277173
2876A63707615j819409O21242O79667j389145l40951L015018K817556p79668p35322
2867A65776603J058525k553951k568826q55036j390842j760872K86559j213675
2859A56778485J78227L852867J533415K44882J476193O26604J74660j560041l376009
2850A59929283k26625K005868J511051J544205n15195j262005P067j585468l723405
$$ y = [155284690, 151204180, 151858333, 152265300, 153018575, 154242536, 155514042, 154708813, 149727602, 148138164, 152800253, 154522066, 151593542, 154471813, 158640381, 161590593, 163490473, 162581142, 160824843, 159542755, 162232696, 165913926, 167865492, 169059810, 167156474, 163429250, 160697890, 161090179, 162319842, 160070234, 159999413, 160305952, 163814008, 165984788, 163707615, 161888206, 162509448, 163189115, 161799970, 161459019, 164474037, 167291593, 166511925, 165776603, 166835128, 164281177, 161712351, 160857315, 159466473, 157705601, 157992160, 156778485, 156956712, 160809579, 162342994, 162587876, 164064069, 164690673, 164865333, 163305292, 159929283, 159702658, 161708526, 163219577, 164763782, 164248587, 162986582, 162993649, 161408181, 157684776]
2841A57684776j225341j241800n621376k409283J848038K885058K360582J639630
2833A55920284N512432N231272M40707l052346l021215l347002j366532P57456
2825A57075056L400019L478906M78100j902805K00669O18071j088621m086287
2817A58173108k01722M830591L448146j605010j002632K72561R50782L032388
2809A67898212L60870l594779j446469L192355J122005o77987k216372m151519
2801A60486316l601846k492439J570120K255307j881573k57636K601338K518903
2793A61198490o24533k228287l08749J867413K912061K305430J828774O36899
2785A67587498o11526P60850j728597k690389O32288O7370j934224r36063J059833
$$ y = [157684776, 156459435, 155217635, 149596259, 147186976, 149035014, 151920072, 154280654, 155920284, 161432716, 166663988, 167104695, 164052349, 161031134, 157684132, 156317600, 157075056, 160475075, 163953981, 164432081, 162529276, 162729945, 163348016, 162259395, 158173108, 157971386, 162801977, 166250123, 164645113, 163642481, 163915042, 164865824, 167898212, 168259082, 164664303, 163217834, 166410189, 167532194, 166854207, 164637835, 160486316, 156884470, 154392031, 155962151, 158217458, 156335885, 156078249, 158679587, 161198490, 160573957, 158345670, 158036921, 159904334, 162816395, 165121825, 166950599, 167587498, 166975972, 167736822, 166008225, 163317836, 163950124, 164017494, 162083270, 161147207, 162207040]
2776A62207040L328351J178149Q6147q7488k65103j603350l316917l267396M91089
2767A58750522K537487J729645o10226l78614k549027n938918l440407r09366
2759A49191096J138773K015699K890008R6903l356766m75579M139516L536754
2751A59176404J696272Q38362j999820k453087j229419L266142J105433l694347
2743A56705940k044749J175373K633964j89751j735207m62167j193743j162316
2735A53727344M147502L874770J19930k325431k076275J48866L232152J391448
2727A62240306l977976j447461L90560l97810K641861N569140L564023J610459
2719A70193102J153181j090629l678801k939268j159999j282338l339966k816231
$$ y = [162207040, 165535391, 166713540, 166799687, 166712199, 166447096, 164843746, 161526829, 158259433, 158750522, 161288009, 163017654, 162407428, 162028814, 159479787, 153540869, 150100462, 149191096, 150329869, 152345568, 155235576, 155332479, 151975713, 151500134, 155639650, 159176404, 160872676, 161711038, 159711218, 157258131, 156028712, 159294854, 160400287, 156705940, 154661191, 155836564, 158470528, 158280777, 156545570, 156083403, 154889660, 153727344, 157874846, 161749616, 161869546, 159544115, 157467840, 157616706, 160848858, 162240306, 158262330, 156814869, 157205429, 156807619, 159449480, 165018620, 168582643, 170193102, 171346283, 170255654, 166576853, 163637585, 162477586, 161195248, 157855282, 155039051]
2711A55039051M09535O86432j286689j560936l77787K651214J568173J314513
2703A58443506n8621P4946J681587O3220J341277M066991M722033J164922k004159
2694A69495702j672039k308300k593480l446435j913615j851417k113994N74490
2686A54170912N512947M260250r60653k052638K978073L241190K090749M61157
2678A69701987r15467l077597j267405K008922K231004j005212l138706l584266
2670A60953260k760936q46746j23647M184738K828327K274467M89294j719148
2662A65279609l711731l193719l713203k929386N850988Q607396L860661k634509
2654A67416106m486074r55189J980565j949373l800795k576622M10899m19865
$$ y = [155039051, 155448586, 156135018, 154848329, 153287393, 152909606, 155560820, 157128993, 158443506, 158384885, 158459831, 160141418, 160204638, 161545915, 165612906, 170334939, 171499861, 169495702, 167823663, 165515363, 162921883, 159475448, 157561833, 155710416, 153596422, 154170912, 159683859, 163944109, 162983456, 160930818, 163908891, 167150081, 169240830, 169701987, 168786520, 165708923, 164441518, 166450440, 168681444, 167676232, 164537526, 160953260, 158192324, 157345578, 157221931, 161406669, 164234996, 166509463, 166998757, 165279609, 161567878, 158374159, 154660956, 151731570, 157582558, 166189954, 170050615, 167416106, 162930032, 161974843, 163955408, 162006035, 158205240, 155628618, 156039517, 155619652]
2646A55619652N4705L163729K285619Q89285J154938p5024k950479q79408K927985
2637A62191002K622063j569126j515543j892454p27560K055143K546888N42250
2629A64252663J805496J013428j356016l198378j368020J312202J475336J495697
2621A65432408K378966q87000k843513j065169j806475l397664j91158L418853
2613A61039248P18193O65196N37343l476931k629952J003881J974857J481898
2605A61313733O79949N23598j245532j989528q57054l28549J177242J54854N96973
2596A60025686j143741k616674q16936J108084K770958K486200K092591K364442
2588A66270610K539118J050173l505737k327378M021044N501896J392875k676132
$$ y = [155619652, 155674357, 158838086, 161123705, 162012990, 163167928, 163092904, 160142425, 159263017, 162191002, 164813065, 163243939, 161728396, 159835942, 159108382, 161163525, 163710413, 164252663, 166058159, 167071587, 165715571, 162517193, 161149173, 162461375, 163936711, 165432408, 167811374, 166924374, 164080861, 163015692, 161209217, 157811553, 157620395, 161039248, 161757441, 162422637, 162959980, 159483049, 156853097, 157856978, 159831835, 161313733, 161993682, 162517280, 161271748, 159282220, 158425166, 158096617, 159273859, 159428713, 160025686, 158881945, 156265271, 155448335, 156556419, 159327377, 161813577, 163906168, 166270610, 168809728, 169859901, 166354164, 164026786, 168047830, 173549726, 174942601, 172266469]
2580A72266469l117519K250663J034843l425184k379615j656334K82377N45447
2572A65801147o78765K26249L69077m52861J060888P7632k12673J26074O7515
2563A66384283O00499L07337J126320o66269l075015R1926K123208j126767l857083
2554A61908439m86909K410829Q18339k841145o356842k812755j41122K793800
2546A55292634J805222r24529j795283l038148l42703L586812L699459K167752
2538A60451216L222436K311935K383559K670922L176552L452474j560780m693917
2530A71414397k643898j777333k98746k006582m16769J074931J638858j642432
2522A65342426l790734k613572k5672K893085L478769k1697k297003k599968M6050
$$ y = [172266469, 169148950, 171399613, 172434456, 169009272, 166629657, 164973323, 165255700, 165801147, 165122382, 165348631, 165717708, 165264847, 166325735, 166403367, 166190694, 166316768, 166384283, 166984782, 167292119, 168418439, 167752170, 164677155, 164769081, 166892289, 165765522, 161908439, 161421530, 163832359, 164650698, 161809553, 155452711, 152639956, 152498834, 155292634, 157097856, 156173327, 154378044, 151339896, 150997193, 154584005, 158283464, 160451216, 163673652, 165985587, 168369146, 171040068, 174216620, 177669094, 176108314, 171414397, 168770499, 166993166, 166694420, 164687838, 164271069, 165346000, 166984858, 165342426, 161551692, 158938120, 158912448, 161805533, 165284302, 165262605, 162965602, 160365634, 160411684]
2513A60411684K197722L801536L339205L023287j774876l690598k065074j2565
2505A65230321n51447k680393j700323J349315J892R38824J831974P31668O88602
2496A65840433j553899l062625k775893P47353j48354J43918J805015J487402
2488A62483350k159645l040390j193924J891961O91906j555385R2785M065109
2480A61275767J342830o04785k031824l620673j766993L635752L724805o26618
2472A61328261r28493n88729j481940o65205K014680J593772L383144M789770
2464A69445260K340402R90279J22870L30103k085924l969527l273627l92692J230668
2455A64737812J554329L373564J500186j434438k294114j518614P9892L096329
$$ y = [160411684, 162609406, 166410942, 169750147, 172773434, 170998558, 167307960, 165242886, 165230321, 164678874, 161998481, 160298158, 161647473, 161649365, 162588189, 164420163, 165151831, 165840433, 164286534, 161223909, 158448016, 159195369, 159047015, 159190933, 160995948, 162483350, 160323705, 157283315, 156089391, 157981352, 158673258, 157117873, 157210658, 161275767, 162618597, 162013812, 159981988, 156361315, 154594322, 158230074, 161954879, 161328261, 160399768, 159811039, 158329099, 157663894, 159678574, 161272346, 164655490, 169445260, 171785662, 172775941, 172898811, 173228914, 171142990, 167173463, 163899836, 163507144, 164737812, 166292141, 169665705, 171165891, 169731453, 167437339, 165918725, 165998617, 169094946]
2447A69094946J815833J718799K045536K259421J772249K679427j189798k346630
2439A77849783n23661J51554L58750j472066P09171R7589J947617K908914J108300
2430A83135951k511739k406735Q65613O4846p58232K136780L108937K076801j028298
2421A84683924k628652k754427m339570l853427N35822J600817J860937R65383
2413A76070807P96937O3279j550082l27009R18221J468846J7808k968280j642087
2404A72848440M881363L482207J142623q32195j480873j82142N22706R7045N51966
2395A81031140K588733j454505j04440K450815K443592K748956m7846J047063
2387A90703508L03299j550166O50292N09445j205423q92017j130878l50283M528112
$$ y = [169094946, 170910779, 172629578, 174675114, 176934535, 178706784, 181386211, 180196413, 177849783, 177326122, 177477676, 177836426, 176364360, 177073531, 177171120, 179118737, 182027651, 183135951, 180624212, 178217477, 179083090, 179147936, 178389704, 180526484, 183635421, 185712222, 184683924, 182055272, 179300845, 174961275, 171107848, 171643670, 173244487, 175105424, 176070807, 176867744, 176931023, 175380941, 175053932, 175972153, 177440999, 177458807, 174490527, 172848440, 177729803, 181212010, 182354633, 181522438, 180041565, 179859423, 180382129, 180479174, 181031140, 183619873, 182165368, 182060928, 184511743, 186955335, 189704291, 189656445, 190703508, 191006807, 189456641, 190106933, 190616378, 189410955, 188518938, 187388060, 187037777, 191565889]
2378A91565889K390886r21166J616454J830904K357388J264392n51314P33681
2370B00287114J058253N942421N668207L522245P239488L055775K03479P069989
2362B34046971R348049O920722Q021798J0549685J2283089J0605158Q404428J3877034
2354C14056934K0038393J6506430p955641o6271813j19583109j04326994n4112322
2347a648122j7061864L127307J4403894J6341648J4036994J2921381J4481329
2340E6602567R698593N368043M369983M297842M456760O055777J925093j79121
2332I2595537L370214K395625N429676O235306N990383M275839J772759J11455
2324A22176794l028824M72648M118943l83051k46281L112427O23860L34024J370200
$$ y = [191565889, 193956775, 193035609, 194652063, 196482967, 198840355, 200104747, 199553433, 200287114, 201345367, 207287788, 212955995, 216478240, 223717728, 226773503, 226976982, 234046971, 243395020, 250315742, 258337540, 268887225, 281170314, 291775472, 300179900, 314056934, 334095327, 350601757, 342646116, 276374303, 156791194, 52464200, -1648122, -18709986, -15582679, -1178785, 15162863, 29199857, 42121238, 56602567, 66301160, 71669203, 76039186, 80337028, 84793788, 90849565, 92774658, 92595537, 95965751, 98361376, 103791052, 110026358, 116016741, 120292580, 122065339, 122176794, 119147970, 119620618, 123739561, 123356510, 123110229, 126222656, 126846516, 127180540, 128550740]
2315A28550740n58054j892346l19121K834394M768825L380874j744393l398051
2307A31622868J45012O163578O044885p00190l297444j916853j510075P55025
2299A37306806K72168j55265J548502K999897l94044j844547j677697J709708
2291A39765528M616570J496874j678912O47931K820123K509129K60164j829744
2283A48607663k00224p05640q28676k319902l193586m257696k90577L429668Q69033
2274A41110063j761203l54335P36542K3385n68814J500283K22720j785399L049066
2265A42172308K428839j715408R55498j86327n04001N7377j071849j275985j669532
2256A39190920j538733P68271J346803K80894J571374L969299K525669j49426
$$ y = [128550740, 127992686, 126100340, 125781219, 128615613, 133384438, 136765312, 135020919, 131622868, 131767880, 137931458, 143976343, 143276153, 139978709, 138061856, 136551781, 137306806, 137578974, 137423709, 138972211, 141972108, 141578064, 139733517, 138055820, 139765528, 144382098, 145878972, 144200060, 144847991, 147668114, 150177243, 150437407, 148607663, 148407439, 147701799, 146873123, 144553221, 141359635, 137101939, 136811362, 140241030, 141110063, 139348860, 138994525, 139731067, 139754452, 139185638, 140685921, 140908641, 139123242, 142172308, 144601147, 142885739, 143841237, 143654910, 143150909, 143208286, 142136437, 140860452, 139190920, 137652187, 138420458, 139767261, 140048155, 141619529, 145588828, 148114497, 147965071]
2248A47965071K701774L508815j056301m800983Q01784Q31565j294117l4611L61660
2239A48984657L86302k404037k724447J053020J645847j186606n67448j953094
2231A43234194r3427J834715R43456J501385J085812J322869N99246M27556o8947
2222A50786859j561637L60237q58172l51321J458006J312075k502892n844094
2214A42799061J501214K168551R95291J002631k019818m018581j897955K910279
2206A43440673M153489K404213P24623K00216J785308L065605K547554j345607
2198A56976074k395684m026020l213655j687136K450610L207780Q53576k114872
2190A50050673j516506L89245M07180N62837K362904J914270j161170j338852
$$ y = [147965071, 150666845, 154175660, 153119359, 148318376, 149120160, 149951725, 148657608, 148622997, 148984657, 149370959, 146966922, 144242475, 145295495, 146941342, 145754736, 145187288, 143234194, 143140767, 144975482, 145918938, 147420323, 148506135, 149829004, 150428250, 150855806, 150786859, 149225222, 149585459, 148727287, 148375966, 149833972, 151146047, 148643155, 142799061, 144300275, 146468826, 147464117, 148466748, 146446930, 142428349, 140530394, 143440673, 147594162, 149998375, 150722998, 150923214, 152708522, 155774127, 158321681, 156976074, 154580390, 150554370, 147340715, 145653579, 148104189, 151311969, 152165545, 150050673, 148534167, 148923412, 149330592, 149893429, 152256333, 154170603, 153009433, 151670581]
2182A51670581k1429K739151K698230m14995l96435l08910Q85291K864140l14033
2173A59401591j592834k12702m05733j60754l031306j802140K404317Q35753j450994
2164A53985198o07236j360554k020525k239175n01892j168107k477299k604110
2156A41006300R98904M905899L112181l01132n3857J70061j359545L139841M757120
2147A56375772L663535L494092K22098q65235j317725l124767m94501J550280
2139A59503549n261997n640028m78411K025890M903488O210527R31679n220264
2131A56974433l188653K408913L742083K496289K359943j216084j587861K375548
2123A64364611j976571k672509m20266N86759K913175j188349l973916J15629
$$ y = [151670581, 151649152, 154388303, 157086533, 156671538, 156275103, 155966193, 156851484, 159715624, 159401591, 157808757, 157596055, 157190322, 157029568, 153998262, 152196122, 154600439, 155436192, 153985198, 153377962, 152017408, 149996883, 147757708, 147255816, 146087709, 143610410, 141006300, 142005204, 146911103, 150023284, 149722152, 149668295, 149838356, 148478811, 151618652, 156375772, 160039307, 163533399, 163755497, 162890262, 161572537, 158447770, 157953269, 159503549, 154241552, 148601524, 148123113, 150149003, 155052491, 161263018, 162194697, 156974433, 153785780, 156194693, 159936776, 162433065, 164793008, 163576924, 161989063, 164364611, 162388040, 159715531, 159295265, 159882024, 162795199, 161606850, 157632934, 157748563]
2115A57748563J356420j257678m249373k216473K257250n51241m983531k341844
2107A45762093Q23855j460240j686325K37120M078770O181747N309863J451823
2099A60698706p95114k841503l082598J052340N3242j019636j23101j589075m05727
2090A51947534J318137J721081K229464R37775Q24713k994384k044994K054712
2082A55994038M507442N751754N11324k145969p78544k415848l677029k802895
2074A54944273N30866j085691k423865K94513J433141L106258K032588r96113
2066A57835970k268001K006951K269768l021878p82531M22802j276331j18328
2058A55068422J945262K310905J371809j853910n583449l829013n8024J656387
$$ y = [157748563, 159104983, 157847305, 153597932, 151381459, 153638709, 153087468, 148103937, 145762093, 146585948, 145125708, 143439383, 143676503, 147755273, 153937020, 159246883, 160698706, 159903592, 157062089, 153979491, 155031831, 155085073, 154065437, 153942336, 152353261, 151947534, 153265671, 154986752, 157216216, 158153991, 158978704, 155984320, 153939326, 155994038, 160501480, 166253234, 166764558, 164618589, 163840045, 161424197, 157747168, 154944273, 155475139, 154389448, 151965583, 152260096, 153693237, 156799495, 158832083, 157835970, 155567969, 157574920, 159844688, 156822810, 156040279, 156463081, 155186750, 155068422, 157013684, 159324589, 160696398, 158842488, 153259039, 149430026, 149372002, 151028389]
2050A51028389n1067J275805Q6904K951535K970084J459098J710364k536000l676174
2041A55218938r27209j150674L4120m15084j884733j956783o13204m16616J089311
2032A48978066L519689K296690j762350k82872K771111J233147K366727M51206
2024A59571414m228726l765202J991293P942898N147475N90750N70325n25057
2016A67295170k301062k804988m598658l772047L473757L369740J008749j882784
2008A59787877j195659L149857K482854K574770J647274p88017k228473j315389
2000A64115094m599890n462334q37966K204513J479299m95920o89389J909869
1992A57623276L1740K80652N91971L271550J670033R85709o4081l522889k043874
$$ y = [151028389, 150977322, 152253127, 152340031, 155291566, 158261650, 159720748, 161431112, 158895112, 155218938, 154291729, 153141055, 153175175, 152760091, 150875358, 148918575, 148305371, 147888755, 148978066, 152497755, 154794445, 153032095, 152749223, 155520334, 156753481, 159120208, 159571414, 155342688, 151577486, 153568779, 161511677, 166659152, 167249902, 167820227, 167295170, 164994108, 162189120, 157590462, 153818415, 157292172, 160661912, 161670661, 159787877, 158592218, 161742075, 164224929, 166799699, 168446973, 167658956, 165430483, 164115094, 159515204, 154052870, 153214904, 155419417, 156898716, 156402796, 155713407, 157623276, 157655016, 157935668, 158527639, 161799189, 163469222, 164454931, 164390850, 160867961, 158824087]
1983A58824087p7214j74444m56519j16208N50028p5201q8042K955886k22441m208402
1973A56911530k552309j654368j656621m42347J944158M955071K576053p83632
1965A59297535j306446p13396j685496J172408J921018l368425j494806j456524
1957A52365868r76079j725785k391853m25207J544881K232131N32549K090243
1949A53246748K510242M46305j10973j93112k186377j892292j806922j407430
1941A48606189j79023M63827j1549J980992K750214j544752q79649K285783M090450
1932A57562482L012311R72841p43151j645222N64444J321573j59589K466091j727125
1923A61624655l607103l240606l379454j026680J126509M72744j414890K419935
$$ y = [158824087, 158746873, 158572429, 158115910, 157999702, 158549730, 158474529, 158386487, 161342373, 161119932, 156911530, 154359221, 152704853, 151048232, 150605885, 152550043, 157505114, 160081167, 159297535, 157991089, 157277693, 155592197, 156764605, 158685623, 155317198, 153822392, 152365868, 151389789, 149664004, 147272151, 146846944, 148391825, 150623956, 151156505, 153246748, 155756990, 156203295, 156092322, 155899210, 153712833, 151820541, 150013619, 148606189, 148427166, 148890993, 148879444, 150860436, 153610650, 152065898, 151186249, 153472032, 157562482, 160574793, 161547634, 160804483, 159159261, 159723705, 161045278, 160885689, 163351780, 161624655, 158017552, 154776946, 151397492, 150370812, 151497321, 151970065, 150555175, 152975110]
1915A52975110L057393J374641J739367J956828q16674l934850k168675L223731
1907A57406871J954350J734920K401921j161044l980642l010062p22057O50969
1899A55275226J409123k293378l712190K031925P251110L028221l186042J433375
1891A61237370K276609r40060j554053j008132L83166k095345l039065j341600
1883A53918890P14624j038776J131152O1407l63449J20250n038226m542628O70681
1874A45633925K201089P69113L39000K309717J790758K13884J260657j17125j900544
1865A52500474K643174M931773j3236l231083k372595L00693Q08534m95298n18088
1856A54554348K514136K485851R00687J52373m31062j86662R18164J713400J600941
$$ y = [152975110, 156032503, 157407144, 159146511, 161103339, 160286665, 156351815, 154183140, 157406871, 159361221, 161096141, 163498062, 162337018, 158356376, 155346314, 154624257, 155275226, 156684349, 154390971, 150678781, 152710706, 159961816, 162990037, 159803995, 161237370, 163513979, 162573919, 161019866, 160011734, 160394900, 158299555, 155260490, 153918890, 154633514, 153594738, 154725890, 154787297, 154423848, 154544098, 149505872, 144963244, 145633925, 147835014, 148604127, 148943127, 151252844, 153043602, 153257486, 154518143, 154401018, 152500474, 155143648, 160075421, 160062185, 156831102, 154458507, 154759200, 155567734, 155072436, 154554348, 157068484, 159554335, 160455022, 160607395, 160176333, 159989671, 160907835, 162621235, 164222176]
1847A64222176L43643n49833k912166j111688O21869M89685j190452j986514j614569
1838A56312151j434313L85557K360137K842584J973672K379516O59710j563528
1830A63915486J565680L87923k989255O47962K856664o72318j263647l448044
1822A61000451k120118j286501r10432j67575K6864k244364k730845r44589Q94991
1813A51517882K742212L926531J302090k162819k370046K52849J769390M436168
1805A61414257M220628K475884J113758J223745j800966l699400j888561k490538
1797A60568807k139533K39286M83729j457516j56638J377321J79001J99215J208110
1788A60501782Q19960k995222n427762j584265J493603R14195R16990J688674
$$ y = [164222176, 164565819, 164015986, 161103820, 159992132, 160614001, 161103686, 159913234, 157926720, 156312151, 154877838, 155263395, 157623532, 160466116, 162439788, 164819304, 165479014, 163915486, 165481166, 165869089, 162879834, 163527796, 166384460, 165712142, 164448495, 161000451, 158880333, 157593832, 156683400, 156515825, 156542689, 154298325, 151567480, 150622891, 151517882, 154260094, 158186625, 159488715, 157325896, 154955850, 155208699, 156978089, 161414257, 165634885, 168110769, 169224527, 170448272, 168647306, 164947906, 163059345, 160568807, 158429274, 158668560, 159152289, 157694773, 157538135, 158915456, 159094457, 159293672, 160501782, 161321742, 158326520, 152898758, 151314493, 152808096, 153722291, 154639281, 156327955]
1780A56327955Q29238Q3588Q18915K127407K281319m50339j586989J287007j016845
1771A60701256k811281o385p81759l151167l66472j984661Q18096K776191O33547
1762A55827365M48109J123656l58491k12415k89528j035270q38236M04732R81603
1753A56051525M325136N022748J612633l459871m690358k734834k133941q32118
1745A53160920J672450N688980L31026J06302L101178J954175L4945q40210o715087
1736A58494679p707706j684463M571503N326511J559125J489859Q39113k324722
1728A60563899k044228N90376J974878K031716L818103J745241j86274k011568
1720A66482143k986355l51946j526323k898420k207515k627503k107140J164191
$$ y = [156327955, 157157193, 157240781, 158059696, 160187103, 162468422, 162018083, 160431094, 161718101, 160701256, 157889975, 157883590, 157101831, 153950664, 153584192, 151599531, 152417627, 155193818, 155827365, 156275474, 157399130, 157040639, 156828224, 156538696, 155503426, 154665190, 155069922, 156051525, 160376661, 165399409, 167012042, 163552171, 158861813, 156126979, 153993038, 153160920, 154833370, 160522350, 160853376, 160959678, 164060856, 166015031, 166049976, 165209766, 158494679, 150786973, 149102510, 153674013, 159000524, 160559649, 162049508, 162888621, 160563899, 158519671, 159110047, 161084925, 163116641, 166934744, 168679985, 168493711, 166482143, 163495788, 163143842, 161617519, 158719099, 156511584, 153884081, 151776941, 152941132]
1712A52941132J676773o95855j852173O1243J237591K535609L842146K043943
1704A61790409J390702j860494m663673m066877p09976m70291M034030M186824
1696A59630654K76163j337787K06294J647383m12675J33101L031143L548395M38584
1687A67161255k011403n395141l191141k96313M27794O38234R65466n8974j286976
1678A56952801j470905P67575M390885K46345k978350j432128l968292l373509
1670A49134422L01933K875289L768982J446122j400193L30093l59937N3394L442600
1661A59592705K224858J86283n72541j950935j766208j045348K94712j31015j239151
1652A55593360k76242p76329J044929O403429M576171j129250l265602j011223
$$ y = [152941132, 154617905, 153922050, 152069877, 152131120, 153368711, 155904320, 159746466, 161790409, 163181111, 161320617, 156656944, 152590067, 151880091, 151409800, 155443830, 159630654, 159906817, 158569030, 158775324, 160422707, 160010032, 160143133, 163174276, 166722671, 167161255, 165149852, 159754711, 156563570, 156267257, 156695051, 157333285, 158298751, 158239777, 156952801, 155481896, 156249471, 160640356, 160886701, 157908351, 156476223, 152507931, 149134422, 149436355, 152311644, 156080626, 157526748, 156126555, 156456648, 156096711, 156150105, 159592705, 161817563, 162003846, 161431305, 159480370, 157714162, 156668814, 156963526, 156832511, 155593360, 155317118, 154540789, 155585718, 161989147, 166565318, 165436068, 162170466, 161159243]
1644A61159243K23006L21641j016926j962108k772315j5804N82682P53737j504478
1635A55768678k426562J709234L326125K488186P41027O00146p12539k956697
1627A58537598l895486k227078J720017L386224K100977N94852J977160J044410
1619A63238674k276480l226182j055882J806032R35792k405251J63816j690459
1611A55490060m30090K374099J062817j153973j937572Q53507j5334r23839K826895
1602A58146570K355667K331164o8600j582886r41580K66165n77323l5821k36493
1593A59656863k272497j985066K857337K273886r72515L29701p63703L551747
1585A62675753O330434L524342j658502n744265m524853P26278L056796K194818
$$ y = [161159243, 161382249, 161703890, 160686964, 158724856, 155952541, 155936737, 156519419, 157273156, 155768678, 153342116, 155051350, 158377475, 160865661, 161606688, 162206834, 161494295, 158537598, 154642112, 152415034, 154135051, 157521275, 159622252, 160217104, 162194264, 163238674, 160962194, 157736012, 156680130, 158486162, 159421954, 157016703, 157180519, 155490060, 155059970, 157434069, 158496886, 157342913, 155405341, 156258848, 156243514, 155319675, 158146570, 160502237, 162833401, 162764801, 161181915, 160240335, 160506500, 159929177, 159893356, 159656863, 157384366, 155399300, 158256637, 160530523, 159558008, 159887709, 159124006, 162675753, 169006187, 172530529, 170872027, 165127762, 160602909, 161329187, 164385983, 166580801]
1577A66580801R91080o22811m648703m788426j582947P0428J199369M648151N666286
1568A67513228K754412q87386n351612m849921o77777J07717R13924L485801K841438
1559A65849824K65571j662573j787313k56694J18957R60567l230081k745647K761210
1550A60273821J871116J695383J073023k675482l138240l430656P80522K559251
1542A59008738j25953m16576j015135j900105j440464p97383P9831K020399J220714
1533A56634066j359001l31882J438399J425174J905265J422176m5326k524852
1525A58564019k820168k934572J298535L713786m02867j143322o19522j859839
1517A53796050M25526J558453K414419L75091j554347m05914N27751M2292j455555
$$ y = [166580801, 167571881, 166949070, 162300367, 157511941, 155928994, 155999422, 157198791, 161846942, 167513228, 170267640, 169380254, 164028642, 159178721, 158500944, 158608661, 159522585, 163008386, 165849824, 166115395, 164452822, 162665509, 162408815, 162527772, 163488339, 160258258, 157512611, 160273821, 162144937, 163840320, 164913343, 162237861, 159099621, 155668965, 156449487, 159008738, 158882785, 158466209, 157451074, 155550969, 154110505, 153313122, 153392953, 155413352, 156634066, 155275065, 154943183, 156381582, 157806756, 159712021, 161134197, 161088871, 158564019, 155743851, 152809279, 154107814, 157821600, 157418733, 156275411, 155655889, 153796050, 154221576, 155780029, 158194448, 158569539, 157015192, 156609278, 157137029, 157179321, 155723766]
1508A55723766J569909K069927K973545L504641j60034j216436r21041j815606
1500A61728671r22759k464707l514530j962721p251M562500J822232j863245k727447
1491A54650743j816740J675225L90396j526205l078490j589037K192741K250437
1483A53149070K279095K271620L038091J515270q76244L50125l790380n748875
1475A52187772m73011L126412J222281K003857K452041P27813j060796j331637
1467A58854732k326310J141363J841302j954591k880082J334994j49091n16384
1459A55345933j155716j202471j642012j463024k00381J240093L374651K449185
1451A56746258J759604J81697J005362J559593j207982n779161j922369L795228
$$ y = [155723766, 157293675, 159363602, 162337147, 165841788, 165681754, 164465318, 163544277, 161728671, 160805912, 158341205, 154826675, 152863954, 152856703, 157419203, 159241435, 157378190, 154650743, 152834003, 154509228, 154899624, 153373419, 150294929, 148705892, 150898633, 153149070, 155428165, 157699785, 160737876, 162253146, 161376902, 161727027, 157936647, 152187772, 151714761, 154841173, 156063454, 158067311, 160519352, 161247165, 160186369, 158854732, 156528422, 157669785, 159511087, 157556496, 154676414, 156011408, 155862317, 155345933, 154190217, 152987746, 151345734, 149882710, 149682329, 150922422, 154297073, 156746258, 158505862, 158687559, 159692921, 161252514, 160044532, 154265371, 152343002, 156138230]
1443A56138230J504488m38112J38829l54048l238682Q44754K427149j176880n94891
1434A55250837k33701K381548J768739l65640M217557K618645j261767k682939
1426A61693279j359151q68031j693943q81314Q65626n1294j699198k074507j428378
1417A52503089l23204j255942j043498J216414Q46254j121950m031829k065871
1409A44723463L80046O20115K610650K108942K273469K166882K966828J769204
1401A59619599R82465J423506K733515J570291K09364p77703r51956m27434j285693
1392A63095954j88212J132344k90293k223035k176565j068842P49185K032529
1384A61063065p10958m386515k371254K472071N291738K318167j088646n07469
$$ y = [156138230, 157642718, 157204606, 157343435, 156989387, 153750705, 154595459, 157022608, 155845728, 155250837, 155017136, 157398684, 159167423, 158801783, 163019340, 165637985, 164376218, 161693279, 160334128, 159466097, 157772154, 156890840, 157756466, 157705172, 156005974, 153931467, 152503089, 152179885, 150923943, 149880445, 151096859, 151943113, 150821163, 146789334, 144723463, 145103509, 145723624, 148334274, 150443216, 152716685, 154883567, 157850395, 159619599, 160602064, 162025570, 164759085, 166329376, 166538740, 165761037, 164809081, 164381647, 163095954, 162907742, 164040086, 163749793, 161526758, 159350193, 158281351, 159030536, 161063065, 160352107, 155965592, 153594338, 156066409, 161358147, 163676314, 162587668, 162080199]
1376A62080199j241963R93156M479381J655433r88548j136072r64928l676879
1368A61199779n140522l009328J22826M936471O897580K450530n77182m078501
1360A62801653l769487j99035M40406J372794j23924j844318p39537K80449L01626
1351A58520627r40141j974574j41265P11872J005326J638691K181038J9824l119039
1342A57902359k851556k609427Q40972O657048L054415j446772n47728K61638
1334A61260949k644739j992734R23298J076385N61402J807474j091295Q91607
1326A60792347r55327J27756K132690N03484m85876j964868k700854k40139J954140
1317A59163353J674559J451892K234016J017043J011922p70018m247056m464552
$$ y = [162080199, 160838236, 161831392, 166310773, 167966206, 166977658, 165841586, 164876658, 161199779, 156059257, 153049929, 153172755, 158109226, 165006806, 167457336, 166880154, 162801653, 159032166, 158833131, 159273537, 160646331, 160522407, 158678089, 157938552, 158219001, 158520627, 157580486, 155605912, 155464647, 156176519, 157181845, 158820536, 161001574, 161021398, 157902359, 155050803, 152441376, 153282348, 159939396, 162993811, 161547039, 160999311, 161260949, 158616210, 156623476, 157546774, 158623159, 159184561, 160992035, 159900740, 160792347, 159837020, 159964776, 162097466, 162600950, 162115074, 160150206, 157449352, 157209213, 159163353, 160837912, 162289804, 164523820, 165540863, 166552785, 165782767, 161535711, 157071159]
1309A57071159j315760J446481K891564k74255j086117Q75293J551953O06974
1301A61767292M94762J969805q29150l334026j839677K985825J340271r96497
1293A61558605k189610k073578J407078J031121K832410L526565N0702l104069
1285A63039224k129793n10931r50807k729481J51337M802985M810765K014828
1277A68498127n70168k28471n32958O83J412827k07229l450712k865386m456133
1268A57600580O91423K584467L10481j285997p8143j719127L10606M204776J280777
1259A63899843l387737m635379k788438r62399p41889Q80549K800132l23468j00494
1250A54640720L323211q87826k525835q28888k261134K298110L587328m8151l553044
$$ y = [157071159, 155755399, 157201880, 160093444, 159819189, 158733072, 159608365, 161160318, 161767292, 162262054, 164231859, 163402709, 160068683, 158229006, 161214831, 162555102, 161558605, 159368995, 157295417, 158702495, 159733616, 162566026, 166092591, 166143293, 163039224, 160909431, 160398500, 159447693, 156718212, 156869549, 161672534, 166483299, 168498127, 167927959, 167699488, 167166530, 167167213, 168580040, 168372811, 164922099, 162056713, 157600580, 158292003, 160876470, 161186951, 159900954, 159822811, 158103684, 158414290, 162619066, 163899843, 160512106, 155876727, 153088289, 152125890, 151384001, 152264550, 155064682, 154741214, 154640720, 157963931, 157076105, 154550270, 153721382, 151460248, 153758358, 157345686, 157297535, 153744491]
1241A53744491k563131J035590K210736J871415J691793R72782j345080j501100
1233A56117496J945104J542955o05272l74716M70028j345559k474612j856538
1225A53418886K726320N278273K988194P77997m48224M07878j257293j959036
1217A61932995O11122L53641o92664K611746K457797m208930m246101l40421Q22836
1208A59302021M78603k626306k188398N70406R40124m92234q66150K112514J705099
1199A58935679k649163j893189j259935k089635r84613N345561M841702l187179
1191A57059228n577783Q37257M867608J564088j513801k65553J503247J476606
1183A59950897N87949J762842K450276J307577K364596K131413l613649o172049
$$ y = [153744491, 151181360, 152216950, 154427686, 156299101, 157990894, 158963676, 157618596, 156117496, 158062600, 159605555, 159000283, 158625567, 159095595, 157750036, 155275424, 153418886, 156145206, 161423479, 164411673, 165189670, 164741446, 165149324, 163892031, 161932995, 162544117, 162897758, 162205094, 164816840, 167274637, 163065707, 158819606, 158479185, 159302021, 159780624, 157154318, 154965920, 155536326, 156476450, 155984216, 155118066, 157230580, 158935679, 156286516, 154393327, 153133392, 151043757, 150059144, 155404705, 160246407, 157059228, 151481445, 152318702, 157186310, 158750398, 157236597, 156971044, 158474291, 159950897, 160538846, 162301688, 164751964, 166059541, 168424137, 170555550, 166941901, 160769852]
1175A60769852l682961p88289n81425j210391l67906K55810M394630J299928k257893
1166A57831355J427347O341650L434086k318985k093930q11488j349710j10069
1158A62350256J694344K458881m40828l341152l316858L44366M484631L138276
1150A67371916n97571k601611k085828l597449m654256q87921J076800J666067
1142A55690147J699269n08568M13418p93858k592768P7787K301429L937929K459383
1133A62684168K312152K211505O28530q01480k437509k474298r88250N35091j200158
1124A60469751j844441j710548m54483n24098k155792j470931j557450K2712J608206
1115A52382926j065157k389585J444947L842672L844649K279514K702491J954010
$$ y = [160769852, 157086891, 156298602, 155717177, 154506786, 154138880, 154394690, 158789320, 160089248, 157831355, 159258702, 165600352, 169034438, 166715453, 164621523, 163810035, 162460325, 162350256, 164044600, 166503481, 166062653, 162721501, 159404643, 159749009, 164233640, 167371916, 166774345, 164172734, 162086906, 158489457, 153835201, 152947280, 154024080, 155690147, 157389416, 156880848, 157294266, 156500408, 153907640, 153985427, 156286856, 160224785, 162684168, 164996320, 167207825, 167836355, 167034875, 164597366, 162123068, 161134818, 161669909, 160469751, 158625310, 156914762, 156460279, 155936181, 153780389, 152309458, 150752008, 150774720, 152382926, 151317769, 148928184, 150373131, 154215803, 158060452, 160339966, 163042457, 164996467]
1107A64996467k10113j49633P87894L16314k13498L09739j083617j878087n60149
1098A62315317M17603r04395l666648k425980K670843M274039L345064P03555
1090A66729398j129516p66948j838757k914174k561757k555519k172799J249269
1082A54039197K050006J730930J811580L95405N34499Q19852j051443k965820
1074A57364206j054942N62348J066145K548343j16461k736366j924789J395018
1066A57103502k3772J96432J773145M92530R8051m04733J546969L488609J719215
1057A65989948j686279P4136R30304k349034m113084j061448j523488k35177L45090
1048A56370968J19280P15371N12787L008825J929574J522848J15360k418062l99131
$$ y = [164996467, 164786354, 164636721, 165424615, 165740929, 165527431, 165837170, 164753553, 162875466, 162315317, 162732920, 161828525, 158161877, 155735897, 158406740, 162680779, 166025843, 166729398, 165599882, 164832934, 162994177, 160080003, 157518246, 154962727, 152789928, 154039197, 156089203, 157820133, 159631713, 160027118, 160561617, 161381469, 160330026, 157364206, 156309264, 156871612, 157937757, 160486100, 160369639, 157633273, 155708484, 157103502, 157079730, 157276162, 159049307, 159541837, 159639888, 159235155, 160782124, 164270733, 165989948, 164303669, 164377805, 165308109, 162959075, 158845991, 157784543, 156261055, 156025878, 156370968, 156490248, 157205619, 157718406, 160727231, 162656805, 164179653, 164295013, 161876951, 161477820]
1039A61477820J909586Q73459r63828j654605k794914k605651J147072K792144
1031A60181083M494J281813O768133L534035k438261k716244j830133O16857J734100
1022A67135877J924114L841864q51573k360961l94585k30426j934541j074421
1014A66055348K183730O85703q30339l927833l131458J657108L302916J46143
1006A66141318o68189m071765l852635j268926O40285J030857J83486j453440
998A56680991p71L09077q99651r42305N07358J879149J190760p81960J250501
989A59193149K336647q69895k599738j788206k40371K883466K274756l98944M05356
980A61196220J686288P15022J481789O63889q60719j560449k740153j450197j517962
$$ y = [161477820, 163387406, 164260865, 163297037, 161642432, 158847518, 156241867, 157388939, 160181083, 160185577, 161467390, 168235523, 171769558, 169331297, 166615053, 164784920, 165401777, 167135877, 169059991, 172901855, 172050282, 169689321, 169294736, 169064310, 167129769, 166055348, 168239078, 168924781, 168094442, 164166609, 161035151, 162692259, 165995175, 166141318, 165473129, 161401364, 157548729, 156279803, 156920088, 157950945, 158134431, 156680991, 156680220, 156989297, 156089646, 155147341, 155654699, 157533848, 158724608, 157942648, 159193149, 161529796, 160659901, 158060163, 156271957, 156031586, 158915052, 161189808, 160790864, 161196220, 162882508, 163597530, 165079319, 165743208, 164882489, 163322040, 160581887, 159131690, 157613728]
971A57613728l401905m71883L598407K883219M31343k151628J196578J288712
963A60986571j683245J698230M159561K080468J964019L577467K425901j170528
955A74038444l107340k579537j639948K90043K165958r85743k050710l366947
947A62764220l417074k507354j60269L560003L350273L019298L64175j10057l072045
938A63791170l514326J926987K035441l171456m278592J221944K33792p0449N90202
929A58764713L53560R53434k06084M98023N72007L951243L960410J261913l355287
920A66753932k182306j333368l63733J388702J987713j203810J11419J919883
912A67078432M66688n78579n282393o428158n09085K17314n01728L201226L345503
$$ y = [157613728, 154211823, 153739940, 157338347, 160221566, 160652909, 158501281, 159697859, 160986571, 159303326, 161001556, 165161117, 167241585, 169205604, 172783071, 175208972, 174038444, 170931104, 168351567, 166711619, 167001662, 169167620, 168181877, 166131167, 162764220, 159347146, 156839792, 156679523, 160239526, 163589799, 166609097, 166973272, 166863215, 163791170, 160276844, 162203831, 164239272, 161067816, 156789224, 158011168, 158244960, 158174511, 158764713, 159118273, 160071707, 159865623, 160363646, 160935653, 164886896, 168847306, 170109219, 166753932, 164571626, 163238258, 162874525, 164263227, 166250940, 165047130, 165158549, 167078432, 167545120, 166966541, 161684148, 155255990, 154746905, 154964219, 154462491, 157663717, 161009220]
903A61009220J944553J441855K9253j254098L143149M407452J127669n97542j855362
894A69396149r54613R8246o64648O41869j116545j182217k613966m277904k231436
885A57094935p00103M96041J735845J789425J592999J098533l098085m75326K947609
876A62481873m23221K002297J511770O61855K966651l87632l075628k771018l498586
867A59468361J158796J814020J68817l84595j220792o17064J943907M463555J846934
858A68641939j022092r67496J086078K362431J165008J337773k379627k880496
850A67343518l58549o68599j619257J301528j97614l243159k673069j14270K248262
841A62018791J818988k799010j331730l084308k126982j914844j24838L007210
$$ y = [161009220, 162953773, 164395628, 164424881, 163170783, 166313932, 170721384, 171849053, 171251511, 169396149, 168441536, 168539782, 167875134, 168517003, 167400458, 166218241, 163604275, 159326371, 157094935, 156394832, 156890873, 158626718, 160416143, 162009142, 163107675, 160009590, 159534264, 162481873, 162058652, 164060949, 165572719, 166234574, 169201225, 168813593, 165737965, 162966947, 159468361, 160627157, 162441177, 162609994, 162225399, 161004607, 160387543, 162331450, 166795005, 168641939, 167619847, 166652351, 167738429, 170100860, 171265868, 172603641, 170224014, 167343518, 166984969, 166316370, 164697113, 165998641, 165801027, 162557868, 159884799, 159770529, 162018791, 163837779, 161038769, 159707039, 156622731, 154495749, 152580905, 152456067, 155463277]
833A55463277L459309L275081J591762K911438r80976j724554P15342K175483
825A66886162j59767k463450j560597L97201J993252L0007j931086k719447j865065
816A58607210N62424J906868m64643k461441k373731J166473J455495o32443j088189
807A56678023L570046L501154n70716j190034j278136k397879l270216O35351
799A55677593M790876L642809p30450k479568M92700K949735J119402k295628
791A63167469j474697j337550j564524J715495K838021j531465m544597l613771
783A53654381j382927L255222M982288L817426N19262J185258L484928L008254
775A72524092j150571j916785J649543K244029j997242l787309n340763j388059
$$ y = [155463277, 158922586, 162197667, 163789429, 166700867, 165719891, 163995337, 164710679, 166886162, 166726395, 164262945, 162702348, 163099549, 165092801, 165122808, 163191722, 160472275, 158607210, 159169634, 161076502, 160611859, 158150418, 155776687, 156943160, 158398655, 157766212, 156678023, 160248069, 163749223, 163178507, 161988473, 160710337, 158312458, 155042242, 155677593, 160468469, 164111278, 163380828, 160901260, 161393960, 164343695, 165463097, 163167469, 161692772, 160355222, 158790698, 160506193, 163344214, 161812749, 157268152, 153654381, 152271454, 155526676, 160508964, 164326390, 164845652, 166030910, 169515838, 172524092, 171373521, 169456736, 171106279, 173350308, 171353066, 167565757, 162224994, 160836935]
767A60836935K70479N79596j289818l358534J364867K215923J483931K028793
759A64132172J100279j758656n174203k558355N475921N947445L028350J763237
751A71956190k301045j884432k8101l561473j97651L759266J492329J702270j40435
742A70796918m147604p05963J987327j226028l621544k077372P56067m5861N13534
733A62229474k79887j266933l949404m447069K61663R90322J539481R48500L778374
724A59804521K551904j485388j670596n8823J895048J303212Q00074N31470j814876
715A61856546l402669K192970M847118J344989J867080N09857l67749j525780
707A67322362m122378J07871M74509O27827Q80544k777288m035157o88232R08263
$$ y = [160836935, 161107414, 161687010, 160397192, 157038658, 158403525, 160619448, 162103379, 164132172, 165232451, 163473795, 158299592, 155741237, 161217158, 167164603, 170192953, 171956190, 169655145, 167770713, 167742612, 164181139, 163983488, 167742754, 169235083, 170937353, 170796918, 166649314, 165943351, 167930678, 166704650, 163083106, 161005734, 161761801, 161715940, 162229474, 161949587, 160682654, 156733250, 152286181, 152547844, 153538166, 155077647, 156026147, 159804521, 162356425, 160871037, 159200441, 159141618, 161036666, 162339878, 163139952, 163671422, 161856546, 158453877, 160646847, 165493965, 166838954, 168706034, 169215891, 168848142, 167322362, 163199984, 163307855, 163782364, 164410191, 165290735, 162513447, 158478290, 157790058, 158698321]
698A58698321m10938k309848o82375j1978J835666M578683J804540K056308M057946
689A69616325l86990j260798k092711j688121j94093p74963O03652j07154m655355
680A59059792o80393K056789K667479M337445L273386P53361k026459l164516
672A66276884k925730k358966k28482N66228L36266j599606j197119n13251K85487
663A58641711j269411j337446L879297M427872N90732q78016j315676j21806K235083
654A64852340P35957P34386o96359k475019k192847J197787M454951L355624k46420
645A69720400m48029j285914k731252l880015k035956j048874J602333K972163
637A62864856P05073r31775j564253l330068m196846j230028J089310J266403
$$ y = [158698321, 158287383, 155977535, 155295160, 155283182, 157118848, 161697531, 163502071, 165558379, 169616325, 169229335, 167968537, 165875826, 164187705, 163993612, 163218649, 163822301, 163715147, 159059792, 158379399, 160436188, 163103667, 167441112, 170714498, 171467859, 169441400, 166276884, 163351154, 160992188, 160763706, 161329934, 161666200, 160066594, 158869475, 158356224, 158641711, 157372300, 156034854, 159914151, 164342023, 164932755, 164054739, 162739063, 162617257, 164852340, 165588297, 166322683, 165626324, 163151305, 160958458, 162156245, 166611196, 169966820, 169720400, 169272371, 167986457, 165255205, 161375190, 159339234, 158290360, 159892693, 162864856, 163569929, 162638154, 161073901, 157743833, 153546987, 152316959, 153406269, 154672672]
629A54672672L195442N803874M407809k17353l312387l423286Q7834K812218M949195
620A68976018J866180m819111n950349j157858R84108K025197L351986p4944m769793
611A60431434l995732j45618K327273J804182K307852K949090J157682K703653
603A69539816L360383K304187j791901n009958m546431m076421j551999K66966
595A58494642P0582o16492O34488M25762J688118K255365J966892l4008N79633
586A65464982M78674m249630l004425m5835Q46494J420238j65201j617086J432193
577A60560404L073242m9087j662892k022688k593059j809685k009593q08935J00790
568A52778497j401258j982583n65217K289689J882165J594970N249917J667910
$$ y = [154672672, 157868114, 163671988, 168079797, 167862444, 164550057, 161126771, 161214605, 164026823, 168976018, 170842198, 166023087, 160072738, 158914880, 159898988, 161924185, 165276171, 165201227, 160431434, 156435702, 156290084, 158617357, 160421539, 162729391, 165678481, 166836163, 169539816, 172900199, 175204386, 173412485, 168402527, 163856096, 159779675, 158227676, 158494642, 158565224, 157948732, 158583220, 159008982, 160697100, 162952465, 164919357, 164885349, 165464982, 165943656, 161694026, 158689601, 158643766, 159490260, 160910498, 160745297, 159128211, 160560404, 163633646, 163584559, 161921667, 159898979, 157305920, 155496235, 153486642, 152677707, 152778497, 151377239, 149394656, 148829439, 151119128, 153001293, 154596263, 159846180, 161514090]
560A61514090l859962k852345J000698J788835O18028j224568l144631j805810
552A52034335J064304j41970k47671L375935L280580K993346l00504m628295o39326
543A56790734P040914L761997m778381o228852m511829K899910K185753o98552
535A56461694J71177K75294k558915q98217k497736j251108L201727L273213J109312
526A57286441l866129n313446j605266M430548M809109L14095l006096k795708
518A50253548l279188k974690k078582J834154K889146Q74007k78706K842628
510A50082317M718521K133287O02947n81909j244524k502089j884434j923377
502A49400739k86987K160503K585025J891333j027267k245910L30669L74202J27166
$$ y = [161514090, 157654128, 154801783, 155802481, 157591316, 158209344, 156984776, 153840145, 152034335, 153098639, 152956669, 152708998, 156084933, 159365513, 162358859, 162058355, 157430060, 156790734, 163831648, 167593645, 162815264, 156586412, 152074583, 154974493, 157160246, 156461694, 156632871, 156908165, 154349250, 153451033, 150953297, 149702189, 152903916, 156177129, 157286441, 153420312, 148106866, 146501600, 150932148, 155741257, 156055352, 153049256, 150253548, 146974360, 143999670, 141921088, 143755242, 146644388, 147518395, 147239689, 150082317, 154800838, 156934125, 157537072, 156955163, 155710639, 153208550, 151324116, 149400739, 149113752, 151274255, 153859280, 155750613, 154723346, 152477436, 152808105, 153182307, 153309473]
493A53309473K283265L251252K821448M93668l187034l095121j202802p54590
485A53919559p9885J41812l7718q39443l201231k887762k71795K512494J856904
476A51112935k536307j955744J052281J564674Q84445j911243j744108J165873
468A47632806M15672j763142J437408k36351l72060J744574K623421L014131L089184
459A57585643K4863K3232J878179j802463m704377k127759L672053K587167J539902
450A58676440n13282k945203k460463n19975J284988J426772j487129l95461P8224
441A53144911p5961n33546q65014K91674O19995L437724P49568k763619j143929
432A52861803k689645N37690J597945k506706l934447K48968k48356m55836L187576
$$ y = [153309473, 155592738, 158843990, 161665438, 162159106, 158972072, 155876951, 154674149, 153919559, 153839674, 153981486, 153943768, 153104325, 149903094, 147015332, 146743537, 149256031, 151112935, 148576628, 146620884, 147673165, 149237839, 150122284, 148211041, 146466933, 147632806, 148048478, 146285336, 147722744, 147486393, 147114333, 148858907, 151482328, 154496459, 157585643, 157610506, 157633738, 159511917, 157709454, 153005077, 150877318, 154549371, 157136538, 158676440, 158163158, 155217955, 152757492, 152237517, 153522505, 154949277, 153462148, 153066687, 153144911, 153068950, 152535404, 151670390, 151962064, 152582059, 156019783, 156769351, 154005732, 152861803, 150172158, 150709848, 152307793, 149801087, 145866640, 146115608, 145867252, 145411416, 148598992]
423A48598992K782981J157155j444500k023343k29084Q41048M80707k869215k393181
414A44901560k403938q11076O34467n19241J870286O18136J647382J505301p72169
405A46670708Q7527j199395j047056N93143J226957R10378J264042n86173j224998
396A46695133l392640j041899K413550J209435P16406J217902J202339R81804
388A50002030l176943l294442J932395J254864K66973O90267m67349j922236k46739
379A45038820L441465J477645m537180n166465l496552J249174J398838r91434
371A38414311r10622J173940J084592R43571J827655l07529j939080p33964J153155
362A40706029J757392J096883n19100n55758J380603J046264j45699k954727m266148
$$ y = [148598992, 151381973, 152539128, 151094628, 149071285, 148842201, 149683249, 150163956, 147294741, 144901560, 142497622, 141686546, 142321013, 141801772, 143672058, 144290194, 145937576, 147442877, 146670708, 146758235, 145558840, 144511784, 145104927, 146331884, 147242262, 148506304, 147920131, 146695133, 143302493, 142260594, 144674144, 145883579, 146599985, 147817887, 149020226, 150002030, 146825087, 143530645, 145463040, 146717904, 146984877, 147675144, 147207795, 145285559, 145038820, 148480285, 149957930, 145420750, 140254285, 136757733, 138006907, 139405745, 138414311, 137503689, 138677629, 139762221, 140705792, 142533447, 142225918, 140286838, 139552874, 140706029, 142463421, 143560304, 143041204, 142485446, 143866049, 144912313, 144766614, 141811887, 137545739]
353A37545739l39940L410200R0822l895489k805806k094164R64269M737477L043927
344A40657035r08461k74043m86487K34690P59307j885018k105282O91763K597678
335A39281182K175098n58978o69187j580429k19377L563659K408870k54263N8676
326A44205251k223254k392361r64306j349197k927505k261767M70619J280122
318A33837602q45821r01889J316568L326970P74927j898720j428483l821411j690823
309A28668920P85336p50648j494703p33009k86632J234929J90246j858238j215477
300A24540724J605920K74652J300337Q52786Q65895j323048k785363j183668j99074
291A23949161K355910J728674J752077K35115l74605j388227m391398j839551
$$ y = [137545739, 137205799, 140615999, 140706821, 136811332, 134005526, 131911362, 132875631, 137613108, 140657035, 139748574, 139474531, 138988044, 139222734, 139982041, 138097023, 135991741, 136683504, 139281182, 141456280, 140897302, 140228115, 138647686, 138428309, 141991968, 144400838, 144146575, 144205251, 141981997, 139589636, 138625330, 137276133, 134348628, 132086861, 132557480, 133837602, 132991781, 132089892, 133406460, 136733430, 137508357, 135609637, 134181154, 130359743, 128668920, 129454256, 128703608, 127208905, 126475896, 126189264, 127424193, 127614439, 125756201, 124540724, 126146644, 126421296, 127721633, 128574419, 129440314, 128117266, 125331903, 124148235, 123949161, 126305071, 128033745, 129785822, 130020937, 129646332, 128258105, 123866707, 122027156]
283A22027156K634640M373473K217383j086245k578357j847830j061998n28961
275A24149261j498777p96994p10704L69703j002791l698894k983341p50547J847261
266A14924177K384985K596981p86115k544293k393786j119354J519025O81154
258A15262774P71655j47774k164489j061628j6002j418462J986328Q76402K71689
249A14360493Q83176J987922R60454K344669K771616n04810k561704j028197j562991
240A17650628j192207n73723k784356o19612j237294j090545P65049J622233j496287
231A11043886l863781j525821K965892L106584K137488K34487o28025j321312
223A12149398j384481M43151k9001q19968M60634K154485J335438p83822m865414
$$ y = [122027156, 124661796, 129035269, 131252652, 130166407, 127588050, 125740220, 124678222, 124149261, 122650484, 121853490, 121142786, 121512489, 120509698, 116810804, 113827463, 113076916, 114924177, 117309162, 119906143, 119120028, 116575735, 114181949, 113062595, 114581620, 115262774, 116034429, 115886655, 113722166, 112660538, 112644536, 111226074, 113212402, 114088804, 114360493, 115243669, 117231591, 118192045, 120536714, 123308330, 122803520, 120241816, 119213619, 117650628, 116458421, 115884698, 113100342, 112480730, 111243436, 110152891, 110917940, 112540173, 111043886, 107180105, 105654284, 108620176, 111726760, 113864248, 114098735, 113470710, 112149398, 110764917, 111208068, 111179067, 110359099, 110819733, 112974218, 114309656, 113525834, 108660420]
214A08660420l054750J865731J590096k52516k372733L5379O54839p81421l858307
205A02486738l195813J120120J662680p89888j748410k531785q89492R57015J361758
196I8432923n2152K95054l33173L49045K133578J075599O1531j30686J603561
187A03435280J277368M93677j481328k587199j334670q34181k045023k559059
179I4364865l8098K757977K285446M91104j673177j783350k975379j400162K633297
170I4662523K08958k595280j384188o47211J094389L409432N07224N12532o55893
161I5112486l159463k404970o17728j786394n97384N72649K125295Q68337R09561
152I1022389J193209p2500p51847j020305j388174l84460r54641k898105l518411
$$ y = [108660420, 105605670, 107471401, 109061497, 108808981, 106436248, 106471627, 107126466, 106345045, 102486738, 99290925, 100411045, 102073725, 101283837, 99535427, 97003642, 96114150, 97071165, 98432923, 98380771, 98675825, 98342652, 98691697, 100825275, 101900874, 101962405, 101831719, 103435280, 104712648, 105206325, 103724997, 101137798, 99803128, 98968947, 96923924, 94364865, 94326767, 97084744, 99370190, 99861294, 98188117, 96404767, 93429388, 92029226, 94662523, 94871481, 92276201, 90892013, 90244802, 91339191, 94748623, 95255847, 95768379, 95112486, 91953023, 89548053, 88930325, 87143931, 86546547, 87119196, 89244491, 90112828, 91022389, 92215598, 92143098, 91391251, 90370946, 88982772, 88598312, 87643671, 84745566, 81227155]
143H1227155j607512J531901J52360J49671M92793J611467J446796j239767n31344
134H3233520l29781k010703k238684j543489k581190j660924J35390J91618m89689
125G2706068K09747K013485K058702o60610l409472m391193n92293K284129J897785
116G2116348J277091R46297J52026j359110j972199j586288j368820k740581l84126
107F5080638K754803L180611Q38124k014502j758855n91784K28376k37839j95893
98F7283679j087136k274500L92860P87414j67893j324076R62298o6041j438977
89F3067628o20022N43095J275544p53623j849650J202612P41640k658747j329361
80E9619116K163918J880892j224701j729406j890217k583422L43059Q44580M18168
$$ y = [81227155, 79619643, 81151544, 81303904, 81453575, 81946368, 83557835, 85004631, 83764864, 83233520, 82903739, 80893036, 78654352, 77110863, 74529673, 72868749, 73004139, 73195757, 72706068, 72915815, 74929300, 76988002, 76327392, 72917920, 68526727, 67934434, 70218563, 72116348, 73393439, 74339736, 74491762, 73132652, 71160453, 69574165, 68205345, 65464764, 65080638, 67835441, 71016052, 71854176, 69839674, 68080819, 67489035, 67717411, 67479572, 67283679, 66196543, 63922043, 64314903, 65102317, 64934424, 63610348, 64572646, 64506605, 63067628, 62447606, 62990701, 64266245, 63512622, 61662972, 62865584, 63607224, 60948477, 59619116, 61783034, 63663926, 62439225, 60709819, 58819602, 56236180, 56579239, 57423819, 57841987]
71E7841987L85045j51021R91371o5985j076156n15105l376194k233805J546655
62E3346792M852506J141890j171004M79077j816265k027989j666829k038641k770073
53D8329464k417496j031594J008507J253107J602004Q96362p63227m36997Q08867
44D9248997p82843j701100j203918j094343j421181q40475J984927J620381r80189
35D4830256m268110j992583j022283o41877K966737K485272j234646k284203l136187
26C5702376K76070K695108K217937l94738k687873j748768R18755K941623J770696
17D1691186k11216l277621k506887q20119J998921o42307j767722J406016R48889
8C6819140O69535k62464l84530q26155k372948j488719j725384j479878
$$ y = [57841987, 58227032, 58076011, 59067382, 59001397, 57925241, 57410136, 54033942, 51800137, 53346792, 58199298, 59341188, 58170184, 58649261, 56832996, 54805007, 53138178, 51099537, 48329464, 45911968, 44880374, 45888881, 47141988, 48743992, 49640354, 48877127, 48440130, 49248997, 48466154, 46765054, 45561136, 44466793, 43045612, 42205137, 44190064, 45810445, 44830256, 40562146, 38569563, 37547280, 36905403, 39872140, 42357412, 41122766, 38838563, 35702376, 35978446, 38673554, 40891491, 40496753, 37808880, 36060112, 36978867, 39920490, 41691186, 41479970, 38202349, 35695462, 34875343, 36874264, 36231957, 34464235, 35870251, 36819140, 37488675, 37226211, 36841681, 36015526, 33642578, 32153859, 30428475, 28948597]
0B8948597
$$ y = [28948597]
##END NTUPLES=NMR SPECTRUM
##END=
