##TITLE=C13_2PDP1104
 CDCl3, 26000 sc

 11.04.2019
##JCAMPDX= 6.0         $$ Bruker NMR JCAMP-DX V2.0
##DATA TYPE= NMR SPECTRUM
##DATA CLASS= NTUPLES
##ORIGIN= UXNMR, Bruker Analytische Messtechnik GmbH
##OWNER= root
$$ XWIN-NMR		Version 3.5
$$ Fri Apr 12 14:02:30 2019 Russian Standard Time (UT+4h)  she@DPX200
##.OBSERVE FREQUENCY= 50.32789651
##.OBSERVE NUCLEUS= ^13C
##.ACQUISITION MODE= SIMULTANEOUS
##.ACQUISITION SCHEME= undefined
##.AVERAGES= 26391
##.DIGITISER RES= 17
##SPECTROMETER/DATA SYSTEM= spect
##.PULSE SEQUENCE= zgpg30
##.SOLVENT NAME= CDCl3
##.SHIFT REFERENCE= (INTERNAL, CDCl3, 0, 222.653)
##AUDIT TRAIL= $$ (NUMBER, WHEN, WHO, WHERE, WHAT)
$$ ##TITLE= Audit trail, XWIN-NMR		Version 3.5
$$ ##JCAMPDX= 5.01
$$ ##ORIGIN= Bruker BioSpin GmbH
$$ ##OWNER= she
$$ F:/spectra/data/she/nmr/c13/2/pdata/1/auditp.txt
$$ ##AUDIT TRAIL=  $$ (NUMBER, WHEN, WHO, WHERE, WHAT)
(   1,<2019-04-12 14:00:43.65 +0400>,<she>,<DPX200>,
      <created by zg, POWCHK disabled, PULCHK disabled
       terminated by command 'halt'
       configuration hash MD5:
       00 E9 B6 7A A2 85 ED C7 34 08 36 98 17 FE 4E 26
       data hash MD5: 32K
       45 D3 A3 83 E9 28 96 9C 84 CE 6F E4 D7 C4 C9 85>)
(   2,<2019-04-12 14:00:43.82 +0400>,<she>,<DPX200>,
      <Start of raw data processing
       efp BC_mod = 2 LB = 1 FT_mod = 6 PKNL = 1 PHC0 = 1432.26 PHC1 = 6.466777 SI = 32K 
       data hash MD5: 32K
       1F 85 1D 00 12 99 62 A9 0D 38 06 98 4A 45 BA DB>)
(   3,<2019-04-12 14:01:02.31 +0400>,<she>,<DPX200>,
      <pk PHC0 = 9.776559 PHC1 = 0 
       data hash MD5: 32K
       51 03 E8 2A DF 13 E4 00 F0 E7 B2 9E F7 59 34 7F>)
(   4,<2019-04-12 14:01:09.46 +0400>,<she>,<DPX200>,
      <abs ABSG = 5 
       data hash MD5: 32K
       4B D3 0A E6 01 37 A0 F4 4D A9 9F 23 89 2A DD 94>)
(   5,<2019-04-12 14:01:23.70 +0400>,<she>,<DPX200>,
      <pk PHC0 = -19.46536 PHC1 = 30 
       data hash MD5: 32K
       BC 1F EC 95 C8 9A F8 75 7B B9 03 03 EF F2 24 E4>)
(   6,<2019-04-12 14:01:26.79 +0400>,<she>,<DPX200>,
      <abs ABSG = 5 
       data hash MD5: 32K
       E3 43 77 35 AD A1 AE 09 94 CE 29 A7 64 3D DF 61>)
$$ ##END=
$$ 
$$ hash MD5
$$ 9B 0D 07 E8 DC DE FF BF 6A 77 15 DD 45 0E 46 F9
##$RELAX= 
##$RELAX= 
##$RELAX= 
##$RELAX= 
##$RELAX= 
##$RELAX= 
##$RELAX= 
##$RELAX= 
$$ Bruker specific parameters
$$ --------------------------
##$DU= <F:/spectra>
##$EXPNO= 2
##$NAME= <c13>
##$PROCNO= 1
##$TYPE= <nmr>
##$USER= <she>
##$AMP= (0..31)
100 100 100 100 100 100 100 100 100 100 100 100 100 100 100 100 100 100 
100 100 100 100 100 100 100 100 100 100 100 100 100 100 
##$AQSEQ= 0
##$AQ_mod= 1
##$AUNM= <au_zg>
##$AUTOPOS= <>
##$BF1= 50.322709
##$BF2= 200.13
##$BF3= 50.322709
##$BF4= 500.13
##$BF5= 500.13
##$BF6= 500.13
##$BF7= 500.13
##$BF8= 500.13
##$BYTORDA= 1
##$CFDGTYP= 0
##$CFRGTYP= 5
##$CHEMSTR= <none>
##$CNST= (0..31)
1 1 145 1 1 1 1 1 1 1 1 1 1 1 1 1 1 1 1 1 1 1 1 1 1 1 1 1 1 1 1 1 
##$CPDPRG= <waltz16>
##$CPDPRG1= <>
##$CPDPRG2= <waltz16>
##$CPDPRG3= <>
##$CPDPRG4= <mlev>
$$ [...]
##$SUBNAM4= <"">
##$SUBNAM5= <"">
##$SUBNAM6= <"">
##$SUBNAM7= <"">
##$SUBNAM8= <"">
##$SUBNAM9= <"">
##$SW= 239.972172959595
##$SWIBOX= (0..15)
0 1 3 0 0 0 0 0 0 0 0 0 0 0 0 0 
##$SW_h= 12077.2946859903
##$TD= 32768
##$TD0= 1
##$TE= 0
##$TE2= 300
##$TE3= 300
##$TEG= 300
##$TL= (0..7)
120 120 120 120 120 120 120 120 
##$TP= (0..7)
150 150 150 150 150 150 150 150 
##$TP07= 0
##$TPNAME0= <>
##$TPNAME1= <>
##$TPNAME2= <>
##$TPNAME3= <>
##$TPNAME4= <>
##$TPNAME5= <>
##$TPNAME6= <>
##$TPNAME7= <>
##$TPOAL= (0..7)
0.5 0.5 0.5 0.5 0.5 0.5 0.5 0.5 
##$TPOFFS= (0..7)
0 0 0 0 0 0 0 0 
##$TUNHIN= 0
##$TUNHOUT= 0
##$TUNXOUT= 0
##$USERA1= <user>
##$USERA2= <user>
##$USERA3= <user>
##$USERA4= <user>
##$USERA5= <user>
##$V9= 5
##$VALIST= <valist>
##$VCLIST= <CCCCCCCCCCCCCCC>
##$VD= 0
##$VDLIST= <DDDDDDDDDDDDDDD>
##$VPLIST= <PPPPPPPPPPPPPPP>
##$VTLIST= <TTTTTTTTTTTTTTT>
##$WBST= 1024
##$WBSW= 4
##$XGAIN= (0..3)
0 0 0 0 
##$XL= 0
##$YL= 0
##$YMAX_a= 165064088
##$YMIN_a= -42710208
##$ZGOPTNS= <>
##$ZL1= 120
##$ZL2= 120
##$ZL3= 120
##$ZL4= 120
##$ABSF1= 222.6533
##$ABSF2= -17.34351
##$ABSG= 5
##$ABSL= 3
##$ALPHA= 0
##$AQORDER= 0
##$ASSFAC= 0
##$ASSFACI= 0
##$ASSFACX= 0
##$ASSWID= 0
##$AUNMP= <proc_1d>
##$AZFE= 0.1
##$AZFW= 0.5
##$BCFW= 0
##$BC_mod= 2
##$BYTORDP= 0
##$COROFFS= 0
##$CY= -3
##$DATMOD= 1
##$DC= 0
##$DFILT= <>
##$DTYPP= 0
##$F1P= 0
##$F2P= 0
##$FCOR= 0.5
##$FTSIZE= 32768
##$FT_mod= 6
##$GAMMA= 0
##$GB= 0
##$INTBC= 1
##$INTSCL= 1.329259e-09
##$ISEN= 128
##$LB= 1
##$LEV0= 0
##$LPBIN= 0
##$MAXI= 10000
##$MC2= 0
##$MEAN= 0
##$ME_mod= 0
##$MI= 0.9312502
##$NCOEF= 0
##$NC_proc= 3
##$NLEV= 6
##$NOISF1= 120.0001
##$NOISF2= 80.00006
##$NSP= 0
##$NTH_PI= 0
##$NZP= 0
##$OFFSET= 222.6533
##$PC= 1.4
##$PHC0= 1422.572
##$PHC1= 36.46678
##$PH_mod= 1
##$PKNL= yes
##$PPARMOD= 0
##$PSCAL= 0
##$PSIGN= 0
##$REVERSE= no
##$SF= 50.3227306370915
##$SI= 32768
##$SIGF1= 140
##$SIGF2= 120
##$SINO= 35.31775
##$SIOLD= 32768
##$SREGLST= <13C.CDCl3>
##$SSB= 0
##$STSI= 32768
##$STSR= 0
##$SW_p= 12077.2946859903
##$SYMM= 0
##$S_DEV= 0
##$TDeff= 32768
##$TDoff= 0
##$TI= <>
##$TILT= no
##$TM1= 0
##$TM2= 0
##$TOPLEV= 0
##$USERP1= <user>
##$USERP2= <user>
##$USERP3= <user>
##$USERP4= <user>
##$USERP5= <user>
##$WDW= 1
##$XDIM= 32768
##$YMAX_p= 292335403
##$YMIN_p= -4165993
$$ End of Bruker specific parameters
$$ ---------------------------------
##NTUPLES= NMR SPECTRUM
##VAR_NAME=  FREQUENCY,     SPECTRUM/REAL,   SPECTRUM/IMAG
##SYMBOL=    X,             R,               I
##VAR_TYPE=  INDEPENDENT,   DEPENDENT,       DEPENDENT
##VAR_FORM=  AFFN,          ASDF,            ASDF
##VAR_DIM=   32768,         32768,           32768
##UNITS=     HZ,            ARBITRARY UNITS, ARBITRARY UNITS
##FACTOR=    0.368581032318806, 1,           1
##FIRST=     11204.5222956761, 0,            0
##LAST=      -872.772390314241, 0,           0
##MIN=       -872.772390314241, -4165993,    0
##MAX=       11204.5222956761, 292335403,    0
$$ Real data points
##PAGE= N=1
##DATA TABLE= (X++(R..R)), XYDATA
$$ [...]
$$ plain form
15944 -37244 -72753 78022 231276 431656 442860 149785 -122780 -93086 -14884 54198 150422
15933 150422 204721 163468 79894 -164219 -349968 -297255 -74471 -49202 -61119 151383 -27998
15922 -27998 -267122 -192174 -236167 -328199 -239581 -102787 -3967 -8310 -6431 13395 50344 -74777
15910 -74777 -209952 -159755 -119393 -188450 -299923 -140488 155334 359571 314932 294982 131852
15899 131852 4978 -18893 -192375 -441870 -416767 -413097 -555913 -426914 -252133 -211913
15889 -211913 -137722 46541 -71638 -119099 -285032 -672583 -847979 -727404 -326984 89015
15879 89015 226245 506660 814223 969630 894403 649495 615208 629536 756505 839171
15869 839171 642618 356306 61662 -56275 256284 526327 506607 341118 161575 314880
$$ packed form
15944c7244l5509J50775J53254K00380J1204k93075k72565K9694P8202O9082R6224
15933A50422N4299m1253q3574k44113j85749N2713K22784K5269j1917K12502j79381
15922b7998k39124P4948m3993r2032Q8618J36794R8820m343J879J9826L6949j25121
15910g4777j35175N0197M0362o9057j11473J59435K95822K04237m4639j9950j63130
15899A31852j26874k3871j73482k49495K5103L670j42816J28999J74781M0220
15889b11913P4191J84263j18179m7461j65933l87551j75396J20575M00420M15999
15879H9015J37230K80415L07563J55407p5227k44908l4287J4328J26969Q2666
15869H39171j96553k86312k94644j17937L12559K70043j9720j65489j79543J53305
$$ plain form
15859 314880 233650 -130845 -303160 -240066 -122163 -229124 -274230 -247312 -207673 -28894
15849 -28894 166856 274650 500476 676221 687975 620815 412076 220824 230113 157838 -126187
15838 -126187 -316325 -204495 38517 133124 -271201 -660556 -1010394 -1088846 -801726 -628615
15828 -628615 -364849 -194211 -280826 -405339 -302138 54527 259359 120598 159799 214546
15818 214546 96527 194723 184556 -15855 -57157 93121 192136 330897 514525 532572
15808 532572 609841 611112 562170 398702 154573 130352 -55262 -331717 -394904 -506373 -625467
15797 -625467 -679253 -594801 -480628 -274399 -75791 -105052 35231 23260 -193910 -123055
15787 -123055 4846 -181715 -256483 -63121 103404 -3985 -72819 -306664 -466723 -278917
$$ packed form
15859C14880q1230l64495j72315O3094J17903j06961m5106K6918L9639J78779
15849b8894J95750J07794K25826J75745J1754o7160k08739j91252R289p2275k84025
15838a26187j90138J11830K43012R4607m04325l89355l49838p8452K87120J73111
15828f28615K63766J70638q6615j24513J03201L56665K04832j38761L9201N4747
15818B14546j18019R8196j0167k00411m1302J50278R9015J38761J83628J8047
15808E32572P7269J271m8942j63468k44129k4221j85614k76455o3187j11469j19094
15797f25467n3786Q4452J14173K06229J98608k9261J40283j1971k17170P0855
15787a23055J27901j86561p4768J93362J66525j07389o8834k33845j60059J87806
$$ plain form
15777 -278917 -235274 -148938 -54443 -22224 -22518 -130996 -164626 -156370 -95778 -129676 -214266 -231953
15765 -231953 -242251 -282412 -186142 -67978 -272729 -382086 -489681 -701774 -715052 -432748
15755 -432748 -325677 -228084 -177489 -223050 -130331 -213459 -366106 -378719 -384862 -190352 127146
15744 127146 104468 -80576 -271379 -475985 -538521 -490136 -324456 -258300 13968 17651 -198137
15733 -198137 -144769 -173987 -272245 -308314 -265431 -239647 -284513 -175902 -41487 6641 108880
15722 108880 53503 -42531 14646 85488 286627 444134 338817 16159 -201041 -61632
15712 -61632 168926 23057 -294964 -491226 -601007 -550835 -588221 -528951 -503483 -556734 -476772
15701 -476772 -319038 -184753 35861 130007 -109165 -473273 -795642 -766318 -498150 -426507
$$ packed form
15777b78917M3643Q6336R4495L2219k94j08478l3630Q256O0592l3898q4590j7687
15765b31953j0298m0161R6270J18164k04751j09357j07595k12093j3278K82304
15755d32748J07071R7593N0595m5561R2719q3128j52647j2613o143J94510L17498
15744A27146k2678j85044j90803k04606o2536M8385J65680O6156K72268L683k15788
15733a98137N3368k9218r8258l6069M2883K5784m4866J08611J34415M8128J02239
15722A08880n5377r6034N7177P0842K01139J57507j05317l22658k17200J39409
15712f1632K30558j45869l18021j96262j09781N0172l7386N9270K5468n3251P9962
15701d76772J57734J34285K20614R4146k39172l64108l22369K9324K68168P1643
$$ plain form
15691 -426507 -347520 -303440 -508642 -828144 -1133769 -1113350 -917421 -878928 -770479 -550624
15681 -550624 -395140 -308672 -260789 -204912 -228164 -300942 -411274 -466754 -567766 -452434 -358291
15670 -358291 -306862 -350500 -318615 -188901 -40782 32417 30583 33619 -60196 -17875 -26606 -170549
15658 -170549 -363482 -545113 -392047 127692 302346 143183 25596 -98554 -178920 -84021
15648 -84021 222994 373306 355528 336256 323797 193200 -26318 43059 237450 484561
15638 484561 628415 586536 500388 489837 459004 479862 284853 -4555 -257944 -438318
15628 -438318 -586040 -511852 -301307 -28637 90863 -75246 -181803 -137946 -222086 -204961
15618 -204961 -114268 -215761 -275331 -204496 -171839 -385447 -463619 -247996 81808 335078
$$ packed form
15691d26507P8987M4080k05202l19502l05625K0419J95929L8493J08449K19855
15681e50624J55484Q6468M7883N5877k3252p2778j10332n5480j01012J15332R4143
15670c58291N1429m3638L1885J29714J48119P3199j834L036r3815M2321q731j43943
15658a70549j92933j81631J53066N19739J74654j59163j17587j24150q0366R4899
15648h4021L07015J50312j7778j9272j2459j30597k19518O9377J94391K47111
15638D84561J43854m1879q6148j0551l0833K0858j95009k89408k53389j80374
15628d38318j47722P4188K10545K72670J19500j66109j06557M3857q4140J7125
15618b04961R0693j01493n9570P0835L2657k13608p8172K15623L29804K53270
$$ plain form
15608 335078 425529 369318 344734 226001 109015 249710 318898 305537 306144 223946 9574
15597 9574 -39998 26019 -93454 -258098 -471162 -528782 -260895 -159085 -516536 -641541
15587 -641541 -523633 -511871 -380868 -163169 -87989 -29979 62675 325510 469906 561159
15577 561159 571128 364850 93745 -131694 -240700 -284225 -121246 262516 670668 759888
15567 759888 505040 206175 -75195 -172415 -106206 49545 33138 -65080 -124390 -14226
15557 -14226 194313 477967 517398 284633 126074 -129413 -197159 -92507 -28903 140651
15547 140651 437630 390020 282344 243878 58667 -128831 -293533 -253855 -39168 109029
15537 109029 130327 236624 424829 565636 750230 898319 918880 749522 482534 290896
$$ packed form
15608C35078R0451n6211k4584j18733j16986J40695O9188j3361O07q2198k14372
15597I574m9572O6017j19473j64644k13064n7620K67887J01810l57451j25005
15587f41541J17908J1762J31003K17699P5180N8010R2654K62835J44396R1253
15577E61159R969k06278k71105k25439j09006m3525J62979L83762M08152Q9220
15567G59888k54848k98865k81370r7220O6209J55751j6407r8218n9310J10164
15557a4226K08539K83654L9431k32765j58559k55487o7746J04652O3604J69554
15547A40651K96979m7610j07676l8466j85211j87498j64702L9678K14687J48197
15537A09029K1298J06297J88205J40807J84594J48089K0561j69358k66988j91638
$$ plain form
15527 290896 247472 131809 36734 -48077 -167310 -151319 -293172 -468821 -555362 -499700 -250544
15516 -250544 -61714 -15830 -304871 -599513 -608476 -331345 47955 167240 262074 395339
15506 395339 249465 168510 123229 124499 346790 531748 658305 735534 526779 260074
15496 260074 237013 169041 45711 -41078 62759 290834 390431 479611 466917 454312 374209
15485 374209 242105 175106 61723 -140395 -285041 -48496 243423 339599 351651 293017
15475 293017 500822 868866 900960 691716 786875 595806 227821 76414 -118572 -325082
15465 -325082 -390474 -202432 24257 32972 -160133 -312740 -362499 -331620 -180956 -22854
15455 -22854 42833 -64844 -149339 -85826 68477 115751 -131439 -280004 -6850 225386
$$ packed form
15527B90896m3424j15663r5075q4811j19233J5991j41853j75649q6541N5662K49156
15516b50544J88830M5884k89041k94642q963K77131L79300J19285R4834J33265
15506C95339j45874q0955m5281J270K22291J84958J26557P7229k08755k66705
15496B60074k3061o7972j23330q6789J03837K28075R9597Q9180j2694j2605q0103
15485C74209j32104o6999j13383k02118j44646K36545K91919R6176J2052n8634
15475B93017K07805L68044L2094k09244R5159j91069l67985j51407j94986k06510
15465c25082o5392J88042K26689Q715j93105j52607m9759L0879J50664J58102
15455b2854O5687j07677q4495O3513J54303M7274k47190j48565K73154K32236
$$ plain form
15445 225386 163495 69996 -60225 8056 93170 163504 380438 476940 326460 47099 3491
15434 3491 149482 192625 -17491 -204784 -207654 -236949 -76116 116682 137007 78907 -62418
15423 -62418 -165130 870 76315 8682 -189160 -500889 -593858 -603397 -526580 -145337 17867
15412 17867 -237521 -441982 -105491 168012 63267 22147 41162 150144 161323 249202
15402 249202 202518 -189788 -401101 -387423 -246426 36066 78471 -147044 -31765 76768
15392 76768 94603 176280 13993 -130647 -97712 -30763 -72583 8926 160075 84590 191763
15381 191763 412139 422158 296485 86840 -154680 -298611 -284764 -227688 -192882 -111557
15371 -111557 -66468 -136682 -273821 -228645 -60652 -54662 -116002 96072 309946 324620 334152
$$ packed form
15445B25386o1891r3499j30221O8281Q5114P0334K16934R6502j50480k79361m3608
15434C491J45991M3143k10116j87293k870k9295J60833J92798K0325n8100j41325
15423f2418j02712J66000P5445o7633j97842l11729r2969r539P6817L81243J63204
15412A7867k55388k04461L36491K73503j04745m1120J9015J08982J1179Q7879
15402B49202m6684l92306k11313J3678J40997K82492M2405k25515J15279J08533
15392G6768J7835Q1677j62287j44640L2935O6949m1820Q1509J51149p5485J07173
15381A91763K20376J0019j25673k09645k41520j43931J3847N7076L4806Q1325
15371a11557M5089p0214j37139M5176J67993N990o1340K12074K13874J4674R532
$$ plain form
15360 334152 474173 583375 466302 531525 602824 347302 350819 487573 396677 297589 157507
15349 157507 108053 154519 30401 -222738 -466134 -744720 -1019080 -815272 -378732 -109233
15339 -109233 -122756 -390735 -589024 -464796 -396020 -493354 -377177 -211981 -114084 -235384
15329 -235384 -195884 -16104 -9526 -147240 -386829 -592245 -688436 -545580 -461291 -488914 -612281
15318 -612281 -596319 -491230 -453268 -478584 -451630 -290428 -267189 -338448 -219916 -54087 65026
15307 65026 175060 -31673 -130788 163264 501722 552072 607668 671138 612519 773331 850447
15296 850447 864785 808204 571377 477946 452360 421078 406933 429554 393944 343623 330996
15285 330996 366951 484731 522803 437388 263979 188355 350698 529601 806449 728267
$$ packed form
15360C34152J40021J09202j17073O5223P1299k55522L517J36754r0896r9088j40082
15349A57507m9454M6466j24118k53139k43396k78586k74360K03808M36540K69499
15339a09233j3523k67979j98289J24228O8776r7334J16177J65196R7897j21300
15329b35384L9500J79780O578j37714k39589k05416r6191J42856Q4289k7623j23367
15318f12281J5962J05089L7962k5316K6954J61202K3239p1259J18532J65829J19113
15307F5026J10034k06733r9115K94052L38458N0350N5596O3470n8619J60812P7116
15296H50447J4338n6581k36827r3431k5586l1282j4145K2621l5610n0321j2627
15285C30996L5955J17780L8072q5415j73409p5624J62343J78903K76848p8182
$$ plain form
15275 728267 522256 356573 181771 428586 565513 387630 312411 146269 97434 7511
15265 7511 -359194 -633305 -635002 -628612 -620220 -489376 -412267 -387272 -360689 -416231 -464054 -467864
15253 -467864 -441873 -422289 -562087 -716005 -877387 -882537 -699980 -587690 -555850 -452416
15243 -452416 -135989 19841 -99325 -185809 -86253 54918 82284 -122791 -391360 -732990
15233 -732990 -805180 -620619 -309932 -220036 -130036 132936 104474 -200216 -382482 -418101
15223 -418101 -451785 -558084 -472524 -251514 -19882 38924 -104320 -434623 -631371 -646885
15213 -646885 -670417 -597167 -546217 -403544 -220033 -174064 -170380 33114 187607 147304 33651
15202 33651 79706 -95480 -288859 -41851 54138 27617 223684 330075 326231 273193 148850
$$ packed form
15275G28267k06011j65683j74802K46815J36927j77883p5219j66142m8835q9923
15265G511l66705k74111j697O390Q392J30844P7109K4995K6583n5542m7823l810
15253d67864K5991J9584j39798j53918j61382n150J82557J12290L1840J03434
15243d52416L16427J55830j19166q6484R9556J41171K7366k05075k68569l41630
15233g32990p2190J84561L10687Q9896R0000K62972k8462l04690j82266l5619
15223d18101l3684j06299Q5560K21010K31632N8806j43244l30303j96748j5514
15213f46885k3532P3250N0950J42673J83511M5969L684K03494J54493m0303j13653
15202C3651M6055j75186j93379K47008R5989k6521J96067J06391l844n3038j24343
$$ plain form
15191 148850 59907 -30949 -149449 -66573 94485 286402 310309 168079 2608 -56875
15181 -56875 -27307 -106101 -329911 -346760 -188984 -117468 -51266 140879 266353 130586 131433
15170 131433 74179 8645 -36948 -165605 -438142 -611516 -494955 -285943 -292447 -429834
15160 -429834 -226587 126981 289471 226536 135960 -156322 -364483 -273924 -183631 -88471
15150 -88471 24790 -176388 -400223 -442031 -425662 -386435 -458445 -439781 -286726 -46238 169368
15139 169368 66759 54635 125698 124294 142921 180566 140063 74570 12404 83709 191494
15128 191494 150928 42057 -136755 -190440 -116072 2329 114286 56186 47196 37005 -14864
15117 -14864 -42818 -103123 -155024 -252755 -450549 -760525 -732613 -622808 -571319 -501046 -574432
$$ packed form
15191A48850q8943r0856j18500Q2876J61058J91917K3907j42230j65471n9483
15181e6875K9568p8794k23810j6849J57776P1516O6202J92145J25474j35767Q47
15170A31433n7254o5534m5593j28657k72537j73374J16561K09012o504j37387
15160d29834K03247L53568J62490o2935r0576k92282k08161R0559R0293R5160
15150h8471J13261k01178k23835m1808J6369L9227p2010J8664J53055K40488K15606
15139A69368j02609j2124P1063j404J8627L7645m0503o5493o2166P1305J07785
15128A91494m0566j08871j78812n3685P4368J18401J11957n8100q990j0191n1869
15117a4864k7954o0305n1901r7731j97794l09976K7912J09805N1489P0273p3386
$$ plain form
15106 -574432 -579234 -455493 -277824 6882 160359 115262 129575 52302 -10668 -23969 -93164
15095 -93164 -76699 -78190 -44521 259229 688355 817356 614592 447468 362227 243702 18402
15084 18402 -75538 -52472 -107630 -205541 -142185 -112587 -61980 -194468 -361938 -478652 -622248
15073 -622248 -586303 -647878 -758466 -538822 -160631 281918 452715 249822 -20842 -88970
15063 -88970 -152451 -102127 3745 -38816 12472 157087 228325 216509 167867 111280 124153
15052 124153 -54118 -53019 159644 220524 132883 65207 21824 85319 271333 393896 301390
15041 301390 163118 103610 76515 180378 125456 217638 470656 337979 34433 -106857
15031 -106857 -61274 -83279 -171110 -275802 -432532 -259547 -140020 -99052 -156698 -161301 -88105
$$ packed form
15106e74432m802J23741J77669K84706J53477m5097J4313p7273o2970j3301o9195
15095i3164J6465j491L3669L03750M29126J29001k02764j67124q5241j18525k25300
15084A8402r3940K3066n5158r7911O3356K9598N0607j32488j67470j16714j43596
15073f22248L5945o1575j10588K19644L78191M42549J70797k02893k70664o8128
15063h8970o3481N0324J05872m2561N1288J44615P1238j1816m8642n6587J2873
15052A24153j78271J099K12663O0880q7641o7676m3383O3495J86014J22563r2506
15041C01390j38272n9508k7095J03863n4922R2182K53018j32677l03546j41290
15031a06857M5583k2005q7831j04692j56730J72985J19527M0968n7646m603P3196
$$ plain form
15020 -88105 -198174 -174473 6230 131324 25008 -53418 48468 33269 -31212 41506 131336
15009 131336 -144384 -456861 -483250 -543655 -689434 -796377 -812655 -607066 -173748 165805
14999 165805 -21408 -114686 89373 146286 134292 135623 27450 -119653 -175113 -174556 170022
14988 170022 368302 119317 -58226 -40910 -85863 -30046 107342 210751 103945 -26771
14978 -26771 -173757 -382609 -484654 -238856 250574 482934 600516 609225 540512 425145
14968 425145 469394 411718 189948 -28750 11434 232054 364065 492857 602002 604989
14958 604989 272606 118131 180473 134654 96856 -59195 -182936 -93396 -103623 -288632
14948 -288632 -306224 -173278 -134742 -294518 -405336 -307571 -225487 -136174 26554 140599
$$ packed form
15020h8105j10069K3701J80703J25094j06316p8426J01886j5199o4481P2718Q9830
15009A31336k75720l12477k6389o0405j45779j06943j6278K05589M33318L39553
14999A65805j87213r3278K04059N6913j1994J331j08173j47103n5460N57L44578
14988A70022J98280k48985j77543J7316m4953N5817J37388J03409j06806j30716
14978b6771j46986k08852j02045K45798M89430K32360J17582Q709o8713j15367
14968D25145M4249n7676k21770k18698M0184K20620J32011J28792J09145K987
14958F04989l32383j54475O2342m5819l7798j56051j23741Q9540j0227j85009
14948b88632j7592J32946L8536j59776j10818R7765Q2084Q9313J62728J14045
$$ plain form
14938 140599 138281 107893 -97828 -366442 -354853 -221833 -55462 295713 436507 290106
14928 290106 277210 271571 134275 106029 -20481 -220700 -267996 -212806 -265074 -224068 -91433
14917 -91433 -54578 -125110 -185494 -390513 -441081 -227198 -262564 -312500 -329721 -399820 -514092
14906 -514092 -532370 -287403 -155189 -294950 -338944 -115563 45253 188512 404670 516736
14896 516736 391582 20179 -315136 -347844 -319726 -320957 -491582 -416805 -222216 -243076 -498526
14885 -498526 -902903 -867061 -481960 -94402 382522 496015 233197 66361 36535 -5589
14875 -5589 30963 -216947 -195181 19017 -77564 -101799 101575 153990 123692 137137 150254
14864 150254 315400 634459 689225 345750 415236 352514 99395 -13913 -29387 102542
$$ packed form
14938A40599k318l0388k05721k68614J1589J33020J66371L51175J40794j46401
14928B90106j2896n639j37296k8246j26510k00219m7296N5190n2268M1006J32635
14917i1433L6855p0532o0384k05019n0568K13883l5366m9936j7221p0099j14272
14906e14092j8278K44967J32214j39761m3994K23381J60816J43259K16158J12066
14896E16736j25154l71403l35315l2708K8118j231j70625P4777J94589k0860k55450
14885d98526m04377L5842L85101L87558M76924J13493k62818j66836k9826m2124
14875e589L6552k47910K1766K14198r6581k4235K03374N2415l0298J3445J3117
14864A50254J65146L19059N4766l43475O9486o2722k53119j13308j5474J31929
$$ plain form
14854 102542 215789 122745 176632 208575 98417 -101778 -261496 -175237 -93591 54136
14844 54136 111457 6932 -43882 -169333 -203517 -76204 59561 326580 424222 249038
14834 249038 -10672 -268475 -476883 -466301 -438930 -387111 -67354 239426 151161 -147267
14824 -147267 -301989 -137113 -9079 -47841 -105696 -33922 1682 142280 231633 342408
14814 342408 482374 328058 214935 77986 -65413 234792 462471 505632 397127 239491
14804 239491 -90042 -343646 -203592 49322 33333 -135132 178263 551937 257046 15738
14794 15738 46071 138425 293225 367851 308376 20043 -354267 -464942 -433602 -498421 -735025
14783 -735025 -784363 -514810 -179534 150293 139203 82257 -75856 -211157 -227844 -273015
$$ packed form
14854A02542J13247r3044N3887L1943j10158k00195j59718Q6259Q1646J47727
14844E4136N7321j04525n0814j25451l4184J27313J35765K67019R7642j75184
14834B49038k59710k57803k08408J0582K7371N1819L19757L06780q8265k98428
14824a47267j54722J64876J28034l8762n7855P1774L5604J40598Q9353J10775
14814C42408J39966j54316j13123j36949j43399L00205K27679M3161j08505j57636
14804B39491l29533k53604J40054K52914j5989j68465L13395L73674k94891k41308
14794A5738L0333R2354J54800P4626n9475k88333l74310j10675L1340o4819k36604
14783g35025m9338K69553L35276L29827j1090n6946j58113j35301j6687m5171
$$ plain form
14773 -273015 -359355 -476612 -474615 -343055 -200311 -231154 -120475 -91944 -74935 -66439 -287276
14762 -287276 -441498 -568073 -298136 35033 8062 -185300 -169113 -204658 -11422 267392
14752 267392 418281 431254 238143 17414 328995 501567 285367 330243 417335 318455
14742 318455 167371 85321 153228 119985 -37826 -99213 -15509 146762 113492 -139742 -159976
14731 -159976 -76629 -21753 16627 -70938 -109782 10146 65997 106624 218157 170547 -6839
14720 -6839 -116001 -142166 -99472 87266 180198 44329 -120325 -96851 15484 -103589 -272362
14709 -272362 -361362 -371557 -168497 -113236 -306024 -340552 -310905 -465864 -315055 -50052
14699 -50052 -16678 -127369 -328155 -353382 -314903 -180519 171683 414003 550220 625186
$$ packed form
14773b73015q6340j17257J997J31560J42744l0843J10679K8531J7009Q496k20837
14762b87276j54222j26575K69937L33169k6971j93362J6187l5545J93236K78814
14752B67392J50889J2973j93111k20729L11581J72572k16200M4876Q7092r8880
14742C18455j51084q2050O7907l3243j57811o1387Q3704J62271l3270k53234k0234
14731a59976Q3347N4876L8380q7565l8844J19928N5851M0627J11533m7610j77386
14720f839j09162k6165M2694J86738R2932j35869j64654K3474J12335j19073j68773
14709b72362q9000j0195K03060N5261j92788l4528K9647j54959J50809K65003
14699e0052L3374j10691k00786k5227L8479J34384L52202K42320J36217P4966
$$ plain form
14689 625186 678578 663646 646259 741706 856781 771647 680659 621589 363065 -577 -426104
14678 -426104 -563071 -515988 -535560 -541098 -567078 -334493 -195313 -222482 -48069 133758 389506
14667 389506 345420 200237 -24110 -218471 -74707 150310 17305 -271778 -351174 -231429
14657 -231429 -69677 5988 -97385 22812 -68974 -381005 -299776 -24668 198011 137972
14647 137972 12362 -64928 -117507 -37534 110320 278351 425846 620174 670966 443359
14637 443359 278879 595151 833162 638292 308999 155437 87146 -220858 -614831 -632729
14627 -632729 -451825 -659056 -917187 -969490 -865993 -710428 -461560 -214477 -296016 -422602
14617 -422602 -363353 -164925 -122044 -387119 -540418 -687138 -787576 -628721 -384297 -8898
$$ packed form
14689F25186N3392j4932j7387R5447J15075q5134r0988n9070k58524l63642m25527
14678d26104j36967M7083j9572n538k5980K32585J39180k7169J74413J81827K55748
14667C89506m4086j45183k24347j94361J43764K25017j33005k89083p9396J19745
14657b31429J61752P5665j03373J20197r1786l12031Q1229K75108K22679o0039
14647A37972j25610p7290n2579P9973J47854J68031J47495J94328N0792k27607
14637D43359j64480L16272K38011j94870l29293j53562o8291l08004l93973j7898
14627f32729J80904k07231k58131n2303J03497J55565K48868K47083q1539j26586
14617d22602N9249J98428M2881k65075j53299j46720j00438J58855K44424L75399
$$ plain form
14607 -8898 93448 86512 -4974 -121932 -181178 -237378 -208753 34274 258671 227975 161796
14596 161796 30917 -265453 -400407 -344353 -553877 -658912 -582696 -595346 -604698 -327061
14586 -327061 -100383 29680 30007 13548 -79402 -151347 -194179 -261698 -435197 -375384 -170348
14575 -170348 53865 330253 448375 508489 361745 148618 56092 212254 252261 32160
14565 32160 -32912 11212 -33237 -259481 -446715 -373511 -36968 146210 178260 116799 -92285
14554 -92285 -256737 -233977 -396686 -628410 -588779 -363218 -163792 -190784 -273996 -148636
14544 -148636 -61638 -215550 -399865 -719000 -776817 -564614 -387803 -344070 -184980 -298271
14534 -298271 -476681 -351070 -118180 110581 298412 438749 515048 380419 105382 -89530
$$ packed form
14607h898J02346o936r1486j16958n9246n6200K8625K43027K24397l0696o6179
14596A61796j30879k96370j34954N6054k09524j05035P6216j2650r352K77637
14586c27061K26678J30063L27j6459r2950p1945m2832o7519j73499N9813K05036
14575a70348K24213K76388J18122O0114j46744k13127r2526J56162M0007k20101
14565C2160o5072M4124m4449k26244j87234P3204L36543J83178L2050o1461k09084
14554i2285j64452K2760j62709k31724L9631K25561J99426k6992q3212J25360
14544a48636Q6998j53912j84315l19135n7817K12203J76811M3733J59090j13291
14534b98271j78410J25611K32890K28761J87831J40337P6299j34629k75037j94912
$$ plain form
14524 -89530 -312113 -236205 -161681 -157388 17409 96554 -33693 101119 310143 281899 401416
14513 401416 530535 503163 376324 249931 19923 -170669 48982 451283 475937 308122
14503 308122 254150 10934 -537777 -646085 -253107 -130960 -302244 -374596 -580526 -896937
14493 -896937 -1024804 -775418 -384830 -124074 -224502 -342692 -105264 210806 270583 61359
14483 61359 -125844 -37106 -15046 118019 233928 -70138 -438282 -626828 -546817 -599519
14473 -599519 -704110 -738255 -598843 -369022 -437253 -548371 -575859 -467862 -331958 -104769
14463 -104769 9627 -82833 -158928 -179291 -274281 -520210 -690642 -752577 -730333 -638994 -553348
14452 -553348 -600766 -574210 -576413 -562598 -510736 -478837 -497341 -428932 -178187 -189958 -241595
$$ packed form
14524h9530k22583P5908P4524M293J74797P9145j30247J34812K09024k8244J19517
14513D01416J29119k7372j26839j26393k30008j90592K19651M02301K4654j67815
14503C08122n3972k43216n48711j08308L92978J22147j71284p2352k05930l16411
14493h96937j27867K49386L90588K60756j00428j18190K37428L16070N9777k09224
14483F1359j87203Q8738K2060J33065J15909l04066l68144j88546Q0011n2702
14473e99519j04591l4145J39412K29821o8231j11118k7488J07997J35904K27189
14463a04769J14396r2460p6095k0363r4990k45929j70432o1935K2244R1339Q5646
14452e53348m7418K6556k203J3815N1862L1899j8504O8409K50745j1771n1637
$$ plain form
14441 -241595 -98820 -129970 -141229 -104397 11326 -3932 44047 158734 85905 105851 354275
14430 354275 430706 290264 181758 423980 620824 589304 606344 399550 194742 255257
14420 255257 365101 579572 728852 613041 392257 457805 557957 592423 400421 167514
14410 167514 -42136 -309139 -356504 -113780 81922 324996 516811 282561 34643 -99045
14400 -99045 -23446 132178 41892 -126249 -143773 -130633 -28780 407685 615496 403553
14390 403553 337507 186072 64818 12935 14575 -55867 -323059 -468678 -363141 -360944 -386986
14379 -386986 -236123 -136131 -124002 -179543 -196330 -215844 -371313 -459148 -369470 -466873 -539010
14368 -539010 -350675 -2899 245669 515991 565439 605938 741387 857802 813752 486355
$$ packed form
14441b41595J42775l1150j1259L6832J15723j5258M7979J14687p2829J9946K48424
14430C54275P6431j40442j08506K42222J96844l1520J7040k06794k04808O0515
14420B55257J09844K14471J49280j15811k20784O5548J00152L4466j92002k32907
14410A67514k09650k67003m7365K42724J95702K43074J91815k34250k47918j33688
14400i9045P5599J55624r0286j68141j7524J3140J01853M36465K07811k11943
14390D03553o6046j51435j21254n1883J640p0442k67192j45619J05537K197k6042
14379c86986J50863R9992J2129n5541j6787j9514j55469q7835Q9678r7403p2137
14368e39010J88335L47776K48568K70322M9448M0499J35449J16415m4050l27397
$$ plain form
14358 486355 259906 174627 -44542 -205440 -162672 -70051 -88990 75604 348966 334215
14348 334215 233871 -8898 -90456 35780 8465 362 102103 24832 -65378 -225030 -160263
14337 -160263 118520 45170 -199292 -350809 -356575 -292102 -137190 4774 216943 333055
14327 333055 125528 19536 70783 59987 -118979 -248789 -403599 -672779 -890345 -1000234
14317 -1000234 -827515 -612177 -546590 -693074 -818001 -452736 -237746 -335886 -367221 -530368
14307 -530368 -659690 -689377 -887123 -989175 -748844 -617820 -599935 -493867 -514607 -547492
14297 -547492 -528870 -653802 -629767 -288390 -85684 -107403 -368587 -904879 -1193044 -1273766
14287 -1273766 -1062654 -612073 -14690 426697 707036 671075 572944 535146 302834 -59476
$$ packed form
14358D86355k26449q5279k19169j60898M2768R2621j8939J64594K73362j4751
14348C34215j00344k42769q1558J26236k7315q103J01741p7271r0210j59652O4767
14337a60263K78783p3350k44462j51517n766O4473J54912J41964K12169J16112
14327C33055k07527j05992N1247j0796j78966j29810j54810k69180k17566j09889
14317a000234J72719K15338O5587j46484j24927L65265K14990r8140l1335j63147
14307e30368j29322k9687j97746j02052K40331J31024J7885J06068k0740l2885
14297e47492J8622j24932K4035L41377K02706k1719k61184n36292k88165q0722
14287a273766K11112M50581N97383M41387K80339l5961r8131l7798k32312l62310
$$ plain form
14277 -59476 -131989 -11938 176837 332897 190324 33050 -69400 -208412 -404084 -275206
14267 -275206 44352 179714 97563 164723 288870 122571 -225338 -467036 -408444 -167561
14257 -167561 -32766 182484 363047 464465 441880 430650 390796 389573 42806 -416529
14247 -416529 -608413 -354962 -87847 -131139 -138790 -278143 -406658 -438193 -453767 -552849 -558650
14236 -558650 -473594 -346408 -438072 -483912 -412917 -346074 -150951 -30028 115245 361144
14226 361144 455472 351052 161730 69002 122742 246433 259020 158443 139078 -14343
14216 -14343 -76122 19774 -108806 -340662 -443477 -530368 -582262 -431732 -262588 -243721 -122831
14205 -122831 66811 359406 556067 522468 364018 227991 30175 -32642 -142734 -263196
$$ packed form
14277e9476p2513J20051J88775J56060j42573j57274j02450j39012j95672J28878
14267b75206L19558J35362q2151O7160J24147j66299l47909k41698N8592K40883
14257a67561J34795K15250J80563J01418k2585j1230l9854j223l46767m59335
14247d16529j91884K53451K67115m3292p651j39353j28515l1535j5574r9082n801
14236e58650Q5056J27186r1664m5840P0995O6843J95123J20923J45273K45899
14226C61144R4328j04420j89322r2728N3740J23691J2587j00577j9365j53421
14216a4343o1779R5896j28580k31856j02815q6891n1894J50530J69144J8867J20890
14205a22831J89642K92595J96661l3599j58450j36027j97816o2817j10092j20462
$$ plain form
14195 -263196 -208952 33530 51367 -43502 44767 61185 -177166 -481824 -433269 -259263 -87259
14184 -87259 64773 92968 -18299 -183897 -154764 -111023 -191175 -201050 -294437 -318457 -304354
14173 -304354 -326614 -166008 -137465 -151232 -148981 -427294 -464935 -289063 -203579 -206182 -396087
14162 -396087 -428611 -252041 -3703 84137 79856 28037 74011 219415 359050 296910 224392
14151 224392 374154 547846 276037 136019 -1385 -203349 -320280 -446112 -576849 -742215
14141 -742215 -784107 -577865 -466441 -526665 -455791 -406546 -669232 -773742 -527120 -586942
14131 -586942 -703663 -659115 -516063 -244354 -100229 -189138 -197855 -171486 -258742 -342651 -281586
14120 -281586 -243727 -274312 -228764 -325236 -365858 -215003 -220483 -340977 -304566 64255 267608
$$ packed form
14195b63196N4244K42482J7837r4869Q8269J6418k38351l04658M8555J74006J72004
14184h7259J52032K8195j11267j65598K9133M3741q0152r875r3387k4020J4103
14173c04354k2260J60606K8543j3767K251k78313l7641J75872Q5484k603j89905
14162c96087l2524J76570K48338Q7840m281n1819M5974J45404J39635o2140p2518
14151B24392J49762J73692k71809j40018j37404k01964j16931j25832j30737j65366
14141g42215m1892K06242J11424o0224P0874M9245k62686j04510K46622n9822
14131e86942j16721M4548J43052K71709J44125q8909q717K6369q7256q3909O1065
14120b81586L7859l0585M5548r6472m0622J50855n480j20494L6411L68821K03353
$$ plain form
14109 267608 94516 -140401 -255976 -247080 -146690 -119557 -62155 -113335 -140927 -179395 -281286
14098 -281286 -414641 -401034 -393932 -275362 -72065 10680 241821 450810 386199 83521
14088 83521 -87803 -102182 -127637 -138148 -235050 -74995 184623 224296 219079 311165 464193
14077 464193 360187 -99280 -289839 -262827 -234838 132449 352349 344363 377247 301373 109922
14066 109922 122802 26355 -157839 -412122 -501722 -307944 -14615 79322 9881 -32638 -290345
14055 -290345 -603601 -745273 -790228 -532139 -426285 -508079 -550052 -673374 -632376 -570354
14045 -570354 -430183 -59588 326587 316131 410014 450398 358354 363848 231581 64127 -336311
14034 -336311 -725054 -732168 -511649 -441322 -482275 -530060 -528165 -496436 -422758 -347021 -418166
$$ packed form
14109B67608j73092k34917j15575Q896J00390K7133N7402n1180k7592l8468j01891
14098b81286j33355J3607P102J18570K03297Q2745K31141K08989o4611l02678
14088H3521j71324j4379k5455j0511r6902J60055K59618L9673n217R2086J53028
14077D64193j04006m59467j90559K7012K7989L67287K19900p986L2884p5874j91451
14066A09922J2880r6447j84194k54283q9600J93778K93329R3937o9441m2519k57707
14055b90345l13256j41672m4955K58089J05854q1794m1973j23322M0998O2022
14045e70354J40171L70595L86175j0456R3883M0384r2044N494j32267j67454m00438
14034c36311l88743p114K20519P0327m0953m7785J895L1729P3678P5737p1145
$$ plain form
14023 -418166 -435865 -340412 -87411 145050 -39576 -340397 -387662 -331301 -180954 -90111
14013 -90111 -111416 41194 143575 -145272 -259931 1121 119684 160652 201535 35960
14003 35960 -153582 -297172 -332107 -328774 -246084 -231094 -230470 -279538 -131896 -125180 -252610 -215406
13991 -215406 -167960 -231777 -188778 -96604 -238327 -331121 -204461 -30295 118503 246579
13981 246579 151351 17158 129331 -106218 -420662 -400577 -244150 -278694 -497617 -685503
13971 -685503 -666890 -590633 -630807 -646360 -495799 -433652 -424156 -164141 -73946 -402880 -664911
13960 -664911 -552344 -357602 -306140 -276089 -338836 -332344 -92731 -87204 -515584 -692070 -361700
13949 -361700 -162098 -408262 -350724 16504 45966 -100401 15624 153112 115157 -115825
$$ packed form
14023d18166j7699R5453K53001K32461j84626l00821m7265N6361J50347R0843
14013i0111k1305J52610J02381k88847j14659K61052J18563M0968M0883j65575
14003C5960j89542j43590l4935L333Q2690J4990O24m9068J47642O716j27430L7204
13991b15406M7446o3817M2999R2174j41723r2794J26660J74166J48798J28076
13981B46579r5228j34193J12173k35549l14444K0085J56427l4544k18923j87886
13971f85503J8613P6257m0174j5553J50561O2147R496K60015R0195l28934k62031
13960f64911J12567J94742N1462L0051o2747O492K39613N527m28380j76486L30370
13949c61700J99602k46164N7538L67228K9462j46367J16025J37488l7955k30982
$$ plain form
13939 -115825 -557614 -746825 -649122 -427663 -298303 -178820 10438 89508 -216200 -486765
13929 -486765 -392788 -359065 -304174 -250127 -218522 -2673 78577 4257 -96927 -51458 -557
13918 -557 79937 293693 267480 85380 13138 -17684 -55210 -71066 -118949 -100096 74963
13907 74963 189074 158448 290510 366965 263897 115374 -124745 -317274 -508641 -490856
13897 -490856 -423998 -469511 -479604 -494851 -461582 -519782 -536789 -615231 -708767 -855211 -1052271
13886 -1052271 -1063562 -830471 -654578 -653774 -685657 -432374 -271597 -470478 -752290 -1013427
13876 -1013427 -1045123 -717680 -472554 -470175 -501551 -406815 -451259 -531757 -470079 -207344 -196511
13865 -196511 -471305 -608415 -618707 -582893 -517545 -287780 -52418 202607 337779 488661
$$ packed form
13939a15825m41789j89211R7703K21459J29360J19483J89258P9070l05708k70565
13929d86765R3977L3723N4891N4047L1605K15849Q1250p4320j01184M5469N0901
13918e57Q0494K13756k6213j82100p2242l0822l7526j5856m7883J8853J75059
13907G4963J14111l0626J32062P6455j03068j48523k40119j92529j91367J7785
13897d90856O6858m5513j0093j5247L3269n8200j7007p8442r3536j46444j97060
13886a052271j1291K33091J75893Q04l1883K53283J60777j98881k81812k61137
13876a013427l1696L27443K45126K379l1376R4736m4444q0498O1678K62735J0833
13865a96511k74794j37110j0292L5814O5348K29765K35362K55025J35172J50882
$$ plain form
13855 488661 598663 568011 374619 289353 112555 49683 10752 -148851 -234914 -118548
13845 -118548 13225 -57484 -258998 -259340 -125128 -249592 -319255 -412835 -509934 -408244 -358864
13834 -358864 -502048 -555444 -752664 -823575 -496078 -246849 -61818 -75646 -323514 -765809
13824 -765809 -920501 -738765 -503938 -496829 -423916 -403294 -272771 -88707 -145355 -43326
13814 -43326 152021 210376 130421 10389 -301409 -456520 -394220 -395327 -479259 -469794 -325543
13803 -325543 -218058 -74045 -10547 -73608 -398041 -507041 -614690 -543572 -241570 1432
13793 1432 183840 61238 -117616 -173512 -240439 -342938 -613058 -710209 -476499 -69998
13783 -69998 211897 96289 23634 159255 346595 634113 682598 601508 444408 174696
$$ packed form
13855D88661J10002l0652j93392q5266j76798o2872l8931j59603q6063J16366
13845a18548J31773p0709k01514l42J34212j24464o9663r3580r7099J01690M9380
13834c58864j43184n3396j97220p0911L27497K49229J85031j3828k47868m42295
13824g65809j54692J81736K34827P109P2913K0622J30523J84064n6648J02029
13814d3326J95347N8355p9955j20032l11798j55111O2300j107q3932R465J44251
13803c25543J07485J44013O3498o3061l24433j09000j07649P1118L02002K43002
13793A432J82408j22602j78854n5896o6927j02499k70120r7151K33710M06501
13783f9998K81895j15608p2655J35621J87340K87518M8485q1090j57100k69712
$$ plain form
13773 174696 170920 318473 365387 313917 79734 -349059 -553473 -500892 -355402 -182856
13763 -182856 -100301 132895 310206 344496 149715 -178309 -137644 72976 191132 65041
13753 65041 -128991 -393374 -600288 -693215 -612383 -559559 -454832 -254285 -186570 -144700 -94548
13742 -94548 -224662 -398508 -377338 -232325 18057 28393 36642 16463 -24674 152458 115931
13731 115931 181631 150970 96376 93925 -46091 -66312 -30073 -122102 -255923 -261264 -358196
13720 -358196 -463982 -479017 -400639 -357087 -355945 -461922 -371579 -285802 -162113 52926 159879
13709 159879 82544 5751 -29162 -164363 -253310 -242648 -205098 -27574 248424 192267 27187
13698 27187 -99922 -196062 -237350 -73052 74906 -110483 -369099 -165909 87566 58426
$$ packed form
13773A74696l776J47553M6914n1470k34183m28793k04414N2581J45490J72546
13763a82856Q2555K33196J77311L4290j94781l28024M0665K10620J18156j26091
13753F5041j94032k64383k06914r2927Q0832N2824J04727K00547O7715M1870N0152
13742i4548j30114j73846K1170J45013K50382J0336Q249k0179m1137J77132l6527
13731A15931O5700l0661n4594k451j40016k0221L6239r2029j33821n341r6932
13720c58196j05786j5035P8378M3552J142j05977R0343Q5777J23689K15039J06953
13709A59879p7335p6793l4913j35201q8947J0662L7550J77524K75998n6157j65080
13698B7187j27109r6140m1288J64298J47958j85389k58616K03190K53475k9140
$$ plain form
13688 58426 24683 126603 -43356 -63816 229784 395840 278496 79820 -64236 -212032
13678 -212032 -347849 -279638 -125005 -227716 -384938 -320492 -331559 -200747 50470 40601
13668 40601 -52597 -284615 -314244 -398335 -472443 -654807 -774714 -778042 -814993 -729437 -611098
13657 -611098 -607221 -468818 -182219 -53693 32120 -4482 -90098 -160532 -250314 -269045 -281158
13646 -281158 -210297 -135400 -136515 99062 380756 338276 236438 281334 262418 262176 189363
13635 189363 -71371 -171148 15373 140165 429306 831891 813167 804130 901375 760163
13625 760163 565974 242983 -8451 -71511 -58196 -180537 -468574 -642795 -681658 -547192
13615 -547192 -355430 -17819 187779 213741 244786 142577 16847 -153688 -124179 -18339
$$ packed form
13688E8426l3743J01920j69959k0460K93600J66056j17344j98676j44056j47796
13678b12032j35817O8211J54633j02711j57222O4446j1067J30812K51217r869
13668D0601r3198k32018k9629q4091p4108j82364j19907l328l6951Q5556J18339
13657f11098L877J38403K86599J28526Q5813l6602q5616p0434q9782j8731j2113
13646b81158P0861P4897j115K35577K81694m2480j01838M4896j8916k42p2813
13635A89363k60734r9777J86521J24792K89141M02585j8724r037R7245j41212
13625G60163j94189l22991k51434o3060J3315j22341k88037j74221l8863J34466
13615e47192J91762L37611K05598K5962L1045j02209j25730j70535K9509J05840
$$ plain form
13605 -18339 274762 169928 -169719 -414158 -450353 -549581 -564820 -450026 -272780 77089
13595 77089 274498 303714 271220 227448 300966 271604 333000 303623 115793 24250 -141971
13584 -141971 -264273 -286547 -236779 -354020 -373167 -230815 -76620 -115473 -231315 -172775
13574 -172775 147134 319248 288649 184612 136432 30510 -45964 -58581 -206263 -350284
13564 -350284 -435753 -599689 -537197 -129222 46479 -61116 -149806 -244243 -297697 -360374 -334257
13553 -334257 -93434 165063 279718 467669 597238 368166 89703 6316 -85643 -36677
13543 -36677 -97035 -217046 -162714 -36199 -104080 -154573 -128554 -118197 -74217 -96127 -107477
13532 -107477 -116287 -16573 101783 264479 537675 686335 546970 356345 134384 -103906
$$ packed form
13605a8339K93101j04834l39647k44439l6195r9228j5239J14794J77246L49869
13595G7089J97409K9216l2494m3772P3518k9362O1396k9377j87830r1543j66221
13584a41971j22302k2274M9768j17241j9147J42352J54195l8853j15842N8540
13574a72775L19909J72114l0599j04037m8180j05922p6474j2617j47682j44021
13564c50284q5469j63936O2492M07975J75701j07595q8690r4437n3454o2677K6117
13553c34257K40823K58497J14655J87951J29569k29072k78463q3387r1959M8966
13543c6677o0358j20011N4332J26515o7881n0493K6019J0357M3980k1910j1350
13532a07477q810R9714J18356J62696K73196J48660j39365j90625k21961k38290
$$ plain form
13522 -103906 -190509 -54948 124845 267553 249742 155682 139796 38542 -152625 -170209
13512 -170209 -122859 20079 105804 -14060 -95355 49737 78448 82010 369207 511977 266299
13501 266299 -71072 -10945 199949 181445 115247 153385 115835 73253 176062 388663 475501
13490 475501 675137 796236 797317 676394 359914 -23588 -280730 -384400 -485212 -582290
13480 -582290 -604706 -490350 -611132 -397713 62804 248109 290446 558445 579319 376084
13470 376084 320360 454446 728659 762234 616337 491694 521605 576602 354386 138387
13460 138387 48045 -36590 192550 523567 658786 400831 133050 118791 322500 569538
13450 569538 844574 947300 872824 806956 751942 629313 372630 145004 254292 469741
$$ packed form
13522a03906q6603J35561J79793J42708j7811r4060j5886j01254j91167j7584
13512a70209M7350J42938Q5725j19864q1295J45092K8711L562K87197J42770k45678
13501B66299l37371O0127K10894j8504o6198L8138l7550m2582J02809K12601Q6838
13490D75501J99636J21099J081j20923l16480l83502k57142j03670j00812r7078
13480e82290k2416J14356j20782K13419M60517J85305M2337K67999K0874k03235
13470C76084n5724J34086K74213L3575j45897j24643K9911N4997k22216k15999
13460A38387r0342q4635K29140L31017J35219k57955k67781j4259K03709K47038
13450E69538K75036J02726p4476o5868n5014j22629k56683k27626J09288K15449
$$ plain form
13440 469741 558796 488545 508458 667587 622058 389839 249235 358356 537617 718009
13430 718009 576565 167714 -263630 -511029 -339541 -242864 -437169 -446477 -394712 -213598
13420 -213598 -130064 -176458 -47689 131337 125755 113814 67195 -175859 -243958 -38223 149399
13409 149399 159428 275688 278949 135496 -108361 -242208 -251696 -325964 -327990 -394412 -454496
13398 -454496 -544137 -395556 -166130 -191628 -153442 -69708 148787 172482 37916 -287235
13388 -287235 -406047 -244862 -349537 -386105 -63414 12538 3048 113236 266747 350122
13378 350122 335336 326807 197693 93412 -30370 -3139 12034 24177 118123 410133 482117
13367 482117 545253 625888 517410 451132 392088 243693 324060 631319 652604 351320 227403
$$ packed form
13440D69741Q9055p0251J9913J59129m5529k32219j40604J09121J79261J80392
13430G18009j41444m08851m31344k47399J71488R6677j94305r308N1765J81114
13420b13598Q3534m6394J28769J79026n582j1941m6619k43054o8099K05735J87622
13409A49399J0029J16260L261j43453k43857j33847r488p4268k026o6422o0084
13398d54496q9641J48581K29426k5498L8186Q3734K18495K3695j34566l25151
13388b87235j18812J61185j04675l6568L22691P5952r490J10188J53511Q3375
13378C50122j4786q529j29114j04281j23782K7231J5173J2143R3946K92010P1984
13367D82117O3136Q0635j08478o6278n9044j48395Q0367L07259K1285l01284j23917
$$ plain form
13356 227403 194492 -16301 -88714 43841 174510 134418 108474 348715 558119 413111
13346 413111 78580 19286 207449 516230 715063 356766 437247 550918 256765 13401
13336 13401 -150588 -355230 -375488 -171474 34836 131876 199042 347543 371497 329948 384187
13325 384187 540182 641148 560035 400203 486042 807275 1029243 891467 708878 597712
13315 597712 679315 503692 162989 196148 424124 553963 589751 362847 89086 48335
13305 48335 -56627 -154066 -287387 -314990 -17529 190131 107227 3652 55121 141184 109574
13294 109574 105658 299545 456481 587281 650687 637920 790386 759099 603510 557712 567603
13283 567603 505335 323214 231186 181017 178559 149263 233486 380093 385319 177533 171797
$$ packed form
13356B27403l2911k10793p2413J32555J30669m0092k5944K40241K09404j45008
13346D13111l34531n9294J88163L08781J98833l58297Q0481J13671k94153k43364
13336A3401j63989k04642k0258K04014K06310R7040O7166J48501K3954m1549N4239
13325C84187J55995J00966q1113j59832Q5839L21233K21968j37776j82589j11166
13315E97712Q1603j75623l40703L3159K27976J29839L5788k26904k73761m0751
13305D8335j04962r7439j33321k7603K97461K07660q2904j03575N1469Q6063l1610
13294A09574l916J93887J56936J30800O3406j2767J52466l1287j55589m5798R891
13283E67603o2268j82121r2028n0169k458k9296Q4223J46607N226k07786n736
$$ plain form
13272 171797 526955 907755 970609 865021 824919 846510 837049 747832 799770 896572 1016972
13261 1016972 1057530 967774 709366 493233 454460 561259 477480 333845 487215 714513
13251 714513 730278 921585 1022794 1032986 1134350 1110827 999751 692965 537237 398839
13241 398839 387270 444763 513845 567152 256429 -55299 -9307 129800 303821 507183
13231 507183 853920 1017358 967226 899917 838514 788013 919048 925288 848425 890522 1095361
13220 1095361 1383152 1312594 1054585 1075924 1139538 1117973 907022 521282 440530 590125
13210 590125 582119 368842 433618 604553 583401 448421 270712 -74730 -61397 146515
13200 146515 321017 569654 792355 813626 685548 707506 592684 657117 836172 800779
$$ packed form
13272A71797L55158L80800O2854j05588m0102K1591r461q9217N1938R6802J20400
13261A016972M0558q9756k58408k16133l8773J06799q3779j43635J53370K27298
13251G14513J5765J91307J01209J0192J01364k3523j11076l06786j55728j38398
13241C98839j1569N7493O9082N3307l10723l11728M5992J39107J74021K03362
13231E07183L46737J63438n0132o7309o1403n0501J31035O240p6863M2097K04839
13220A095361K87791p0558k58009K1339O3614k1565k10951l85740q0752J49595
13210E90125q006k13277O4776J70935k1152j34980j77709l45442J3333K07912
13200A46515J74502K48637K22701K1271j28078K1958j14822O4433J79055l5393
$$ plain form
13190 800779 667311 693713 607862 535878 518054 320249 123911 24398 204124 566815
13180 566815 579285 413610 194164 139946 370039 553512 684384 542271 447501 606867
13170 606867 855305 904226 897995 789473 696235 636741 620974 671094 684398 698454 746711
13159 746711 993705 1019548 965961 878251 860479 919340 732280 445118 241597 436350
13149 436350 604192 595805 538901 520143 473268 524385 426047 491721 609735 771323 1195573
13138 1195573 1364395 1442896 1659888 1537244 1300542 1355990 1225696 864151 800197 903064
13128 903064 1033878 1361007 1410472 1268696 1062506 919751 853436 860625 1005210 1078443
13118 1078443 1169894 1439556 1595698 1661498 1558205 1219800 1072673 1047237 872147 681603
$$ packed form
13190H00779j33468K6402q5851p1984j7824j97805j96338r9513J79726L62691
13180E66815J2470j65675k19446n4218K30093J83473J30872j42113r4770J59366
13170F06867K48438M8921o231j08522r3238n9494j5767N0120J3304J4056M8257
13159G46711K46994K5843n3587q7710j7772N8861j87060k87162k03521J94753
13149D36350J67842q387n6904j8758m6875N1117r8338O5674J18014J61588M24250
13138A195573J68822P8501K16992j22644k36702N5448j30294l61545o3954J02867
13128I03064J30814L27129M9465j41776k06190j42755o6315P189J44585P3233
13118A078443R1451K69662J56142O5800j03293l38405j47127k5436j75090j90544
$$ plain form
13108 681603 666702 845438 996788 770462 407586 277244 436481 684355 672659 438466
13098 438466 334043 546904 869761 1219348 1369739 1477868 1591194 1468169 1074550 768783
13088 768783 806605 948412 1108878 860397 584100 646538 921057 1165479 1200113 1086168
13078 1086168 1057714 1046540 1055792 1292423 1542688 1414943 1055850 919772 859421 941526
13068 941526 1025562 1063437 1008712 1080006 1291140 1299680 1254045 1245709 1328481 1547285 1716131
13057 1716131 1618992 1549247 1680540 1676141 1726911 1865715 1683686 1460882 1448408 1432519 1408136
13046 1408136 1592514 1715600 1952876 2255131 2122905 1801151 1808227 1925209 1898893 1759863
13036 1759863 1799072 2147969 2415667 2321099 2172299 2333928 2544666 2746710 3039854 3166028
$$ packed form
13108F81603j4901J78736J51350k26326l62876j30342J59237K47874j1696k34193
13098D38466j04423K12861L22857L49587J50391J08129J13326j23025l93619l05767
13088G68783L7822J41807J60466k48481k76297O2438K74519K44422L4634j13945
13078A086168k8454j1174R252K36631K50265j27745l59093j36078o0351Q2105
13068I41526Q4036L7875n4725P1294K11134Q540m5635q336Q2772K18804J68846
13057A716131r7139o9745J31293m399N0770J38804j82029k22804j2474j5889k4383
13046A408136J84378J23086K37276L02255j32226l21754P076J16982k6316j39030
13036A759863L9209L48897K67698r4568j48800J61629K10738K02044K93144J26174
$$ plain form
13026 3166028 3291422 3339712 3066131 2925456 3083803 3250368 3271040 3283270 3342876 3364131
13016 3364131 3453702 3604037 3712386 3922086 4049356 4222837 4508593 4897721 5153081 5182456
13006 5182456 5310476 5401457 5512989 5585972 5706298 5923899 6422039 6908937 7372528 7851122
12996 7851122 8398385 9012941 9525501 10257568 11338777 12572151 13881605 15539751 17810476
12987 17810476 20536301 23795685 27800438 32961352 39688444 48093451 59219067 74245703
12979 74245703 94387212 121755239 158974272 206494999 256070859 284854693 272468243
12972 272468243 228555136 178244583 135722695 103802859 80809201 64134500 51767568
12965 51767568 42612919 35727733 30213949 26010936 22730231 19832092 17560356 15760741
$$ packed form
13026C166028J25394M8290k73581j40675J58347J66565K0672J2230N9606K1255
13016C364131Q9571J50335J08349K09700J27270J73481K85756L89128K55360K9375
13006E182456J28020R0981J11532P2983J20326K17601M98140M86898M63591M78594
12996G851122N47263O14556N12560P32067J081209J233374J309454J658146K270725
12987A7810476K725825L259384M004753N160914O727092Q405007J1125616J5026636
12979G4245703K0141509K7368027L7219033M7520727M9575860K8783834j2386450
12972B72468243m3913107n0310553m2521888l1919836k2993658j6674701j2366932
12965E1767568r154649o885186n513784m203013l280705k898139k271736j799615
$$ plain form
12957 15760741 14336637 13092780 12057572 11158410 10269898 9535791 9012880 8754310 8353776
12948 8353776 7772032 7199119 6749227 6539017 6212497 5985809 6069964 6101191 5880431 5649471
12938 5649471 5538246 5493467 5327919 5187535 5171766 5230254 5394738 5586471 5620643 5575409
12928 5575409 5353464 5215185 5397346 5912797 6326692 6575976 6787764 7356713 8082715
12919 8082715 8969207 10073341 11628339 13672502 15059021 15065283 14024847 12663409 11647054
12910 11647054 11444500 11439635 11565969 11851503 12312722 13002817 13899962 14928234 16313221
12901 16313221 18376273 21008271 24106632 28164848 33565523 40707832 50084552 62405427
12893 62405427 78821101 100856658 130566361 170770363 221542634 271236276 292335403
$$ packed form
12957A5760741j424104j243857j035208q99162q88512p34107n22911k58570m00534
12948H353776n81744n72913m49892k10210l26520k26688Q4155L1227k20760k30960
12938E649471j11225m4779j65548j40384j5769N8488J64484J91733L4172m5234
12928E575409k21945j38279J82161N15451M13895K49284K11788N68949P26002
12919H082715Q86492J104134J554998K044163J386519O262j040436j361438j016355
12910A1647054k02554m865J26334K85534M61219O90095Q97145J028272J384987
12901A6313221K063052K631998L098361M058216N400675P142309R376720J2320875
12893F2405427J6415674K2035557K9709703M0204002N0772271M9693642K1099127
$$ plain form
12886 292335403 268755254 218719817 167882998 127104471 97048407 75411532 59695785
12879 59695785 48300842 39848078 33627692 28960334 25100988 21917332 19315704 17267334
12871 17267334 15479398 13817885 12413601 11025131 9957980 9340637 8809149 8368396
12863 8368396 8007947 7624520 7416383 7297687 7088380 6775255 6282379 5777143 5439011
12854 5439011 5445566 5517157 5595990 5537116 5342319 5212279 5203557 5250905 5170495 5191134 5271134
12843 5271134 5421938 5492586 5215768 5052814 5132454 5118034 5206488 5354078 5361497 5398126 5519978
12832 5519978 5720622 5923454 6153422 6516593 6830530 6902181 6994513 7125720 7245590 7615900
12822 7615900 8200218 8952754 9736688 10484387 11735893 13356200 14848335 16570650 18677343
$$ packed form
12886B92335403k3580149n0035437n0836819m0778527l0056064k1636875j5715747
12879E9695785j1394943q452764o220386m667358l859346l183656k601628k048370
12871A7267334j787936j661513j404284j388470j067151o17343n31488m40753
12863H368396l60449l83427k08137j18696k09307l13125m92876n05236l38132
12854E439011O555P1591P8833n8874j94797j30040q722M7348q0410K0639Q0000
12843E271134J50804P0648k76818j62954P9640j4420Q8454J47590P419L6629J21852
12832E519978K00644K02832K29968L63171L13937P1651R2332J31207J19870L70310
12822G615900N84318P52536P83934P47699J251506J620307J492135J722315K106693
$$ plain form
12813 18677343 21483718 25037439 29594869 35365511 42786980 52638304 65849827 83308637
12805 83308637 106780535 138636028 180719987 230873667 274095512 284264730 253495870
12798 253495870 203184730 155405430 118187880 90940534 71193303 56883037 46423969
12791 46423969 38721612 32959695 27994350 23776324 20595851 18168631 16149619 14140759
12783 14140759 12496754 11359139 10453976 9627504 8740213 8110448 7733680 7092669 6573025
12774 6573025 6113616 5577916 5146835 4772925 4440181 4543070 4520164 4134889 3914174 3514484
12764 3514484 3248413 3073234 2909780 3007828 3212447 3273241 3067149 2700706 2489818 2473074
12754 2473074 2592138 2482810 2194056 2124284 1971666 1925146 1898143 1632019 1480970 1477934
$$ packed form
12813A8677343K806375L553721M557430N770642P421469R851324J3211523J7458810
12805H3308637K3471898L1855493M2083959N0153680M3221845J0169218l0768860
12798B53495870n0311140m7779300l7217550k7247346j9747231j4310266j0459068
12791D6423969p702357n761917m965345m218026l180473k427220k019012k008860
12783A4140759j644005j137615r05163q26472q87291o29765l76768o41011n19644
12774F573025m59409n35700m31081l73910l32744J02889k2906l85275k20715l99690
12764C514484k66071j75179j63454R8048K04619O0794k06092l66443k10888j6744
12754B473074J19064j09328k88754o9772j52618m6520k7003k66124j51049l036
$$ plain form
12744 1477934 1342124 1271924 1286480 1335002 1509675 1526210 1402249 1316013 1168056 1075553
12734 1075553 1126677 1124061 1249908 1436878 1471652 1320594 1177516 1022984 922186 1014591
12724 1014591 1001041 869795 769989 1057672 1321076 1342095 1307175 1342812 1253218 977898
12714 977898 745523 705906 698650 684313 632958 589687 626845 903093 820771 494359 353226
12703 353226 445585 674653 766420 834134 852272 810279 757646 581667 455366 533163 320312
12692 320312 124208 388110 949965 1299167 1245909 879049 494167 208356 -25500 66858
12682 66858 510467 607592 525027 359085 436330 646905 764601 839263 663793 457215
12672 457215 384537 51762 71560 191261 242832 325455 509955 590317 507142 443798 447117
$$ packed form
12744A477934j35810p0200J4556M8522J74673J6535j23961q6236j47957r2503
12734A075553N1124k616J25847J86970L4774j51058j43078j54532j00798R2405
12724A014591j3550j31246r9806K87683K63404K1019l4920L5637q9594k75320
12714I77898k32375l9617p256j4337n1355m3271L7158K76248q2322l26412j41133
12703C53226R2359K29068R1767O7714J8138m1993n2633j75979j26301P7797k12851
12692C20312j96104K63902N61855L49202n3258l66860l84882k85811k33856R2358
12682F6858M43609R7125q2565j65942P7245K10575J17696P4662j75470k06578
12672D57215p2678l32775J9798J19701N1571Q2623J84500Q0362q3175o3344L319
$$ plain form
12661 447117 385585 534328 782733 769661 800731 872487 709996 617228 620919 713566 762492
12650 762492 719239 659955 735166 736021 599020 457951 383062 499889 517277 426543 241771
12639 241771 14992 -98746 -102009 -84014 40500 324126 477588 382006 434719 725300
12629 725300 810528 589594 525793 684975 881736 868249 760573 591855 318965 229491
12619 229491 169422 20769 170140 239871 294352 521244 773202 826190 570811 339619
12609 339619 190026 196162 181795 141983 66125 37477 19098 -108557 -58902 193968 190291
12598 190291 9714 -98524 10748 177424 193401 74120 -40542 12051 7568 -221566
12588 -221566 -193136 86627 123535 92528 115548 273112 524847 593387 638309 735693 863412
$$ packed form
12661D47117o1532J48743K48405j3072L1070P1756j62491r2768L691R2647M8926
12650G62492m3253n9284P5211Q55j37001j41069p4889J16827J7388r0734j84772
12639B41771k26779j13738l263J7995J24514K83626J53462r5582N2713K90581
12629G25300Q5228k20934o3801J59182J96761j3487j07676j68718k72890q9474
12619B29491o0069j48653J49371O9731N4481K26892K51958N2988k55379k31192
12609C39619j49593O136j4367l9812p5858k8648j8379j27655M9655K52870l677
12598A90291j80577j08238J09272J66676J5977j19281j14662N2593m483k29134
12588b21566K8430K79763L6908l1007K3020J57564K51735O8540M4922R7384J27719
$$ plain form
12577 863412 986636 727098 257766 -63048 -159479 -104916 -303237 -259306 -38776 -30381
12567 -30381 149673 230241 240242 247661 234168 31818 -127642 10061 58941 -184217 -255885
12556 -255885 -328275 -380740 -276882 -289941 -319319 -72214 222468 377375 269130 283382
12546 283382 191865 49346 100976 60155 -21181 52064 234016 381703 399017 195947 224685
12535 224685 444736 487742 378700 344533 563890 772992 711138 484411 341347 208959
12525 208959 181260 190804 406458 666016 437600 203166 78469 90651 227737 350111
12515 350111 469355 486363 387187 333705 216797 124356 111331 37177 -87592 -197323 -249880
12504 -249880 -255430 -260712 -327888 -382642 -239275 79599 387514 380950 279329 448242 494537
$$ packed form
12577H63412J23224k59538m69332l20814r6431N4563j98321M3931K20530Q395
12567c0381J80054Q0568J0001P419j3493k02350j59460J37703M8880k43158p1668
12556b55885p2390n2465J03858j3059k9378K47105K94682J54907j08245J4252
12546B83382r1517j42519N1630m0821q1336P3245J81952J47687J7314k03070K8738
12535B24685K20051M3006j09042l4167K19357K09102o1854k26727j43064j32388
12525B08959k7699R544K15654K59558k28416k34434j24697J2182J37086J22374
12515C50111J19244J7008r9176n3482j16908r2441j3025p4154j24769j09731n2557
12504b49880n550n282o7176n4754J43367L18874L07915o564j01621J68913M6295
$$ plain form
12493 494537 396143 265496 139767 170939 141455 195062 242993 291555 315061 284240 359499
12482 359499 368479 515688 567506 410441 57401 -7309 121496 139390 263958 345699 348685
12471 348685 203897 231813 520603 530387 520282 756497 814942 732535 497375 438675 335952
12460 335952 105599 -17897 76632 217021 343418 476705 439895 256059 -28305 -72749
12450 -72749 -8058 121703 407882 528560 504746 465334 277373 223646 314091 262733 184333
12439 184333 159812 257653 428234 551181 429033 231729 210220 189811 226188 41941
12429 41941 -346024 -646894 -845777 -849416 -585975 -438599 -230065 -41794 -61736 -110617
12419 -110617 102754 207117 107644 -121530 -418832 -480718 -568277 -483100 -259317 -273064
$$ packed form
12493D94537r8394j30647j25729L1172k9484N3607M7931M8562K3506l0821P5259
12482C59499Q980J47209N1818j57065l53040o4710J28805J7894J24568Q1741K986
12471C48685j44788K7916K88790R784j0105K36215N8445q2407k35160n8700j02723
12460C35952k30353j23496R4529J40389J26397J33287l6810j83836k84364m4444
12450g2749O4691J29761K86179J20678k3814l9412j87961n3727R0445n1358p8400
12439A84333k4521R7841J70581J22947j22148j97304k1509k0409L6377j84247
12429D1941l87965l00870j98883l639K63441J47376K08534J88271j9942m8881
12419a10617K13371J04363r9473k29174k97302o1886q7559Q5177K23783j3747
$$ plain form
12409 -273064 -421363 -417050 -222257 -111923 -212558 -312855 -263428 -43926 119281 85917
12399 85917 112343 3461 -227458 -379941 -153248 -26136 -82266 -5880 5587 -94616
12389 -94616 33276 388736 711951 559443 125726 -268513 -387578 -304703 -354244 -432850
12379 -432850 -570893 -661547 -788478 -722018 -422436 -10493 422951 479059 221000 -187243
12369 -187243 -517475 -702002 -633178 -324816 -63496 -131587 -17908 60747 216971 386014
12359 386014 293374 348099 315991 260891 363419 556938 617508 508987 415811 374641 426446
12348 426446 637013 662541 454290 377103 444530 373371 375142 502922 616237 578196 435153
12337 435153 465688 535837 392220 124093 158618 390618 603638 855446 952501 894513
$$ packed form
12409b73064j48299M313J94793J10334j00635j00297M9427K19502J63207l3364
12399H5917K6426j08882k30919j52483K26693J27112n6130P6386J1467j00203
12389i4616J27892L55460L23215j52508m33717l94239j19065Q2875m9541p8606
12379d32850j38043r0654j26931O6460K99582M11943M33444N6108k58059m08243
12369a87243l30232j84527O8824L08362K61320o8091J13679P8655J56224J69043
12359C86014r2640N4725l2108n5100J02528J93519O0570j08521r3176m1170N1805
12348D26446K10567K5528k08251p7187O7427p1159J771J27780J13315l8041j43043
12337D35153L0535P0149j43617k68127L4525K32000K13020K51808R7055n7988
$$ plain form
12327 894513 686812 454985 486884 673287 869461 678096 384170 405590 352271 227648
12317 227648 438784 683169 634735 730971 819047 638165 358635 171634 97529 -16677
12307 -16677 -294838 -268056 -171473 -73528 63166 49412 -36828 -33762 -173357 -220506 -186091
12296 -186091 -159197 -285292 -416968 -341063 -265146 -284623 -326785 -206559 41043 193812
12286 193812 6808 -271216 -421644 -237623 -113222 -291164 -466801 -400395 -183851 -35938
12276 -35938 43118 -143045 -508430 -559462 -379269 10235 284659 337127 385903 240093
12266 240093 63654 -219001 -508136 -520549 -198361 114574 178067 103252 -111 -167811
12256 -167811 -324602 -208420 -53522 -11164 227706 439661 287584 8826 -94529 27656
$$ packed form
12327H94513k07701k31827L1899J86403J96174j91365k93926K1420n3319j24623
12317B27648K11136K44385m8434R6236Q8076j80882k79530j87001p4105j14206
12307a6677k78161K6782R6583R7945J36694j3754q6240L066j39595m7149L4415
12296a86091K6894j26095j31676P5905P5917j9477m2162J20226K47602J52769
12286A93812j87004k78024j50428J84021J24401j77942j75637O6406K16544J47913
12276c5938P9056j86163l65385n1032J80193L89504K74424N2468M8776j45810
12266B40093j76439k82655k89135j2413L22188L12935O3493p4815j03363j67700
12256a67811j56791J16182J54898M2358K38870K11955j52077k78758j03355J22185
$$ plain form
12246 27656 199841 338632 380466 270480 342528 409593 205627 -37921 -72695 34060
12236 34060 72731 -11517 31698 24878 2022 -23571 -55168 67293 345034 430202 427884 467621
12224 467621 342332 -12306 -250150 -420145 -553178 -550752 -497371 -264531 -301907 -387948
12214 -387948 -110596 214467 241447 136324 202766 124793 35764 14434 68015 67657 -87794
12203 -87794 -201253 -186503 -19119 26923 -106853 187 227791 188771 192323 285628 292596
12192 292596 224745 106921 332895 654654 770905 663898 418429 209852 181093 258082
12182 258082 295119 253507 186792 110251 194801 298895 386148 447073 243719 13222 -104780
12171 -104780 -76257 107450 229664 293882 415408 428519 404589 391507 293713 267303 471016
$$ packed form
12246B7656J72185J38791M1834j09986P2048O7065k03966k43548l4774J06755
12236C4060L8671q4248M3215o820k2856k5593l1597J22461K77741Q5168k318L9737
12224D67621j25289l54638k37844j69995j33033K426N3381K32840l7376q6041
12214c87948K77352L25063K6980j05123O6442p7973q9029k1330N3581l58j55451
12203h7794j13459J4750J67384M6042j33776J07040K27604l9020L552R3305O968
12192B92596o7851j17824K25974L21759J16251j07007k45469k08577k8759P6989
12182B58082L7037m1612o6715p6541Q4550J04094Q7253O0925k03354k30497j18002
12171a04780K8523J83707J22214O4218J21526J3111k3930j3082r7794k6410K03713
$$ plain form
12160 471016 386915 232844 209580 -90827 -614666 -881814 -891498 -763374 -130860 422942
12150 422942 374305 16999 21894 216228 76407 -156679 -129606 -39663 -64812 -182770 -310100
12139 -310100 -553166 -527059 -238261 -2182 38300 142684 311280 262454 169936 260521
12129 260521 522278 489169 403058 363855 173470 38932 203473 365107 303563 277920
12119 277920 334112 286180 198469 119489 -24429 -397848 -506794 -236340 -15874 111290
12109 111290 256943 345994 326255 136912 -198417 -489452 -550986 -362506 -125578 -110782
12099 -110782 -17595 379295 270125 -121837 -250843 -288737 -407242 -557661 -384822 -197070
12089 -197070 -33658 41643 329087 469022 446445 401095 377386 207047 72880 85714
$$ packed form
12160D71016q4101j54071k3264l00407n23839k67148r684J28124O32514N53802
12150D22942m8637l57306M895J94334j39821k33086K7073Q9943k5149j17958j27330
12139c10100k43066K6107K88798K36079M0482J04384J68596m8826r2518R0585
12129B60521K61757l3109q6111l9203j90385j34538J64541J61634o1544k5643
12119B77920N6192m7932q7711p8980j43918l73419j08946K70454K20466J27164
12109A11290J45653Q9051j9739j89343l35329k91035o1534J88480K36928J4796
12099a10782R3187L96890j09170l91962j29006l7894j18505j50419J72839J87752
12089a97070J63412P5301K87444J39935k2577m5350k3709j70339j34167J2834
$$ plain form
12079 85714 -4997 -232921 -291650 -351970 -461967 -407214 -401048 -132002 -5645 -46558 -151129
12068 -151129 -203234 -30145 398167 409936 325928 260733 208175 203622 76538 -124223 -254153
12057 -254153 -252098 -113744 125921 234617 290684 312663 185452 25541 -7953 45748 266478
12046 266478 533678 533712 410508 647466 851684 725372 456376 230516 10998 -54901
12036 -54901 -96952 -4099 179938 243101 154827 24344 -80211 -82645 -20500 -134879 -422885
12025 -422885 -414698 -112044 -72781 -410314 -540270 -267414 -1301 -104899 -122673 -158087
12015 -158087 -430382 -657847 -742157 -617884 -477984 -473478 -567279 -430531 -16751 304275
12005 304275 447637 420988 386668 107727 -320280 -670440 -823035 -622378 -260124 -192522
$$ packed form
12079H5714r0711k27924n8729o0320j09997N4753O166K69046J26357m0913j04571
12068a51129n2105J73089M28312J1769q4008o5195n2558m553j27084k00761j29930
12057b54153K055J38354K39665J08696N6067K1979j27211j59911l3494N3701K20730
12046B66478K67200L4j23204K36958K04218j26312k68996k25860k19518o5899
12036e4901m2051R2853J84037O3163q8274j30483j04555k434O2145j14379k88006
12025d22885Q187L02654L9263l37533j29956K72856K66113j03598j7774l5414
12015a58087k72295k27465q4310J24273J39900M506r3801J36748M13780L21026
12005C04275J43362k6649l4320k78941m28007l50160j52595K00657L62254O7602
$$ plain form
11995 -192522 -347217 -269744 5227 258760 409052 455582 444045 369364 200031 56532
11985 56532 -8489 151750 78045 -131574 -210189 -259469 -339019 -296177 36257 385139 573954
11974 573954 731049 837190 763105 564458 314857 263814 370302 306636 226787 142380
11964 142380 -31434 -229624 -297265 -247319 -195032 -77893 98455 148169 132491 215904 196996
11953 196996 30666 -84315 -91141 -13160 152878 209789 -20232 -191542 -269496 -279287 -232345
11942 -232345 -126462 -50813 -117108 -390627 -569790 -624494 -691433 -585679 -346337 -178402
11932 -178402 -161062 -256548 -480101 -610819 -554536 -272993 21170 -13033 -45528 8494 -50849
11921 -50849 45265 215608 300354 256747 44535 -302306 -363064 -88108 228012 502033
$$ packed form
11995a92522j54695P7473K74971K53533J50292M6530j1537p4681j69333j43499
11985E6532o5021J60239p3705k09619p8615m9280p9550M2842L32434L48882J88815
11974E73954J57095J06141p4085j98647k49601n1043J06488o3666p9849q4407
11964A42380j73814j98190o7641M9946N2287J17139J76348M9714j5678Q3413j8908
11953A96996j66330j14981o826P7981J66038N6911k30021j71310p7954r791M6942
11942b32345J05883P5649o6295k73519j79163n4704o6939J05754K39342J67935
11932a78402J7340r5486k23553j30718N6283K81543K94163l4203l2495N4022n9343
11921e0849R6114J70343Q4746m3607k12212l46841o0758K74956L16120K74021
$$ plain form
11911 502033 724050 871582 856779 609015 283306 -36869 -156730 -132315 -258864 -242545
11901 -242545 -141529 -222469 -248647 -184354 -155845 -383 -38317 -101283 -45514 96846 271241
11890 271241 226568 -28508 -393853 -435538 -352788 -68151 77593 158214 155086 -70782 -140332
11879 -140332 -99912 -230471 -259695 15914 378076 436541 277191 24420 -68193 -96844
11869 -96844 -113833 -217663 -150142 28322 92988 201322 365501 636839 600705 116634
11859 116634 -399058 -821106 -848145 -705552 -738637 -730198 -649496 -394908 -219576 56149
11849 56149 306450 298109 230279 196701 4387 -357042 -464288 -101948 103753 -72620
11839 -72620 -164408 -150179 -190933 -249471 -240889 -227843 -108299 -42700 -150747 -297277 -287621
$$ packed form
11911E02033K22017J47532j4803k47764l25709l20175j19861K4415j26549J6319
11901b42545J01016q0940k6178O4293K8509J55462l7934o2966N5769J42360J74395
11890B71241m4673k55076l65345m1685Q2750K84637J45744Q0621l128k25868o9550
11879a40332M0420j30559k9224K75609L62162N8465j59350k52771r2613k8651
11869i6844j6989j03830O7521J78464O4666J08334J64179K71338l6134m84071
11859A16634n15692m22048k7039J42593l3085Q439Q0702K54588J75332K75725
11849E6149K50301q341o7830l3578j92314l61429j07246L62340K05701j76373
11839g2620r1788J4229m0754n8538Q582J3046J19544O5599j08047j46530R656
$$ plain form
11828 -287621 -262148 -386136 -427967 -299002 -23172 -16947 -175664 -62994 153232 364373
11818 364373 502075 414531 258534 278251 192497 47885 134061 217500 420965 441689 273850
11807 273850 82460 -94284 -124893 -128732 -295607 -377679 -316430 -88166 -2529 190209 307984
11796 307984 350280 554395 536947 429771 294265 -29285 -263327 -279693 -311526 -280889
11786 -280889 -117297 90412 172892 259643 165221 85747 55465 65210 160231 -171927 -425931
11775 -425931 -319146 -180871 -124771 -119731 -26770 75712 -45211 -243552 -96024 171252
11765 171252 290663 277929 368043 606069 430203 123445 -105284 -4219 129408 275560
11755 275560 123177 -232302 -279443 -395618 -784752 -1099602 -1131154 -825760 -376271 -22645
$$ packed form
11828b87621K5473j23988m1831J28965K75830O225j58717J12670K16226K11141
11818C64373J37702q7544j55997J9717q5754j44612Q6176Q3439K03465K0724j67839
11807B73850j91390j76744l0609l839j66875q2072O1249K28264Q5637J92738J17775
11796C07984M2296K04115j7448j07176j35506l23550k34042j6366l1833L0637
11786b80889J63592K07709Q2480Q6751r4422p9474l0282R745R5021l32158k54004
11775d25931J06785J38275N6100N040R2961J02482j20923j98341J47528K67276
11765A71252J19411j2734R0114K38026j75866l06758k28729J01065J33627J46152
11755B75560j52383l55479m7141j16175l89134l14850l1552L05394M49489L53626
$$ plain form
11745 -22645 67956 -24983 -100333 -95990 -155784 23457 442595 623196 442557 238333 295809
11734 295809 362204 300808 262575 235179 292335 258004 53179 -121279 -64754 -57478 -173116
11723 -173116 -62699 -72551 107944 203364 -103601 -277004 -108671 -179528 -383259 -546988
11713 -546988 -604737 -600195 -447320 -244615 -383054 -812612 -1033338 -635297 59369 353057
11703 353057 158074 -18100 -22336 125389 227701 302749 371926 257511 335492 417179 525225
11692 525225 404633 156215 45295 -58850 58985 156821 237983 188993 58077 91765
11682 91765 155363 -18297 -324448 -455363 -461284 -516415 -274229 -63705 -190438 -375694
11672 -375694 -320983 -278436 -70231 81612 -6678 -248105 -422146 -789510 -1248257 -1152613
$$ packed form
11745b2645R0601r2939p5350M343n9794J79241M19138J80601j80639k04224N7476
11734B95809O6395o1396l8233k7396N7156l4331k04825j74458N6525P276j15638
11723a73116J10417r852J80495R5420l06965j73403J68333p0857k03731j63729
11713e46988n7749M542J52875K02705j38439m29558k20726L98041O94666K93688
11703C53057j94983j76174m236J47725J02312P5048O9177j14415P7981Q1687J08046
11692E25225j20592k48418j10920j04145J17835R7836Q1162m8990j30916L3688
11682I1765O3598j73660l06151j30915n921n5131K42186K10524j26733j85256
11672c75694N4711M2547K08205J51843q8290k41427j74041l67364m58747R5644
$$ plain form
11662 -1152613 -662635 -186222 -11347 -49816 -177578 -489796 -586745 -405970 -297689 -453546
11652 -453546 -362150 -139865 -316836 -333100 -100409 -45605 116835 236863 9801 -64107
11642 -64107 -41614 73179 308311 398479 594865 561502 232909 90598 115805 38331 41249
11631 41249 44041 -85491 -299486 -341459 -129354 -86384 -261711 -312367 -230989 -177910 -23110
11620 -23110 92176 194191 229073 134275 11255 116921 318141 380065 335434 440429
11610 440429 443772 30154 -440834 -517350 -334287 -395702 -407573 -129774 177641 171482 -5541
11599 -5541 248726 550147 662162 693543 494598 379349 532023 382498 266852 82872
11589 82872 -90654 -121187 -15239 -57122 -66228 50474 44912 40959 -22935 -114982 138614
$$ packed form
11662a152613M89978M76413J74875l8469j27762l12218r6949J80775J08281j55857
11652d53546R1396K22285j76971j6264K32691N4804J62440J20028k27062p3908
11642f4107K2493J14793K35132R0168J96386l3363l28593j42311K5207p7474K918
11631D1249K792j29532k13995m1973K12105M2970j75327n0656Q1378N3079J54800
11620b3110J15286J02015L4882r4798j23020J05666K01220O1924m4631J04995
11610D40429L343m13618m70988p6516J83063o1415j1871K77799L07415o159j77023
11599e541K54267L01421J12015L1381j98945j15249J52674j49525j15646j83980
11589H2872j73526l0533J05948m1883r106J16702n562l953o3894r2047K53596
$$ plain form
11578 138614 342712 306353 331669 345652 297741 291481 436617 581749 494056 552297 765287
11567 765287 766936 705305 591827 422043 157905 58723 163407 252061 301356 456531 759479
11556 759479 785883 321531 -55112 -134073 -36943 -43069 -43758 33796 57054 51384 9816 -128729
11544 -128729 -96417 211957 181789 165963 220954 382566 614124 871684 879178 556393 260544
11533 260544 183139 63832 40889 135009 308710 437295 401348 477798 440864 192742 -125549
11522 -125549 -179092 88021 328257 531422 542756 415441 164392 -3990 -61232 -18261
11512 -18261 -40123 -126914 -192230 -168474 -36536 -44159 -144648 -165615 67519 64358 -80002
11501 -80002 -96456 -17458 28848 -21439 169168 98286 -256228 -276462 -180364 -147083 -78469
$$ packed form
11578A38614K04098l6359K5316J3983m7911o260J45136J45132q7693N8241K12990
11567G65287J649o1631j13478j69784k64138r9182J04684Q8654M9295J55175L02948
11556G59479K6404m64352l76643p8961R7130o126o89P7554K3258n670m1568j38545
11544a28729L2312L08374l0168j5826N4991J61612K31558K57560P494l22785k95849
11533B60544p7405j19307k2943R4120J73701J28585l5947P6450l6934k48122l18291
11522a25549n3543K67113K40236K03165J1334j27315k51049j68382n7242M2971
11512a8261k1862q6791o5316K3756J31938p623j00489k0967K33134l161j44360
11501h0002j6454P8998M6306n0287J90607p0882l54514k0234R6098L3281O8614
$$ plain form
11490 -78469 -31531 153407 324090 393647 327851 196996 143588 198207 147413 76625 279758
11479 279758 463586 321405 93862 45147 76530 64386 -135659 -180512 -152517 -83690 -117533
11468 -117533 -170784 -175064 -85292 -80064 -97135 131024 291061 280845 119844 2342 -17600
11457 -17600 -13327 -17061 36288 -85853 -223068 -321968 -476334 -596932 -531464 -433343 -345244
11446 -345244 -289805 -356748 -298520 -263153 -214714 56346 332427 396967 427924 334428 -36492
11435 -36492 -231752 -193477 -239969 -375009 -318489 -192020 17820 144731 93000 -103787
11425 -103787 -274237 -198254 209357 654744 695123 463432 289521 416584 369607 242893
11415 242893 245307 221209 212201 230287 241565 223346 332571 261206 -33796 -290572 -454652
$$ packed form
11490g8469M6938J84938J70683O9557o5796j30855n3408N4619n0794p0788K03133
11479B79758J83828j42181k27543m8715L1383j2144k00045m4853K7995O8827l3843
11468a17533n3251m280Q9772N228j7071K28159J60037j0216j61001j17502j9942
11457a7600M273l734N3349j22141j37215r8900j54366j20598O5468R8121Q8099
11446c45244N5439o6943N8228L5367M8439K71060K76081O4540L0957r3496l70920
11435c6492j95260L8275m6492j35040N6520J26469K09840J26911n1731j96787
11425a03787j70450P5983M07611M45387M0379k31691j73911J27063m6977j26714
11415B42893K414k4098r008J8086J1278j8219J09225p1365k95002k56776j64080
$$ plain form
11404 -454652 -307613 -142560 -4123 13097 150230 366089 437686 364911 339077 276259
11394 276259 223245 -27892 -379257 -620698 -753167 -813499 -300046 60403 39546 -63802
11384 -63802 -172696 -263581 -237604 -86959 12892 267174 236602 -48407 114684 273598
11374 273598 143297 -79901 -345684 -410931 -464192 -476325 -702797 -877163 -702490 -456726
11364 -456726 -90636 129035 167488 132465 211024 381472 824897 1149853 999515 651254
11354 651254 364624 74968 -110320 23300 156416 243590 154177 -113172 -236420 -256098
11344 -256098 -184945 -118895 -237325 -430193 -518303 -550104 -660287 -693754 -634350 -323786 -40519
11333 -40519 86212 53940 -103956 -299083 -285148 -224895 -153979 -232800 -334878 -363673 -23578
$$ packed form
11404d54652J47039J65053J38437J7220J37133K15859P1597p2775k5834o2818
11394B76259n3014k51137l51365k41441j32469o0332N13453L60449k0857j03348
11384f3802j08894r0885K5977J50645R9851K54282l0572k85009J63091J58914
11374B73598j30301k23198k65783o5247n3261j2133k26472j74366J74673K45764
11364d56726L66090K19671L8453l5023P8559J70448M43425L24956j50338l48261
11354F51254k86630k89656j85288J33620J33116Q7174q9413k67349j23248j9678
11344b56098P1153O6050j18430j92868q8110l1801j10183l3467N9404L10564K83267
11333d0519J26731l2272j57896j95127J3935O0253P0916p8821j02078k8795L40095
$$ plain form
11322 -23578 358938 458133 313210 99986 -32438 -234219 -407415 -269849 -90529 -164105
11312 -164105 -398442 -401857 -351088 -185930 -109785 -74890 99762 157970 166410 -47104 -216856
11301 -216856 -218627 -92478 136495 265933 234759 228246 274442 177102 39152 -56720 171895
11290 171895 402672 339732 290622 201930 160608 115871 88924 173731 250711 190605 -49609
11279 -49609 -259087 -123839 -79376 -221278 -306985 -341002 -446482 -536491 -483837 -240378 -210929
11268 -210929 -270320 -398302 -516963 -612357 -827534 -845119 -492649 -315708 -265934 -209789
11258 -209789 -143107 -323311 -539483 -832991 -820475 -614428 -464448 -107857 266360 408249
11248 408249 372954 355169 243732 194672 270163 283501 -128462 -337598 -283346 -235750 -315518
$$ packed form
11322b3578L82516R9195j44923k13224j32424k01781j73196J37566J79320p3576
11312a64105k34337l415N0769J65158P6145L4895J74652N8208Q440k13514j69752
11301b16856j771J26149K28973J29438l1174o513M6196r7340j37950r5872K28615
11290A71895K30777o2940m9110q8692m1322m4737k6947Q4807P6980o0106k40214
11279d9609k09478J35248M4463j41902q5707l4017j05480r0009N2654K43459K9449
11268b10929n9391j27982j18661r5394k15177j7585L52470J76941M9774N6145
11258b09789O6682j80204k16172k93508J2516K06047J49980L56591L74217J41889
11248D08249l5295j7785j11437m9060P5491J3338m11963k09136N4252M7596p9768
$$ plain form
11237 -315518 -320924 -419274 -549316 -258661 185180 477967 409111 396680 493306 340090 114840
11226 114840 21366 -146069 -334656 -312711 -68682 70470 224716 269117 151418 18447
11216 18447 -73400 -37699 160561 382046 391004 234871 165301 333368 318053 267472 88771
11205 88771 -362902 -588539 -401303 -115559 -24934 97790 250416 173325 -128813 -425500
11195 -425500 -658854 -660915 -506205 -442082 -459595 -244097 247808 619290 615903 443568 304879
11184 304879 157593 40141 -208624 -461781 -442949 -278026 -327431 -493473 -602720 -511639
11174 -511639 -521570 -555139 -247248 -214618 -219622 -116773 -47512 183827 169210 -51681 -98073
11163 -98073 146135 444679 613828 555790 220563 -157713 -370950 -401305 -267954 -17717
$$ packed form
11237c15518n406r8350j30042K90655M43841K92787o8856j2431R6626j53216k25250
11226A14840r3474j67435j88587K1945K44029J39152J54246M4401j17699j32971
11216A8447r1847L5701J98260K21485Q958j56133o9570J68067j5315n0581j78701
11205H8771m51673k25637J87236K85744R0625J22724J52626p7091l02138k96687
11195d25500k33354k061J54710O4123j7513K15498M91905L71482l387j72335j38689
11184C04879j47286j17452k48765k53157J8832J64923m9405j66042j09247R1081
11174e11639r931l3569L07891L2630n004J02849O9261K31339j4617k20891m6392
11163i8073K44208K98544J69149n8038l35227l78276k13237l0355J33351K50237
$$ plain form
11153 -17717 192066 245004 217209 21172 -131582 -239020 -6641 380787 564779 381819
11143 381819 62571 -169455 -214596 -39387 41329 -114622 -142194 -92909 -401801 -649610
11133 -649610 -515829 -295243 -227764 -311741 -353571 -314183 -384463 -258715 -17312 170691
11123 170691 220472 169079 -105107 -453624 -562703 -489617 -395729 -400814 -296813 56080 22235
11112 22235 -357961 -648113 -479345 -61923 -6444 -109282 -460745 -660765 -458253 -125103
11102 -125103 86164 91860 274877 182831 -298797 -449690 -367122 -423437 -547980 -545790 -480212
11091 -480212 -388531 -398561 -413273 -318165 -148116 28885 62831 61138 -55817 -43547 443
11080 443 -57209 -44522 16240 175308 282853 283750 189701 -42973 -120481 -57614 -42460 -337054
$$ packed form
11153a7717K09783N2938k7795j96037j52754j07438K32379L87428J83992j82960
11143C81819l19248k32026m5141J75209Q0716j55951k7572M9285l08892k47809
11133f49610J33781K20586O7479q3977m1830L9388p0280J25748K41403J88003
11123A70691M9781n1393k74186l48517j09079P3086R3888n085J04001L52893l3845
11112B2235l80196k90152J68768M17422N5479j02838l51463k00020K02512L33150
11102a25103K11267N696J83017r2046m81628j50893Q2568n6315j24543K190O5578
11091d80212R1681j0030j4712R5108J70049J77001L3946j693j16955J2270M3990
11080D43n7652J2687O0762J59068J07545Q97r4049k32674p7508O2867J5154k94594
$$ plain form
11068 -337054 -613635 -379317 -46539 153135 361882 438522 322169 212380 -35090 -251284
11058 -251284 -130808 72306 23591 -212829 -285546 -91838 112729 89877 -63970 106936
11048 106936 -19472 -169109 -236513 -364141 -363316 -312139 -220490 -9159 -184917 -656610 -834001
11037 -834001 -840824 -735785 -451011 -338894 -241474 -207509 -55603 290495 494518 567428
11027 567428 558371 600332 734805 731860 502153 347235 65707 -222182 -221204 -84695 121232
11016 121232 354529 168999 -132994 -55393 87036 93936 84230 -65281 -198765 -50509
11006 -50509 112684 337575 519767 485350 374811 221254 114120 142865 223249 200866
10996 200866 121570 -89794 -313139 -324803 -217553 -134762 -66785 -40516 -105231 -255756 -343294
$$ packed form
11068c37054k76581K34318L32778J99674K08747P6640j16353j09789k47470k16194
11058b51284J20476K03114m8715k36420p2717J93708K04567k2852j53847J70906
11048A06936j26408j49637o7404j27628Q25N1177R1649K11331j75758m71693j77391
11037h34001o823J05039K84774J12117R7420L3965J51906L46098K04023P2910
11027E67428r057M1961J34473k945k29707j54918k81528k87889R78J36509K05927
11016A21232K33297j85530l01993P7601J42429O900r706j49511j33484J48256
11006e0509J63193K24891J82192l4417j10539j53557j07134K8745Q0384k2383
10996B00866p9296k11364k23345j1664J07250Q2791O7977K6269o4715j50525q7538
$$ plain form
10985 -343294 -237706 -95865 169340 354700 316435 116464 -309489 -686476 -593002 -472261
10975 -472261 -521906 -429268 -286816 -399965 -557009 -422204 -305820 -237088 -61724 19252
10965 19252 42105 10010 -99147 -250901 -270815 -227972 -55830 262879 339108 189951 6980
10954 6980 -7137 201968 402176 515250 577729 426421 299745 405080 449530 427438 368253
10943 368253 184017 -39537 -104749 46108 143149 257695 215807 148231 263527 334910
10933 334910 283857 283968 380583 355565 357018 394400 489090 503757 126854 -227892 -131599 -801
10921 -801 75679 262541 358659 407666 278350 133202 -61411 -247835 -340359 -241819 -144282
10910 -144282 -144223 -120012 -139543 -310571 -275003 -240679 -227415 -70033 -100425 -188681 -371628
$$ packed form
10985c43294J05588J41841K65205J85360l8265j99971m25953l76987R3474J20741
10975d72261m9645R2638J42452j13149j57044J34805J16384O8732J75364Q0976
10965A9252K2853l2095j09157j51754j9914M2843J72142L18709P6229j49157j82971
10954F980j4117K09105K00208J13074O2479j51308j26676J05335M4450k2092n9185
10943C68253j84236k23554o5212J50857R7041J14546m1888o7576J15296P1383
10933C34910n1053J11R6615k5018J453L7382R4690J4667l76903l54746R6293J30798
10921h01P6480J86862R6118M9007j29316j45148j94613j86424r2524R8540R7537
10910a44282N9K4211j9531j71028L5568L4324J3264J57382l0392q8256j82947
$$ plain form
10899 -371628 -502344 -667510 -815041 -854094 -638835 -255580 -27016 95978 131065 290662
10889 290662 437077 327134 68125 -332853 -577124 -658744 -542207 -204620 -21804 95606
10879 95606 112841 -68991 -127023 -248445 -484153 -280770 -25410 174071 279751 31560
10869 31560 -497914 -713513 -409259 -89638 -103932 -279539 -352178 -317662 -104803 -24680
10859 -24680 -82824 16209 99915 215442 301487 379885 340685 233857 -95436 -421362 -525824
10848 -525824 -690701 -744228 -548474 -518487 -633771 -422575 -76823 120127 259321 353107
10838 353107 282745 -19213 -34869 99025 30786 -62218 -29873 -32477 -194591 -346383 -363010
10827 -363010 -324026 -149144 -6054 161356 248008 145738 138051 188662 400051 566549
$$ packed form
10899c71628j30716j65166j47531l9053K15259L83255K28564J22994L5087J59597
10889B90662J46415j09943k59009m00978k44271q1620J16537L37587J82816J17410
10879I5606J7235j81832n8032j21422k35708K03383K55360J99481J05680k48191
10869C1560n29474k15599L04254L19621j4294j75607p2639L4516K12859Q0123
10859b4680n8144R9033Q3706J15527Q6045P8398l9200j06828l29293l25926j04462
10848e25824j64877n3527J95754K9987j15284K11196L45752J96950J39194R3786
10838C53107p0362l01958j5656J33894o8239r3004L2345k604j62114j51792j6627
10827c63010L8984J74882J43090J67410Q6652j02270p687N0611K11389J66498
$$ plain form
10817 566549 565647 450611 387110 304411 175767 138056 323801 474704 457411 146239 -19977
10806 -19977 11220 -119152 -14634 150278 196856 312687 360514 412924 259978 2504
10796 2504 -248705 -184414 324675 499728 276268 63643 -149584 -97943 71277 290028
10786 290028 423282 271538 246122 334569 308903 286109 425008 488761 605402 536616 394749
10775 394749 393450 394019 534545 787692 827036 546028 399946 549973 757334 839733 1007078
10764 1007078 1034447 834230 610058 641630 790386 927762 1306025 1721791 2298940 3134119
10754 3134119 4154314 5539304 6746228 7105167 6745193 5897076 4950397 4116781 3501076
10745 3501076 3070343 2862210 2871722 2789629 2762330 3109097 3765601 4309054 5031602 6097278
$$ packed form
10817E66549r02j15036o3501q2699j28644l7711J85745J50903j7293l11172j66216
10806a9977L1197j30372J04518J64912M6578J15831M7827N2410j52946k57474
10796B504k51209O4291N09089J75053k23460k12625k13227N1641J69220K18751
10786B90028J33254j51744k5416Q8447k5666k2794J38899O3753J16641o8786j41867
10775C94749j299N69J40526K53147L9344k81008j46082J50027K07361Q2399J67345
10764A007078K7369k00217k24172L1572J48756J37376L78263M15766N77149Q35179
10754C134119J020195J384990J206924L58939l59974q48117r46679q33616o15705
10745C501076m30733k08133R512q2093k7299L46767O56504N43453P22548J065676
$$ plain form
10735 6097278 7529053 9788284 12951390 17402652 24280437 35563742 51515375 67044265
10727 67044265 70300863 64734318 63292782 62446708 52010325 36927915 25750882 18550973
10719 18550973 13791292 10346437 8177033 6700650 5701538 4735766 3777693 3019089 2690441
10710 2690441 2601806 2501522 2053665 1578318 1321640 1407925 1376780 1156993 1069014 1268882
10700 1268882 1274658 1157845 1075286 749461 601505 614596 447538 386983 322354 260364 239603
10689 239603 240993 188680 93798 26713 270572 387425 630420 941119 890158 819486 890963
10678 890963 933316 873033 926666 955213 1000575 1100341 1001497 812405 664101 702842 670964
10667 670964 463120 203031 110704 244460 308607 32687 -90884 -85173 -129952 -98340 -93760
$$ packed form
10735F097278J431775K259231L163106M451262O877785J1283305J5951633J5528890
10727F7044265L256598n566545j441536q46074j0436383j5082410j1177033p199909
10719A8550973m759681l444855k169404j476383r99112r65772r58073p58604l28648
10710B690441q8635j00284m47857m75347k56678Q6285l1145k19787q7979J99868
10700A268882N776j16813q2559l25825j47956J3091j67058o0555o4629o1990k0761
10689B39603J390n2313r4882o7085K43859J16853K42995L10699n0961p0672P1477
10678H90963M2353o0283N3633K8547M5362R9766r8844j89092j48304L8741l1878
10667F70964k07844k60089r2327J33756O4147k75920j23571N711m4779L1612M580
$$ plain form
10656 -93760 -90133 -192229 -159660 -80327 183054 472397 478001 257238 199306 72004 -97392
10645 -97392 -163330 -138049 -177841 -302924 -365672 -436704 -422439 -320767 -179808 -11769 210721
10634 210721 375188 277186 195127 80934 95668 222629 93682 19159 -59204 -11066 67619
10623 67619 96387 169752 256434 335605 411609 465696 283417 -112380 -403704 -389059 -277204
10612 -277204 -287548 -170320 156152 442696 323588 131539 154621 152893 270067 309878
10602 309878 -76299 -119723 55117 -65195 -347349 -507042 -428452 -218948 -14535 -41479
10592 -41479 -183996 -215663 -49622 38723 83394 -26333 -39884 131207 280959 185935 135641
10581 135641 231542 498406 611282 428978 119042 -109092 16432 355206 531528 453855
$$ packed form
10656i3760L627j02096L2569P9333K63381K89343N604k20763n7932j27302j69396
10645i7392o5938K5281l9792j25083o2748p1032J4265J01672J40959J68039K22490
10634B10721J64467r8002q2059j14193J4734J26961j28947p4523p8363M8138P8685
10623F7619K8768P3365Q6682P9171P6004N4087j82279l95797k91324J4645J11855
10612b77204j0344J17228L26472K86544j19108j92049K3082j728J17174L9811
10602C09878l86177m3424J74840j20312k82154j59693P8590K09504K04413k6944
10592d1479j42517l1667J66041Q8345M4671j09727j3551J71091J49752r5024n0294
10581A35641R5901K66864J12876j82304l09936k28134J25524L38774J76322p7673
$$ plain form
10571 453855 130824 -4533 93191 -2142 -199851 -22640 150643 196863 248530 186919
10561 186919 101130 80599 67561 63807 164586 83975 -257224 -344167 -238022 -324421 -421139
10550 -421139 -333064 -176396 -87783 -121610 -1622 157158 -42921 -160653 -25967 172983
10540 172983 40981 -290622 -356161 -122153 -173682 -237955 81877 222996 25881 9925
10530 9925 79138 102496 9932 -192155 -157709 -8021 -5959 -172705 -62819 44986 -85205
10519 -85205 -214750 -261647 -206265 -180828 28304 221168 266573 599030 650823 116131 5716
10508 5716 224056 423119 447436 502419 667164 745242 738299 617421 450908 241004 70610
10497 70610 -30809 -10609 -105666 -125263 70642 132143 -950 102682 170638 3403 -20965
$$ packed form
10571D53855l23031j35357R7724r5333j97709J77211J73283M6220N1667o1611
10561A86919q5789k0531j3038l754J00779q0611l41199q6943J06145q6399r6718
10550d21139Q8075J56668Q8613l3827J19988J58780k00079j17732J34686J98950
10540A72983j32002l31603o5539K34008n1529o4273L19832J41119j97115j5956
10530I925O9213K3358r2564k02087L4446J49688K062j66746J09886J07805j30191
10519h5205j29545m6897N5382K5437K09132J92864M5405L32457N1793n34692j10415
10508E716K18340J99063K4317N4983J64745P8078o943j20878j66513k09904j70394
10497G0610j01419K0200r5057j9597J95905O1501j33093J03632O7956j67235k4368
$$ plain form
10486 -20965 94170 316403 371953 325311 344364 303757 355484 437643 458520 276627 66117
10475 66117 -155488 -355467 -298757 -246611 -146361 -17781 -71982 41810 50319 -99787 -253596
10464 -253596 -375735 -200934 -76756 -165993 -141779 60035 126207 68327 16090 -156094
10454 -156094 -543985 -701981 -689777 -490209 -302331 -195559 -94885 112209 134876 -149435
10444 -149435 -195523 -172100 -206142 -116495 -127151 -212988 -10476 323528 426872 93471 -145875
10433 -145875 -9846 -22667 -152720 -252414 -236024 13267 253239 341885 276616 147169
10423 147169 136718 -36306 -180553 -164513 -67884 -72202 -118538 -4787 225068 92089 -183286
10412 -183286 -310028 -518557 -837846 -960254 -933742 -686129 -271413 -140233 -127048 -37162
$$ packed form
10486b0965J15135K22233N5550m6642J9053m0607N1727Q2159K0877j81893k10510
10475F6117k21605j99979N6710N2146J00250J28580n4201J13792Q509j50106j53809
10464b53596j22139J74801J24178q9237K4214K01814O6172n7880n2237j72184
10454a56094l87891j57996J2204J99568J87878J06772J00674K07094K2667k84311
10444a49435m6088K3423l4042Q9647j0656q5837K02512L34004J03344l33401k39346
10433a45875J36029j2821j30053r9694J6390K49291K39972Q8646o5269j29447
10423A47169j0451j73024j44247J6040R6629m318m6336J13751K29855j32979k75375
10412a83286j26742k08529l19289j22408K6512K47613M14716J31180J3185Q9886
$$ plain form
10402 -37162 200525 441963 485237 437719 277744 87481 247167 582167 714925 620280
10392 620280 435297 250649 226995 166356 -126297 -125733 112226 353723 649272 746795 694263
10381 694263 603620 574699 514056 469308 560062 407839 292031 264273 342920 452011 497377
10370 497377 475392 325124 263305 115516 -105645 -329753 -376760 -336806 -261288 -273995 -195688
10359 -195688 44226 248628 567017 750714 426640 40058 -37805 -48967 -11394 -55461
10349 -55461 -157648 -53956 93698 -11024 -108463 -99434 53516 217251 182536 -73483
10339 -73483 -268505 -183968 -197103 -316955 -249668 -62089 2647 63606 92199 -45705 -231798
10328 -231798 -331346 -157542 23810 39436 164501 282851 246722 113488 205560 225667
$$ packed form
10402c7162K37687K41438M3274m7518j59975j90263J59686L35000J32758r4645
10392F20280j84983j84648k3654o0639k92653N64K37959K41497K95549R7523n2532
10381F94263r0643k8921o0643m4748R0754j52223j15808k7758P8647J09091M5366
10370D97377k1985j50268o1819j47789k21161k24108m7007L9954P5518j2707P8307
10359a95688K39914K04402L18389J83697l24074l86582p7863j1162L7573m4067
10349e5461j02187J03692J47654j04722r7439R029J52950J63735l4715k56019
10339g3483j95022Q4537j3135j19852O7287J87579O4736O0959K8593j37904j86093
10328b31798r9548J73804J81352J5626J25065J18350l6129j33234R2072K0107
$$ plain form
10318 225667 238854 231961 149614 155869 146702 91980 348299 548084 549743 634469 731887 775984
10306 775984 771217 527151 320161 145774 88517 67032 127012 116872 33753 109517 211505
10295 211505 164868 92094 -2251 -161570 -139628 4688 252041 429933 617117 769203
10285 769203 575293 399211 236666 220545 188847 -78494 -259627 -240005 15783 528465
10275 528465 767875 506050 142438 -74433 -88600 16381 56901 -3654 -159444 -189367
10265 -189367 -9347 127648 71255 76708 82757 -189029 -296795 -326480 -448126 -594820 -388393
10254 -388393 -149532 -81933 -57815 30263 155464 -96842 -452307 -767709 -981922 -988711
10244 -988711 -914613 -720005 -621312 -549375 -388794 -179763 -391396 -836148 -942175 -602808
$$ packed form
10318B25667J3187o893q2347O255r167n4722K56319J99785J659Q4726R7418M4097
10306G75984m767k44066k06990j74387n7257k1485N9980j0140q3119P5764J01988
10295B11505m6637p2774r4345j59319K1942J44316K47353J77892J87184J52086
10285G69203j93910j76082j62545j6121l1698k67341j81133J9622K55788N12682
10275E28465K39410k61825l63612k16871j4167J04981M0520o0555j55790k9923
10265a89367J80020J36995n6393N453O049k71786j07766k9685j21646j46694K06427
10254c88393K38861O7599K4118Q8078J25201k52306l55465l15402k14213o789
10244i88711P4098J94608R8693P1937J60581K09031k11633m44752j06027L39367
$$ plain form
10234 -602808 -392977 -243376 -89452 68141 230555 69702 -183463 -341528 -332879 -200500
10224 -200500 -299710 -264824 -132594 -279998 -402071 -128146 290623 330426 278919 216198
10214 216198 130437 37022 139610 86199 -205053 -320310 -292312 -401311 -435315 -327633
10204 -327633 -100854 105867 150435 65937 13111 41545 -12068 -255036 -308072 -171596 -49975
10193 -49975 205914 482765 654410 675898 661708 451385 212151 112888 49635 -1437 28987
10182 28987 -113014 -247665 -196192 -31031 135782 269330 366763 259761 -52217 -317809
10172 -317809 -404479 -325067 -335117 -292389 -195799 -464592 -694174 -417446 -30509 183897
10162 183897 345906 615348 730360 627903 336310 80741 11543 -16000 202741 336510
$$ packed form
10234f02808K09831J49601J53924J57593J62414j60853k53165j58065Q649J32379
10224b00500r9210L4886J32230j47404j22073K73925M18769L9803n1507o2721
10214B16198q5761r3415J02588n3411k91252j15257K7998j08999l4004J07682
10204c27633K26779K06721M4568q4498n2826K8434n3613k42968n3036J36476J21621
10193d9975K55889K76851J71645K1488j4190k10323k39234r9263o3253n1072L0424
10182B8987j42001j34651N1473J65161J66813J33548R7433j07002l11978k65592
10172c17809q6670P9412j0050M2728R6590k68793k29582K76728L86937K14406
10162A83897J62009K69442J15012j02457k91593k55569o9198k7543K18741J33769
$$ plain form
10152 336510 277152 134446 -106688 -93061 -122717 -511415 -822287 -959876 -698586 -452308
10142 -452308 -441240 -266564 -992 56478 31928 132581 336486 397433 194792 151879
10132 151879 50064 4921 -330943 -801196 -818512 -465972 -157195 5304 265720 577358
10122 577358 643742 663985 667760 450630 376431 212553 84212 258145 534239 475978 211022
10111 211022 140715 324174 482402 434435 249834 141692 214394 320747 286042 374894
10101 374894 520974 508707 387774 430284 371692 298300 280675 217858 260538 325654 342403
10090 342403 342593 348131 335059 479197 600459 430747 310946 167016 -315800 -676844 -714416
10079 -714416 -375544 94584 324326 431892 566324 376322 -10498 -390921 -378173 -272037
$$ packed form
10152C36510n9358j42706k41134J3627k9656l88698l10872j37589K61290K46278
10142d52308J1068J74676K65572N7470k4550J00653K03905O0947k02641m2913
10132A51879j01815m5143l35864m70253j7316L52540L08777J62499K60416L11638
10122E77358O6384K0243L775k17130p4199j63878j28341J73933K76094n8261k64956
10111B11022p0307J83459J58228m7967j84601j08142P2702J06353l4705Q8852
10101C74894J46080j2267j20933M2510n8592p3392j7625o2817M2680O5116J6749
10090C42403J90N538j3072J44138J21262j69712j19801j43930m82816l61044l7572
10079g14416L38872M70128K29742J07566J34432j90002l86820l80423J2748J06136
$$ plain form
10069 -272037 -271672 -268636 -380137 -449378 -390427 -80946 206716 194112 151247 309944 809256
10058 809256 1116918 1122916 1247155 1177985 1057855 845849 564013 308782 199650 126428
10048 126428 30032 -249463 -618038 -519305 -304511 59284 303615 300475 171263 262566
10038 262566 576313 587428 308435 8117 -192140 -217680 -212283 -20258 68930 -122981
10028 -122981 -162052 80881 172095 180582 1784 -266192 -217572 1170 205156 351751
10018 351751 624847 576285 406390 243934 171419 29614 -241507 -459997 -431405 -128953
10008 -128953 183859 306486 357670 289445 65030 -241619 -337863 -311298 -146222 -127330
9998 -127330 -118340 105863 231306 82870 -62539 84652 330166 440566 415038 184179
$$ packed form
10069b72037L65L036j11501o9241N8951L09481K87662j2604m2865J58697M99312
10058H09256L07662N998J24239o9170j20130k12006k81836k55231j09132p3222
10048A26428r6396k79495l68575R8733K14794L63795K44331l140j29212R1303
10038B62566L13747J1115k78993l00318k00257k5540N397J92025Q9188j91911
10028a22981l9071K42933R1214Q487j78798k67976M8620K18742K03986J46595
10018C51751K73096m8562j69895j62456p2515j41805k71121k18490K8592L02452
10008a28953L12812J22627N1184o8225k24415l06649r6244K6565J65076J8892
9998a27330Q990K24203J25443j48436j45409J47191K45514J10400k5528k30859
$$ plain form
9988 184179 -13138 40558 114399 -110629 -213159 -139737 -225307 -198804 -124547 -55915 61766
9977 61766 -22226 -253934 -154203 -8931 3332 -96349 -122263 -153473 -236389 -270224 -291901
9966 -291901 -224354 79964 316268 375156 314815 459099 508632 323332 -21420 -323846
9956 -323846 -380792 -272215 -81411 38228 -158851 -410712 -680486 -671924 -401668 -216618
9946 -216618 -357599 -519245 -649537 -810862 -659514 -434767 -376058 -410793 -430942 -393110
9936 -393110 -350427 -213608 -411380 -482783 -401548 -321823 -298470 -370531 -368477 -356929 -51958
9925 -51958 207569 124973 -18876 -174561 -261240 -304764 -200955 -8884 24876 210517 239982
9914 239982 287481 305199 364754 304604 151781 -92760 -176890 -120225 -81816 -140743 -215442
$$ packed form
9988A84179j97317N3696P3841k25028j02530P3422q5570K6503P4257O8632J17681
9977F1766q3992k31708R9731J45272J2263r9681k5914l1210q2916l3835k1677
9966b91901O7547L04318K36304N8888o0341J44284M9533j85300l44752l02426
9956c23846n6946J08577J90804J19639j97079k51861k69774Q562K70256J85050
9946b16618j40981j61646j30292j61325J51348K24747N8709l4735k0149L7832
9936c93110M2683J36819j97772p1403Q1235P9725K3353p2061K054J1548L04971
9925e1958K59527q2596j43849j55685q6679m3524J03809J92071L3760J85641K9465
9914B39982M7499J7718N9555o0150j52823k44541q4130N6665L8409n8927p4699
$$ plain form
9903 -215442 -565954 -805424 -519407 -206702 -86903 71049 105208 -118987 -429519 -551972
9893 -551972 -564260 -433329 -543253 -573139 -479492 -296783 -34404 54631 -16869 -162620 -134533
9882 -134533 -33451 30679 225249 484378 614336 585638 560133 465170 257798 143274
9872 143274 74512 -70704 32938 4921 121321 513888 550880 550583 576177 684298 788944
9861 788944 929277 956920 844278 1173327 1938775 2975560 4179822 5623070 7600603
9852 7600603 10663985 14863726 19530721 21166477 17832171 13292895 9825766 7471872
9844 7471872 5762925 4323961 3305426 2681892 2229192 1905909 1401544 784129 332877
9835 332877 187701 256899 377592 346440 189632 84198 47615 -13156 154293 306768
$$ packed form
9903b15442l50512k39470K86017L12705J19799J57952L4159k24195l10532j22453
9893e51972j2288J30931j09924k9886R3647J82709K62379Q9035p1500j45751K8087
9882a34533J01082O4130J94570K59129J29958k8698k5505r4963k07372j14524
9872A43274o8762j45216J03642k8017J16400L92567L6992k97K5594J08121J04646
9861G88944J40333K7643j12642L29049P65448J036785J204262J443248J977533
9852G600603L063382M199741M666995J635756l334306m539276l467129k353894
9844G471872j708947j438964j018535o23534m52700l23283n04365o17415m51252
9835C32877j45176O9198J20693l1152j56808j05434l6583o0771J67449J52475
$$ plain form
9825 306768 475408 710680 644073 355211 236188 206470 355694 316489 -17885 -170796
9815 -170796 -129301 35273 80052 100840 213835 278943 292512 247492 249186 286534 233557
$$ packed form
9825C06768J68640K35272o6607k88862j19023k9718J49224l9205l34374j52911
9815a70796M1495J64574M4779K0788J12995O5108J3569m5020J694L7348n2977
$$ [...]
##END NTUPLES=NMR SPECTRUM
##END=
