##TITLE=C13_11P153_k5D2O
 aceton-d6, 22300 sc

 27.9.2023
##JCAMPDX= 6.0         $$ Bruker NMR JCAMP-DX V2.0
##DATA TYPE= NMR SPECTRUM
##DATA CLASS= NTUPLES
##ORIGIN= UXNMR, Bruker Analytische Messtechnik GmbH
##OWNER= root
$$ XWIN-NMR		Version 3.5
$$ Thu Sep 28 13:37:35 2023 Russian Standard Time (UT+4h)  she@DPX200
##.OBSERVE FREQUENCY= 50.327896
##.OBSERVE NUCLEUS= ^13C
##.ACQUISITION MODE= SIMULTANEOUS
##.ACQUISITION SCHEME= undefined
##.AVERAGES= 19345
##.DIGITISER RES= 17
##SPECTROMETER/DATA SYSTEM= spect
##.PULSE SEQUENCE= zgpg30
##.SOLVENT NAME= DMSO
##.SHIFT REFERENCE= (INTERNAL, DMSO, 0, 222.624)
##AUDIT TRAIL= $$ (NUMBER, WHEN, WHO, WHERE, WHAT)
$$ ##TITLE= Audit trail, XWIN-NMR		Version 3.5
$$ ##JCAMPDX= 5.01
$$ ##ORIGIN= Bruker BioSpin GmbH
$$ ##OWNER= she
$$ F:/spectra/data/she/nmr/c13/1/pdata/1/auditp.txt
$$ ##AUDIT TRAIL=  $$ (NUMBER, WHEN, WHO, WHERE, WHAT)
(   1,<2023-09-28 11:04:34.87 +0400>,<she>,<DPX200>,
      <created by zg, POWCHK disabled, PULCHK disabled
       terminated by command 'halt'
       configuration hash MD5:
       00 E9 B6 7A A2 85 ED C7 34 08 36 98 17 FE 4E 26
       data hash MD5: 32K
       54 80 DA 3E DC 2B 83 30 4C 5B C2 28 DA 98 A2 19>)
(   2,<2023-09-28 13:35:15.34 +0400>,<she>,<DPX200>,
      <Start of raw data processing
       efp BC_mod = 2 LB = 2 FT_mod = 6 PKNL = 1 PHC0 = -378.0411 PHC1 = 41.73753 SI = 32K 
       data hash MD5: 32K
       DA 22 D0 80 47 76 DF 84 A1 B5 29 2A 7E FC AA D6>)
(   3,<2023-09-28 13:36:06.35 +0400>,<she>,<DPX200>,
      <pk PHC0 = 7.259374 PHC1 = -14.8 
       data hash MD5: 32K
       06 DB C6 CA CE DA 84 A8 1D 03 07 0D 95 6D 1D 9C>)
(   4,<2023-09-28 13:36:12.20 +0400>,<she>,<DPX200>,
      <abs ABSG = 5 
       data hash MD5: 32K
       B2 38 52 89 CC 0D 9E 9B 3A 0B 07 CE 66 C5 56 57>)
(   5,<2023-09-28 13:36:30.14 +0400>,<she>,<DPX200>,
      <pk PHC0 = -0.6539797 PHC1 = -1.043081e-07 
       data hash MD5: 32K
       1A 33 F3 F2 5D 4F DE EF D9 92 9D 6D B1 AF E6 6A>)
(   6,<2023-09-28 13:36:33.98 +0400>,<she>,<DPX200>,
      <abs ABSG = 5 
       data hash MD5: 32K
       4A 91 5F F5 50 53 D9 DE 94 D0 35 48 97 A3 49 04>)
$$ ##END=
$$ 
$$ hash MD5
$$ 6B BC 11 6C 41 32 37 76 66 B6 C3 81 80 DA E2 1B
##$RELAX= 
##$RELAX= 
##$RELAX= 
##$RELAX= 
##$RELAX= 
##$RELAX= 
##$RELAX= 
##$RELAX= 
$$ Bruker specific parameters
$$ --------------------------
##$DU= <F:/spectra>
##$EXPNO= 1
##$NAME= <c13>
##$PROCNO= 1
##$TYPE= <nmr>
##$USER= <she>
##$AMP= (0..31)
100 100 100 100 100 100 100 100 100 100 100 100 100 100 100 100 100 100 
100 100 100 100 100 100 100 100 100 100 100 100 100 100 
##$AQSEQ= 0
##$AQ_mod= 1
##$AUNM= <au_zg>
##$AUTOPOS= <>
##$BF1= 50.322709
##$BF2= 200.13
##$BF3= 50.322709
##$BF4= 500.13
##$BF5= 500.13
##$BF6= 500.13
##$BF7= 500.13
##$BF8= 500.13
##$BYTORDA= 1
##$CFDGTYP= 0
##$CFRGTYP= 5
##$CHEMSTR= <none>
##$CNST= (0..31)
1 1 145 1 1 1 1 1 1 1 1 1 1 1 1 1 1 1 1 1 1 1 1 1 1 1 1 1 1 1 1 1 
##$CPDPRG= <waltz16>
##$CPDPRG1= <>
##$CPDPRG2= <waltz16>
$$ [...]
##$SUBNAM4= <"">
##$SUBNAM5= <"">
##$SUBNAM6= <"">
##$SUBNAM7= <"">
##$SUBNAM8= <"">
##$SUBNAM9= <"">
##$SW= 239.972175391363
##$SWIBOX= (0..15)
0 1 3 0 0 0 0 0 0 0 0 0 0 0 0 0 
##$SW_h= 12077.2946859903
##$TD= 32768
##$TD0= 1
##$TE= 0
##$TE2= 300
##$TE3= 300
##$TEG= 300
##$TL= (0..7)
120 120 120 120 120 120 120 120 
##$TP= (0..7)
150 150 150 150 150 150 150 150 
##$TP07= 0
##$TPNAME0= <>
##$TPNAME1= <>
##$TPNAME2= <>
##$TPNAME3= <>
##$TPNAME4= <>
##$TPNAME5= <>
##$TPNAME6= <>
##$TPNAME7= <>
##$TPOAL= (0..7)
0.5 0.5 0.5 0.5 0.5 0.5 0.5 0.5 
##$TPOFFS= (0..7)
0 0 0 0 0 0 0 0 
##$TUNHIN= 0
##$TUNHOUT= 0
##$TUNXOUT= 0
##$USERA1= <user>
##$USERA2= <user>
##$USERA3= <user>
##$USERA4= <user>
##$USERA5= <user>
##$V9= 5
##$VALIST= <valist>
##$VCLIST= <CCCCCCCCCCCCCCC>
##$VD= 0
##$VDLIST= <DDDDDDDDDDDDDDD>
##$VPLIST= <PPPPPPPPPPPPPPP>
##$VTLIST= <TTTTTTTTTTTTTTT>
##$WBST= 1024
##$WBSW= 4
##$XGAIN= (0..3)
0 0 0 0 
##$XL= 0
##$YL= 0
##$YMAX_a= 116092206
##$YMIN_a= -55727820
##$ZGOPTNS= <>
##$ZL1= 120
##$ZL2= 120
##$ZL3= 120
##$ZL4= 120
##$ABSF1= 222.624
##$ABSF2= -17.3728
##$ABSG= 5
##$ABSL= 3
##$ALPHA= 0
##$AQORDER= 0
##$ASSFAC= 0
##$ASSFACI= 0
##$ASSFACX= 0
##$ASSWID= 0
##$AUNMP= <proc_1d>
##$AZFE= 0.1
##$AZFW= 0.5
##$BCFW= 0
##$BC_mod= 2
##$BYTORDP= 0
##$COROFFS= 0
##$CY= -3
##$DATMOD= 1
##$DC= 0
##$DFILT= <>
##$DTYPP= 0
##$F1P= 0
##$F2P= 0
##$FCOR= 0.5
##$FTSIZE= 32768
##$FT_mod= 6
##$GAMMA= 0
##$GB= 0
##$INTBC= 1
##$INTSCL= 4.134877e-10
##$ISEN= 128
##$LB= 2
##$LEV0= 0
##$LPBIN= 0
##$MAXI= 10000
##$MC2= 0
##$MEAN= 0
##$ME_mod= 0
##$MI= 0.1934396
##$NCOEF= 0
##$NC_proc= 4
##$NLEV= 6
##$NOISF1= 120.0001
##$NOISF2= 80.00006
##$NSP= 0
##$NTH_PI= 0
##$NZP= 0
##$OFFSET= 222.624
##$PC= 1.4
##$PHC0= -371.4357
##$PHC1= 26.93753
##$PH_mod= 1
##$PKNL= yes
##$PPARMOD= 0
##$PSCAL= 0
##$PSIGN= 0
##$REVERSE= no
##$SF= 50.3227315983092
##$SI= 32768
##$SIGF1= 140
##$SIGF2= 120
##$SINO= 11.81781
##$SIOLD= 32768
##$SREGLST= <13C.CDCl3>
##$SSB= 0
##$STSI= 32768
##$STSR= 0
##$SW_p= 12077.2946859903
##$SYMM= 0
##$S_DEV= 0
##$TDeff= 32768
##$TDoff= 0
##$TI= <>
##$TILT= no
##$TM1= 0
##$TM2= 0
##$TOPLEV= 0
##$USERP1= <user>
##$USERP2= <user>
##$USERP3= <user>
##$USERP4= <user>
##$USERP5= <user>
##$WDW= 1
##$XDIM= 32768
##$YMAX_p= 273708633
##$YMIN_p= -4552615
$$ End of Bruker specific parameters
$$ ---------------------------------
##NTUPLES= NMR SPECTRUM
##VAR_NAME=  FREQUENCY,     SPECTRUM/REAL,   SPECTRUM/IMAG
##SYMBOL=    X,             R,               I
##VAR_TYPE=  INDEPENDENT,   DEPENDENT,       DEPENDENT
##VAR_FORM=  AFFN,          ASDF,            ASDF
##VAR_DIM=   32768,         32768,           32768
##UNITS=     HZ,            ARBITRARY UNITS, ARBITRARY UNITS
##FACTOR=    0.368581032318806, 1,           1
##FIRST=     11203.0474430531, 0,            0
##LAST=      -874.247242937185, 0,           0
##MIN=       -874.247242937185, -4552615,    0
##MAX=       11203.0474430531, 273708633,    0
$$ Real data points
##PAGE= N=1
##DATA TABLE= (X++(R..R)), XYDATA
32767 158577 154933 157599 167553 175797 173547 156237 128184 106927 94020 81274 75747 87597 114560
32754 114560 140709 145538 128688 106535 91886 82955 82979 96713 122138 158118 193145 214832
32742 214832 228375 241122 250687 253499 251151 244920 225581 182239 116784 52882 14446 2475
32730 2475 6159 13500 14074 7668 1680 431 7275 20480 28151 34390 61337 107487 146247 164035
32716 164035 166154 160347 154391 149321 148825 160644 178453 188664 186576 175389 160498 150873 159916
32703 159916 189020 215506 218726 202515 191057 195491 205538 215251 205487 166020 126613 113238
32691 113238 107972 85059 51094 28771 29605 42297 50246 54017 56803 53932 48532 42497 29392
32678 29392 19207 32521 67789 111743 141940 146879 149233 157089 151709 125217 89975 61277
32666 61277 41882 33099 41071 63909 92669 122452 156740 194542 226055 241462 236456 216262
32654 216262 190569 168608 157663 154194 147278 136858 128503 120719 109269 99938 94846 89310 79470
32641 79470 69441 68952 74753 89245 113151 139377 173352 220963 263040 281327 279421 270290 267072
32628 267072 268015 263773 251006 239749 245379 266624 284052 284837 271915 252416 231352 207582 181294
32615 181294 161359 163803 195089 235451 261384 261186 234575 188708 142321 127255 159053 224407
32603 224407 285025 305922 282176 239806 205663 185315 167875 142068 112915 90021 70206
32592 70206 42980 16185 15005 43806 79054 102023 107324 96295 78485 68857 82240 119453
32580 119453 157384 181111 198022 212175 218944 218236 213698 205359 191755 175825 167280 166454 159438
32567 159438 146497 130958 115045 106429 102080 90960 73821 53822 28653 -6911 -43380 -68768
32555 -68768 -80907 -66665 -25666 11131 31164 42588 48981 46177 40123 39091 45391 64208 86288
32542 86288 96669 92738 82671 69029 59645 63790 73912 76709 70988 64344 64588 69341 58655
32529 58655 28236 2559 -8171 -15881 -25304 -36452 -48661 -61427 -76874 -88103 -94178 -100317
32517 -100317 -91148 -46949 27669 104224 151468 153171 131006 126183 145020 164491 176814 179929
32505 179929 176518 172457 155567 127274 99216 70448 52030 57593 84575 118236 138944 143007
32493 143007 138905 132433 131495 151044 188904 223843 237293 233821 228279 223937 224313 227178 217438 191882
32479 191882 169973 166205 163309 151115 142921 139718 131359 118978 101547 61598 2861 -43481
32467 -43481 -70323 -85575 -89537 -82349 -57917 -10827 40653 69403 75379 86209 108071 121770
32455 121770 122431 121217 121320 113664 99822 92003 93911 105323 123258 140739 156998 174178 189280
32442 189280 203865 224223 243919 254040 267413 290334 290916 256719 218113 201358 203890 215192
32430 215192 230369 244750 260811 273158 267291 247788 234582 235287 241254 244602 242591 230454 198275
32417 198275 144570 92381 72516 82585 105393 127920 130216 108829 76005 48808 45258 74318
32405 74318 119719 157339 175849 175489 169235 174750 190664 197844 193467 189299 188947 189488 188762 184224
32391 184224 190417 215655 239393 241843 217162 166878 122121 117772 148193 177853 185633 170833
32379 170833 143276 114121 85793 54572 27831 16262 23256 47330 75400 96368 110589 119105
32367 119105 126393 148034 179530 201476 207233 202904 192005 169748 135706 95321 61242 50935
32355 50935 65056 89191 110859 126735 131396 120243 97023 62074 29347 19863 24686 20049
32343 20049 4304 -4483 1171 15140 26117 27964 25939 30054 37780 43892 50783 58752 62077 58445
32329 58445 65253 96526 142871 173725 175315 173157 184861 192961 183343 163579 147120 133437 117758
32316 117758 106604 113108 142530 174154 188910 187718 169823 131000 87456 67725 87190 136475
32304 136475 190035 219398 211744 191469 199202 233276 250601 233264 197587 166418 149028 144785
32292 144785 148423 146736 139531 141035 150576 148448 127499 106726 105798 119462 131947 137741 143532
32279 143532 149801 150873 146614 140533 136979 138897 147741 162909 181697 200408 215942 229709 237735
32266 237735 232942 208320 162696 98191 26966 -25727 -48273 -45285 -25855 915 22955 39495
32254 39495 58135 71511 80640 89777 95299 106852 136719 182163 228775 268939 308269 341121
32242 341121 357428 351007 327106 304790 292205 291271 300074 301344 285774 264838 246739 228133
32230 228133 207364 185074 162713 138921 119550 115176 120999 118208 97155 67641 49443 37863
32218 37863 28653 22478 274 -38924 -71155 -76758 -55972 -27037 -8342 775 18777 52824
32206 52824 88394 110011 115472 125208 147193 171913 190940 193369 183223 175919 185939 214203
32194 214203 243831 259549 262123 259800 248408 224343 195108 169221 138383 92908 45015 12346
32182 12346 4422 15685 33515 47038 49112 48060 52727 48445 23657 -9337 -36631 -51567 -47842
32169 -47842 -36964 -35688 -51719 -83418 -123121 -170375 -222194 -260955 -260409 -206448 -117804 -40299
32157 -40299 4498 26787 37445 49143 68359 90958 119477 157727 186237 180478 152361 128011
32145 128011 126390 152682 188811 205631 179917 124603 78994 73307 100860 122819 125595 125156
32133 125156 131259 135607 134703 128792 121965 108650 73694 20974 -44052 -118930 -187740 -225465 -217972
32120 -217972 -181742 -151045 -143832 -138009 -110114 -58556 3663 52651 82057 108524 132055 153010
32108 153010 184232 224641 259278 287011 308476 310389 284899 249313 215978 183702 155860 147176
32096 147176 163071 195927 237212 270274 284519 276954 236394 170054 122618 114430 114526 99666
32084 99666 74743 49554 38285 49402 78735 113726 137829 146468 150572 162420 170083 155972
32072 155972 131343 98722 60837 45903 56369 63546 55523 44046 47194 62112 72473 87728
32060 87728 109908 117976 118176 126144 141650 156835 166689 169536 176309 192781 204901 198130 174952
32047 174952 152042 141752 149289 169285 176676 164782 153859 150964 157944 179386 209586 231510
32035 231510 227809 211048 204053 208005 219389 228635 214541 170318 114352 72827 67495 99928
32023 99928 149762 186186 191850 179702 175411 181989 181041 161150 123631 85490 69291 79541 95586
32010 95586 103056 114101 132706 157204 186714 207250 210537 202913 182809 140989 97382 80768
31998 80768 87482 100044 107036 113798 137458 173819 199872 202218 187679 181685 198772 230594 251272
31985 251272 235850 179969 100587 28134 -13469 -35472 -57261 -69527 -63757 -39017 11776 84178
31973 84178 147982 187247 208047 200170 155569 86501 16108 -16662 8251 62914 109214 136020
31961 136020 152016 155290 138396 105209 62569 25526 18193 37950 55536 52594 31486 16670
31949 16670 20525 24115 23219 30114 36014 25163 9509 5418 10083 15907 20921 34728 61785 79650
31935 79650 76300 66828 45120 12843 -15540 -38358 -51105 -45311 -28276 -9482 10854 27102
31923 27102 36786 52953 82885 114264 131337 128682 103820 52420 -4316 -38918 -57173 -72839
31911 -72839 -94553 -134537 -180372 -214016 -234660 -246200 -247492 -233599 -207266 -181897 -172638 -178735
31899 -178735 -183307 -181762 -173846 -159207 -148256 -142977 -135498 -123999 -108419 -83452 -50279 -16692
31887 -16692 14844 42833 56485 48491 29772 3944 -36304 -78136 -100668 -100255 -86010 -71287
31875 -71287 -68064 -71656 -70087 -65184 -65338 -70178 -59285 -6958 80356 157041 187784 183361 169849
31862 169849 145084 101540 56055 34359 38653 49931 54716 48594 27799 -7868 -41805 -51499
31850 -51499 -46238 -45999 -52760 -60405 -50129 -12177 30894 40772 5169 -54245 -110599 -143198 -144460
31837 -144460 -132014 -122601 -117353 -110267 -94644 -72860 -59050 -69252 -97281 -125165 -140183 -124580
31825 -124580 -75031 -13805 36980 75009 104943 116904 108152 98639 95906 96603 95933 78732 41609
31812 41609 7235 -12243 -23871 -36973 -59459 -83339 -85195 -62837 -43718 -39241 -35848 -41578
31800 -41578 -71783 -116245 -146007 -141378 -105066 -48058 23077 89267 124813 124820 100321 73293 60988
31787 60988 61608 57979 31590 -13073 -49950 -56631 -26755 16545 34404 14509 -21867 -43099
31775 -43099 -35027 -21778 -25721 -38543 -43804 -35261 -12908 16205 35895 37571 14846 -29559 -78100
31762 -78100 -107233 -104967 -71089 -24830 -5608 -29130 -82201 -141180 -185312 -197951 -172068 -122874
31750 -122874 -80194 -57447 -56773 -80522 -105171 -102493 -91818 -101702 -119430 -125192 -116735 -94909 -65132
31737 -65132 -29472 9140 38801 49619 47821 53819 78219 96553 77623 23440 -43465 -104881
31725 -104881 -149628 -172567 -180177 -170614 -140977 -103784 -68687 -32449 9140 53970 102474 140980
31713 140980 160410 179954 203118 212361 205811 189347 172036 158032 146018 137742 132229 122486
31701 122486 100219 59950 9248 -28330 -49020 -75452 -124037 -182135 -230331 -258354 -264913 -250427
31689 -250427 -213184 -162603 -112214 -64335 -26607 -7014 1380 4726 4035 2576 9244 33611 68888
31676 68888 94705 96229 82746 68496 52056 31779 12221 -4866 -13639 -9566 3629 18462
31664 18462 18676 5224 6405 43848 103225 146428 157525 140945 93935 19922 -56492 -115132
31652 -115132 -144343 -146938 -140249 -145350 -159279 -156419 -133636 -104747 -75706 -48083 -25838 -11055
31640 -11055 -13044 -29303 -44689 -54397 -60104 -65028 -72390 -65958 -24773 44890 106692 125030 96869
31627 96869 51520 15163 8614 31518 54992 52121 29862 -3126 -49658 -101779 -141558 -160701
31615 -160701 -164418 -157849 -141127 -112782 -87655 -82253 -85953 -84551 -80238 -73428 -70500 -80910 -110092
31602 -110092 -157046 -200547 -222721 -226579 -212427 -185600 -155002 -127798 -114528 -119199 -132488 -140453
31590 -140453 -132784 -113291 -105637 -130290 -177398 -214098 -218190 -202935 -185132 -164717 -135284 -98394
31578 -98394 -66108 -48116 -32805 -11343 3077 -3832 -27545 -41374 -34011 -21072 -24743 -45178
31566 -45178 -60104 -56422 -39292 -27373 -25598 -14353 21085 71779 112711 124545 116100 94217
31554 94217 56609 19844 8820 18236 14304 254 -3131 -6280 -18132 -33899 -47078 -40121 -13604
31541 -13604 17167 48966 88950 142546 200358 234700 232077 208250 180826 154219 132372 119316
31529 119316 106248 88676 61216 20356 -8111 -2576 29037 58272 61573 36192 5012 -8719
31517 -8719 -17456 -38093 -63396 -74001 -52103 9013 92799 167091 198120 169935 97688 13296
31505 13296 -58935 -106183 -109183 -61956 15289 86160 117653 112827 100275 103152 123170 137696
31493 137696 119175 58995 -20194 -90391 -130692 -127556 -94148 -42858 1248 3384 -21692 -31802
31481 -31802 -22019 -19517 -25733 -24512 -17212 -13613 -22039 -35784 -48731 -59665 -61600 -49114 -27059
31468 -27059 -9617 4923 22458 41456 58183 64332 61778 64225 72727 73984 60603 32239 2537
31455 2537 -17899 -35277 -52987 -76391 -113130 -159330 -196093 -214163 -227074 -227236 -189227 -118979
31443 -118979 -49309 1596 33447 49138 48347 33196 14278 -14530 -60967 -106521 -133070 -144086
31431 -144086 -134664 -106907 -86553 -86426 -110251 -150121 -170705 -149798 -103617 -51414 -4172 35471
31419 35471 71419 96532 100727 90998 73745 54762 42137 39598 39036 32938 29304 28304 18451
31406 18451 -2292 -24327 -30481 -20095 -13918 -23092 -52560 -87114 -110394 -136991 -169776 -187598
31394 -187598 -182515 -171052 -157176 -120549 -68792 -27986 -13933 -20343 -22590 -5537 29286 69302
31382 69302 101317 125031 144356 149469 139023 134826 149972 163973 148898 102423 54127 31077
31370 31077 21821 -335 -50157 -118712 -176314 -198417 -191296 -172567 -154880 -152462 -164236 -180331
31358 -180331 -190239 -179603 -151030 -130093 -130349 -139799 -139287 -107669 -39169 34103 78323 87585 74423
31345 74423 58063 51377 58909 81342 108596 137460 176606 214925 231113 215302 171877 117987
31333 117987 75141 51009 39475 45474 71780 99113 117948 129856 124541 92908 47203 14003
31321 14003 2347 221 -8164 -27980 -49661 -57582 -47084 -29753 -14529 -1818 10663 23807
31309 23807 40176 61807 79346 75623 35262 -33522 -84188 -82655 -45404 -8663 431 -23267
31297 -23267 -57829 -72973 -62610 -40599 -24447 -26099 -37607 -43247 -33507 -10554 11364 25209
31285 25209 39784 58248 64583 53216 36556 23926 20976 12759 -14294 -51211 -86873 -100571
31273 -100571 -83249 -51761 -27765 -6892 22355 52935 69501 72048 72669 75977 81161 82458 72018
31260 72018 39307 -4996 -37980 -52618 -46145 -21901 2952 20400 37805 55512 67155 77976
31248 77976 88507 84310 57296 7536 -51230 -100707 -139848 -177515 -199939 -180751 -130161 -88881
31236 -88881 -73573 -67427 -54229 -34820 -14348 2706 9991 8744 4276 -3238 -13964 -19926 -19634
31223 -19634 -30769 -63098 -102800 -135420 -157223 -165899 -153760 -117289 -65516 -26539 -29683 -58445
31211 -58445 -69491 -60811 -60024 -70946 -70245 -46697 -24772 -28415 -64740 -123412 -180044 -227452 -267275
31198 -267275 -291607 -311646 -336979 -358840 -371590 -368524 -342894 -297163 -249501 -218443 -206968 -211010
31186 -211010 -221434 -215185 -171911 -99022 -22997 26119 39455 38209 42896 49758 51480 47770 36767
31173 36767 14761 -14049 -35279 -39888 -32386 -27602 -34910 -57102 -94208 -133465 -150067 -134477
31161 -134477 -100829 -72601 -64689 -65472 -59068 -46924 -34073 -29947 -35789 -43749 -53267 -72544 -100211
31148 -100211 -110191 -82625 -24931 42825 98342 126773 116787 67324 -339 -67491 -118353 -129840
31136 -129840 -101680 -59181 -23737 -3553 12749 33811 50873 54085 51337 69710 120995 181347
31124 181347 213845 202093 169173 137809 102526 64991 34113 9839 -12019 -23562 -16758 -8867
31112 -8867 -5576 11671 42521 68724 87328 110587 139076 160444 164658 147864 107133 57987
31100 57987 17366 863 16588 41666 54768 61435 70649 77634 65694 36094 10149 584
31088 584 14464 48737 73427 59981 18342 -25932 -59345 -78548 -77633 -55982 -33946 -28060 -22456
31075 -22456 -4234 19521 47636 86411 123749 143742 158788 182190 210752 216745 178014 109145
31063 109145 47283 9341 -13494 -26138 -25290 -11520 5059 12884 13587 4435 -18731 -40854 -46504
31050 -46504 -34474 -12010 14645 39653 52091 50821 48863 53034 52437 41611 43842 66812 90452
31037 90452 106074 117746 125536 124927 125601 126588 122850 117209 111785 109036 114538 123433 128016 125047 104918
31022 104918 60239 2516 -40108 -40565 -6611 22784 36331 51900 79792 107073 113570 94699
31010 94699 51074 -5345 -49430 -68459 -61466 -35422 733 37617 66396 68971 37015 -21109
30998 -21109 -90523 -147840 -180313 -199698 -224777 -251747 -262529 -255267 -238739 -207797 -160037 -107135
30986 -107135 -64115 -41479 -42890 -53192 -50730 -30478 1229 36603 71142 98075 111498 110361
30974 110361 92860 55750 11489 -26441 -57666 -77665 -92989 -115061 -133661 -126605 -98788 -82507
30962 -82507 -79915 -65160 -36192 -2874 43396 100852 147577 176964 202255 232232 257018 258137
30950 258137 228669 175182 120131 80597 52190 19384 -14758 -25237 1604 45347 68379
30939 68379 54562 19134 -16028 -27070 1309 53271 100351 130092 134202 109605 69020 36328
30927 36328 25530 24207 17619 4323 -6899 -4954 -3696 -18877 -45968 -68696 -71951 -51115 -13420
30914 -13420 42819 111872 168130 194520 192815 176130 160532 156306 166997 184099 191438 166394
30902 166394 99465 25130 -16089 -27268 -26634 -16522 6748 40454 70101 78017 73068 73138 87036
30889 87036 123979 185984 255267 306504 324270 305774 257233 197842 162097 151666 149020 154163
30877 154163 167848 178635 179321 176096 174704 166866 156638 146897 126449 95146 58479 22994 -12128
30864 -12128 -47570 -70852 -78577 -78516 -68812 -50930 -31153 -22153 -27838 -34816 -33253 -27690 -19970 3027
30850 3027 52173 109989 146056 153133 137938 108411 83029 75985 88422 118936 155077 181767
30838 181767 198091 201445 184779 156452 119997 71695 23129 -13500 -43366 -52397 -21956 35222
30826 35222 86066 98274 66084 11823 -28662 -25335 18091 66672 87482 72892 43379 26769
30814 26769 29875 45481 66750 86194 99569 103516 90029 71327 65495 73962 91893 118443
30802 118443 157056 197201 223576 237039 248737 249649 236120 228502 241795 271618 294219 302101
30790 302101 313314 327162 320161 287419 252507 232531 231974 237826 231787 218897 212119 216116 231723
30777 231723 253194 273733 296163 320932 332097 317125 285493 255741 245164 257581 282018
30766 282018 307694 321799 303116 251745 193585 151080 129560 124762 131346 145695 171596 213503
30754 213503 259131 290241 307523 324693 349875 375376 388269 385801 372342 351628 329729 327067
30742 327067 360065 417092 462071 475062 477095 494465 511036 512163 515986 522564 512768 483603
30730 483603 448149 419381 401329 392387 396802 416488 447697 481211 502540 499024 484119 480726
30718 480726 484850 494639 515190 540143 568153 603634 637514 654628 653987 639602 602510 536737
30706 536737 459303 398772 376370 404301 469780 543269 598272 618744 624636 637149 644668 637363
30694 637363 620973 591841 537993 468606 411519 377955 372051 390925 419877 454866 493311 523082
30682 523082 544547 567268 594536 624743 657440 690727 724341 762329 805347 837980 836813 796671
30670 796671 737678 685876 656785 647517 648638 667898 701524 735038 745496 720749 687749 670916
30658 670916 673766 685936 704487 734172 769831 812588 869204 912808 897010 825143 746128 700019
30646 700019 692706 709513 729583 737030 733707 738629 756466 788137 833295 889048 954928 1022166
30634 1022166 1073941 1107649 1138155 1160557 1157228 1134715 1112703 1095770 1079185 1056511 1037629
30623 1037629 1038053 1055647 1084194 1113449 1125248 1115664 1094078 1065482 1034233 1002112 971286 955865
30611 955865 970295 1003329 1023269 1014502 993790 985463 1009133 1058606 1108072 1128781 1119428 1112173
30599 1112173 1128361 1163420 1194711 1206929 1212938 1235148 1281724 1350360 1429089 1502760 1562055
30588 1562055 1609304 1661879 1723387 1780773 1821255 1834947 1836998 1852800 1878677 1886643 1875266 1874969
30576 1874969 1906475 1957402 2002595 2031527 2048131 2064280 2084506 2103328 2117404 2140914 2189086
30565 2189086 2259104 2339525 2419004 2490876 2562264 2633933 2704668 2788856 2905176 3058196 3230592
30554 3230592 3405580 3587496 3780281 3987017 4210360 4444095 4691143 4960734 5247158
30545 5247158 5532657 5809188 6083956 6364132 6635459 6862508 7005963 7061153 7055283 7019739
30535 7019739 6974847 6925071 6890088 6897924 6942752 6993904 7042654 7109429 7208161 7345941 7536899
30524 7536899 7779228 8062433 8391144 8773567 9209989 9697864 10239702 10849193 11550442
30515 11550442 12352454 13260674 14292973 15473915 16830047 18382162 20152778 22183944
30507 22183944 24532838 27276163 30515940 34360333 38927338 44381114 50932874 58807466
30499 58807466 68237094 79436339 92583105 107788376 124999315 144016796 164433572
30492 164433572 185590584 206673860 226594717 244266288 258624869 268640508 273708633
30485 273708633 273384751 267686767 257050080 242116728 223926009 203537581 182067838
30478 182067838 160596340 139947071 120761026 103443572 88204678 75087379 63985790
30471 63985790 54722599 47063608 40744906 35514911 31160259 27507059 24415200 21794774
30463 21794774 19585342 17710714 16080538 14644736 13398510 12336760 11432095 10640774
30455 10640774 9930882 9300630 8750115 8257216 7789323 7329361 6885790 6480629 6136758
30446 6136758 5865915 5660876 5510195 5414218 5377367 5392128 5434361 5476608 5508642 5537275 5571883
30435 5571883 5610347 5626069 5599112 5535535 5442717 5309734 5128251 4910142 4668546 4399609
30425 4399609 4113161 3836188 3574712 3316174 3053034 2794415 2558231 2360166 2202395
30416 2202395 2070116 1951101 1840879 1732315 1630924 1537784 1451285 1378336 1321407 1278723
30406 1278723 1233623 1166130 1073960 985156 943717 966795 1025212 1069487 1066759 1012801 930077
30395 930077 856083 801668 754531 710671 677493 663502 662863 665195 667669 663943 644385 612319
30383 612319 585386 560414 521765 472127 437594 434027 443463 436551 397670 335819 273972 230746
30371 230746 220511 243660 280127 315916 339284 340319 323997 311830 303130 287548 275813 275921
30359 275921 291926 326788 368916 402489 425411 437947 433888 423767 414202 406519 403617 396702
30347 396702 374340 340835 307185 275468 249450 235010 226994 212785 188642 165818 156756 171871
30335 171871 208738 245548 268390 273200 259038 221010 174900 142028 124981 125654 172664 263579
30323 263579 337954 350150 304617 239159 178995 133584 107750 102115 99018 80982 61254 65305
30311 65305 94981 138350 179079 198293 200743 210824 232650 237390 199421 132316 74176 46083
30299 46083 38610 34518 35229 41873 44786 49040 68877 101041 119974 109257 80431 45781 11843
30286 11843 -9862 -13869 -5102 18180 55533 95059 133289 176965 224830 261999 270037 248343
30274 248343 211371 183561 176663 176141 171683 160387 147499 144133 156247 175803 187677 186220 176051
30261 176051 170178 171546 165661 147731 123796 103124 92098 84848 71743 57854 63541 91598
30249 91598 119850 120137 91825 48876 1320 -33991 -41881 -34676 -28838 -16685 16101 64064 108263
30236 108263 149483 192540 227872 237984 209068 154512 102021 57203 16641 -4770 3574 38800
30224 38800 89519 127688 135842 124293 117960 131394 157440 173803 160748 137453 126489 128755
30212 128755 141215 141417 118792 102397 110343 135671 157524 149097 120940 108406 123575 151362
30200 151362 177552 200424 238822 294734 339341 354420 335707 286350 219988 146038 74669
30189 74669 27199 520 -31953 -78555 -114470 -123006 -120769 -128013 -140788 -147803 -142700 -119244 -85301
30176 -85301 -65293 -77893 -118471 -162725 -186356 -183606 -167082 -149155 -130099 -108467 -91055 -79932
30164 -79932 -73270 -67658 -49870 -7118 59910 121015 151386 152049 127185 82591 46860 40993 61175
30151 61175 97208 128080 142171 137867 113308 85789 70576 49694 8576 -41467 -83219 -108225
30139 -108225 -117480 -111991 -92576 -58985 -17584 31733 82723 118586 128270 105689 57156 -3867
30127 -3867 -51265 -61008 -40603 -5820 32278 56884 55843 37027 12466 -23850 -72739 -120005
30115 -120005 -160154 -193230 -210941 -210766 -203674 -210564 -226445 -225881 -203250 -166708 -120709 -83880 -73490
30102 -73490 -78433 -84528 -94560 -102668 -94996 -70762 -42879 -20432 -7557 -2308 -2619 -13174 -29227
30089 -29227 -43832 -55612 -51406 -24129 -4777 -18592 -47853 -60705 -40732 -4290 29406 54228
30077 54228 74025 96348 114678 115189 96106 63983 23900 -13838 -40336 -49935 -28876 19466
30065 19466 74100 121557 143834 134306 105364 68767 43590 37388 35222 28125 24897 41322 73763
30052 73763 103097 117790 112890 83607 38987 -279 -25849 -32553 -19028 3391 22147 37854
30040 37854 60515 94756 142462 194975 238004 261457 260967 236779 204295 181311 174321 185058
30028 185058 200594 213705 222171 220470 214705 203698 178791 158546 170010 208421 246437 255289
30016 255289 233651 197697 162027 122703 70625 15314 -28928 -56404 -59510 -33811 4183 25667
30004 25667 15371 -17451 -53359 -65376 -40118 13026 68597 107249 136974 162487 182806 197829
29992 197829 201347 187006 156104 131197 148704 204669 256747 278972 278875 268567 249519 222912
29980 222912 188825 148577 118476 111376 117101 126930 143521 162866 172489 172370 171072 175167 186949
29967 186949 194187 187908 178143 160079 116407 50421 -15897 -59961 -78484 -84972 -84077 -64213 -23172
29954 -23172 21742 55221 89539 129932 145668 112411 53693 10351 -1280 3520 14423 32311
29942 32311 53029 73630 85789 73934 29852 -35439 -91073 -116554 -115411 -106717 -109162 -118749
29930 -118749 -131571 -144501 -158499 -166675 -156559 -136830 -106220 -60016 -21217 -5502 -6432 -15380
29918 -15380 -28402 -52317 -86754 -111677 -111289 -81294 -31052 13507 34969 47774 56638 45788
29906 45788 21089 5744 7775 17843 32672 50611 70511 98105 129857 157788 175376 176889
29894 176889 165015 148382 126560 95802 73232 75240 92327 110241 116430 103392 80050 45932
29882 45932 -5806 -60832 -99378 -110613 -101562 -93286 -93361 -81066 -39583 9848 34815 24813 -9153
29869 -9153 -53663 -97992 -127595 -135232 -134643 -135621 -130472 -114897 -91464 -66239 -47789 -42054 -42368 -45965
29855 -45965 -54310 -69153 -100070 -142828 -180972 -188204 -150231 -93695 -53835 -44819 -59887 -75604
29843 -75604 -71619 -37277 16109 66919 104582 110691 83944 54824 37217 40032 71831 112002
29831 112002 142228 162785 172085 162274 128872 72974 -1552 -75179 -123861 -138317 -126773 -109855
29819 -109855 -95930 -83061 -64908 -40086 -8376 24282 53417 78965 93302 92371 93185 106882
29807 106882 119925 117005 95293 67836 47185 32338 7590 -25000 -40643 -35179 -14187 26835
29795 26835 80368 123715 135535 127938 126162 132664 138989 133679 116582 95244 71909 50185 40290
29782 40290 46250 61656 80301 100068 119433 132089 125703 100358 62738 24059 2836 -5641
29770 -5641 -12967 -17773 -13095 4308 27228 49811 72737 86450 84969 79544 66432 46065 34561
29757 34561 37977 48653 61129 77615 93841 106233 117222 117259 92969 49804 13175 -4587
29745 -4587 -7722 -1440 1467 -9301 -30725 -50364 -52480 -43703 -51518 -75583 -87620 -79393 -66712
29732 -66712 -57302 -38534 -11601 9276 11961 -1200 -6196 6544 24457 24496 -1064 -38927 -81680
29719 -81680 -125953 -157118 -172354 -169898 -138785 -75301 8226 89275 152168 183158 160109 91456
29707 91456 26311 10955 38782 70875 81185 71339 56190 43004 38284 44445 50975 47792 45360
29694 45360 57135 74797 88439 103590 119872 118301 88719 47806 17397 -6005 -24060 -28199
29682 -28199 -33781 -63642 -96986 -94295 -57433 -24691 -22236 -31992 -17446 28385 79257 109568
29670 109568 113330 92925 56575 5029 -47981 -76750 -70352 -42977 -16394 10243 34218 38405
29658 38405 17183 -9865 -22457 -25642 -37099 -57200 -67542 -61250 -36800 7559 57588 94971
29646 94971 111184 111666 103899 84588 55038 35677 40178 59548 85214 114366 142457 163075
29634 163075 163027 141980 110032 77872 56502 50103 42920 22221 -2865 -23960 -43808 -71572
29622 -71572 -110237 -136871 -129254 -96579 -55318 -18694 3260 14573 15798 -1915 -39413 -71371
29610 -71371 -72338 -45250 -8521 31567 64046 81663 96626 104832 101115 113751 156842 196196
29598 196196 208929 196615 163611 136665 134710 159780 203393 244019 265822 272145 275888 274962
29586 274962 256659 213882 161506 113465 62307 6520 -52509 -116557 -178103 -231238 -264989
29575 -264989 -259027 -212973 -148600 -94421 -60563 -34174 -2923 26148 44640 43406 6466 -52863
29563 -52863 -97335 -104888 -82812 -57967 -51599 -61912 -67981 -52517 -21920 4469 9552 -1429
29551 -1429 -7268 571 21850 56588 91846 110914 110758 91941 56674 23244 15559 35763 69967
29538 69967 97857 103145 95283 90598 95696 105979 113592 120588 130963 146182 154483 144153 123897
29525 123897 102948 77428 46689 22779 14094 7444 -9663 -33653 -51604 -54747 -43881 -31360
29513 -31360 -26664 -40328 -74559 -110833 -128831 -131336 -128894 -129285 -129868 -131040 -135988 -126965 -91724 -41274
29499 -41274 677 22792 26826 25913 36502 61160 92005 112462 118484 125146 138763 156829 187181
29486 187181 236672 281721 282258 240571 193825 165891 159930 169962 181412 167968 119000 49607
29474 49607 -14900 -59084 -78628 -88746 -100336 -98455 -71493 -37115 -19249 -23304 -37146 -46764
29462 -46764 -41270 -18957 6876 26100 40867 56415 84226 114953 127976 121388 98136 63035
29450 63035 38110 40812 68140 91335 88981 58721 10654 -37257 -72271 -95641 -102162 -85693
29438 -85693 -62170 -53546 -53662 -50938 -54007 -74713 -111170 -142584 -161434 -164170 -144630 -113638 -88648
29425 -88648 -82180 -98248 -116864 -114124 -81735 -26369 30521 69213 76562 58923 34137 10420
29413 10420 -4071 -12871 -28804 -52499 -76392 -91119 -86602 -66702 -53270 -48893 -38181 -22246
29401 -22246 -17149 -30135 -39332 -25592 -3335 2274 -7931 -12441 -5349 -1524 -6537 -16812 -34495
29388 -34495 -57884 -72003 -83727 -107331 -136701 -160203 -174044 -186041 -192050 -182476 -158298 -129536
29376 -129536 -107852 -96527 -92130 -94819 -107586 -118956 -116574 -104888 -88598 -62856 -27458 7393
29364 7393 37375 61950 69502 57778 58926 93407 138224 151036 119875 80903 72294 88208
29352 88208 103389 112851 117367 115478 115130 133278 173604 207802 203109 163704 116143 74019 57687
29339 57687 79417 114226 136308 145285 152105 161267 167128 157359 129764 92876 53117 16119 -13646
29326 -13646 -34753 -52975 -70257 -78778 -72222 -49245 -14541 21075 50078 56099 30066 -3810
29314 -3810 -15879 -2152 14593 14644 5634 19117 59456 100050 123249 137139 157103 181307 195424
29301 195424 194000 181366 165206 156429 155600 149867 132827 113588 105475 105383 104054 102769 105880 108224
29287 108224 90371 44326 -5238 -32103 -31825 -16013 -3012 3655 11822 28949 60693 97734
29275 97734 127081 142291 134470 105976 82932 85077 106728 134049 170724 208856 230456 230923
29263 230923 204119 156850 111685 86243 77927 84649 106716 125470 109561 58823 4434 -41818
29251 -41818 -89375 -131747 -142161 -113511 -77494 -63210 -61123 -48426 -24342 -18212 -45470 -86171
29239 -86171 -112481 -106234 -79049 -67569 -86965 -111988 -115458 -95350 -59610 -19168 10044 18062
29227 18062 8609 1396 9777 17354 2533 -40178 -105012 -168541 -204651 -204836 -179376 -136388 -88173
29214 -88173 -50496 -32083 -34010 -43526 -46288 -40630 -26371 -4429 22839 60035 98783 113600
29202 113600 96561 46779 -22513 -74982 -92758 -80351 -53528 -33942 -39004 -70465 -122080 -178840
29190 -178840 -221890 -246527 -258332 -263832 -266219 -267853 -274203 -273836 -250452 -208806 -161948 -115318 -77512
29177 -77512 -67170 -81993 -105793 -125477 -138261 -155751 -178775 -197575 -201884 -189865 -169414 -143349
29165 -143349 -112337 -82785 -62447 -54541 -53529 -49440 -44585 -41464 -41592 -58785 -93884 -131090 -157204
29152 -157204 -162051 -145438 -118242 -94814 -96266 -113114 -115545 -100718 -93304 -100834 -111140 -123983
29140 -123983 -138958 -150016 -152445 -139649 -114206 -89144 -74948 -60221 -40152 -27397 -27753 -39446
29128 -39446 -47302 -32117 -3869 14239 23109 34212 49352 64982 82721 97326 108715 121023
29116 121023 138165 159056 160752 122056 63991 24809 18154 33907 45011 30676 -1187 -22207
29104 -22207 -28848 -24150 -14093 -21475 -49291 -72708 -78533 -76589 -65784 -39332 -11853 3452 7932
29091 7932 3776 -12759 -40306 -63732 -67524 -51255 -33753 -43862 -93581 -158228 -199265 -207812
29079 -207812 -198909 -180612 -155566 -125949 -89971 -43109 13333 63304 88067 80407 48729 4099
29067 4099 -40907 -81506 -119510 -139212 -131781 -105451 -75783 -63641 -75593 -94200 -97638 -84632
29055 -84632 -71365 -79465 -106049 -116328 -90584 -42436 2134 29605 47513 66231 81777 86497
29043 86497 89284 92490 83296 54488 17817 -13585 -42417 -77755 -118583 -142192 -129724 -87002
29031 -87002 -31580 22968 67096 88987 84279 61578 21378 -24255 -53675 -75220 -106658 -130403
29019 -130403 -127942 -114925 -111436 -108212 -93367 -82687 -83931 -79139 -62640 -39100 -15514 -660
29007 -660 -9646 -54217 -111820 -149932 -160579 -158676 -157533 -154204 -148854 -139747 -122542 -97740 -64057
28994 -64057 -30762 -11542 -6023 -10844 -18164 -26875 -43783 -64276 -87414 -107894 -116091 -111253 -98587
28981 -98587 -95429 -111337 -138258 -161427 -173616 -176197 -170366 -157025 -147529 -145364 -146419 -159228 -169607
28968 -169607 -156239 -123117 -86536 -58516 -46864 -59835 -93869 -134675 -168286 -185310 -187727 -194815
28956 -194815 -211265 -216844 -200648 -177179 -160794 -151262 -154231 -170022 -183456 -189363 -199702 -211427
28944 -211427 -203419 -182227 -165778 -162171 -166096 -179337 -210234 -241717 -250609 -239984 -226192 -214995
28932 -214995 -199177 -178297 -159500 -150684 -152593 -166085 -183689 -188275 -179652 -173667 -174972 -181102 -184836
28919 -184836 -173104 -142887 -102995 -67635 -44957 -31399 -16982 -865 6621 -8295 -38661 -66190
28907 -66190 -83654 -90772 -98672 -117088 -135611 -149946 -163269 -169151 -172585 -183217 -198830 -220179
28895 -220179 -245753 -267069 -266498 -231453 -171107 -94664 -19908 30671 52805 59310 70639 90113
28883 90113 102605 92149 54006 3096 -37706 -50738 -29518 7876 44336 77207 104290 114349
28871 114349 105351 93218 82688 68615 53768 43130 43847 56572 71680 80317 84057 84349 77390
28858 77390 63792 56711 66152 86619 108913 128069 138971 136914 126380 118352 115888 105525 79858
28845 79858 46228 14806 -12872 -41010 -66275 -76598 -65005 -36372 -4910 14587 17929 8396
28833 8396 -3269 -7469 -7899 -13103 -24323 -37170 -51598 -62088 -58078 -37708 -4811 32655 59930
28820 59930 72670 83526 99284 114286 120792 115054 96748 70490 35751 -8053 -46196 -61501
28808 -61501 -60482 -60230 -62281 -51016 -15637 34081 84426 121824 130705 113267 88991 70688 52466
28795 52466 21258 -14265 -39451 -45811 -30435 -4489 8647 -13145 -59366 -96705 -111156 -109569
28783 -109569 -97311 -67727 -20387 38417 96708 127860 128494 121039 114607 99682 84053 93572
28771 93572 132691 176248 198657 202608 199791 190511 170836 142363 113595 92570 65179 23289
28759 23289 -14771 -34514 -42524 -54652 -64718 -74818 -91964 -105215 -109693 -112698 -115190 -119990 -129229
28746 -129229 -135641 -133326 -111766 -72400 -46158 -45793 -48741 -37233 -16897 7957 28979 32870 17924
28733 17924 1498 -1354 16393 56035 101252 140356 172164 179554 134919 53598 -23762 -74582
28721 -74582 -91223 -77855 -50659 -19832 12111 36130 41819 30745 10940 -23519 -62369 -76595
28709 -76595 -64013 -42807 -25217 -3627 20605 33679 40176 36946 13435 -15173 -25573 -12658
28697 -12658 14649 36601 56383 84847 105534 107040 86966 44240 -9808 -59819 -93196 -106064
28685 -106064 -99624 -78630 -50386 -14382 29700 64513 71119 46105 -5376 -64724 -108885 -130347
28673 -130347 -146096 -157136 -141571 -97938 -53791 -33417 -39206 -58682 -72540 -69379 -57068 -39513
28661 -39513 -17020 1053 13432 14247 -4378 -32074 -49491 -52560 -56734 -62362 -44067 944 38098
28648 38098 42263 27908 12895 2149 -5399 -10298 -2807 24652 57037 65759 39421 -4171 -32165
28635 -32165 -37185 -35771 -33335 -25608 -18292 -15360 -8469 8009 24327 19115 -8386 -30370 -22782
28622 -22782 13706 63962 97608 92500 61049 32402 8403 -22214 -57146 -84843 -88109 -63318
28610 -63318 -34923 -25239 -35341 -54601 -68253 -68658 -61631 -62269 -87317 -136354 -170111 -167601 -148251
28597 -148251 -121307 -86942 -65904 -74470 -106429 -138594 -145769 -133569 -121429 -110796 -97415 -87197
28585 -87197 -87575 -93847 -93793 -84193 -74152 -60258 -38250 -27194 -46282 -86646 -122895 -137899 -129299
28572 -129299 -97490 -48358 7868 62973 94963 88614 58542 27723 9193 -6409 -12365 13436
28560 13436 59270 96961 115709 107106 67053 18447 -8181 -9240 2426 15486 22354 18716
28548 18716 9499 5936 7190 -3711 -34057 -66697 -88824 -96815 -80183 -42281 6804 55956
28536 55956 93370 120956 145941 147713 109328 55232 17148 -6403 -32668 -67216 -103185 -128436
28524 -128436 -128560 -95104 -35424 21983 53696 68144 78953 79663 55796 27080 13189 11210
28512 11210 13011 17334 29842 46471 47965 18607 -36946 -93383 -122762 -121608 -94362 -38464
28500 -38464 25549 72016 109570 136727 136876 115021 94343 82463 82631 99461 112577 103522 77765
28487 77765 45531 11425 -14295 -22494 -13875 20660 68643 88516 76246 52786 30155 16197
28475 16197 10059 6428 11319 23643 26098 17393 11651 8408 -2205 -14228 -9300 6584 15806
28462 15806 23547 39117 54401 60822 60823 47700 12481 -34284 -76999 -101661 -96775 -63430 -23584
28449 -23584 -1017 -1336 -19604 -46586 -60583 -48481 -22782 607 15949 17005 -2662 -40307
28437 -40307 -83819 -108173 -99863 -70896 -41247 -30102 -33530 -34150 -39205 -60706 -103264 -164916 -222983
28424 -222983 -248966 -229805 -182307 -135318 -105819 -88693 -86813 -103927 -120361 -127514 -133022 -142141
28412 -142141 -153424 -157349 -153520 -154985 -163710 -154360 -119345 -87686 -76091 -64631 -37952 -11712
28400 -11712 -6697 -29203 -67312 -96178 -100570 -88828 -71718 -48184 -28910 -32303 -50808 -63827
28388 -63827 -67995 -79747 -101081 -110932 -98953 -66398 -20665 8026 -1007 -27885 -38070 -29794
28376 -29794 -30693 -54332 -89658 -125760 -150702 -160121 -160187 -152749 -139739 -129788 -117012 -90347 -53753
28363 -53753 -21803 -7355 -10836 -4977 23449 57872 84047 89816 77384 66297 69375 90375
28351 90375 121008 145624 147536 110474 43534 -36743 -119870 -184871 -212615 -206822 -187540 -167251
28339 -167251 -148055 -137313 -138143 -145085 -146528 -131303 -89680 -27325 38978 112723 192088 241170
28327 241170 243860 221262 191001 165598 154986 145644 123623 99837 94306 110490 137139 145048
28315 145048 105709 33390 -39148 -77959 -83728 -98312 -133675 -173894 -195354 -172022 -111077 -43800
28303 -43800 1981 19975 17355 -3241 -32255 -69041 -114864 -153291 -173261 -178003 -176357 -165787
28291 -165787 -140392 -103270 -68274 -48512 -35236 -19404 -3326 9681 8682 -20054 -65574 -108461
28279 -108461 -132469 -130316 -120788 -118543 -116926 -100890 -61166 -28432 -33759 -45393 -20234 34566
28267 34566 80768 88635 69867 64753 92362 138611 181988 209753 208170 176722 128206 79565
28255 79565 45163 21483 -6506 -46927 -89110 -118378 -130297 -130673 -135555 -149660 -168178 -186703
28243 -186703 -199495 -199034 -184620 -158439 -131987 -116218 -99857 -74454 -50395 -49180 -80955 -126453
28231 -126453 -156555 -157289 -126355 -80643 -48101 -27218 -14996 -24396 -56966 -91794 -99318 -71727
28219 -71727 -23812 30759 81657 113158 122994 126625 147112 189746 225258 231116 197620 125971
28207 125971 48257 -10157 -53398 -94728 -129638 -124634 -65328 4669 39356 37834 20167 6226
28195 6226 -9528 -45346 -83723 -105129 -110877 -100367 -66321 -23269 -75 -5642 -29714 -61639
28183 -61639 -91066 -106153 -103955 -74330 -14144 53193 110239 152482 179470 199574 212958 202149
28171 202149 156335 99965 61954 45955 39889 32838 16531 -20551 -72436 -115427 -128332 -116026
28159 -116026 -103335 -98519 -93279 -85421 -85440 -95928 -105978 -106585 -94943 -81366 -70782 -51739 -28932
28146 -28932 -17869 -3677 30496 75293 105151 102199 72854 38023 16500 12819 14825 4189
28134 4189 -23340 -47317 -60539 -76914 -99687 -127072 -155676 -171841 -165649 -152166 -147029 -149895
28122 -149895 -149496 -120622 -64378 -16078 14778 40657 51151 32482 -10611 -66246 -121481 -165565
28110 -165565 -187686 -192688 -200161 -209901 -203876 -169934 -118771 -67464 -13025 54665 124949 171957
28098 171957 183634 163710 125452 84085 44930 9833 -16127 -19863 3676 32503 37537 10219
28086 10219 -37233 -89425 -126463 -132947 -127193 -136071 -162673 -199022 -233349 -252513 -241506 -199916
28074 -199916 -144927 -93726 -63507 -46337 -27075 -1893 22310 37479 40018 32156 25924 28948
28062 28948 32904 27646 8548 -25633 -75716 -119488 -128783 -102371 -53057 -5797 17544 21289
28050 21289 16975 2327 -21642 -59614 -117748 -177765 -209177 -214324 -213322 -209056 -200874 -188573 -160711
28037 -160711 -125866 -105364 -101405 -108382 -131169 -166260 -197173 -213305 -215393 -215050 -223951 -240569 -249338
28024 -249338 -248661 -251823 -249971 -232326 -203546 -175355 -165546 -172875 -187296 -182800 -140834 -89441 -66485
28011 -66485 -74047 -92185 -96396 -81226 -78276 -97815 -117220 -118561 -105101 -92224 -91576 -100563 -107895
27998 -107895 -96379 -72596 -62138 -65783 -76690 -91312 -99270 -98510 -94882 -89270 -70969 -37111 -10052
27985 -10052 -13504 -35833 -52568 -55504 -43672 -18944 2771 10144 16331 28620 38812 34329 1507
27972 1507 -55439 -105817 -137155 -160180 -174068 -174066 -160419 -126668 -71889 -19874 10283 15963 -5521
27959 -5521 -42783 -73238 -92953 -91459 -68777 -51483 -42133 -27144 -14377 -19327 -38177 -55848
27947 -55848 -67132 -85218 -114792 -132668 -121331 -94083 -83957 -94876 -104314 -111286 -123248 -147860
27935 -147860 -185294 -211701 -214458 -204331 -188169 -171440 -165578 -163240 -139427 -94751 -50810 -21023
27923 -21023 -3071 7371 16320 31264 50666 70198 82761 83458 68414 33993 -8634 -51579
27911 -51579 -100477 -154318 -198272 -224655 -238283 -247210 -247053 -220002 -164538 -95532 -16085 72068
27899 72068 145503 178860 182490 191414 221971 258460 276340 259861 221052 192826 178916 173355
27887 173355 169317 159388 132879 79819 23433 -16865 -50966 -86255 -116815 -129580 -130418 -138186
27875 -138186 -157366 -181088 -202580 -214765 -216706 -209589 -191817 -172540 -164946 -170019 -174968 -163843
27863 -163843 -135734 -94145 -32086 38421 81465 80614 54852 28253 1842 -25206 -37144 -31208
27851 -31208 -24493 -27931 -36357 -40883 -44339 -45630 -40285 -30824 -18745 -7084 1017 8576 14835 14843 3081
27836 3081 -24229 -61595 -89572 -101122 -109044 -118145 -119013 -100067 -54807 -3031 31606 52171 73934
27823 73934 91111 84465 59333 34338 18725 15213 15553 13195 14207 16452 10850 -2176 -10404
27810 -10404 -1215 35955 86702 119345 126849 121671 109506 96662 96310 108095 125558 140760 144085
27797 144085 129725 107256 95397 95699 89897 70357 44606 22803 14892 13038 12056 18434 24287
27784 24287 15314 -4190 -15435 -12232 -4581 4319 12077 16815 22348 25555 17731 7116 19515
27771 19515 58850 96130 113885 113871 113393 125356 135911 131257 115322 90679 61473 33364 7493
27758 7493 -10207 -8969 -6463 -13095 -1462 42964 88903 110047 103836 82245 72782 84624 93258
27745 93258 94540 93966 75277 42662 19835 10298 1045 -13096 -28759 -48344 -68321 -79982 -84008
27732 -84008 -84835 -75602 -57922 -35231 -7428 16455 41205 66257 63921 15721 -66836 -152731
27720 -152731 -211071 -234710 -230677 -212360 -196303 -186393 -169942 -143358 -121191 -118781 -135454 -149412
27708 -149412 -136654 -88164 -13288 55385 79492 45992 -17847 -68181 -102456 -135182 -160545
27697 -160545 -168429 -170003 -182576 -203000 -223489 -236311 -237778 -231871 -216570 -188861 -150034 -113556
27685 -113556 -103651 -115836 -122559 -115437 -114483 -132018 -143091 -133654 -121566 -103108 -55994 8128 58957
27672 58957 80715 73036 59354 59292 64348 58663 25862 -36516 -102568 -145578 -158615 -160484 -169486
27659 -169486 -176368 -162333 -132020 -99023 -69091 -47661 -33676 -25811 -35500 -51592 -54936 -52776
27647 -52776 -54102 -53121 -51011 -59860 -69161 -70239 -76975 -103594 -143789 -157877 -123400 -58786 1732
27634 1732 32042 27359 3281 -30070 -64208 -85635 -92854 -94157 -88518 -77133 -61150 -34778 -6140
27621 -6140 9428 8166 -562 -13678 -40240 -74693 -97340 -102122 -104082 -128408 -165008 -176328 -145761
27608 -145761 -87733 -14688 59883 118244 138384 104143 37851 -19897 -47496 -54271 -53149 -45465
27596 -45465 -36835 -32266 -30813 -37672 -66377 -106960 -130722 -138669 -148690 -164642 -185425 -192806 -169191
27583 -169191 -126516 -72291 -7606 49881 78674 69452 28985 -34644 -105654 -153937 -161669 -134244
27571 -134244 -85596 -33145 1137 20574 40377 57200 68794 81498 88458 85780 79695 77727
27559 77727 78612 77521 74285 58150 25816 2956 1981 3461 -4662 -21934 -47821 -71550 -84848
27546 -84848 -80603 -60245 -40173 -19293 -1146 2045 -5185 -2000 4551 -20929 -78794 -138462 -177623
27533 -177623 -196511 -208936 -225145 -245809 -261333 -251599 -213165 -153733 -86811 -28285 14205 40333
27521 40333 51348 51089 56936 76650 97530 109843 114517 108043 86962 60662 40423 18823 -13412
27508 -13412 -51909 -83780 -103511 -109812 -95051 -69888 -55827 -52064 -48068 -36529 -17574 -10899
27496 -10899 -37452 -84384 -118514 -120859 -85652 -34174 3190 13697 1263 -23044 -47817 -56704
27484 -56704 -32260 10812 49602 88662 130262 147664 118631 58324 -2125 -40727 -56895 -63144
27472 -63144 -68638 -76447 -84407 -89007 -84638 -77256 -78770 -88123 -85781 -63090 -33478 -10553 4776
27459 4776 20784 36963 37095 12588 -31170 -81384 -124011 -154696 -173429 -174979 -156344 -126375
27447 -126375 -94556 -68671 -60671 -81451 -117710 -145194 -151158 -141492 -124381 -103841 -91140 -92358
27435 -92358 -106723 -124592 -137311 -150914 -175054 -199047 -204894 -193568 -168559 -132491 -103162 -99328
27423 -99328 -115112 -144651 -170278 -165324 -136456 -100043 -57569 -15899 8560 11602 4928 155
27411 155 7902 24215 40569 53262 59490 58271 58255 56350 37320 6333 -28165 -59293 -70237
27398 -70237 -50275 -3544 49340 86669 104110 113737 125225 141909 156342 158412 149736 137931
27386 137931 122626 90655 39335 -3836 -24558 -40819 -65260 -85261 -88031 -72401 -38098 9774
27374 9774 50049 64062 49151 16671 -8329 -2151 42768 106973 148021 134776 87294 36445
27362 36445 -769 -23722 -43798 -68944 -94115 -106631 -109931 -116854 -121428 -112185 -86555 -48055
27350 -48055 -20565 -20897 -38581 -46336 -28732 7858 48586 71074 59410 36800 42148 69501
27338 69501 81097 61474 28967 -1500 -31520 -53416 -60957 -54945 -40860 -28312 -19010 -9782
27326 -9782 3466 22988 48119 62098 55533 42331 31156 18540 1701 -15812 -33390 -56756
27314 -56756 -84923 -113759 -135282 -143924 -145463 -157374 -193450 -239773 -272567 -282362 -272072 -256896
27302 -256896 -241936 -227031 -213663 -200501 -184028 -162596 -137043 -104753 -59504 -4846 54062
27291 54062 107837 139454 141078 121970 97955 87926 97516 105788 100193 88025 84833 93558 90906
27278 90906 58427 6764 -36027 -57240 -68318 -76788 -86381 -103147 -124771 -143661 -150562 -132657
27266 -132657 -88329 -38876 -2216 17610 17317 482 -14866 -8528 20374 59213 99885 137050
27254 137050 168984 204536 239709 255556 234690 176817 123066 96439 73255 38050 4526
27243 4526 -14817 -30070 -64255 -110625 -133147 -135923 -160228 -208279 -242409 -235035 -196284 -155572
27231 -155572 -120539 -91629 -81234 -86446 -82188 -50745 -14965 -9873 -26001 -31618 -26101 -25325 -26011
27218 -26011 -28511 -43217 -78206 -113084 -120277 -108967 -97802 -80798 -51171 -26669 -20766 -32404
27206 -32404 -53328 -59280 -43290 -18617 8876 38944 68950 91060 86033 45660 -11289 -58242
27194 -58242 -87155 -103634 -113223 -122792 -131333 -128116 -103913 -59323 -11941 18411 31103 44975
27182 44975 65122 75985 70707 65872 67346 56604 38136 30084 31581 48307 82706 116111 141620
27169 141620 162639 160633 122170 63739 14589 -15224 -37512 -59560 -82597 -109729 -140517 -157983
27157 -157983 -140619 -93504 -43843 -7367 17760 23714 -1340 -48532 -93260 -124466 -153668 -181881
27145 -181881 -190810 -172545 -140155 -115043 -108988 -115183 -121965 -129217 -134020 -127033 -112238 -97875 -93133
27132 -93133 -108349 -139122 -176464 -207168 -215215 -197619 -160753 -121452 -93464 -72866 -51993 -29483
27120 -29483 -9749 4612 2492 -26486 -73208 -111437 -128649 -137281 -153572 -170149 -178775 -188098
27108 -188098 -200044 -205285 -195464 -163577 -110216 -63691 -48051 -44506 -36486 -38765 -51792 -56452 -51517
27095 -51517 -52616 -62303 -72655 -72642 -67778 -76074 -102149 -127885 -139397 -134157 -111321 -95859 -104918
27082 -104918 -109444 -91075 -67636 -49306 -36255 -27060 -19037 -10065 8308 33003 53393 59613
27070 59613 51934 48193 64774 90530 100822 98640 91417 72626 53024 53587 72939 81864 58096
27057 58096 11189 -32380 -60604 -75434 -81836 -81373 -70961 -50274 -22448 9837 40693 52504
27045 52504 38838 21314 15701 22188 46737 83058 127652 179081 216371 212222 164835 106397
27033 106397 64644 43416 39795 48925 62168 73578 75860 70168 60268 41195 10566 -30705
27021 -30705 -73679 -96809 -71340 -6359 69629 148162 210695 235349 210042 139086 50934 -27144
27009 -27144 -82968 -116880 -133979 -132358 -110052 -81420 -66850 -56802 -24676 22692 48935 36170
26997 36170 -3787 -50095 -88100 -114152 -130902 -141283 -154231 -170433 -179415 -172051 -147247 -126657
26985 -126657 -121323 -128690 -152591 -182493 -199778 -197243 -177481 -138465 -79445 -13881 34017 53712
26973 53712 55527 39716 -5213 -65251 -113287 -141844 -153129 -146640 -132356 -122675 -115284 -103112
26961 -103112 -80724 -47849 -16473 2725 6925 1010 -13527 -35835 -64348 -95275 -127194 -152987
26949 -152987 -158691 -136879 -105833 -90016 -105475 -143842 -179597 -203362 -220281 -223196 -203587 -172717
26937 -172717 -143230 -119074 -101168 -97287 -104905 -115226 -125389 -130600 -128755 -123524 -111155 -88191
26925 -88191 -69858 -63705 -61049 -58465 -65472 -83403 -94099 -76572 -19603 49367 95608 118096
26913 118096 128255 124503 91246 32494 -23212 -54649 -63407 -59272 -35717 9547 52627 86222
26901 86222 116635 138827 145997 142611 134464 112973 79075 52530 40982 34970 32266 27429 6948
26888 6948 -35544 -96772 -159997 -194221 -189027 -155094 -112085 -81105 -58840 -27107 10233 43688
26876 43688 70026 81645 79959 78768 82422 85437 88355 78729 44250 -764 -45382 -93883 -134810
26863 -134810 -159285 -171288 -179898 -195320 -218610 -246953 -268959 -274050 -270929 -272910 -271541 -250842
26851 -250842 -207475 -155480 -107498 -68802 -42700 -18199 18876 66741 111712 148470 171902
26840 171902 177959 182272 202250 236166 264899 263731 237612 218496 216620 212484 196026 178419
26828 178419 165822 159348 164782 178357 186693 174072 126577 59198 3187 -32484 -63518 -93965
26816 -93965 -107767 -103163 -93521 -82587 -62063 -34882 7099 71239 136154 175021 180618 162509
26804 162509 126477 79133 33319 -1396 -26393 -36553 -26260 -7241 2159 -9051 -30695 -43584
26792 -43584 -45972 -44955 -47631 -51649 -61380 -87599 -117485 -133857 -140684 -144363 -152739 -175052 -210693
26779 -210693 -243862 -258387 -249954 -227126 -196516 -158979 -115373 -70866 -32189 4473 36695 47422
26767 47422 32927 11124 1673 8980 21284 21771 -221 -42116 -88941 -115270 -113040 -111169 -132081
26754 -132081 -166225 -190661 -200069 -200621 -191296 -170294 -142174 -114615 -88090 -68085 -63581 -73872
26742 -73872 -84451 -79672 -53704 -6363 48086 88318 107825 106349 98459 96785 97482 103407 122004
26729 122004 141176 139256 99617 23191 -67587 -144667 -201475 -251048 -291915 -311059 -313411 -304663
26717 -304663 -269572 -204679 -137388 -92237 -59624 -33914 -18666 -15085 -31200 -65010 -99397 -113837
26705 -113837 -100934 -67949 -27841 4937 30898 55362 73016 80258 78723 76380 75497 63381
26693 63381 40636 20725 9414 22282 71958 132407 167498 172385 167919 161479 148027 134261
26681 134261 123185 117235 126754 146754 159344 144415 101478 58950 33712 12509 -14751 -51312
26669 -51312 -85560 -97483 -78148 -51698 -42098 -42123 -40530 -32857 -24294 -25473 -33857 -38161 -34977 -31146
26655 -31146 -34006 -41730 -42684 -27959 2889 37261 60288 76337 88240 88046 69148 28869 -15612
26642 -15612 -37477 -30434 -10800 -6230 -20384 -32809 -37675 -41394 -34763 -19857 -13801 -20246 -34107
26629 -34107 -58386 -91966 -117386 -122934 -104043 -60045 -9625 31133 57730 63637 56271 53097
26617 53097 60084 57954 40309 25468 14060 -11602 -54420 -103637 -147084 -174079 -177441 -164845
26605 -164845 -153596 -144836 -128568 -90988 -38140 1808 18155 18288 12272 16517 33430 56579
26593 56579 86990 126592 165217 186961 174167 115676 41114 -9860 -18969 8424 31501 25563
26581 25563 14903 24816 49865 66409 71397 78374 76970 58779 41529 33563 23356 7352 -8705
26568 -8705 -31436 -62854 -88907 -100155 -94790 -74155 -41588 -4361 25928 32746 11134 -24440
26556 -24440 -60420 -88631 -102684 -104630 -100969 -95982 -89733 -82354 -87027 -108237 -123484 -118786 -98401
26543 -98401 -78955 -76753 -90544 -117538 -148259 -162972 -157983 -142679 -124722 -111186 -96699 -69911
26531 -69911 -38390 -18298 -2302 26971 57461 81638 106638 118076 103516 88914 98355 122543
26519 122543 135024 120229 87010 50383 8469 -46592 -96633 -126279 -148333 -173330 -186113
26508 -186113 -166271 -119963 -76807 -39278 20230 87938 125714 127086 108264 89232 71012 46741
26496 46741 32712 42559 62267 66018 39664 -9408 -49799 -65706 -69074 -76830 -85050 -80890 -74049
26483 -74049 -75349 -82638 -100902 -118293 -108679 -65110 -8145 42955 87827 116795 112809 91659
26471 91659 80709 74224 64468 60775 65903 78679 82788 46739 -26851 -107673 -178598 -222000 -228599
26458 -228599 -214621 -198429 -180201 -152118 -113689 -71417 -34961 -10583 6297 31282 58773
26447 58773 75825 82934 77062 62533 44885 24418 7184 -8229 -28108 -44533 -36127 -6205
26435 -6205 13876 16288 19626 34945 52393 57822 41858 15494 -10132 -43323 -84532 -122885
26423 -122885 -146181 -141322 -102367 -42098 11556 49424 86523 124276 163762 210638 248472 257258
26411 257258 237617 204718 175539 156864 154088 172854 202400 225688 230579 215049 198970 197925
26399 197925 205734 206082 192444 174513 157331 140085 130949 131826 134267 133568 142366 175140 213414
26386 213414 232722 237569 245211 254434 250467 233969 219624 212298 200000 178209 160179 159548 178140
26373 178140 200862 210469 212645 219176 234121 255925 288295 312198 309863 292973 273605 259509
26361 259509 251371 249615 267352 302974 335235 353972 365839 378896 400370 439400 486211 509816
26349 509816 488589 439540 404588 419381 487836 579082 653381 697380 726447 767487 833987
26338 833987 921720 1024634 1129601 1221329 1291096 1330979 1338310 1314836 1268170 1220469 1180627
26327 1180627 1140304 1106459 1097316 1127587 1190444 1260854 1329140 1395776 1460655 1511505 1538368
26316 1538368 1562812 1609625 1669348 1724402 1761981 1773339 1754308 1697997 1610524 1514067 1431504
26305 1431504 1370168 1334498 1327772 1336304 1337800 1322385 1302746 1292058 1291517 1296053 1299066 1300543 1303064
26292 1303064 1301860 1288114 1245016 1175189 1109936 1071877 1067041 1079465 1087360 1069387 1006764 912104
26280 912104 816395 743209 695247 663134 634693 591256 531707 469374 415327 375972 344983
26269 344983 307636 265483 241827 241640 252469 271018 297646 325580 349498 375612 409630 442606
26257 442606 457186 442093 405929 359271 312731 289468 295697 306255 295169 263303 231690 218703
26245 218703 224360 248575 290520 330908 345883 337159 307319 250949 180435 123775 102209 109947
26233 109947 124887 142467 165610 169235 138119 90640 47517 14806 -3830 -5316 -15186 -58834
26221 -58834 -114373 -142094 -129555 -87757 -36695 -5803 -12029 -42784 -76997 -109494 -137291 -145826
26209 -145826 -132123 -103362 -61204 -22300 -3549 -7431 -25261 -40380 -41723 -30012 -15465 2533
26197 2533 27528 50717 60465 50055 21016 -6947 -9039 2141 15107 44968 88504 130736
26185 130736 167119 189665 198114 203871 213764 227408 231605 221931 210870 209876 220418 235615 253019
26172 253019 268662 274913 272736 270607 267755 252399 220415 187465 168119 160862 156576 140113 114644
26159 114644 90596 60196 21443 -1514 15524 76638 156385 212853 234429 241391 241459 230786
26147 230786 208024 183804 164742 150034 136057 117874 101364 88904 77128 59152 39894
26136 39894 32009 39064 59111 78941 89567 100747 118187 138260 150289 144160 126427 115002
26124 115002 121541 152324 204223 257473 292242 307494 299235 264553 223254 202506 212426 239024
26112 239024 267513 290994 307355 324382 346333 356477 342916 328160 336927 358105 363353 340340
26100 340340 310078 301666 316332 344796 376060 390062 390055 398887 414607 414910 396632 384287 401559
26087 401559 437671 461640 469331 482291 510905 551654 600403 642438 662042 662547 637664 593292
26075 593292 552360 515928 486784 475665 483317 506999 545068 583376 594163 564539 497525 394677
26063 394677 288402 217266 163562 97025 28698 -17758 -28591 -15397 5572 36029 77632
26052 77632 124532 165175 195584 215215 222968 222772 216064 200824 183636 182173 202653 238802 291070
26039 291070 346635 379637 378387 345277 303984 279071 273371 284166 306954 324621 318792 308440
26027 308440 322717 353382 385263 412076 429838 434925 417298 385665 372379 377811 375273 358991
26015 358991 342656 334267 337136 357880 389552 413435 408409 364251 304815 261687 239146 228666
26003 228666 207504 160873 99798 44744 6643 -14788 -7372 21806 40807 34732 16698 6558
25991 6558 10418 35936 83439 139958 193474 228384 234566 214268 179979 153810 146515 141936 125722
25978 125722 109748 110279 120507 119168 97553 59750 24523 12037 31008 78627 129175 161088
25966 161088 164307 137512 95057 57954 42992 36382 20730 9876 22284 52399 76776 78327
25954 78327 69474 78908 108347 130466 128358 109957 93567 82353 70717 56839 39647 14956
25942 14956 -16702 -37884 -46406 -59239 -84336 -119026 -152999 -164086 -140085 -101930 -79942 -79956
25930 -79956 -86457 -88384 -80431 -55972 -26402 -5857 3870 6642 13702 30205 54176 75321 84526
25917 84526 85781 92367 114590 148932 178046 186176 178791 168215 153665 130238 104002 76396
25905 76396 45852 15595 -8668 -15247 -4526 10805 28873 53242 82924 111944 129341 129853
25893 129853 116206 100259 89270 93467 119335 156345 186761 190452 170339 152433 151172 154026
25881 154026 137106 109047 98809 102313 87375 52665 19262 2712 10766 35549 50273 33545
25869 33545 -10382 -56312 -67436 -38495 -3723 21002 44295 61143 67995 69134 58631 34376
25857 34376 3861 -22686 -36863 -47073 -61281 -76176 -91598 -106977 -117696 -106016 -59878 -521
25845 -521 45434 69956 82738 87497 70287 32785 2645 -2829 6545 8854 -4889 -32711 -63691
25832 -63691 -82021 -86263 -79856 -69814 -68970 -80909 -103256 -125892 -134571 -123076 -96987 -69558 -56340
25819 -56340 -61154 -78345 -104661 -129488 -140867 -139152 -123802 -88286 -32532 24089 54740 56988
25807 56988 41169 13287 -23724 -74679 -131148 -170962 -192687 -198659 -189535 -178313 -177544 -193636
25795 -193636 -225854 -247717 -241587 -224445 -207022 -183592 -158861 -146658 -149141 -154617 -157963 -158037 -128972
25782 -128972 -59338 14586 50453 46640 27335 12032 10050 18501 15803 -5005 -27645 -51175
25770 -51175 -76936 -96893 -110915 -117420 -114291 -103035 -76550 -47648 -39382 -50227 -64193 -62167
25758 -62167 -45265 -34233 -33629 -38030 -46203 -52500 -53123 -50468 -48763 -46294 -51927 -70763 -82574 -68520
25744 -68520 -44739 -41501 -64324 -102560 -150830 -197872 -230378 -240777 -226357 -203319 -189931 -187505
25732 -187505 -180681 -163346 -145327 -128217 -109561 -98593 -101612 -122711 -161388 -193429 -201372 -203826
25720 -203826 -224496 -262004 -296446 -323373 -339559 -325094 -284041 -230450 -177954 -151682 -155158 -171905
25708 -171905 -182456 -169446 -129744 -73517 -14860 23295 23523 -1667 -33700 -67833 -86692 -72515
25696 -72515 -42329 -19489 -3321 15087 41247 77450 108590 119435 104284 61592 15367 6661
25684 6661 43772 94288 122156 115623 88074 66717 62890 59030 45070 26894 22173 49741 92743
25671 92743 119116 123802 114279 88491 58887 45570 52545 64982 64477 47141 15126 -31965 -82314
25658 -82314 -119012 -131796 -119485 -99810 -86831 -77096 -61765 -38863 -19289 -21838 -47127 -67750
25646 -67750 -68904 -63260 -67466 -73213 -73556 -79528 -92812 -104497 -109972 -112475 -115265 -114171 -105568 -100561
25632 -100561 -104880 -100046 -71035 -32180 -2772 14919 23906 25750 21043 16669 24306 50290 91510
25619 91510 135011 167325 178173 157584 107918 59646 23465 -14640 -49363 -65211 -62641 -60362
25607 -60362 -59534 -48650 -24096 1430 13404 13658 6505 2479 12138 43105 81541 100221 98651
25594 98651 94597 93565 96622 103277 106717 114838 139721 165677 168809 143075 115428 119063 145982
25581 145982 171337 187516 202893 215603 215548 196681 166845 133388 103481 82980 70708 57405
25569 57405 34205 22109 39494 71776 96332 98658 78586 54033 40719 41852 52081 59570
25557 59570 53693 42743 48386 62021 52902 17300 -29468 -73999 -97105 -89762 -56760 -21618
25545 -21618 -16823 -42966 -71099 -83535 -83377 -69751 -50103 -40701 -42137 -44645 -44241 -46034 -58411
25532 -58411 -71465 -64178 -36532 -8261 -2526 -18711 -35824 -49551 -65398 -77900 -78973 -65718
25520 -65718 -41235 -16282 4653 27433 50840 60646 51854 36262 24937 23404 44939 92999
25508 92999 147260 173876 161130 120291 73393 47744 54583 73864 80182 64628 35873 11117
25496 11117 2563 9198 14704 39 -43973 -103588 -143806 -147111 -115572 -56991 2755 41209
25484 41209 64847 94941 134227 164019 178724 178559 160523 129324 98788 78566 68658 67319
25472 67319 70534 65460 40371 10674 -3716 -10927 -25803 -48003 -77825 -116577 -147603 -150419
25460 -150419 -131172 -114635 -112720 -110923 -96657 -82512 -75231 -72726 -73888 -62062 -19700 36460
25448 36460 82433 110098 121059 118931 106057 96219 98190 108925 111496 88559 40043 -3590
25436 -3590 -14706 357 22627 35771 41080 44098 40072 35936 42186 61730 91615 110128 97428
25423 97428 78108 83263 101820 105033 83386 49705 22799 -2638 -28835 -32367 -4920 35818
25411 35818 72285 102029 124188 135931 155780 193065 210781 187077 141336 95965 48016 -8323
25399 -8323 -56920 -73670 -56414 -31959 -17612 -15094 -15573 -8960 9841 35077 41573 18335 -17589
25386 -17589 -43066 -45459 -33945 -26523 -27605 -28495 -17915 1217 20929 41094 59412 66483 63801
25373 63801 69889 87568 108460 114526 89671 46834 15795 13630 36489 74202 103878 105146
25361 105146 82466 49790 19662 2983 654 11050 29327 40603 38278 23455 7285 121
25349 121 1432 11877 29376 36067 26872 28608 53177 76231 71144 35540 -4342 -32701 -59901
25336 -59901 -85358 -96469 -86408 -62984 -45070 -44819 -51250 -55769 -55890 -46683 -40817 -51178 -67553
25323 -67553 -80460 -87613 -94090 -100463 -96950 -102884 -133187 -164095 -169986 -143607 -100752 -68092 -60700
25310 -60700 -87962 -148518 -209916 -235000 -217692 -177172 -139895 -123087 -114205 -90016 -64552 -61278
25298 -61278 -66144 -49245 -9155 36716 72496 88994 100891 113991 124200 138170 167456 204206
25286 204206 219047 192249 122550 42492 -6443 -18166 -8595 7794 18443 13205 924 -10888
25274 -10888 -25507 -34830 -36963 -34299 -17807 4192 20103 28709 17194 -24931 -82737 -117691
25262 -117691 -111314 -82618 -58362 -42064 -21496 -4318 -1458 -1182 9603 30088 67248 135378
25250 135378 230589 321547 375029 378586 331933 253603 169433 92028 25826 -17908 -32235 -31158
25238 -31158 -37791 -70309 -121603 -166361 -186633 -189825 -183415 -162302 -116765 -57472 -17643 -11602
25226 -11602 -35657 -81100 -134254 -185746 -238616 -282106 -298200 -291385 -283423 -274989 -242889 -169689
25214 -169689 -65892 31594 93547 130945 162038 193450 220047 225895 211532 187910 173510
25203 173510 175650 182850 203561 253786 329615 404104 433551 397308 322984 251096 192289 138964
25191 138964 100456 75808 50174 38266 44608 48192 44661 42194 38663 24515 8858 3865 2970
25178 2970 -4374 -15354 -15293 3419 29823 54550 69512 68110 59176 55397 64105 74168 77187 81150
25164 81150 92596 103314 99242 85631 65591 41517 24166 8362 -4898 -3454 3947 -1931
25152 -1931 -27195 -55285 -51670 -10566 35264 69899 93902 109557 124147 132879 122806 103891
25140 103891 97460 109143 127022 134399 127604 111319 87456 65658 52180 45451 37046 18479
25128 18479 -7471 -34200 -52710 -64192 -80043 -94780 -102117 -109691 -117630 -109758 -80846 -48070
25116 -48070 -29164 -16140 7328 27166 18926 -9776 -37680 -53763 -52019 -27125 25190 83015
25104 83015 131667 160761 153912 101793 4223 -109132 -203220 -257591 -267136 -246996 -217210 -181210
25092 -181210 -131772 -80562 -51254 -55049 -72797 -78445 -72095 -66012 -62258 -55670 -45790 -43866 -55338
25079 -55338 -74041 -92808 -115093 -145319 -166317 -158760 -118643 -69218 -41067 -44567 -67984 -92745
25067 -92745 -110666 -130977 -166728 -209519 -241953 -265674 -284228 -286517 -266694 -224410 -164936 -93713
25055 -93713 -19241 32540 47586 53960 82798 126835 155542 147821 117972 97840 107715 135067
25043 135067 151598 149670 136457 114959 84515 57963 39410 12890 -24624 -58387 -78765 -77665
25031 -77665 -57082 -20903 25323 62799 70864 51985 24665 -671 -23302 -43127 -53076 -33834
25019 -33834 10470 47286 59495 48299 15170 -20712 -33410 -17900 6791 13227 1324 -5607
25007 -5607 5924 21358 19196 -1099 -25434 -43969 -66102 -106224 -143668 -142938 -101769 -51214
24995 -51214 -24790 -20312 -10113 16236 37256 28805 1430 -11924 -15801 -35645 -77507 -133364
24983 -133364 -168181 -152726 -104994 -60667 -40749 -38375 -30849 -6440 32738 69758 92668 111980
24971 111980 125557 114485 80575 47369 19170 -8874 -11714 25411 75293 90532 59170 6334
24959 6334 -42982 -66291 -51394 -9875 34363 57714 49005 16470 -33291 -82993 -101139 -86839
24947 -86839 -62384 -39740 -17748 739 8600 10036 16580 19765 3492 -25204 -40959 -20957
24935 -20957 26433 51656 13362 -69729 -148870 -195221 -200863 -169289 -107421 -34154 17312 33388
24923 33388 25614 5379 -14046 -21586 -14132 344 7691 12617 16146 -3051 -37897 -58904 -68771
24910 -68771 -85384 -102637 -115670 -136196 -167211 -188971 -179688 -142990 -104093 -90042 -110520 -154887
24898 -154887 -197286 -211879 -204021 -187774 -169843 -151901 -143326 -165115 -198663 -196957 -157842 -107400
24886 -107400 -64218 -39505 -24559 -2249 34876 72023 93113 104491 124236 150851 162921
24875 162921 147586 108894 65188 38263 26954 11646 -18533 -63666 -111820 -134837 -120138
24864 -120138 -84952 -42449 7492 55816 86421 94122 77447 44289 26851 36188 60807 88413
24852 88413 102689 96923 75908 49867 30607 36632 68518 92454 84630 71511 76944 74210 38058
24839 38058 -11054 -43014 -44836 -3012 73737 149791 195700 198681 172767 136498 100070 71212
24827 71212 45030 17495 -13775 -47612 -69871 -75783 -83173 -105021 -129052 -144556 -165798 -193721
24815 -193721 -221292 -250639 -274939 -295413 -315888 -320686 -300795 -256615 -196496 -137463 -89638 -57854
24803 -57854 -38147 -16182 15720 54061 80174 92798 103558 106798 91449 59713 36070 16783
24791 16783 -18408 -63314 -97644 -123831 -155132 -198956 -250258 -283317 -275287 -236719 -203769 -184560
24779 -184560 -161858 -129566 -95193 -71310 -62164 -52848 -35232 -23987 -45153 -92920 -133365 -156960
24767 -156960 -176742 -194627 -203467 -201008 -182165 -140868 -86248 -30263 26180 62741 57201 28089
24755 28089 9736 7469 10201 18591 41645 77496 108034 115664 104300 89769 73627 57187
24743 57187 53839 65512 69484 44792 5589 -22877 -34729 -34371 -24458 -12097 2220 20429 39186
24730 39186 52496 62179 63751 58104 57832 71170 82844 71813 36059 -18341 -64801 -76564 -70373
24717 -70373 -82178 -117013 -151847 -167959 -163059 -143536 -125133 -117328 -120331 -137192 -171918 -210954
24705 -210954 -240454 -258718 -255688 -233758 -217566 -201456 -159299 -102243 -51935 -10963 26615 60460
24693 60460 83637 94015 97684 105213 124733 156582 176291 157836 111995 74810 60354 57079
24681 57079 58995 69444 79947 76656 63094 60023 81599 113037 125964 119549 105800 79677
24669 79677 43534 14184 -4304 -5211 18977 47138 56195 57151 60185 69256 84412 93548 94350 88498
24655 88498 79672 71632 61300 39811 5306 -29073 -53614 -65097 -61856 -50441 -36112 -18170
24643 -18170 -4210 2299 6819 9524 2084 -13974 -38724 -74442 -94016 -80019 -42388 2097
24631 2097 41568 76453 101848 103484 87459 70537 66069 71165 59680 26902 -7545 -37335
24619 -37335 -74464 -123371 -173079 -206443 -208686 -193894 -177590 -148242 -100158 -43919 -4872 4661
24607 4661 5228 13012 22479 41256 83862 139100 187866 218857 218942 173775 94816 18152 -38185
24594 -38185 -73590 -95342 -112927 -126696 -136229 -142267 -143426 -137393 -129845 -123542 -115986 -103995 -79422
24581 -79422 -44466 -22693 -23989 -40441 -66132 -87066 -98314 -105286 -103650 -98290 -102284 -117049 -136284
24568 -136284 -144449 -133353 -117038 -107375 -107647 -116629 -129757 -149008 -180624 -201155 -187261 -162161
24556 -162161 -155330 -157420 -156521 -153094 -146860 -141943 -140198 -133375 -125871 -123480 -124044 -119234 -85086 -15730
24542 -15730 62128 116126 135381 133009 131185 133570 132988 121356 99145 84472 82740 85735 84220
24529 84220 79481 82276 89901 86421 65011 41219 33571 36987 46589 59671 55968 17777 -52455
24516 -52455 -135767 -192752 -197414 -168909 -153306 -181290 -225708 -241999 -226694 -203442 -176113 -140924
24504 -140924 -114996 -114739 -132225 -151571 -166481 -174649 -173221 -166109 -166181 -167443 -148660 -120568 -102275
24491 -102275 -90255 -74007 -64352 -68076 -67725 -51848 -32114 -34210 -55791 -73260 -73936 -61687 -48099
24478 -48099 -28672 -4830 8648 -2272 -24386 -25324 -13147 -21861 -43898 -61647 -72240 -68589
24466 -68589 -53764 -38700 -29415 -27717 -26732 -19209 -9663 1588 17979 32853 38553 43633 63377
24453 63377 91610 107537 98373 72621 51575 49309 60531 69193 69981 63082 54693 54976 49531 34033
24439 34033 18323 -3577 -29237 -46057 -63289 -93722 -126689 -151783 -166332 -169024 -161881 -149926
24427 -149926 -141135 -130616 -102074 -61164 -28713 -2720 21631 34549 27609 4240 -24843 -50502
24415 -50502 -53429 -19977 38614 87373 101943 87740 48355 -11797 -75300 -127539 -163830 -193421
24403 -193421 -219113 -230501 -221658 -192278 -144742 -100197 -75752 -76267 -101938 -131387 -149308 -153430
24391 -153430 -133667 -95270 -57307 -37887 -40128 -48473 -45887 -27030 -1962 12773 12302 -4564
24379 -4564 -25453 -34639 -29855 -9763 14782 23288 9165 -21136 -57870 -79763 -70646 -42175 -26703
24366 -26703 -35657 -47874 -42673 -23290 -9730 -6846 -12620 -29228 -47298 -47983 -19382 32483 87035
24353 87035 130149 152595 151376 122872 64360 -7237 -56401 -67443 -60088 -54470 -46240 -27348
24341 -27348 -6499 14409 29814 28116 10447 -20142 -59511 -94952 -112691 -105377 -78567 -53457
24329 -53457 -43782 -35887 -28018 -36748 -62059 -89670 -103495 -105325 -107737 -116932 -130010 -141258 -154856
24316 -154856 -174649 -198813 -218457 -223527 -207246 -168192 -113889 -54170 1145 40428 54486 36175
24304 36175 -8586 -70605 -133619 -166857 -160925 -142363 -133213 -121637 -102807 -78520 -46486 -6544
24292 -6544 27535 43630 55197 71243 87080 95586 101506 114472 133816 149735 159728 148363
24280 148363 101652 43873 1435 -29141 -62080 -97004 -124825 -145676 -162233 -167103 -159266 -162921
24268 -162921 -188594 -205138 -185800 -155350 -149971 -164195 -181142 -186566 -163181 -119469 -86473 -71686
24256 -71686 -66984 -69460 -80510 -106329 -141680 -173939 -198692 -211275 -216165 -208144 -170559 -116508
24244 -116508 -70139 -45701 -43253 -57804 -76796 -94259 -115750 -130538 -122908 -97097 -65653 -41533
24232 -41533 -22234 3377 30332 42581 33427 16233 4179 5310 23771 50762 73616 93717
24220 93717 112454 126269 138341 144074 132261 101708 65364 28737 -9297 -44454 -74361 -97704
24208 -97704 -108239 -88669 -28222 37696 62702 50416 31768 19657 -6547 -54193 -97435 -114024
24196 -114024 -104969 -85811 -63238 -44617 -47142 -54056 -43580 -31027 -40239 -69800 -91534 -85429
24184 -85429 -61337 -36866 -17888 -2955 4913 3911 -7484 -26210 -35243 -24548 -61 23014
24172 23014 23231 -5227 -46115 -98110 -156289 -196400 -205236 -199494 -192997 -189491 -193452 -197945 -191198
24159 -191198 -172964 -150943 -125362 -94734 -66483 -56125 -71647 -102771 -125322 -132462 -131095 -115850
24147 -115850 -81937 -50556 -42866 -60628 -100233 -149713 -188431 -197379 -179378 -157504 -145057 -130702
24135 -130702 -99573 -59959 -23866 14910 63235 111440 144146 154088 146040 126612 97816 71927
24123 71927 57136 45675 33550 28777 26686 13631 -21495 -72269 -108482 -121114 -120139 -113072 -112612
24110 -112612 -132540 -165261 -173445 -138712 -93364 -72505 -73833 -79234 -60437 -5765 59455 111458
24098 111458 141743 144552 110157 52142 -7093 -63924 -109358 -124324 -110136 -89535 -80321 -87770
24086 -87770 -109815 -139469 -169459 -197581 -211306 -193420 -156852 -130123 -112723 -104322 -109139 -121029
24074 -121029 -130112 -131030 -125420 -112510 -91168 -54261 -6178 29510 34625 18278 1525 -9779
24062 -9779 -23175 -40876 -52575 -45591 -19382 8575 25457 35534 36170 20305 -3065 -11657 8031
24049 8031 50234 100096 151002 192391 202977 180827 137627 89790 53247 33303 32320 45979
24037 45979 57887 59816 53433 39212 18291 -18244 -77901 -140950 -179146 -182396 -149044 -83814
24025 -83814 5387 109099 205171 276091 320457 332060 311261 274074 240322 208965 170123
24014 170123 125936 77825 37517 11655 -9795 -29538 -37290 -34702 -28718 -16085 -5805 -13355
24002 -13355 -38018 -59554 -70899 -76430 -77965 -88480 -106837 -131208 -166975 -199966 -215643 -198006
23990 -198006 -140199 -65060 -11863 8507 15044 10750 -12160 -52319 -91758 -103497 -81016 -41921
23978 -41921 -2222 22423 24415 17729 21179 38928 57274 61832 53879 42334 37712 37045 35758
23965 35758 39807 39795 24987 4130 -11097 -14139 -8254 -3958 -4062 -16200 -41805 -66651 -86496
23952 -86496 -113818 -150601 -180737 -194948 -198974 -199879 -200148 -195220 -174865 -133326 -77498 -33751 -14977
23939 -14977 -4807 11195 30096 37228 18196 -20606 -56806 -82041 -98402 -100276 -90969 -81038
23927 -81038 -68695 -49664 -28884 -13648 -5142 4824 17615 28420 48509 83198 123474 163104
23915 163104 189153 186898 161336 126636 83289 25775 -38129 -91409 -126824 -141769 -135045 -122633
23903 -122633 -121386 -130436 -132925 -113703 -83244 -54000 -26821 -2349 21365 46410 63129 61664
23891 61664 37872 -6338 -51524 -76156 -85542 -94381 -88041 -60665 -38161 -40638 -62258 -89423
23879 -89423 -118028 -151919 -187559 -218550 -223736 -191060 -137222 -64555 29452 115378 161716 173106
23867 173106 165661 144384 119441 110167 119571 126589 115616 88018 44810 -19007 -91265 -144446
23855 -144446 -158181 -142709 -119006 -84447 -35994 18979 78488 141643 194780 231875 257003
23844 257003 264691 252029 227310 207063 205216 223113 255758 287581 314295 340717 362763 370766
23832 370766 359661 344279 334723 324554 302294 265101 224309 207486 225302 251391 271386 289544
23820 289544 306419 325480 355357 407952 484222 568460 659521 748681 814000 848159 846359 803957
23808 803957 724686 631832 557869 512099 479694 447188 419281 409013 416391 438324 481367 540043
23796 540043 603220 665757 718937 760564 801961 835065 843355 831360 807078 763941 700725 645156
23784 645156 618397 618205 635261 645579 626551 587781 555296 531720 510065 490868 459291 413662
23772 413662 381929 370374 364052 360142 368261 394483 432530 460004 461340 447650 435072 441435
23760 441435 465043 482692 476216 457132 448764 460238 495648 541679 573481 595798 630208 672895
23748 672895 711635 749866 799486 852946 907712 972989 1052356 1141930 1230172 1313914 1401603
23737 1401603 1483617 1535503 1542084 1516453 1493772 1499360 1541592 1612488 1674382 1679157 1626094 1557313
23725 1557313 1490858 1415704 1335489 1258389 1185693 1112993 1036749 966749 898153 821788 759754
23714 759754 730619 719221 704692 683362 668800 661023 655189 657574 667832 661560 621318 572661
23702 572661 537886 514287 486679 439619 376390 314295 266745 238928 224546 211516 195930
23691 195930 184784 183953 189419 182182 155125 127642 117560 122397 130859 146096 175799 215612 253909
23678 253909 286392 299435 275026 234478 219885 248965 302591 346754 361466 348945 323204
23667 323204 295261 270426 250943 225728 185210 150588 138157 131459 109807 78166 59193 71401
23655 71401 108529 134702 127715 106538 88645 76234 78865 101483 142438 202885 271616 324285
23643 324285 352959 375604 395829 395167 374305 360092 361115 353226 326565 294573 258066 216433
23631 216433 185073 176134 178910 183491 192259 200512 204865 208528 212345 217102 217905 212375 211638 232550
23617 232550 275758 315199 327524 317322 295732 271033 256968 256058 277800 310886 320048 304143
23605 304143 294324 298151 295170 280894 265353 242088 206059 175906 166522 167249 160437 156595 175625
23592 175625 210934 239368 254994 271221 292456 309765 317675 315640 293443 253259 211961 175002
23580 175002 152684 160228 179546 172301 137925 106853 84273 70003 77431 103874 123315 118367
23568 118367 91403 55181 23084 4727 -799 -725 2490 12862 24612 34048 44833 52160 54298
23555 54298 54960 47121 30460 16266 14221 22181 28515 20142 3386 -13158 -27772 -31855 -24079
23542 -24079 -8990 2031 -2987 -16073 -10681 27436 76645 107677 120950 129243 134122 121167
23530 121167 86437 49660 21672 -1926 -22043 -35449 -38671 -34205 -27361 -17685 -8069 -815 3170
23517 3170 -1135 -10802 -15584 -9718 8994 40693 72001 82943 70691 56251 56424 66737 90380
23504 90380 125126 150782 166100 175582 182279 192414 210654 221030 208142 187808 171486 144339
23492 144339 114930 105109 104917 96190 79541 62512 50980 49654 62743 81537 90658 97743 109247
23479 109247 105822 81514 59927 44513 28646 28433 51699 83882 105270 103197 85748 66427
23467 66427 52590 47817 46258 48149 67025 102442 134339 144745 136226 122279 109675 97028
23455 97028 99363 128878 158993 165444 155465 145032 146897 158764 163875 156734 135636 98043 55058
23442 55058 23747 20988 42228 61031 65903 70947 85107 96506 85705 57628 30329 12348
23430 12348 8146 18496 43649 79065 105195 94102 47698 -9483 -49441 -58495 -51390 -51021 -54274
23417 -54274 -41527 -12311 17656 44911 64334 64105 56711 56604 48403 19623 -15727 -40042 -50264
23404 -50264 -59481 -67089 -61157 -44903 -25815 -11107 -5492 -7720 -14151 -23916 -44478 -78918 -113040
23391 -113040 -137258 -143305 -118947 -79888 -63831 -69257 -68198 -46144 -6430 40839 90130 125802
23379 125802 132439 112971 80597 48442 30250 20220 7569 7585 21975 22674 -2072 -20291 -11346
23366 -11346 -3841 -18818 -36913 -46739 -54063 -65636 -72896 -61519 -36983 -9338 23588 62653
23354 62653 103869 136717 147924 140143 131380 145103 192092 242200 266315 272934 262564 218376
23342 218376 156073 120869 120804 133246 149505 166070 176958 177477 180650 199401 214161 208024 191430
23329 191430 174660 151969 127010 103809 77129 53738 44118 49073 72333 114394 160789 194661
23317 194661 215539 233487 244670 241849 224696 203408 193063 201017 215441 208137 175465 140101
23305 140101 113812 83951 42143 -1909 -27263 -24635 -16357 -24953 -39573 -35851 -10238 23298
23293 23298 60241 96227 118333 121420 122220 129324 136907 146080 154099 152659 143291 132456 116013
23280 116013 92180 80405 94793 126659 166426 211935 255894 281970 286122 274555 247289 213900
23268 213900 182760 148531 111489 75602 37641 -280 -23858 -12055 38250 94611 122543
23257 122543 121272 113863 104677 81078 51745 44826 62217 86016 109177 131310 139770 119430
23245 119430 82039 60975 78858 120928 148682 142770 115961 85028 57717 52108 69494 81201
23233 81201 77481 66833 61357 64156 75857 94677 101900 93587 92228 107246 124872 137126 148373
23220 148373 162504 169281 156164 136158 124285 106840 83283 69879 67932 62605 44011 28309
23208 28309 38816 69602 86820 78344 65251 67555 84429 102042 117044 116928 89172 50748
23196 50748 16226 -13562 -36947 -48726 -48632 -36057 -20960 -11352 2466 26255 59888 93876
23184 93876 116649 125628 115366 83069 43379 19923 13451 11858 18541 33469 43985 50065 62429
23171 62429 82680 101016 117064 130171 119327 74852 11913 -50478 -96201 -112619 -94498 -55489
23159 -55489 -24168 -17057 -25663 -24928 -6955 15155 28242 40947 66516 96648 104217 74787 20777
23146 20777 -41234 -102362 -164708 -216071 -237488 -232595 -222233 -216916 -201695 -166653 -120425 -66378
23134 -66378 -17161 18883 45122 53795 38146 10405 -7408 -20132 -38566 -57516 -72937 -88302
23122 -88302 -97097 -93440 -92808 -103993 -122873 -147261 -171357 -178719 -161323 -132584 -115699 -127460 -162201
23109 -162201 -189335 -181190 -154829 -140169 -129762 -112453 -97663 -96145 -109979 -128370 -133358 -127993
23097 -127993 -134810 -156788 -181981 -197495 -197724 -189146 -179800 -174970 -177520 -182124 -181378 -175791 -158742 -127073
23083 -127073 -102787 -102091 -113002 -124945 -135285 -142386 -154187 -167148 -157687 -130711 -112676 -111834 -139482
23070 -139482 -203542 -279647 -329262 -334226 -301640 -249288 -201116 -171093 -158559 -161816 -174677 -186602
23058 -186602 -192546 -191360 -187219 -192478 -208757 -227852 -248554 -265250 -265473 -236800 -177214 -107491 -51373
23045 -51373 -27183 -25055 -13930 1468 -532 -18157 -34391 -41924 -45152 -49887 -54867 -49030 -27413
23032 -27413 3928 35548 45077 22712 -14479 -39886 -39053 -26311 -13013 -1376 4157 197 -9341
23019 -9341 -17964 -40717 -74597 -102483 -121469 -138587 -153147 -146025 -107332 -44353 23965 78427
23007 78427 105044 105762 94086 84521 75334 61387 52022 59528 81922 107329 131997 152912 164676
22994 164676 165942 154657 134040 115950 104178 105890 124574 151963 172850 169331 140374 102684
22982 102684 67963 49353 50626 59389 63440 58255 59879 81505 109672 122211 117297 104482 95229
22969 95229 99710 123184 157600 179815 185455 182206 177563 177262 170129 142701 90773 16803 -53433
22956 -53433 -91172 -91318 -58931 -11609 21975 25245 8609 -14476 -26473 -23999 -17268 -7597 -11728
22943 -11728 -32518 -57795 -82851 -118353 -161961 -194755 -201524 -176848 -132028 -79674 -31675 9629
22931 9629 43229 69666 83550 74586 44097 901 -43866 -90124 -137111 -174383 -192924 -181388
22919 -181388 -130568 -54296 9419 34869 35185 35810 37298 32191 29829 38525 52398 56936 45985
22906 45985 21442 -13586 -48002 -73600 -89672 -96767 -93250 -82922 -69652 -52850 -40473 -37592
22894 -37592 -32852 -8535 25665 43742 36282 13797 3365 19248 42279 45543 34126 27590
22882 27590 21972 10249 2877 1727 769 6922 33774 86035 137521 140584 88848 17606 -46593
22869 -46593 -91300 -112771 -113553 -107899 -110897 -121605 -129426 -120348 -87315 -33671 21170 62113 94418
22856 94418 121941 136804 133954 121169 113478 115266 121562 132157 143630 151671 151039 126229 76197
22843 76197 28188 4994 -6939 -27835 -58423 -87876 -100665 -92588 -78736 -76127 -94408 -122213
22831 -122213 -140855 -156583 -184482 -219177 -236473 -223236 -191099 -165244 -157839 -159415 -164959 -175670
22819 -175670 -179699 -162019 -133016 -112784 -108612 -122860 -157047 -185202 -175482 -126557 -61989 3065
22807 3065 67458 130706 189973 231062 241485 215014 173536 156443 169840 186534 176703 140473
22795 140473 104059 70209 27736 -13764 -36805 -41200 -32509 -17194 -6103 -3762 -3891 8173
22783 8173 32464 58989 82164 101507 117929 113870 81336 45880 37463 59727 91921 109973
22771 109973 85590 11298 -77333 -147466 -193509 -203284 -168590 -108283 -45601 9188 51033 70872
22759 70872 60089 45604 55731 79304 91873 92635 97142 120842 160071 180758 167104 127605
22747 127605 74436 29064 12120 22307 29819 15672 -9800 -31779 -40604 -36461 -23896 -11329
22735 -11329 -9910 -21162 -34746 -39482 -26907 2678 33613 49664 52109 41014 16593 -11770
22723 -11770 -50074 -99515 -136411 -133462 -86073 -22627 28308 60653 74391 72330 70222 80055
22711 80055 100245 115616 110181 73580 12959 -39836 -59839 -51265 -36115 -30146 -46601 -91153
22699 -91153 -145381 -185657 -192404 -172954 -147929 -107551 -47366 11242 53276 75913 78187 60083
22687 60083 34022 10845 -6949 -16614 -14765 10529 53264 87103 101769 88748 49414 7634
22675 7634 1762 43723 98594 125317 111337 76050 40050 716 -42521 -81138 -115077 -140673
22663 -140673 -141964 -119741 -89459 -52949 -17224 9743 38336 72775 92279 69746 17037 -27609
22651 -27609 -48825 -49738 -34954 -9954 22075 52188 73365 79647 72212 65166 73062 103957 152594
22638 152594 201364 230227 221088 179311 133080 107990 113763 135575 144171 125616 94246 59765
22626 59765 26151 -3758 -23890 -22462 -6911 10698 26073 32040 22720 5480 4973 36315 83836
22613 83836 119532 129406 113440 82587 50989 25124 14204 24088 49685 79295 114321 161121
22601 161121 213231 250901 255067 234183 209295 186044 155399 123457 114498 131651 150799 153759
22589 153759 128210 75093 16534 -27288 -53619 -62139 -50049 -22488 20027 70728 111853 138236
22577 138236 153493 157043 149744 143774 149556 152454 129002 83509 33279 -8954 -27179 -24251 -11459
22564 -11459 14523 48898 72290 74911 65873 64984 75873 73643 48877 14079 -31303 -93885 -159429
22551 -159429 -211551 -249999 -273234 -270490 -244558 -199501 -132729 -65564 -37107 -59848 -109943 -161310
22539 -161310 -197905 -219868 -236369 -246193 -245160 -230705 -205037 -168999 -118722 -65629 -23698 -382
22527 -382 2625 -10025 -31098 -53106 -76324 -102956 -125107 -138692 -150019 -147098 -114438 -59741
22515 -59741 -17541 426 10907 20599 30123 38569 43741 58486 78017 83164 75521 72451 79560
22502 79560 79334 52602 11256 -6696 5785 12938 3160 6559 40471 95749 142901 155402 137941
22489 137941 101152 53502 14007 -9186 -24632 -44835 -79130 -117295 -151280 -186086 -212169
22478 -212169 -210213 -178157 -125454 -68974 -26709 14680 65106 106132 112842 88362 58605 49293
22466 49293 63131 82190 98945 116675 133581 130848 97802 50578 10338 -18431 -40524 -53394
22454 -53394 -50205 -18043 44251 110700 162211 197795 200648 160051 102808 55448 20138 3026
22442 3026 11096 32096 47349 52240 45759 27562 5533 -10550 -20629 -41591 -75720 -101052
22430 -101052 -113757 -126855 -139799 -141647 -128542 -102187 -73917 -53448 -43194 -44812 -43637 -25721
22418 -25721 -284 7894 -2528 -10287 -5234 1572 -6526 -24526 -38848 -50730 -60962 -57375 -45830
22405 -45830 -53310 -83788 -123112 -157124 -187024 -225690 -257774 -260300 -248556 -244946 -257966 -278244
22393 -278244 -283793 -260246 -215671 -176435 -155795 -153532 -164632 -178040 -185132 -191778 -202380 -209620
22381 -209620 -214025 -214917 -202184 -177562 -156432 -157048 -180043 -199114 -199799 -201884 -223335 -258901 -286546
22368 -286546 -289081 -267806 -222432 -164033 -116769 -94407 -87602 -86788 -93424 -100763 -105282 -102676 -92601
22355 -92601 -88244 -92830 -98442 -102807 -112803 -128518 -132532 -116398 -103063 -112720 -136244 -151574 -151340
22342 -151340 -139940 -117311 -79551 -31896 -8504 -37658 -106065 -174121 -201711 -177086 -129388
22331 -129388 -95453 -84064 -78487 -66341 -57268 -68023 -87572 -100437 -100507 -84952 -72792 -81770 -100325
22318 -100325 -109251 -104102 -89793 -73769 -59961 -50310 -42802 -29468 -13008 -5545 -12802 -43279 -97876
22305 -97876 -151467 -176348 -179238 -182717 -186407 -185677 -183381 -171963 -133572 -72246 -12092 35632 71831
22292 71831 94894 102218 82943 31729 -36786 -102527 -149475 -179763 -205035 -214701 -201835 -172747
22280 -172747 -122658 -50174 14184 51990 77798 97953 90695 48538 6435 -11670 -15676 -14848
22268 -14848 -12321 -13613 -21161 -35204 -50755 -61829 -68621 -67233 -43507 10443 74182 113778 110465
22255 110465 74334 34490 12467 12028 19669 15050 -5065 -26021 -42284 -60987 -73724 -66134
22243 -66134 -55130 -59465 -77151 -99153 -114553 -117481 -115931 -117491 -118834 -111500 -83088 -34366 807
22230 807 -1185 -28749 -60055 -82226 -92906 -83940 -40123 30880 105537 166441 197700 199958 192250
22217 192250 184133 169606 144797 114103 90642 74947 54427 31505 20786 27815 39107 46344
22205 46344 53304 56121 48080 27808 -6960 -40352 -52168 -40699 -16416 1481 7749 20500
22193 20500 40282 50441 51879 50290 33988 -6207 -63316 -129668 -198591 -256571 -286512 -278065
22181 -278065 -243432 -204614 -174601 -159848 -161706 -168535 -168591 -160492 -144981 -125828 -108304 -99573 -96824
22168 -96824 -88972 -79698 -70390 -50824 -28727 -15048 -3420 4677 3850 -9979 -33703 -51624 -50947
22155 -50947 -32588 -5991 27258 66684 97780 99244 62211 3808 -48983 -82858 -106769 -125652
22143 -125652 -142014 -162424 -178423 -175398 -147649 -108148 -69822 -36035 -5666 29158 69603 107146
22131 107146 144221 175515 182981 170983 146119 103216 57421 20709 -12659 -48219 -79692 -99254
22119 -99254 -94463 -54862 -6062 16250 13175 -533 -16087 -23506 -20939 -17694 -24022 -35057 -31583
22106 -31583 -20012 -24360 -46639 -67769 -70108 -56768 -45380 -35575 -6552 43971 90144 116494
22094 116494 122389 111778 94829 65127 18049 -24920 -39491 -25361 768 36953 79687 114886
22082 114886 135625 131353 100709 76951 88695 118578 135745 134409 126918 110708 76838 36310
22070 36310 6792 -7562 -13765 -14318 -1634 20612 40172 46901 41099 41195 47226 40517 15192 -20609
22056 -20609 -48840 -54074 -28464 11583 35613 44254 62853 105224 162181 219489 270583 306248
22044 306248 301045 254729 203746 175192 172179 183282 194117 188360 163150 138582 134199 148082
22032 148082 173398 200155 215964 213792 185014 135120 85085 44720 6958 -26825 -44633 -40327
22020 -40327 -11334 36261 79650 95812 75929 38832 4307 -23514 -41483 -50232 -48604 -31633
22008 -31633 -2277 30479 63257 85410 94768 107764 146781 202531 244369 267228 281617 284632
21996 284632 271238 248307 217090 179693 151136 140253 152804 184031 218470 245812 252556 238253
21984 238253 220912 210643 199177 179486 146354 99653 48460 -6151 -58760 -101691 -141536
21973 -141536 -180103 -209483 -226182 -234708 -234325 -216681 -188845 -166050 -142338 -95798 -23715 42491
21961 42491 88864 124998 145755 153462 163233 179326 182470 159864 123530 92389 79358 63814
21949 63814 36234 18611 20900 43822 79103 104961 114633 111672 106403 111049 119254 120164 117640
21936 117640 116170 119266 130426 137391 133894 134462 148363 162288 159369 144596 133983 134645 146081
21923 146081 158978 150605 110212 53398 5789 -22043 -43783 -68208 -87369 -93417 -92977 -93803 -88480
21910 -88480 -75988 -73915 -88395 -99047 -85891 -46297 -67 30882 44730 48745 47126 41696
21898 41696 27677 -2167 -41854 -80973 -119582 -152822 -165135 -144373 -101783 -58639 -23422 -5264
21886 -5264 1777 8279 14076 20041 39492 76666 114596 131241 124664 115330 110262 97790 92940
21873 92940 123350 180240 224059 242118 250495 240912 207106 173666 158793 156230 156252 147249 108614
21860 108614 47281 6043 6636 23691 26755 15639 4002 -1253 -6799 -9723 3189 28429 50746
21847 50746 67206 71443 47422 1472 -33452 -40511 -37033 -31537 -10890 19061 32619 23693 13785
21834 13785 18563 35875 66118 106677 138183 142771 139050 154661 189042 218177 237795 261066
21822 261066 282963 289338 276928 253046 223409 186722 137898 84130 44712 38180 53837 65652
21810 65652 71134 72960 68435 61544 57938 62997 68765 75652 92470 108898 115041 108260 86487 62135
21796 62135 55346 68077 86848 106121 124358 139611 144673 129882 97688 62997 41281 35859
21784 35859 34389 31534 38589 57102 84288 111960 135723 161135 199569 247308 280929 294321
21772 294321 305230 325076 339366 334595 326889 337159 361536 372653 362379 345784 324952 300394
21760 300394 276460 252123 227277 211731 211463 222733 242306 253263 237793 194247 138132 95353
21748 95353 81494 94883 129116 173250 199556 185933 146917 113759 88855 67942 57139 49926
21736 49926 45444 57023 85606 120912 152803 174100 190731 201341 194720 178541 165254 154292
21724 154292 142635 137909 150022 167694 169433 152351 139068 146061 165895 191611 230466 276634
21712 276634 322411 365289 395965 404473 382342 350388 336637 348211 365847 374097 372964 362191
21700 362191 346045 335806 333851 334412 337145 336880 328305 319163 320792 344317 384385 414285 414298 392468
21686 392468 375476 378623 390806 396057 386469 350820 271264 166259 83119 31541 918 -7421
21674 -7421 15189 60235 110530 154307 184909 194983 175932 141556 120097 115146 116635 127037
21662 127037 148291 163490 160839 157109 163226 165059 159951 170175 221101 302081 358405 369198
21650 369198 352562 318273 281568 260019 252595 252104 255522 255957 246400 232984 220343 205653 200330
21637 200330 216572 240228 252097 251896 254242 271208 299039 318391 326267 334280 342603 342502 335051
21624 335051 331920 334938 339854 353047 373682 400508 444198 506409 568813 608384 597791 525762
21612 525762 428860 346124 282980 234473 211695 213511 222072 227386 231764 241453 252065 269508
21600 269508 305924 335342 336995 332214 339280 359408 379501 384758 383764 388219 386978 374903 372980
21587 372980 379555 376248 366830 364613 369659 365724 350569 339780 334057 327636 326645 335351 348599 350294
21573 350294 331074 298613 264043 240994 231807 232220 245818 264003 270418 268608 273849 282443 269784
21560 269784 239603 226558 248170 286721 307376 304371 293214 280098 264030 235989 195191 156148
21548 156148 145141 176026 226511 268347 305945 348209 387038 420690 445522 465781 486269
21537 486269 498740 501723 495694 466293 415877 369389 335554 305888 277569 246461 218136 208040
21525 208040 212234 207572 185586 164111 155216 157372 164632 169382 174606 188265 207639 231182 271801
21512 271801 337081 409295 465324 505810 552732 613703 671880 711451 729687 735652 744955 753455
21500 753455 752831 740668 715483 690946 674368 662621 663992 686988 714874 718502 689432 644997
21488 644997 605772 584189 584598 601909 624552 641523 654407 669677 682410 686405 679939 673919
21476 673919 680629 695338 708981 703690 672309 630433 597139 575313 554774 535834 540214 569201
21464 569201 594478 611299 633531 652889 665725 686083 715356 743682 768381 805238 852636
21453 852636 878733 869142 834353 784348 735985 712358 719740 754622 815850 885858 931347 938188
21441 938188 921920 896145 870766 858375 866224 876491 862187 832517 810673 815254 853985 906999
21429 906999 959849 1013103 1069010 1128942 1182198 1219383 1242062 1256481 1277443 1335533 1440450
21418 1440450 1554008 1624503 1626970 1562969 1448067 1308105 1170857 1054160 954064 857755
21408 857755 776312 716745 676634 657349 638119 605152 569258 562687 604440 661827 708495 756389
21396 756389 808660 859441 905720 931269 921320 882084 835135 792286 760781 748739 760745 792511
21384 792511 824403 855414 892963 924396 946507 964475 978441 983847 968317 939325 919804 930162
21372 930162 990139 1087433 1185159 1268504 1350971 1441908 1528972 1605634 1661816 1669309 1629076 1579771
21360 1579771 1534154 1476322 1406976 1343500 1288147 1236645 1189124 1136277 1088417 1066623 1075663
21349 1075663 1104424 1136197 1157402 1177626 1209312 1251061 1286430 1310502 1343780 1406350 1504924
21338 1504924 1628876 1748826 1832021 1865402 1867963 1880490 1934605 2038221 2163104 2262141 2322292
21327 2322292 2377585 2468465 2607802 2786298 2990138 3210368 3466114 3774861 4087463 4310767
21317 4310767 4409622 4429374 4401790 4314610 4173646 4028544 3932606 3877763 3831387 3791595 3777237
21306 3777237 3805300 3844362 3819337 3677794 3451949 3218815 3008859 2811975 2622853 2445049
21296 2445049 2287231 2169649 2095893 2040907 1986762 1941971 1917920 1897821 1865554 1832920 1797383
21285 1797383 1740424 1665188 1587325 1523940 1493855 1490923 1497440 1504263 1499962 1478676 1436980 1375363
21273 1375363 1311363 1260885 1229837 1223022 1238035 1273500 1331894 1403116 1466662 1514878 1558460
21262 1558460 1602380 1643501 1675249 1688838 1692694 1713940 1767807 1841907 1924686 2011410 2077392
21251 2077392 2099724 2084463 2050471 1998875 1919314 1817646 1716925 1640683 1597730 1583416 1575216
21240 1575216 1551786 1506787 1453109 1415677 1419492 1467736 1526503 1574632 1609164 1615313 1589660 1555977
21228 1555977 1532965 1523976 1521033 1517947 1518684 1529988 1565406 1629627 1701891 1766441 1812846 1830563
21216 1830563 1825357 1813188 1800675 1779748 1747758 1701847 1628704 1517716 1374570 1233867 1125773
21205 1125773 1046244 984404 934817 895712 872466 866231 868718 859037 833097 807250 781853 741747
21193 741747 687672 641047 615422 603987 599308 607298 625391 643854 660494 663868 640948 595975
21181 595975 553343 538783 550025 566154 574812 578026 581476 589572 597131 599810 610025 633838 650931
21168 650931 642671 618679 587790 546120 505968 496578 522215 552192 566366 582861 620968 680520
21156 680520 738446 774051 794361 809800 810243 792479 783559 799434 813152 796252 757197 704326
21144 704326 642377 599976 588147 598129 624484 650752 654967 630831 593627 557542 520137 490326
21132 490326 492272 523146 559926 595297 623845 633257 617113 587975 570154 574388 578165 568530
21120 568530 558782 547488 536512 533698 528595 518950 516413 537677 588176 648552 708068 770730
21108 770730 835084 877723 884581 865663 828092 761199 672465 598100 555919 519801 467298 411692
21096 411692 363854 327483 318410 336724 360691 368881 357324 341620 339958 354525 372999 387203
21084 387203 408809 439922 461520 467961 461148 435538 396905 365588 356843 369222 379982 361252
21072 361252 318197 272242 232391 204504 197721 217671 256196 288924 298337 293542 295275 317757
21060 317757 360444 408613 448485 470601 480245 487042 483104 470445 467589 478206 488267 489400
21048 489400 483177 473618 475244 484978 472127 427334 373205 335315 314204 301179 307608 340255
21036 340255 380635 400248 393884 384703 396152 428857 463261 483384 495471 510630 524731 525255
21024 525255 504929 482182 475044 482154 497130 513336 525425 529889 528876 517881 498416 476695
21012 476695 458012 461982 494060 522151 519802 485316 433985 386611 364189 376605 416541 459230
21000 459230 469167 435649 381693 335830 309251 296139 286714 291898 323624 362703 398096 435639
20988 435639 468100 475302 453988 433043 423186 410731 389892 366950 350533 340379 337482 336974
20976 336974 320277 283789 241641 212829 216604 244537 263361 250640 215589 180953 165574 180774
20964 180774 227024 276913 291099 274874 260404 263513 283689 315567 345333 366753 379672 381173
20952 381173 368788 353136 348755 359725 378115 393252 382750 331298 267686 226975 216469 228547
$$ [...]
##END NTUPLES=NMR SPECTRUM
##END=
