##TITLE=C13_11P153_k4TFA
 CDCl3, 22300 sc

 25.9.2023
##JCAMPDX= 6.0         $$ Bruker NMR JCAMP-DX V2.0
##DATA TYPE= NMR SPECTRUM
##DATA CLASS= NTUPLES
##ORIGIN= UXNMR, Bruker Analytische Messtechnik GmbH
##OWNER= root
$$ XWIN-NMR		Version 3.5
$$ Tue Sep 26 13:38:29 2023 Russian Standard Time (UT+4h)  she@DPX200
##.OBSERVE FREQUENCY= 50.327896
##.OBSERVE NUCLEUS= ^13C
##.ACQUISITION MODE= SIMULTANEOUS
##.ACQUISITION SCHEME= undefined
##.AVERAGES= 22301
##.DIGITISER RES= 17
##SPECTROMETER/DATA SYSTEM= spect
##.PULSE SEQUENCE= zgpg30
##.SOLVENT NAME= DMSO
##.SHIFT REFERENCE= (INTERNAL, DMSO, 0, 222.624)
##AUDIT TRAIL= $$ (NUMBER, WHEN, WHO, WHERE, WHAT)
$$ ##TITLE= Audit trail, XWIN-NMR		Version 3.5
$$ ##JCAMPDX= 5.01
$$ ##ORIGIN= Bruker BioSpin GmbH
$$ ##OWNER= she
$$ F:/spectra/data/she/nmr/c13/1/pdata/1/auditp.txt
$$ ##AUDIT TRAIL=  $$ (NUMBER, WHEN, WHO, WHERE, WHAT)
(   1,<2023-09-26 13:36:46.71 +0400>,<she>,<DPX200>,
      <created by zg, POWCHK disabled, PULCHK disabled
       terminated by command 'halt'
       configuration hash MD5:
       00 E9 B6 7A A2 85 ED C7 34 08 36 98 17 FE 4E 26
       data hash MD5: 32K
       03 C1 B5 67 C7 07 18 B9 BD FA 23 FA 85 C5 B6 70>)
(   2,<2023-09-26 13:37:22.75 +0400>,<she>,<DPX200>,
      <Start of raw data processing
       efp BC_mod = 2 LB = 2 FT_mod = 6 PKNL = 1 PHC0 = -377.6251 PHC1 = 39.73753 SI = 32K 
       data hash MD5: 32K
       6F D2 68 4E F9 64 F1 D1 6F B0 66 DB F2 30 78 24>)
(   3,<2023-09-26 13:37:26.34 +0400>,<she>,<DPX200>,
      <abs ABSG = 5 
       data hash MD5: 32K
       13 BC 17 AB 23 8A 2B 29 B6 1B C8 B9 88 B4 E4 51>)
(   4,<2023-09-26 13:37:45.00 +0400>,<she>,<DPX200>,
      <pk PHC0 = -0.4160281 PHC1 = 2 
       data hash MD5: 32K
       57 B5 D0 4B 25 F2 5A B1 07 DD A1 01 EA DE 22 45>)
(   5,<2023-09-26 13:37:48.92 +0400>,<she>,<DPX200>,
      <abs ABSG = 5 
       data hash MD5: 32K
       F8 04 51 B5 F3 4F B9 B7 89 1D CD 77 A2 0E BC F9>)
$$ ##END=
$$ 
$$ hash MD5
$$ B6 22 0F B8 16 66 E4 2F E8 69 88 8B BE E7 1C 6C
##$RELAX= 
##$RELAX= 
##$RELAX= 
##$RELAX= 
##$RELAX= 
##$RELAX= 
##$RELAX= 
##$RELAX= 
$$ Bruker specific parameters
$$ --------------------------
##$DU= <F:/spectra>
##$EXPNO= 1
##$NAME= <c13>
##$PROCNO= 1
##$TYPE= <nmr>
##$USER= <she>
##$AMP= (0..31)
100 100 100 100 100 100 100 100 100 100 100 100 100 100 100 100 100 100 
100 100 100 100 100 100 100 100 100 100 100 100 100 100 
##$AQSEQ= 0
##$AQ_mod= 1
##$AUNM= <au_zg>
##$AUTOPOS= <>
##$BF1= 50.322709
##$BF2= 200.13
##$BF3= 50.322709
##$BF4= 500.13
##$BF5= 500.13
##$BF6= 500.13
##$BF7= 500.13
##$BF8= 500.13
##$BYTORDA= 1
##$CFDGTYP= 0
##$CFRGTYP= 5
##$CHEMSTR= <none>
##$CNST= (0..31)
1 1 145 1 1 1 1 1 1 1 1 1 1 1 1 1 1 1 1 1 1 1 1 1 1 1 1 1 1 1 1 1 
##$CPDPRG= <waltz16>
##$CPDPRG1= <>
##$CPDPRG2= <waltz16>
##$CPDPRG3= <>
##$CPDPRG4= <mlev>
##$CPDPRG5= <mlev>
##$CPDPRG6= <mlev>
##$CPDPRG7= <mlev>
##$CPDPRG8= <mlev>
##$CPDPRGB= <>
##$CPDPRGT= <>
##$D= (0..31)
$$ [...]
##$SUBNAM4= <"">
##$SUBNAM5= <"">
##$SUBNAM6= <"">
##$SUBNAM7= <"">
##$SUBNAM8= <"">
##$SUBNAM9= <"">
##$SW= 239.972175391363
##$SWIBOX= (0..15)
0 1 3 0 0 0 0 0 0 0 0 0 0 0 0 0 
##$SW_h= 12077.2946859903
##$TD= 32768
##$TD0= 1
##$TE= 0
##$TE2= 300
##$TE3= 300
##$TEG= 300
##$TL= (0..7)
120 120 120 120 120 120 120 120 
##$TP= (0..7)
150 150 150 150 150 150 150 150 
##$TP07= 0
##$TPNAME0= <>
##$TPNAME1= <>
##$TPNAME2= <>
##$TPNAME3= <>
##$TPNAME4= <>
##$TPNAME5= <>
##$TPNAME6= <>
##$TPNAME7= <>
##$TPOAL= (0..7)
0.5 0.5 0.5 0.5 0.5 0.5 0.5 0.5 
##$TPOFFS= (0..7)
0 0 0 0 0 0 0 0 
##$TUNHIN= 0
##$TUNHOUT= 0
##$TUNXOUT= 0
##$USERA1= <user>
##$USERA2= <user>
##$USERA3= <user>
##$USERA4= <user>
##$USERA5= <user>
##$V9= 5
##$VALIST= <valist>
##$VCLIST= <CCCCCCCCCCCCCCC>
##$VD= 0
##$VDLIST= <DDDDDDDDDDDDDDD>
##$VPLIST= <PPPPPPPPPPPPPPP>
##$VTLIST= <TTTTTTTTTTTTTTT>
##$WBST= 1024
##$WBSW= 4
##$XGAIN= (0..3)
0 0 0 0 
##$XL= 0
##$YL= 0
##$YMAX_a= 155507401
##$YMIN_a= -35599100
##$ZGOPTNS= <>
##$ZL1= 120
##$ZL2= 120
##$ZL3= 120
##$ZL4= 120
##$ABSF1= 222.624
##$ABSF2= -17.3728
##$ABSG= 5
##$ABSL= 3
##$ALPHA= 0
##$AQORDER= 0
##$ASSFAC= 0
##$ASSFACI= 0
##$ASSFACX= 0
##$ASSWID= 0
##$AUNMP= <proc_1d>
##$AZFE= 0.1
##$AZFW= 0.5
##$BCFW= 0
##$BC_mod= 2
##$BYTORDP= 0
##$COROFFS= 0
##$CY= -3
##$DATMOD= 1
##$DC= 0
##$DFILT= <>
##$DTYPP= 0
##$F1P= 0
##$F2P= 0
##$FCOR= 0.5
##$FTSIZE= 32768
##$FT_mod= 6
##$GAMMA= 0
##$GB= 0
##$INTBC= 1
##$INTSCL= 4.134877e-10
##$ISEN= 128
##$LB= 2
##$LEV0= 0
##$LPBIN= 0
##$MAXI= 10000
##$MC2= 0
##$MEAN= 0
##$ME_mod= 0
##$MI= 0.1934396
##$NCOEF= 0
##$NC_proc= 2
##$NLEV= 6
##$NOISF1= 120.0001
##$NOISF2= 80.00006
##$NSP= 0
##$NTH_PI= 0
##$NZP= 0
##$OFFSET= 222.624
##$PC= 1.4
##$PHC0= -378.0411
##$PHC1= 41.73753
##$PH_mod= 1
##$PKNL= yes
##$PPARMOD= 0
##$PSCAL= 0
##$PSIGN= 0
##$REVERSE= no
##$SF= 50.3227315983092
##$SI= 32768
##$SIGF1= 140
##$SIGF2= 120
##$SINO= 11.81781
##$SIOLD= 32768
##$SREGLST= <13C.CDCl3>
##$SSB= 0
##$STSI= 32768
##$STSR= 0
##$SW_p= 12077.2946859903
##$SYMM= 0
##$S_DEV= 0
##$TDeff= 32768
##$TDoff= 0
##$TI= <>
##$TILT= no
##$TM1= 0
##$TM2= 0
##$TOPLEV= 0
##$USERP1= <user>
##$USERP2= <user>
##$USERP3= <user>
##$USERP4= <user>
##$USERP5= <user>
##$WDW= 1
##$XDIM= 32768
##$YMAX_p= 415839997
##$YMIN_p= -2922422
$$ End of Bruker specific parameters
$$ ---------------------------------
##NTUPLES= NMR SPECTRUM
##VAR_NAME=  FREQUENCY,     SPECTRUM/REAL,   SPECTRUM/IMAG
##SYMBOL=    X,             R,               I
##VAR_TYPE=  INDEPENDENT,   DEPENDENT,       DEPENDENT
##VAR_FORM=  AFFN,          ASDF,            ASDF
##VAR_DIM=   32768,         32768,           32768
##UNITS=     HZ,            ARBITRARY UNITS, ARBITRARY UNITS
##FACTOR=    0.368581032318806, 1,           1
##FIRST=     11203.0474430531, 0,            0
##LAST=      -874.247242937185, 0,           0
##MIN=       -874.247242937185, -2922422,    0
##MAX=       11203.0474430531, 415839997,    0
$$ Real data points
##PAGE= N=1
##DATA TABLE= (X++(R..R)), XYDATA
$$ [...]
18104 636910 680741 556554 385051 296626 286263 276899 185657 9056 -157390 -237952 -254648
18093 -254648 -255989 -293157 -383498 -467150 -514791 -523365 -518653 -550404 -632743 -721071 -769626 -768404
18081 -768404 -738646 -726483 -676632 -537982 -385318 -344039 -478211 -710239 -907777 -1064680
18071 -1064680 -1176303 -1169064 -1026634 -821807 -612459 -424462 -321688 -332192 -430664 -550548
18061 -550548 -624245 -635003 -634091 -637094 -646577 -760563 -956086 -1077722 -1031414 -849709 -682916
18050 -682916 -662192 -801896 -1008494 -1167282 -1204755 -1096368 -872808 -628214 -468449 -345984
18040 -345984 -181107 -1725 97755 89897 67842 67920 55444 12915 -62517 -200698 -417742
18029 -417742 -618618 -697829 -672965 -607182 -510437 -436740 -458210 -470087 -357511 -188663 -65366
18018 -65366 -30679 -31916 -93713 -278304 -450406 -436861 -267766 -101195 -45971 -104807 -208835
18007 -208835 -265742 -289847 -343876 -413608 -453813 -473788 -475403 -400454 -254483 -75821 71938
17996 71938 117634 93019 37346 -30180 -94449 -174433 -264146 -354105 -438333 -484336 -481421 -466817
17984 -466817 -495717 -622061 -800658 -904055 -849291 -635994 -373800 -202820 -137344 -103947
17974 -103947 -46061 63253 211672 326861 321992 175133 10486 -31693 -68669 -261279
17964 -261279 -480678 -526965 -361914 -133510 -76924 -244171 -498206 -657943 -622948 -489818
17954 -489818 -415415 -449537 -581867 -740875 -869674 -916240 -815381 -561333 -296210 -194757
17944 -194757 -265066 -384444 -437176 -403786 -361071 -375143 -429242 -436469 -340826 -208508 -131333
17933 -131333 -170985 -354566 -636677 -909370 -1101703 -1163789 -1092565 -919950 -671705 -405872
17923 -405872 -157359 48098 135402 69859 -135024 -406955 -604313 -652976 -549030 -349081
17913 -349081 -152390 -46752 -94472 -239039 -348706 -327091 -200002 -65348 -21301 -56504
17903 -56504 -81385 -99085 -173833 -274375 -295157 -174735 8740 29017 -186302 -523317 -821030
17892 -821030 -960469 -975844 -1037658 -1170103 -1226066 -1151658 -1022167 -902875 -807170 -735099 -702000
17881 -702000 -741516 -891547 -1098545 -1271744 -1371212 -1438687 -1539991 -1674528 -1787142 -1778029
17871 -1778029 -1635937 -1425819 -1202644 -1063435 -1074272 -1186336 -1338648 -1450407 -1445915 -1319070
17861 -1319070 -1077738 -841628 -750443 -734202 -711299 -710623 -751328 -797350 -845589 -860502 -789478
17850 -789478 -696139 -673875 -695333 -652217 -450934 -130441 186552 428904 596359 717861
17840 717861 805991 761524 552101 302246 117738 72767 167476 269541 279059 202126 25403
17829 25403 -258823 -520488 -623372 -605027 -597174 -660012 -767913 -808250 -747347 -662727 -578135
17818 -578135 -501381 -521973 -634487 -637517 -424307 -137953 47104 116952 106165 -13161 -234538
17807 -234538 -461668 -560335 -462872 -251368 -86033 -55183 -151968 -296325 -382863 -403986 -314035
17796 -314035 -101771 91955 114996 -26382 -214994 -356353 -409136 -393037 -393515 -467119 -602379
17785 -602379 -700253 -611356 -338122 -7941 248512 372982 336613 151697 -76971 -245805
17775 -245805 -348010 -374711 -323173 -197359 -25987 196194 494989 834531 1106295 1176832
17765 1176832 1024893 754291 544175 476753 452302 362620 271565 284556 375350 448356 459951
17754 459951 420849 373170 404433 561758 792585 1018446 1136380 1122004 1070075 1061670 1079624
17743 1079624 1048583 982804 965568 991842 1043913 1149264 1216049 1151726 1045918 1002392 981569
17732 981569 923530 852826 834451 839669 822386 794853 783938 792995 762234 679609 593924 536986
17720 536986 543182 641558 758832 804980 790076 719639 575038 364048 172688 116626 238797
17709 238797 476527 703161 857808 944622 1013012 1135551 1317114 1453299 1524405 1560148
17699 1560148 1536601 1498809 1488601 1547041 1737953 2028098 2323608 2522483 2519900 2343327
17689 2343327 2109587 1868369 1669141 1530138 1428900 1305727 1104137 910388 814196 813618
17679 813618 861031 873044 823773 802574 889168 1043363 1217323 1406584 1613171 1749001
17669 1749001 1711518 1540797 1329949 1131707 990483 927956 896288 897536 1084398 1527534
17659 1527534 2070568 2517165 2818264 3020027 3158415 3290282 3512506 3860349 4234345
17650 4234345 4554111 4858408 5174627 5482035 5745259 5965331 6206701 6535684 6985585
17641 6985585 7576140 8271344 8975951 9671152 10437759 11295871 12272713 13415712 14788643
17632 14788643 16433126 18325075 20428265 22729952 25255622 28065129 31232188 34766742
17624 34766742 38581890 42448330 45899661 48326349 49202923 48428256 46338116 43371844
17616 43371844 39878220 36112804 32340429 28852186 25741994 22951115 20437126 18147771
17608 18147771 16095319 14314946 12777074 11442029 10243511 9178328 8310971 7580374
17600 7580374 6928356 6375922 5909243 5481671 5137437 4911312 4756760 4568641 4298227
17591 4298227 3952207 3539532 3142970 2849179 2650215 2520100 2422699 2283933 2106939 1927616
17581 1927616 1801567 1747965 1701823 1629546 1506686 1280989 974748 656942 371908 125514
17571 125514 -111017 -324062 -461715 -493384 -479733 -477395 -434863 -311936 -150206 2347
17561 2347 124252 159378 112042 83493 81731 31131 -76141 -209021 -351882 -535412 -774822
17550 -774822 -930044 -871474 -677942 -473050 -346573 -355514 -421164 -446076 -462701 -533152 -645637
17539 -645637 -669488 -536033 -355174 -218104 -121446 -100054 -193208 -341453 -458413 -500836
17529 -500836 -489902 -486824 -552758 -723041 -954976 -1138826 -1183012 -1085080 -916436 -756598 -668428
17518 -668428 -671585 -733764 -770696 -692920 -477707 -247849 -177559 -262359 -379235 -467487 -532847
17507 -532847 -580537 -589490 -531212 -402860 -276269 -260503 -359517 -450542 -428927 -333479 -289633
17496 -289633 -293898 -258805 -169531 -57457 20036 -9043 -138696 -286109 -399279 -478461 -560080
17485 -560080 -663993 -744703 -781877 -765128 -669159 -557798 -473401 -344874 -163613 1127
17475 1127 118383 248700 387094 397579 251902 86025 -40366 -176828 -334955 -446822
17465 -446822 -490942 -472711 -354151 -170147 -61505 -145563 -384072 -577075 -671648 -780266
17455 -780266 -912995 -1024886 -1138834 -1206152 -1084494 -809093 -582946 -502311 -453530 -334819
17445 -334819 -185054 -46980 45943 91033 108824 86094 34275 -38405 -185466 -423194 -697510
17434 -697510 -917848 -1009539 -992626 -963663 -903243 -723375 -441922 -208542 -188897 -384913
17424 -384913 -616585 -707173 -630681 -461748 -307754 -223539 -237331 -315480 -335855 -193050 106770
17413 106770 448131 695776 742816 554727 252809 -8623 -164143 -277545 -387110 -481352
17403 -481352 -620034 -803029 -969842 -1115765 -1287889 -1430254 -1431779 -1328121 -1249638 -1192859
17393 -1192859 -1045175 -762459 -391950 -12203 289694 442193 336451 26919 -252483
17384 -252483 -381351 -410659 -461485 -593117 -745774 -860057 -949379 -1048524 -1114574 -1055986 -915676
17373 -915676 -797956 -756726 -813533 -864180 -843525 -841486 -867173 -871869 -887476 -922589 -930137 -971131
17361 -971131 -1115388 -1277062 -1288862 -1136064 -913914 -719986 -631981 -610537 -560778 -495923
17351 -495923 -488795 -522664 -562415 -641496 -761470 -886379 -1035863 -1244578 -1430237 -1541931
17341 -1541931 -1682133 -1905555 -2118100 -2195431 -2050185 -1667180 -1176243 -729757 -310488 69334
17331 69334 317513 399909 351382 222571 41703 -171573 -442693 -709487 -909936 -1071084
17321 -1071084 -1118026 -979623 -732801 -530319 -390695 -271513 -208713 -249012 -339256 -403412
17311 -403412 -447424 -476144 -476836 -486350 -544360 -622083 -652671 -585026 -454351 -376566 -433061 -542386
17299 -542386 -594627 -607301 -652664 -716154 -774580 -849105 -935042 -926737 -797123 -661795 -580858
17288 -580858 -489443 -344714 -252222 -269774 -364398 -470363 -515293 -500479 -459923 -446437 -584324
17277 -584324 -922675 -1335989 -1646451 -1762157 -1669253 -1428010 -1178911 -993726 -854935 -715878
17267 -715878 -592133 -516918 -506913 -538852 -520729 -439049 -388376 -447949 -634205 -874279 -1012178
17256 -1012178 -998139 -881238 -756546 -709478 -707891 -790300 -996633 -1160687 -1130821 -926631
17246 -926631 -696323 -570623 -572425 -636891 -701982 -756519 -731525 -525194 -136021 302882 657120
17235 657120 921286 1073727 1036046 836425 601936 430241 355110 384735 504235 627517
17225 627517 649187 588592 568422 634038 689745 679343 570525 335125 43444 -184211 -251913
17214 -251913 -207997 -89069 157665 432438 516488 385563 140196 -109965 -334231 -551833
17204 -551833 -724087 -795400 -696206 -445908 -174987 -5020 59109 61150 -22614 -128476 -133308
17193 -133308 -24454 43348 -52408 -230018 -382089 -513633 -684455 -894159 -1104514 -1278376
17183 -1278376 -1374431 -1349067 -1240645 -1067324 -839651 -636280 -512381 -434481 -421526 -537722
17173 -537722 -726405 -860263 -898902 -837484 -689601 -535517 -389654 -203759 11357 181954
17163 181954 252476 282220 332107 387565 426150 447515 485829 578879 707261 747232 679678
17152 679678 629226 693938 825240 910264 913184 879114 857392 834317 777121 699910 652576
17141 652576 654425 661693 608582 453616 265045 98885 -90854 -298274 -462650 -525772 -470188
17130 -470188 -330286 -145849 51752 200742 315519 447999 582326 663739 659008 569564
17120 569564 377122 156150 27122 -26821 -45314 -72607 -108462 -123329 -122980 -188749 -346342
17109 -346342 -460209 -454646 -313742 -60233 224266 516552 789797 930311 933420 919172
17099 919172 921005 888914 805321 744146 746957 745673 684177 579302 447834 286073 122384
17088 122384 7121 11413 99080 160069 160657 80294 -69383 -254071 -418404 -512946 -535211
17077 -535211 -488147 -437943 -487388 -645432 -823068 -914751 -865643 -738517 -605292 -421034
17067 -421034 -175009 -8005 -35681 -235806 -487644 -693731 -825870 -847121 -797457 -742598
17057 -742598 -660025 -514321 -313793 -113621 36947 77464 -4315 -79630 -855 223609
17047 223609 473751 666946 757419 742713 659214 511558 263565 -99965 -414321 -492612
17037 -492612 -374719 -225756 -120171 -51828 -29727 -73223 -162634 -293318 -411738 -462083
17027 -462083 -487212 -521481 -573020 -662346 -779553 -897957 -979453 -938957 -673828 -234044 233409
17016 233409 596525 759301 766496 680495 519973 323274 145935 -4803 -165262 -276491
17006 -276491 -276675 -208934 -149631 -150943 -243864 -402373 -521479 -565180 -603879 -597164 -431464 -179758
16994 -179758 30312 185958 280589 295513 284559 229562 112503 51432 79465 99788 33605
16983 33605 -98932 -227435 -339236 -456446 -567134 -658413 -776552 -917327 -988956 -887695
16973 -887695 -598388 -250204 -92377 -205125 -404154 -526536 -542376 -521809 -530901 -539300 -508122
16962 -508122 -497656 -546636 -567931 -488277 -330256 -128083 101107 273321 349688 388539 358390
16951 358390 210865 18064 -161252 -345078 -451315 -390108 -249816 -125670 -62733 -85767
16941 -85767 -182543 -291496 -368059 -399515 -345123 -153007 139754 409592 601853 752597
16931 752597 855284 894268 916202 969751 1004647 979763 963445 1012502 1077654 1079489 947879
16920 947879 675937 363430 135994 38307 -6023 -120114 -270518 -326685 -271287 -120974
16910 -120974 53472 211575 355165 479875 576960 572421 416124 232595 177945 191845
16900 191845 144062 -39726 -321363 -602110 -798468 -850314 -837268 -830526 -795020 -699677 -559315
16889 -559315 -360296 -131316 76427 276929 452699 561215 639558 719974 815072 928499
16879 928499 1007350 989473 824174 562269 318106 245465 439393 777551 1140074 1485066
16869 1485066 1737299 1858935 1917853 2060687 2357592 2698504 2946513 3111034 3306666 3628751
16859 3628751 4106687 4760235 5529438 6329708 7209143 8244311 9477879 10860883 12258481
16850 12258481 13541380 14605706 15423338 15997966 16231634 16025861 15409659 14479457 13360948
16841 13360948 12187429 11153410 10311294 9543132 8780473 8038275 7399666 6865846 6303476
16832 6303476 5617923 4791517 3902128 3109793 2513599 2129493 1883671 1712389 1607622
16823 1607622 1617575 1730298 1812905 1758253 1547967 1225544 899946 682539 485150 224311
16813 224311 -58358 -288007 -411673 -465668 -520207 -566289 -505166 -377521 -283894 -279619 -351709
16802 -351709 -433498 -498870 -512304 -501261 -480054 -365777 -109992 213673 470186 602828
16792 602828 604157 492363 294540 55259 -194631 -448082 -620292 -683905 -694594 -691328 -653785
16781 -653785 -549670 -383923 -242385 -230400 -353314 -556405 -798959 -1045221 -1192398 -1140585
16771 -1140585 -924507 -767709 -831771 -1014032 -1126350 -1189690 -1323432 -1491776 -1565575 -1463379
16761 -1463379 -1246216 -1059692 -957965 -908335 -844195 -740507 -633842 -533285 -435221 -349048
16751 -349048 -278395 -214992 -157974 -99289 -30444 -1421 -71588 -206814 -335836 -450415 -470737
16740 -470737 -312292 -78364 87264 145049 93178 -3915 -75856 -151296 -297292 -491175
16730 -491175 -592760 -591263 -576576 -521958 -331867 -48981 221976 448382 628091 754479
16720 754479 807441 820300 797072 698105 610206 591936 551333 450365 354132 311948 282659
16709 282659 157471 -101218 -442074 -781740 -991666 -970595 -731586 -375302 -56500 58838
16699 58838 -14835 -179846 -435444 -826479 -1297661 -1644981 -1712251 -1554204 -1274654 -1007461
16689 -1007461 -849788 -720438 -552959 -348462 -119231 53830 130654 150895 94557 -29042
16679 -29042 -166188 -293551 -361815 -316453 -195281 -114205 -131681 -249557 -426272 -535378
16669 -535378 -545492 -533745 -570729 -650354 -703362 -709649 -733201 -828223 -883910 -741924 -417031
16658 -417031 -101069 26313 -59532 -274658 -462314 -445199 -228386 14610 130391 130625
16648 130625 113528 97041 13854 -145006 -342250 -504277 -546634 -536964 -565400 -560201 -463461
16637 -463461 -321065 -182708 -104141 -112933 -189171 -262037 -302959 -316438 -273252 -192982 -78949
16626 -78949 148193 424595 635232 737941 682839 442122 60742 -379492 -776425 -1093160
16616 -1093160 -1280120 -1290213 -1164602 -905102 -523623 -172871 41534 147836 137078 21
16606 21 -138085 -167582 -151834 -151536 -164335 -189951 -198531 -105354 159221 503013 771409 905966
16594 905966 952869 927516 747532 462732 186646 -18309 -150357 -211497 -232535 -267220
16584 -267220 -282019 -251905 -175945 -14173 89842 -23415 -244112 -422050 -500021 -481579
16574 -481579 -365209 -151804 77478 171270 91676 -21907 -82505 -158933 -255607 -286795 -289446
16563 -289446 -341974 -398436 -381341 -317027 -227936 -49129 204721 394085 431382 342415 234466
16552 234466 189600 163576 117317 66184 12757 -23323 -64713 -167685 -258983 -255903 -181468
16541 -181468 -73708 39276 103189 85331 32713 -11591 -61166 -88205 -25079 151629 429659
16530 429659 741978 928917 886519 709636 538747 422095 398867 468123 515828 493505
16520 493505 457742 402543 311278 198782 80837 14409 48555 154531 298105 462327
16510 462327 634616 775087 765767 578078 363449 229516 140645 72012 -15004 -84947 -69460
16499 -69460 2037 24578 -58371 -234003 -469123 -659011 -728683 -735013 -764218 -820493 -906264
16488 -906264 -1002359 -1067189 -1066155 -986492 -846248 -649854 -408815 -217797 -161230 -224960 -293150
16477 -293150 -292370 -345910 -516724 -623878 -552463 -437939 -365740 -341867 -376125 -395670 -331223
16466 -331223 -209393 -170494 -317893 -597548 -876641 -1019052 -1005294 -941069 -923231 -926196 -902985
16455 -902985 -887010 -968692 -1095905 -1118207 -1020027 -901683 -763204 -501341 -98241 347100
16445 347100 680713 787871 666607 479781 392248 416627 457905 426376 262173 13187
16435 13187 -190051 -369970 -620420 -818159 -849482 -797177 -738362 -644048 -504896 -308569
16425 -308569 -108342 1998 7381 -61611 -164711 -246271 -278514 -245776 -93163 182769 500979
16414 500979 693145 661170 518388 385313 323130 341571 371933 374603 327002 243320 198663
16403 198663 181488 140392 14429 -211854 -411760 -489544 -488719 -493691 -547332 -601583 -604468 -524352
16391 -524352 -388132 -286291 -211200 -151509 -158758 -268651 -450834 -636284 -735076 -677543 -547076
16380 -547076 -538913 -670690 -757063 -727213 -627432 -446288 -179777 32504 128598 139138 19988
16369 19988 -241169 -573227 -850453 -968222 -866782 -617409 -413783 -354871 -347096 -322210
16359 -322210 -271323 -195975 -111634 -33610 -62205 -284643 -571454 -743334 -737720 -598534 -418557
16348 -418557 -241890 -140891 -197259 -287321 -183197 98667 376753 578509 741340 845640
16338 845640 848812 740302 607405 488479 311294 135522 72895 133553 253600 383941
16328 383941 504282 585441 594823 541683 438484 232582 -50767 -263213 -372737 -452672
16318 -452672 -484515 -346851 -100701 29400 -49008 -229780 -376077 -472004 -569032 -626446
16308 -626446 -594593 -485119 -275159 -1208 144744 69003 -137193 -336965 -458070 -518589
16298 -518589 -478520 -314745 -126836 -2092 9760 -109782 -276556 -387536 -392522 -344227
16288 -344227 -338824 -275503 -126719 -102895 -200454 -291855 -395568 -501118 -559949 -632149 -727009
16277 -727009 -746265 -650518 -429402 -120148 142175 311515 429568 503490 587127 673280
16267 673280 647947 480359 197673 -108618 -322906 -411415 -394064 -318844 -247775 -224691 -220829
16256 -220829 -212854 -258217 -334755 -424336 -533033 -575029 -471301 -241216 -56246 -36257 -63344
16245 -63344 -27281 53380 152412 275173 379228 396605 359950 314482 253501 171160 91954
16234 91954 -22002 -176561 -296222 -331370 -352370 -434185 -524117 -576548 -579304 -542654 -491578
16223 -491578 -442907 -490357 -647725 -755553 -696099 -498812 -305925 -260920 -409415 -672318
16213 -672318 -868673 -946450 -975482 -931291 -763261 -506179 -283039 -224947 -297397 -348553 -277658
16202 -277658 -107278 102704 287918 320895 145124 -142489 -400603 -537405 -523865 -462359
16192 -462359 -472902 -508234 -429874 -227430 -28979 80961 97855 24854 -90969 -214311
16182 -214311 -356962 -494493 -644972 -814184 -864942 -694848 -370912 -12494 290577 527013
16172 527013 732128 850994 821618 673746 485318 283781 75133 -104974 -270886 -397581
16162 -397581 -371957 -162166 105350 346616 592778 825148 930896 835181 589834 307015
16152 307015 64776 -85117 -115930 -85764 -45083 51706 219178 365680 403918 385137 338380
16141 338380 219701 79362 -38805 -130156 -186252 -220303 -287136 -354961 -296002 -102014 132434
16130 132434 317534 343042 174808 -33873 -120340 -146511 -228062 -286413 -314957 -393525 -436442
16119 -436442 -371596 -206279 5531 160676 156275 53049 29980 139415 269252 377944
16109 377944 477493 550098 612828 645927 577699 368541 77450 -182794 -309091 -319290 -352087
16098 -352087 -475902 -658107 -894037 -1147732 -1301463 -1380504 -1449251 -1433040 -1292213 -1103069
16088 -1103069 -976383 -967488 -1076921 -1253314 -1365633 -1313739 -1097268 -821946 -673457 -698494
16078 -698494 -774449 -808900 -778450 -679054 -535603 -389321 -287989 -199192 -19916 247833
16068 247833 454764 515432 405426 148047 -171024 -424295 -562631 -611702 -573139 -475273
16058 -475273 -421985 -457713 -488189 -414697 -279027 -166439 -104779 -74029 -15218 76721 143529
16047 143529 157426 103759 -35917 -214772 -408374 -600169 -724409 -672338 -416295 -159446
16037 -159446 -57840 -97661 -247968 -454843 -678055 -881274 -1075601 -1242954 -1303793 -1219647
16027 -1219647 -1026529 -780753 -541174 -377810 -256116 -119580 -38699 -69895 -150617 -148332
16017 -148332 -33603 143177 306116 321743 149780 -14752 -10811 38546 3020 -56711 -44291
16006 -44291 21955 74159 81796 52020 -16342 -88987 -106638 -74338 1812 118269 233996
15995 233996 328175 382075 347132 239752 177258 227705 387576 592304 708431 650338 471694
15984 471694 258482 53952 -87792 -151311 -173196 -182042 -226630 -339875 -465910 -516081 -482951
15973 -482951 -463652 -555361 -719667 -859080 -913227 -821698 -589224 -350706 -225080 -149323
15963 -149323 -109430 -175085 -304501 -402769 -454401 -561538 -750366 -922227 -1011873 -994487 -851548
15952 -851548 -598964 -350461 -218095 -194235 -160866 -63422 20224 57823 80402 61293 6526
15941 6526 -56542 -132207 -257429 -398946 -475077 -511862 -538968 -551969 -542510 -468038 -277952
15930 -277952 -755 230911 328400 320463 320399 375824 407463 390124 351677 229372 -35739
15919 -35739 -400657 -686608 -765521 -688876 -524360 -371730 -294288 -250588 -200009 -181275 -230024
15908 -230024 -325136 -467727 -587861 -557782 -415751 -298826 -230746 -156096 -112514 -166138 -210016
15897 -210016 -150229 -91835 -96505 -72582 -64225 -160759 -312751 -518272 -770268 -971318 -1082419
15886 -1082419 -1163573 -1203267 -1132889 -970343 -829026 -799601 -834119 -843257 -831427 -830422 -805126
15875 -805126 -758155 -732258 -685479 -569894 -398942 -239846 -157422 -169578 -271447 -445910
15865 -445910 -624565 -731409 -724111 -593165 -374803 -122008 157741 450148 680217 773322
15855 773322 723927 592424 445273 342821 267069 115688 -49049 -35189 105526 118622
15845 118622 -85846 -377689 -656913 -851864 -922479 -949415 -964764 -915979 -806598 -689369
15835 -689369 -653833 -768392 -961495 -1066216 -995452 -824380 -646307 -472429 -311861 -177157
15825 -177157 -81038 -41533 -72689 -190582 -328582 -376327 -339898 -283750 -178783 40494 334804
15814 334804 557547 624471 540422 343686 148080 96771 241735 440572 531867 491158
15804 491158 361140 208777 111622 80188 30081 -102451 -289896 -481942 -625426 -679072
15794 -679072 -633620 -542528 -455005 -416774 -452177 -512927 -554306 -563867 -530667 -422779 -251133
15783 -251133 -23119 248125 504868 699377 758601 600244 279688 -29550 -282229 -528268
15773 -528268 -748656 -909547 -992461 -982686 -925892 -870541 -774094 -675485 -655302 -702030 -730164
15762 -730164 -682321 -542728 -303067 -6632 244903 386313 408109 348754 235897 80934
15752 80934 -66419 -144968 -185323 -340635 -575972 -753962 -873111 -905544 -793668 -555599
15742 -555599 -311163 -235990 -415655 -705364 -896366 -923547 -875726 -821791 -800156 -852590 -951655
15731 -951655 -1027818 -1056029 -1006510 -886135 -794558 -803016 -902086 -1024957 -1058443 -973172 -795995
15720 -795995 -542059 -286096 -177341 -294961 -500188 -535020 -345068 -164812 -176978 -340248
15710 -340248 -482545 -478755 -355802 -258716 -299769 -445163 -610780 -735918 -725310 -573494
15700 -573494 -441564 -460762 -563469 -616266 -680249 -833510 -998493 -1094765 -1122292 -1065654 -870059
15689 -870059 -596809 -363472 -233745 -243197 -372601 -535213 -628728 -573579 -443715 -397358
15679 -397358 -440201 -534960 -701655 -967150 -1314977 -1659644 -1911201 -2018267 -2006195 -1905614
15669 -1905614 -1741484 -1552035 -1375957 -1259065 -1205017 -1177715 -1146625 -1052959 -905793 -803232
15659 -803232 -764915 -719681 -630472 -573948 -679141 -926607 -1100254 -1072343 -916085 -722403
15649 -722403 -577392 -542884 -605038 -678356 -662177 -601319 -548828 -497230 -414976 -282692 -148436
15638 -148436 -78952 -29049 78539 184251 246820 278379 218781 96073 48754 123880 280755
15627 280755 429189 466219 390681 269574 148341 67836 -2729 -124517 -283818 -381880
15617 -381880 -388159 -381024 -356632 -285825 -197173 -115579 -48493 -40774 -130627 -332825 -622136 -913542
15605 -913542 -1133687 -1219154 -1100795 -825981 -579035 -436393 -321651 -192095 -79887 -43506
15595 -43506 -57052 -62319 -55578 -29965 26451 81829 84070 46780 -79842 -289065 -429490 -461576
15583 -461576 -509088 -629015 -731927 -705879 -544270 -374868 -370590 -561083 -809085 -983887
15573 -983887 -1088084 -1181310 -1255669 -1273600 -1198085 -1039167 -860015 -658535 -456873 -314917
15563 -314917 -241218 -175573 -126743 -180364 -331738 -498791 -621677 -636081 -562055 -420376 -195070
15552 -195070 21193 99108 -29057 -245319 -418147 -589612 -806431 -1046036 -1280341 -1495046
15542 -1495046 -1670022 -1762308 -1733467 -1557203 -1283360 -1018548 -839091 -716987 -582938 -439899
15532 -439899 -321736 -229833 -167362 -138982 -87972 -7576 37759 28699 -28716 -108022 -122831
15521 -122831 -29851 71767 134574 233084 361922 430516 372957 198349 -62625 -313099
15511 -313099 -464496 -565022 -653763 -647803 -517156 -399384 -451195 -603195 -713622 -771050
15501 -771050 -754465 -643342 -466835 -282181 -127426 -28135 -42234 -200498 -500598 -841369
15491 -841369 -1091521 -1269434 -1404627 -1420450 -1309414 -1174183 -1107924 -1116735 -1140171 -1137628 -1069503
15480 -1069503 -932826 -825737 -767770 -654194 -441493 -186336 -4528 69664 111384 144125
15470 144125 126977 76879 32891 23633 58019 114783 184534 217171 181131 160289 227119 352053
15458 352053 475145 521408 467198 277358 5377 -189553 -218788 -74192 144690 267081
15448 267081 209195 -13265 -275060 -436179 -462046 -461646 -562191 -732804 -826537 -743937 -511539
15437 -511539 -280106 -179274 -220885 -383247 -590086 -738931 -761213 -685321 -603850 -531828
15427 -531828 -420002 -295354 -250561 -328745 -492968 -648926 -711233 -710503 -669570 -571172 -455306
15416 -455306 -395271 -334930 -172781 64064 230899 204841 -50826 -457559 -844582 -1095948
15406 -1095948 -1221764 -1248690 -1169720 -1023196 -866192 -709963 -550834 -365443 -180656 -25908
15396 -25908 128256 288417 411539 448746 372223 244735 122216 -16870 -132619 -153466
15386 -153466 -108297 -52083 23847 142540 354085 638049 842657 869395 751226 571600
15376 571600 389623 234108 132529 105647 152911 215944 181257 32336 -161329 -323358
15366 -323358 -370298 -288579 -163386 -145552 -332775 -659401 -965782 -1139086 -1188136 -1192167 -1195668
15355 -1195668 -1213997 -1256802 -1300361 -1268434 -1124924 -926517 -782088 -674715 -529253 -399754
15345 -399754 -316182 -245081 -213090 -261787 -381813 -535086 -625286 -621369 -649968 -772040 -912010
15334 -912010 -1018917 -1086260 -1060539 -864569 -526081 -164475 96619 224413 281945 287070
15324 287070 134517 -212288 -600899 -889745 -1002955 -942155 -879053 -928657 -1004881 -1035191
15314 -1035191 -1042784 -1033681 -1055735 -1123709 -1157911 -1157770 -1138709 -1065604 -900709 -680542 -516513
15303 -516513 -514810 -644936 -754878 -835638 -961552 -1073940 -1065791 -944732 -759436 -532163
15293 -532163 -335473 -218617 -123788 -27032 38869 49138 -27531 -180331 -359475 -538706
15283 -538706 -677937 -737854 -726118 -645525 -443074 -109277 256012 488311 516390 397723
15273 397723 256435 165856 105751 1044 -131904 -176521 -204374 -310914 -376753 -331036 -205564
15262 -205564 -56228 25569 -15049 -109414 -167097 -149708 -55931 113989 277456 273350 8354
15251 8354 -382894 -658669 -762710 -800601 -884129 -1020920 -1128939 -1140261 -1118785 -1151819 -1188480
15240 -1188480 -1129595 -937338 -727747 -677384 -762189 -853043 -917132 -997347 -1098488 -1111523 -956703
15229 -956703 -753301 -637836 -627355 -722229 -831694 -772261 -531197 -223131 88014 326643
15219 326643 369800 218982 -26886 -294549 -509032 -531671 -377820 -178059 26141 253932
15209 253932 532250 788243 883483 760130 457333 70839 -305129 -585376 -731114 -764092
15199 -764092 -750181 -678790 -535008 -340942 -90584 185116 360133 381197 327942 315966
15189 315966 352590 403955 446659 369760 113163 -192014 -346558 -286606 -117984 -7606
15179 -7606 3229 221 66915 233511 413266 545645 687761 831172 921467 950164 950607
15168 950607 918575 814240 654623 467772 276425 125992 -5873 -208411 -412620 -528118
15158 -528118 -598389 -720302 -904369 -1027862 -974341 -745145 -506453 -448978 -568778 -725024
15148 -725024 -825661 -807021 -702068 -578924 -431085 -208593 111654 413766 585224 604758
15138 604758 519233 385653 183604 -70479 -321426 -552927 -744568 -891575 -1033473 -1120118
15128 -1120118 -1105345 -1066375 -990451 -801553 -537750 -361613 -362672 -445567 -473891 -386887 -193179
15117 -193179 9009 96128 9090 -251120 -590076 -880617 -993648 -903943 -724210 -540842
15107 -540842 -416063 -396866 -461416 -575357 -710824 -857877 -994750 -1057261 -1010230 -924203
15097 -924203 -891228 -936536 -1028314 -1127116 -1210074 -1255259 -1234031 -1111666 -902579 -662583 -383137
15086 -383137 -130921 354 3508 -60659 -146506 -283888 -467093 -615277 -693413 -710239 -665561
15075 -665561 -580324 -476216 -346214 -163570 42335 176002 193138 165608 174674 227963 246637
15064 246637 198261 151525 117916 87924 86462 50162 -49563 -148426 -200497 -207747 -181082 -174145
15052 -174145 -276905 -439552 -569015 -701116 -845368 -926288 -875447 -689996 -522403 -470467
15042 -470467 -461731 -468686 -524809 -603001 -680943 -769178 -814248 -761146 -601895 -400245 -263750
15031 -263750 -250069 -304265 -344424 -349353 -302159 -241877 -275156 -408052 -554226 -692602 -858217
15020 -858217 -1010043 -1062211 -1012717 -923329 -846753 -823444 -876990 -948030 -989313 -999025 -935737
15009 -935737 -728611 -345610 58394 315215 490307 672200 821686 820595 665806 453114
14999 453114 227479 39539 -62991 -105721 -182279 -356357 -497018 -449492 -281568 -147342
14989 -147342 -41863 62333 83477 23629 1817 72501 223496 409822 549971 635562
14979 635562 664135 616846 588564 564193 405611 165382 -38197 -131885 -65020 135407 340708
14968 340708 441153 482731 456318 292637 67139 -87128 -138394 -120077 -24552 92331
14958 92331 123170 67293 11188 -76806 -297271 -589291 -759733 -778358 -739924 -662694 -528706
14947 -528706 -345562 -203178 -202369 -326978 -523083 -795247 -1084939 -1256286 -1231108 -1088232
14937 -1088232 -918968 -739855 -636267 -666650 -754176 -800432 -745704 -603683 -440628 -349057
14927 -349057 -373322 -375646 -228178 -63515 -10350 -27546 -93175 -220246 -370171 -465627 -442773
14916 -442773 -370655 -376954 -470813 -638924 -836793 -959051 -954087 -826172 -603117 -377270 -250435
14905 -250435 -260160 -342195 -424474 -502708 -574322 -609871 -606994 -549355 -436498 -341321 -280646 -241387
14893 -241387 -318406 -560071 -849624 -1077720 -1155916 -1063185 -872027 -639494 -439873 -350389
14883 -350389 -378600 -489651 -618640 -655891 -537088 -315624 -78906 147369 354805 520372
14873 520372 673847 813241 837979 692558 459492 251133 123452 86992 88452 91817 34089
14862 34089 -132931 -295549 -317269 -233407 -149460 -119734 -86955 83144 394297 666135 720646
14851 720646 583157 391238 235499 85594 -103607 -354478 -709736 -1074247 -1231955 -1092769
14841 -1092769 -816450 -563326 -425518 -445716 -536708 -643571 -800275 -973426 -1015516 -901277
14831 -901277 -746832 -607977 -481984 -386419 -384844 -564434 -858513 -1084224 -1172942 -1236050
14821 -1236050 -1360717 -1462562 -1516559 -1582060 -1655852 -1629945 -1399181 -1074619 -766089 -475280
14811 -475280 -243170 -89317 -7898 4878 15008 102382 238707 374776 486459 584503
14801 584503 602961 445543 179181 -70837 -239780 -330309 -373251 -405624 -375078 -214839
14791 -214839 58928 392241 704300 920587 1005244 984161 956454 990024 1041808 1055985 1054281
14780 1054281 1072466 1090886 1124601 1183020 1134269 909091 600596 315081 80671 -104680
14770 -104680 -230146 -348053 -487918 -531175 -439653 -366191 -365539 -369207 -333165 -258721 -178193
14759 -178193 -175308 -231428 -201456 -82290 19666 82474 204888 438982 736141 943775
14749 943775 940476 768788 560089 422863 351647 302058 203520 78026 115977 328036 434917
14738 434917 329121 239859 283314 282659 108597 -131040 -235974 -145808 2131 93739 92690
14727 92690 -20449 -188803 -307045 -283550 -83660 219665 481236 614006 608374 530983
14717 530983 483645 486806 465119 409618 394209 467699 608939 767332 891908 959048 909594
14706 909594 712389 426711 139356 -146426 -448022 -681478 -752979 -639566 -364011 2856
14696 2856 362003 646581 813808 868846 842928 767421 673378 648428 727578 870328 976081
14685 976081 944888 798805 606695 431770 341473 333394 344839 348525 288418 69130 -303679
14674 -303679 -711078 -1042232 -1261890 -1342783 -1266558 -1102812 -918966 -728465 -571529 -525664
14664 -525664 -586257 -692886 -787926 -798957 -713184 -555194 -408537 -375055 -413052 -435704 -414452
14653 -414452 -381473 -356998 -347635 -288467 -173102 -125676 -191702 -308231 -442165 -625145 -835287
14642 -835287 -1046626 -1252530 -1360917 -1333885 -1267498 -1246198 -1280049 -1375381 -1549392 -1750866
14632 -1750866 -1864358 -1839336 -1756895 -1697459 -1677956 -1654352 -1573525 -1399543 -1151785 -885379
14622 -885379 -658286 -489966 -424282 -528972 -679086 -697926 -656808 -708918 -818833 -914189
14612 -914189 -933197 -839217 -683551 -465334 -129729 258359 552756 705822 726666 678700
14602 678700 638092 609377 562033 535625 537499 478876 355306 230824 80448 -127147 -372471
14591 -372471 -564714 -595385 -529193 -448122 -297393 -91119 8294 -91886 -268288 -369472
14581 -369472 -371291 -329769 -324543 -331858 -282549 -207588 -203481 -323637 -527816 -742875 -923165
14570 -923165 -998881 -981719 -932440 -844828 -669273 -421061 -199139 -39474 72517 129887
14560 129887 159818 190938 277103 423280 531758 570084 611950 702474 838780 950432 896631
14549 896631 738642 645672 614169 581963 514647 413680 261339 57488 -75956 -55686
14539 -55686 61225 220856 431482 598317 586167 445667 285143 167384 97850 14248
14529 14248 -149069 -342184 -406899 -308925 -152348 -60857 -72013 -160806 -294254 -415250 -433356
14518 -433356 -279543 16831 340304 582354 688186 744067 856856 1041183 1159878 1103313
14508 1103313 937896 771990 664379 630851 666492 690968 603521 388027 161733 16847
14498 16847 -33159 11565 46505 -48160 -263891 -466796 -563987 -530571 -377143 -156824 13823
14487 13823 100989 156437 223634 314124 367846 301118 70957 -270821 -598018 -834747 -942830
14476 -942830 -941179 -904546 -829686 -649528 -418389 -290001 -237774 -232179 -321803 -462464 -577567
14465 -577567 -662503 -682232 -584502 -425682 -329773 -320302 -280654 -201940 -127362 -74027 -116554
14454 -116554 -318303 -537053 -596536 -552352 -481588 -371936 -213761 -45754 146302 336175
14444 336175 403901 311167 205778 235880 421949 690494 922921 1030725 981357 790912
14434 790912 578790 434288 349367 329315 405142 516315 542691 493160 444711 478213 621869
14423 621869 724749 655719 514724 414508 376196 514945 874919 1232804 1393075 1374664
14413 1374664 1241176 1035359 774651 482052 280752 266970 351005 403021 423542 403141
14403 403141 321825 266402 337043 554759 821469 997742 1023033 949619 771809 505950
14393 505950 287041 161887 61252 -109647 -361176 -647515 -902963 -1008348 -940103 -844802
14383 -844802 -793902 -789060 -819108 -848903 -867130 -833435 -698526 -532567 -448827 -368459 -168391
14372 -168391 52807 110552 -65962 -293314 -388196 -417055 -522445 -692580 -811971 -866305
14362 -866305 -859104 -765283 -550172 -237597 90035 348137 476049 479631 361935 165932
14352 165932 8190 -36450 -23984 -61913 -164449 -297756 -492773 -716786 -865052 -914518
14342 -914518 -886039 -794242 -714345 -672494 -607209 -510240 -448318 -489282 -555839 -524746 -419223
14331 -419223 -310889 -282266 -361892 -427604 -329586 -48089 269875 468156 499692 378499
14321 378499 145271 -156094 -466651 -734077 -972111 -1236658 -1491244 -1606080 -1554538 -1462037
14311 -1462037 -1430665 -1412836 -1327758 -1185021 -1053169 -986975 -969448 -900719 -798080 -727029 -711170
14300 -711170 -797689 -930200 -1044360 -1066622 -865800 -512507 -200320 193 68760 52699
14290 52699 57087 99403 126659 104432 10583 -91902 -79318 -10254 -31648 -127522 -185470 -193629
14278 -193629 -122893 32725 163332 169842 26405 -193183 -347597 -368449 -325853 -343883 -431583
14267 -431583 -467818 -430044 -359422 -233048 -80120 -15126 -90876 -237533 -383737 -437017 -363615
14256 -363615 -267480 -273965 -427533 -630601 -698833 -645155 -631718 -660037 -645634 -531280 -312815
14245 -312815 -105101 -20058 -43677 -114768 -241367 -404289 -510104 -551446 -598688 -660169 -707568
14234 -707568 -724931 -706909 -647834 -622708 -695757 -795819 -856500 -907449 -1022281 -1224983 -1398430
14223 -1398430 -1440055 -1435043 -1483799 -1528676 -1499669 -1434383 -1341870 -1207421 -1059473 -959340 -878907
14212 -878907 -780648 -716484 -704910 -707258 -704241 -712240 -736138 -740626 -696199 -630151 -556339 -473588
14200 -473588 -301289 39618 447890 699846 648005 393758 160717 44305 47584 120036
14190 120036 216767 330957 396094 379585 275249 38030 -314226 -645608 -785453 -669326
14180 -669326 -403338 -118962 76570 136936 117177 19282 -177145 -441722 -710603 -948677
14170 -948677 -1205838 -1401172 -1426295 -1317720 -1099951 -836842 -570153 -287002 -29223 154994
14160 154994 249514 208147 -7040 -348720 -728329 -991291 -1085814 -1121392 -1112980 -1048288 -984666
14149 -984666 -935925 -864134 -707567 -461193 -213202 -51442 11164 -60556 -238537 -436331
14139 -436331 -624471 -782559 -896141 -909452 -777219 -562201 -369769 -227744 -168154 -224478
14129 -224478 -267966 -128536 176391 494371 734778 873946 860796 698342 543470 512989
14119 512989 593697 739057 887743 953441 886942 782875 811087 951361 1017683 894652
14109 894652 601065 219656 -144678 -411578 -584864 -693151 -756031 -811067 -846214 -775874
14099 -775874 -625427 -528077 -558382 -661861 -719225 -746611 -784754 -798061 -814428 -855346 -936059
14088 -936059 -1052918 -1110639 -997447 -720713 -393399 -92337 154638 366940 508047 496160
14078 496160 373713 220236 67963 -71750 -217834 -362028 -452431 -471622 -417504 -321218
14068 -321218 -236129 -176055 -121007 -91165 -144367 -288181 -500362 -750483 -956910 -1035571 -1002946
14057 -1002946 -948877 -919061 -895656 -859981 -821115 -809876 -727669 -489131 -227193 -73061 -28149
14046 -28149 -47071 -97476 -207649 -431725 -755840 -1034253 -1090823 -930239 -689192 -508259
14036 -508259 -444027 -400486 -295455 -177327 -185602 -363659 -542038 -581033 -543230 -524485 -564872
14025 -564872 -585009 -549974 -545730 -586760 -632172 -712000 -799738 -822314 -806006 -810216 -831705 -855280
14013 -855280 -826824 -660778 -366323 -84797 28288 -43179 -180743 -287061 -350105 -377635
14003 -377635 -338956 -214407 -48964 87980 154086 129379 43401 -37326 -56982 -5999 99491
13992 99491 255127 367137 370656 316799 237825 169677 183361 332054 620372 954266 1203947
13981 1203947 1402153 1655720 1875617 1905759 1777217 1621846 1462631 1269410 1023483 724428
13971 724428 452641 318049 295484 266593 141404 -49442 -185833 -237037 -252629 -225663
13961 -225663 -105453 45199 94976 30300 -20468 -11657 18771 41261 -45124 -326374 -696326
13950 -696326 -892706 -797010 -535537 -279493 -119416 46413 380686 779527 979123 931211
13940 931211 830864 869179 1015331 1082892 989941 779531 579828 561009 778875 1108729
13930 1108729 1378614 1452151 1333581 1078715 784545 574325 482450 499237 516936 389546
13920 389546 110323 -220014 -491327 -765357 -1112825 -1369658 -1377994 -1172610 -856868 -563326
13910 -563326 -405561 -407401 -514616 -563756 -441490 -202991 37741 165908 130202 -17090
13900 -17090 -221939 -442925 -613674 -680162 -655621 -601402 -491648 -320324 -169180 -95175
13890 -95175 -10101 212230 528654 817082 1008065 1057882 977483 859985 808500 760760 605127
13879 605127 417023 311527 257977 204523 150272 31481 -186769 -442087 -597531 -624477
13869 -624477 -626102 -635892 -688501 -820048 -987222 -1129154 -1189722 -1113021 -980716 -956386 -1080084
13858 -1080084 -1183329 -1111982 -938188 -790089 -711005 -664355 -594055 -489864 -373201 -315366
13848 -315366 -369842 -449044 -414662 -276484 -135474 -32034 -18202 -153481 -396968 -580195
13838 -580195 -609751 -615427 -727179 -911533 -1029266 -987088 -884194 -794244 -638601 -401211
13828 -401211 -196016 -129317 -257534 -506706 -669141 -681479 -717362 -860507 -981915 -1023173
13818 -1023173 -1026944 -1004515 -989847 -1048065 -1123006 -1130893 -1090490 -1013303 -854637 -626496 -412138
13807 -412138 -217447 -86789 -104313 -123749 6394 226952 434121 568224 559476 410175
13797 410175 232658 119652 34798 -51069 -52183 24554 108578 177029 225855 236724 191774
13786 191774 110072 43597 -21589 -125068 -213688 -208359 -94181 87103 197603 129419 -45521
13775 -45521 -241893 -442783 -604719 -667165 -646593 -652049 -744784 -912916 -1156521 -1405065 -1552434
13764 -1552434 -1583992 -1473908 -1098990 -507570 32196 372826 502461 465328 364453 264992
13754 264992 165269 51476 -92922 -277107 -440117 -535986 -579098 -562372 -509995 -478835 -505895
13743 -505895 -518519 -452789 -389675 -396689 -450852 -475542 -397365 -252077 -157806 -191238 -270404
13732 -270404 -236699 -132474 -121958 -197581 -210178 -58170 164828 272409 250480 181373 147166
13721 147166 179645 238722 301639 319556 230796 25641 -238179 -483459 -670419 -766309 -667814
13710 -667814 -333374 99900 426401 536532 416676 122397 -259745 -589611 -721090 -641060
13700 -641060 -483005 -370515 -350261 -434309 -521672 -446713 -196496 145597 494179 743505
13690 743505 841448 816917 706104 516763 261041 11786 -146089 -177832 -123800 -86577
13680 -86577 -120120 -120592 -1304 191223 358111 434437 390156 238510 36966 -105046 -92906
13669 -92906 88133 447503 818818 986451 909766 702465 520917 453602 476240 483338 356561
13658 356561 137146 -33586 -57804 25537 148214 227902 165340 -217 -161432 -276409
13648 -276409 -322777 -361689 -446248 -533866 -621772 -774528 -961348 -1054857 -1067903 -1023778 -870273
13637 -870273 -672974 -548036 -494474 -379811 -173434 -836 10217 -120788 -229747 -240016
13627 -240016 -196359 -198101 -299816 -459442 -618471 -695342 -666728 -632448 -649846 -702263 -751593
13616 -751593 -788938 -840473 -829273 -707077 -629516 -700307 -865972 -1005531 -1047433 -1013161 -903947
13605 -903947 -682349 -394292 -175455 -86811 -27736 111826 254947 241395 37970 -266083
13595 -266083 -543094 -637379 -446053 -93225 239843 466196 576658 626293 689850 762168
13585 762168 729932 578286 435732 381613 394329 339589 134599 -143420 -423979 -700204
13575 -700204 -950613 -1081806 -1000845 -776060 -549215 -368372 -233932 -161966 -160647 -247730
13565 -247730 -400402 -584068 -749910 -854188 -866947 -765385 -635555 -619271 -689713 -718059
13555 -718059 -687871 -608481 -514055 -447144 -397484 -298735 -218301 -301776 -485327 -593708 -574138
13544 -574138 -487120 -439085 -504555 -627892 -676073 -630806 -486317 -214928 140946 538232
13534 538232 921054 1162823 1251733 1292863 1342484 1394334 1324255 1022555 572137 157331
13524 157331 -187969 -519887 -726934 -677751 -409947 -116421 57281 200510 409297 610467
13514 610467 663652 550146 392743 308728 354451 496093 681638 904666 1128518 1236963
13504 1236963 1172954 1051875 957100 897802 906207 974096 1089404 1225934 1271264 1099757 685163
13493 685163 212034 -64906 -67295 -3144 -170608 -533093 -870058 -1081505 -1158835 -1145503
13483 -1145503 -1081896 -1080528 -1182043 -1202124 -1002913 -659221 -358027 -188580 -135634 -147260
13473 -147260 -127594 -119076 -239026 -461940 -661257 -726636 -619399 -426440 -209962 23999
13463 23999 144075 74093 -58344 -126135 -126676 -57701 37942 52631 -28298 -145110 -231753
13452 -231753 -254658 -222819 -150574 -103627 -154644 -263490 -326826 -350418 -414050 -496771 -517510
13441 -517510 -427274 -208863 56425 283380 477637 648323 704611 570011 380141 324454
13431 324454 382457 387553 328703 259405 154247 58037 40670 57612 -40609 -249681 -419241
13420 -419241 -482859 -507084 -516434 -454546 -322732 -224610 -220215 -246949 -208012 -101450 7983
13409 7983 126365 222980 219573 95421 -75719 -229468 -324184 -356757 -351162 -283039 -142641
13398 -142641 901 122594 228131 339449 463331 548891 560640 493641 306035 18992
13388 18992 -295910 -566018 -686157 -645545 -479424 -219779 56186 285765 411998 440691
13378 440691 471496 540661 588779 659000 816084 918893 800950 466742 58692 -313656
13368 -313656 -655925 -883566 -907745 -735744 -383852 27847 327148 440165 452913 497439
13358 497439 539896 466751 316770 208387 180492 196107 214838 192068 117273 48445 -12384
13347 -12384 -109256 -299572 -522294 -611726 -554972 -472799 -445957 -504291 -566191 -506578 -325315
13336 -325315 -42174 342332 762319 1170090 1481541 1610675 1552387 1379715 1123748 769825
13326 769825 432666 189276 49631 21662 41931 35097 -11923 -18815 36501 95112 168488
13315 168488 265920 319595 269814 204469 166199 114891 31977 5417 177356 539185 935160
13304 935160 1281896 1552524 1706758 1776681 1846006 1981038 2167444 2326135 2352595 2202592
13294 2202592 1967319 1772978 1664815 1565136 1367913 1090500 879949 810524 827628 778374
13284 778374 592100 403694 394327 652762 1063497 1392122 1528263 1420850 1075091 598734
13274 598734 168356 -58746 -11467 207212 414562 577907 757753 974341 1218319 1464533
13264 1464533 1693006 1932324 2206122 2475413 2622319 2593213 2429083 2277161 2238434 2199718
13254 2199718 2086447 1992550 2041204 2182249 2270116 2271619 2197188 2045471 1884139 1744488
13244 1744488 1588163 1436903 1327982 1279683 1322421 1493042 1701539 1799088 1778778 1706363
13234 1706363 1607514 1543047 1604594 1740574 1830369 1883001 1967513 2085957 2186532 2246095 2244739
13223 2244739 2243941 2297265 2344321 2296202 2095470 1855501 1807434 1956711 2128599 2176850 2094752
13212 2094752 2016007 2046050 2176086 2256026 2196744 2038862 1804290 1537417 1326440 1234887
13202 1234887 1203336 1110086 1020011 1037240 1047717 940218 735578 509709 368735 312270
13192 312270 315354 430516 649854 885747 1077118 1230875 1336871 1343289 1238085 1138970
13182 1138970 1118645 1162226 1243395 1300812 1351482 1413211 1433095 1430936 1500319 1602839 1582775
13171 1582775 1385937 1240698 1320679 1499981 1627734 1710857 1827868 2003611 2153134 2104456
13161 2104456 1840824 1545413 1359375 1318723 1453238 1707245 1938526 2066097 2092923 2053124
13151 2053124 2043694 2126706 2229167 2305115 2367571 2394547 2352483 2212156 2003532 1806648 1649393
13140 1649393 1601957 1698914 1876691 2032712 2127227 2197525 2238551 2265661 2288616 2259484 2195796
13129 2195796 2124538 2127902 2311402 2641731 2963928 3147834 3195132 3181341 3059970 2774647
13119 2774647 2494068 2382604 2346877 2253755 2127996 1993536 1842848 1771700 1826740 1912945
13109 1912945 1918885 1787896 1653632 1662576 1826844 2086101 2378404 2705698 3020046 3246388
13099 3246388 3424950 3538249 3551366 3562269 3590335 3581970 3535221 3437830 3261788 3040335 2860743
13088 2860743 2795984 2895338 3127668 3431378 3715945 3886402 3932081 3880853 3734750 3609269
13078 3609269 3619808 3751483 3944784 4143665 4269537 4271316 4181659 4068623 3980309 3890120
13068 3890120 3769855 3687139 3709270 3796738 3909396 3983957 3963634 3891671 3860225 3852117 3791300
13057 3791300 3744488 3820296 3981342 4156362 4388827 4788295 5226169 5462371 5520260 5557468
13047 5557468 5681774 5923156 6244492 6577806 6903019 7192375 7345746 7344349 7250316 7165718
13037 7165718 7204873 7295639 7316524 7297370 7337156 7483985 7693839 7922833 8112727 8229053
13027 8229053 8355607 8537014 8722487 8837847 8899576 8954218 9029421 9174878 9453565 9854475
13017 9854475 10320845 10828104 11378069 11919785 12388635 12850743 13416031 14076524 14709898
13008 14709898 15164139 15424401 15601326 15805279 16149544 16604553 17092646 17719124 18624246
12999 18624246 19748932 20922270 22133814 23498947 25054781 26766474 28649489 30812642
12991 30812642 33289177 36008988 38959654 42169335 45675786 49577493 54068264 59348870
12983 59348870 65590290 72997992 81817860 92363110 105094802 120583356 139435018
12976 139435018 162307444 189985258 223225627 262326476 306273802 351088139 388536588
12969 388536588 407874735 401964996 373102535 331144269 286272171 244694993 208810580
12962 208810580 178789851 153951468 133486209 116589548 102509595 90697611 80833388
12955 80833388 72571284 65515275 59411487 54185476 49833980 46211625 42997990 39987782
12947 39987782 37207375 34661113 32347944 30367821 28762560 27535579 26604410 25755298
12939 25755298 24842286 23914358 23047287 22320440 21751550 21211387 20661968 20175622 19833267
12930 19833267 19693233 19707487 19813098 19914730 19934408 19916539 20006595 20353790 20996931 21838784
12920 21838784 22769807 23666735 24427655 25112642 25862051 26732358 27699484 28781027 30032963
12911 30032963 31421378 32729823 33847068 34872184 35936762 37097163 38382399 39880092
12903 39880092 41733249 44037750 46865348 50273336 54211894 58699268 63939622 70178353
12895 70178353 77680960 86785360 97816995 111151153 127308264 146948734 170894037
12888 170894037 199978875 234891828 275822837 321342858 366490164 401712614 415839997
12881 415839997 403479819 369543008 324958937 279395348 238157751 203005187 173807058
12874 173807058 149722756 129831044 113338794 99614043 88182524 78655618 70644538
12867 70644538 63774228 57787577 52579301 48117133 44380593 41289198 38727758 36542135
12859 36542135 34532840 32625525 30867472 29204615 27579937 26091371 24806416 23680560
12851 23680560 22666327 21807384 21208588 20823687 20504605 20227398 20000051 19843618 19768593
12842 19768593 19704846 19559304 19305424 19065554 18934268 18910713 18989870 19182560 19448289 19659779
12832 19659779 19794147 19946522 20158721 20506733 21102553 21986086 23131091 24366021 25514613
12823 25514613 26594094 27787324 29163062 30693438 32389152 34251961 36271783 38517509
12815 38517509 41104291 44207062 47994537 52471810 57646053 63659887 70721729 79046340
12807 79046340 88789788 100206912 113839252 130357859 150506258 175154675 205176454
12800 205176454 241142077 282745066 327700355 370086946 399985451 407436841 389520493
12793 389520493 352811046 308055635 263797583 224363824 191020961 163471536 140789392
12786 140789392 121998868 106349466 93231519 82197141 72920549 65067045 58412015
12779 58412015 52861889 48182740 44011436 40115012 36475196 33178567 30298667 27795429
12771 27795429 25642877 23854578 22387101 21106152 19969178 18926348 17830582 16700577
12763 16700577 15682738 14786222 13919932 13060125 12269629 11555415 10868974 10249342 9676549
12754 9676549 9150429 8783436 8584175 8429302 8168202 7743163 7214468 6694628 6397708
12745 6397708 6377696 6441591 6432916 6357250 6284952 6238175 6183200 6022761 5722108 5281556 4734177
12734 4734177 4241322 3962248 3911406 3983683 4048208 4089975 4152779 4181379 4198149 4339053 4539538
12723 4539538 4652074 4648258 4488354 4190286 3839009 3501921 3252393 3120942 3105628 3193676
12713 3193676 3265419 3244735 3215460 3253432 3364342 3500401 3567049 3557041 3486848 3400564 3319435
12702 3319435 3216726 3160882 3104661 2939922 2762353 2647912 2552415 2463893 2368250 2278446
12692 2278446 2212388 2104924 1956383 1816005 1603456 1277779 945935 655547 480991 497352
12682 497352 588875 644289 656058 692721 883294 1198973 1493764 1706233 1832263 1880267
12672 1880267 1865704 1815102 1772107 1797784 1957229 2151486 2231015 2221919 2164677 1998580 1716324
12661 1716324 1422023 1187836 988142 840241 851578 948617 920006 800799 770174 855532
12651 855532 956321 1063362 1211504 1289224 1286016 1276329 1250951 1247604 1308766 1395109 1451611
12640 1451611 1468333 1454028 1453211 1476564 1454279 1355023 1216392 1079640 989924 949199 933494
12629 933494 874022 802405 865127 1023184 1069455 994482 944761 988387 1120560 1266066 1305605
12618 1305605 1191639 983478 769079 663873 769991 1055722 1344368 1478244 1438008 1290773
12608 1290773 1138324 1024993 885017 679511 539230 524371 496050 391816 234871 83936
12598 83936 45438 66814 47858 37081 54161 60415 76671 187859 415316 695219 955418
12587 955418 1088336 1029849 886454 755770 662940 641974 708200 819971 913554 959595 1021745
12576 1021745 1065667 963041 684969 347982 113461 45431 84917 228797 551470 1019775
12566 1019775 1442469 1657817 1663332 1577960 1513496 1461988 1374294 1240015 1056697 831567
12556 831567 615326 403843 198714 79911 92325 168159 249922 322130 394063 485290 512610
12545 512610 440677 380856 366259 346169 292950 244144 262963 304579 310058 352244 463399
12534 463399 565227 625870 650891 643460 603994 547567 511274 512903 573013 703392 784865
12523 784865 667157 386207 115158 -42663 -71441 -72450 -117005 -181824 -256124 -263348 -145023
12512 -145023 18858 75614 42330 10174 3771 17623 69235 191059 332889 471501 601267
12501 601267 658487 628400 600782 646808 732054 792039 775162 639890 413563 150450 -132877
12490 -132877 -326321 -327411 -193078 -42196 -25203 -113978 -132481 -25872 139429 276300
12480 276300 343172 366718 375071 360814 316920 214158 84806 -3970 -19246 52949 227532
12469 227532 472526 706787 888887 1025788 1210655 1469093 1624531 1533755 1244576 900241
12459 900241 585176 358783 279720 329598 459522 598228 659565 675992 783022 949321
12449 949321 1074032 1175924 1270864 1259199 1078264 812474 571350 410093 351619 353915
12439 353915 395728 475739 616361 823543 977086 989893 858335 622432 442283 424550
12429 424550 482235 493565 393968 244412 153375 105619 56390 56118 175793 357856 503975
12418 503975 627457 742584 812882 807791 733782 655983 613047 549525 478445 407147 304446
12407 304446 249152 283413 328965 274928 139804 -4604 -198026 -425376 -549566 -511298
12397 -511298 -391389 -271156 -152897 -35581 21160 -26669 -138048 -225992 -237680 -233944 -302549
12386 -302549 -409629 -460985 -466939 -485871 -550750 -616426 -606829 -516262 -362577 -197641 -64039
12375 -64039 -3729 -62880 -205753 -321403 -388461 -464047 -547937 -585381 -599431 -577932 -423763
12364 -423763 -132317 178657 352821 366786 289168 194850 147209 212900 397423 592437
12354 592437 739311 895181 1089778 1229747 1274475 1314268 1418493 1598464 1778983 1853383
12344 1853383 1790793 1641335 1532241 1541444 1620657 1681821 1621227 1408443 1149716 940582
12334 940582 850658 895240 1016653 1111961 1151644 1145841 1106752 1122190 1162542 1026118 676386
12323 676386 369787 298224 357086 356466 304841 276388 255605 155819 -42837 -229257 -384770
12312 -384770 -564301 -705320 -764899 -763740 -727019 -690203 -697140 -744393 -767593 -681722 -497405
12301 -497405 -386506 -410453 -492225 -541618 -525346 -445809 -314047 -184417 -120373 -167477 -357070
12290 -357070 -586648 -793661 -993441 -1126694 -1138092 -1022173 -863938 -734719 -601782 -493207
12280 -493207 -489205 -549778 -577864 -586147 -541154 -366026 -138214 12466 60255 68780 100313
12269 100313 174479 235317 226842 192076 224625 351633 537874 691474 714552 587536 404108
12258 404108 198437 -23708 -160903 -157221 -7782 269175 545362 725393 872949 928119
12248 928119 764400 466846 153525 -143790 -322642 -283458 -83204 125326 238060 302974
12238 302974 401684 519641 628803 725587 728835 607221 434858 274148 102289 -112254
12228 -112254 -337697 -592911 -931523 -1320886 -1657083 -1827190 -1828955 -1740836 -1563544 -1206117
12218 -1206117 -615495 35276 499623 721900 741979 623237 463493 348801 290270 211084
12208 211084 106724 80408 126356 194984 266097 302505 284984 232759 247572 427112 632180
12197 632180 706573 774972 964474 1180958 1228123 1030008 686984 441713 365248 339555
12187 339555 271742 159285 47169 6287 80372 183504 271598 360371 369374 257979 49162
12176 49162 -219285 -380420 -358784 -301889 -294279 -309445 -314705 -303666 -287462 -263529 -206806 -126113
12164 -126113 -103154 -236204 -458823 -646167 -765768 -788518 -719962 -631378 -542898 -449012 -324321
12153 -324321 -190624 -125242 -159896 -249498 -286965 -250461 -164045 -722 254732 497493 567255
12142 567255 451291 344856 343520 323162 206829 43481 -145811 -390138 -679316 -955565
12132 -955565 -1182476 -1319935 -1344175 -1257482 -1054425 -791669 -590864 -515730 -583360 -729180
12122 -729180 -830345 -822724 -738928 -591901 -379956 -156845 48640 273262 462882 524261
12112 524261 563684 682442 810302 827201 704859 550128 502855 556646 609749 566726 467314
12101 467314 467385 555777 543015 396058 265506 225800 211623 164394 134377 190436 285636 329303
12089 329303 254232 74229 -102184 -165392 -44918 222122 464049 521999 337088 -23796
12079 -23796 -400719 -687308 -887347 -1028311 -1042740 -887721 -578495 -154367 264109 517769
12069 517769 570179 477569 348867 293653 301019 225738 -96908 -518585 -771769 -836819 -760022
12058 -760022 -621912 -522041 -463639 -422734 -366970 -276114 -212596 -275828 -503624 -798178 -976681
12047 -976681 -962632 -840622 -706582 -591050 -505186 -426000 -267951 -90975 9045 67474
12037 67474 117436 166410 186406 97732 -181661 -543509 -739750 -706842 -600580 -505825 -381375
12026 -381375 -243242 -189038 -221198 -273599 -355787 -460550 -572419 -639349 -552146 -350702 -118944
12015 -118944 144830 408565 623058 694150 556803 298453 36391 -153821 -208555 -153946
12005 -153946 -106723 -130297 -173369 -224441 -384343 -684966 -959866 -982819 -730161 -388875
11995 -388875 -181959 -172393 -246088 -324326 -379110 -374586 -283628 -99313 100480 225245 302591
11984 302591 389251 510183 667905 817615 857907 777833 705625 748209 903337 1071534
11974 1071534 1148117 1079765 936693 836901 791459 727564 547896 227832 -143692 -507717
11964 -507717 -855104 -1115658 -1235620 -1251792 -1297648 -1437657 -1558750 -1564668 -1429356 -1186671
11954 -1186671 -926312 -676519 -418435 -199910 -21677 148706 254614 273426 304149 383335
11944 383335 387136 276621 109285 -289 53451 168920 159040 33457 -109937 -292595
11934 -292595 -485540 -598405 -627446 -624924 -598587 -508759 -358714 -197487 -20315 212763
11924 212763 426183 473055 338534 95590 -210765 -513785 -701306 -667322 -466686 -270136
11914 -270136 -110876 70096 244345 332022 329408 306624 347668 492797 655054 737552 763468
11903 763468 805916 889751 970365 996444 931356 755182 525938 297145 54259 -175462
11893 -175462 -301916 -285219 -176091 -89389 -65681 -69531 -122139 -183947 -160887 -84439 -15715
11882 -15715 9329 -3828 -42609 -96259 -193343 -357372 -516743 -531970 -353876 -83034 132292
11871 132292 219094 204891 140103 84657 20985 -93448 -200765 -245289 -364921 -636981 -888097
11860 -888097 -951774 -827206 -600711 -423228 -382331 -415993 -423820 -364676 -294709 -236961 -215118
11849 -215118 -290212 -420532 -501644 -443493 -291924 -170107 -123259 -113356 -104756 -133351 -210147
11838 -210147 -304806 -315313 -118143 218587 436342 329909 -21924 -440425 -769831 -832786
11828 -832786 -591354 -183563 156734 230421 -34846 -549473 -1118590 -1468464 -1475543 -1295534
11818 -1295534 -1092136 -946680 -872880 -804306 -670932 -513210 -381933 -212625 77323 406723
11808 406723 599498 621903 579801 583652 610847 496190 229396 -23411 -163510 -185048 -73859
11797 -73859 117320 259497 347685 489291 657457 689919 523238 210713 -107841 -296119
11787 -296119 -313744 -271206 -278592 -304131 -310433 -278890 -90255 279597 722165 1123848 1375153
11776 1375153 1460438 1435523 1395071 1385811 1347296 1224756 1043275 774149 470213 155878
11766 155878 -192705 -542252 -869293 -1091942 -1154080 -1079138 -859688 -541792 -162644 279514
11756 279514 707808 1012950 1185213 1198300 1038241 883150 892384 1017864 1090047 1016887
11746 1016887 857974 694400 597317 550967 519742 510666 501253 535246 624087 714616 806492
11735 806492 926887 1006322 858232 516219 229687 79593 -7467 -48410 28009 205498
11725 205498 285040 194004 107500 149873 285777 339940 192267 -67846 -278649 -355852 -352901
11714 -352901 -353922 -352596 -364779 -490468 -715184 -893180 -949308 -935319 -997609 -1144373 -1203109
11703 -1203109 -1098303 -950022 -830161 -719160 -568645 -382919 -221632 -60106 165926
11694 165926 439722 642134 722107 706617 617894 471221 186118 -202393 -480621 -566653
11684 -566653 -544943 -457979 -310846 -142694 12541 105370 -7661 -323143 -576572 -563129
11674 -563129 -360766 -98691 159652 274041 208511 38231 -226820 -510943 -726582 -876253
11664 -876253 -932954 -875032 -771874 -710275 -653426 -527030 -359148 -217046 -7994 286817
11654 286817 543372 663357 646023 569747 416448 166014 -105114 -279000 -323064 -276333
11644 -276333 -150865 -1424 113365 142711 19597 -223696 -469956 -615563 -629064 -493189
11634 -493189 -253586 -111799 -221257 -501320 -741537 -869569 -910195 -871118 -734416 -507459
11624 -507459 -292578 -201872 -209092 -256115 -390726 -556993 -642327 -701095 -808871 -914942 -935580
11613 -935580 -870272 -762031 -682743 -738433 -892157 -962902 -922909 -853571 -842275 -873103 -850572
11602 -850572 -753272 -566353 -343788 -234339 -204643 -112626 24840 64426 -10861 -80944 -115601
11591 -115601 -206655 -412100 -649025 -781924 -774126 -714308 -701703 -808264 -1011257 -1194566
11581 -1194566 -1303553 -1370314 -1378300 -1273468 -1049400 -769432 -546305 -424245 -354044 -304694
11571 -304694 -282876 -321304 -401458 -435041 -331904 -200859 -191386 -278232 -361401 -437070 -555932
11560 -555932 -679261 -738662 -690677 -543392 -374871 -180265 155751 674260 1183640 1497349
11550 1497349 1560378 1391927 1095361 753559 427325 212120 186306 278809 384898 449617
11540 449617 465513 490642 501497 470889 464683 512262 535794 474525 357989 226228 124379
11529 124379 31566 -107122 -266357 -331066 -188945 82979 265267 305614 291004 162981
11519 162981 -138608 -432987 -529333 -458125 -353964 -301328 -325667 -377360 -430605 -563352 -799532
11508 -799532 -1030450 -1162357 -1164358 -977149 -705946 -578002 -629264 -671026 -586798 -436489
11498 -436489 -275050 -122267 28079 204577 338245 336591 235753 149620 99811 63058
11488 63058 72413 164201 328258 478086 550968 663015 930961 1224241 1440396 1568825
11478 1568825 1554984 1387062 1149141 876570 569230 266540 -23662 -211597 -175382 46797
11468 46797 264763 335115 342285 439976 595101 680033 670359 539513 292708 31713 -154559
11457 -154559 -274696 -420426 -692709 -1027406 -1183234 -1058854 -730363 -322170 10122 176645
11447 176645 231548 245668 285098 443495 722450 1056033 1397736 1696794 1894909 1906153
11437 1906153 1703578 1363867 1041319 827135 673414 495807 265193 -23106 -385614
11428 -385614 -731511 -911153 -893484 -783785 -726152 -732736 -730758 -701635 -650300 -570190 -375464
11417 -375464 -32021 271997 314962 92962 -233304 -421930 -392220 -259758 -95140 46441
11407 46441 149052 262079 359665 403124 447955 513191 520270 405150 216866 35546 -77698
11396 -77698 -107664 -56353 46154 134723 191129 248520 322231 330787 152997 -213057 -672425
11385 -672425 -1079746 -1299848 -1297529 -1156933 -963213 -736489 -444230 -57490 304295 534262
11375 534262 670092 752807 816934 854747 775909 572769 356102 255270 321887 547800
11365 547800 910752 1297864 1562205 1705884 1761485 1659106 1392499 1140313 1045214 1062256
11355 1062256 1054795 982400 922991 952413 1016149 1012159 934915 786550 604552 422704 258081
11344 258081 175437 159908 119655 51370 61718 261051 584384 842500 956396 982506 954542
11333 954542 787369 436087 51552 -181465 -252665 -230509 -95695 144507 371365 528456
11323 528456 635515 774395 991347 1248394 1495682 1731050 1908871 1899419 1731138 1615717
11313 1615717 1603280 1620796 1640019 1617329 1449536 1108970 725115 428006 302740 377829
11303 377829 580869 739612 722210 590269 547753 724496 1047425 1381693 1679282 1880906
11293 1880906 1935126 1904028 1846917 1759364 1621800 1469656 1369478 1311374 1275476 1269858 1300861
11282 1300861 1408299 1570385 1704656 1792041 1839577 1879231 1927841 1993982 2024445 1980061 1954957
11271 1954957 1972952 1992145 1984475 1888389 1741543 1638253 1589797 1598607 1661672 1764718 1916705
11260 1916705 2131046 2354851 2483209 2522975 2548415 2566185 2569247 2581022 2634863 2707699 2661828
11249 2661828 2446033 2210023 2126731 2208828 2328048 2393368 2448893 2530420 2602232 2709572
11239 2709572 2879618 3000789 2988047 2859639 2641347 2346542 2074909 1960815 2020889 2128829
11229 2128829 2199167 2244321 2271159 2312821 2427411 2642657 2938770 3277574 3561035 3662280
11219 3662280 3626129 3544129 3441476 3391423 3432227 3544355 3673043 3794557 3899159 3935783
11209 3935783 3912683 3965050 4137838 4321004 4421925 4414475 4375488 4389396 4446986 4614938 4963001
11198 4963001 5347797 5586540 5669166 5659262 5609015 5514576 5269233 4846762 4392239 4045627
11188 4045627 3810089 3614144 3358382 3065682 2878597 2859110 2938417 2959453 2829835 2589728
11178 2589728 2356815 2183001 2041843 1915236 1777311 1654028 1688784 1902238 2097119 2153492
11168 2153492 2164739 2239163 2332848 2375685 2343512 2259734 2200159 2174661 2132141 2050470 1975786
11157 1975786 1998895 2150980 2364665 2566286 2697620 2672450 2473589 2241517 2138563 2172830
11147 2172830 2312811 2534669 2725554 2813029 2900908 3086433 3339610 3594931 3734063 3678066
11137 3678066 3538035 3535953 3728924 3959069 4045936 3946649 3791489 3668069 3573304 3538678
11127 3538678 3570458 3628850 3670231 3725173 3840510 3967703 4085635 4222825 4368530 4478502
11117 4478502 4514945 4443893 4282833 4083391 3820451 3497446 3157320 2841399 2666618 2686328
11107 2686328 2809953 2898745 2902280 2830399 2710839 2635786 2654623 2776917 3022436 3304833
11097 3304833 3482427 3568383 3643955 3669429 3619401 3581232 3573838 3538274 3543243 3679482 3852569
11086 3852569 3967990 4043438 4090676 4108429 4122626 4134004 4152169 4240695 4418189 4664952 4982603
11075 4982603 5388126 5871678 6373628 6924215 7567926 8181150 8643729 8988309 9232634
11066 9232634 9338947 9355875 9256293 8930001 8413813 7847215 7339039 6867496 6367447 5928259
11056 5928259 5631680 5406871 5237711 5212980 5360653 5596604 5791188 5876375 5870139 5874859
11046 5874859 5977206 6114606 6288906 6625724 7187011 7983027 8911681 9784311 10448245
11037 10448245 10826807 10929133 10791120 10456377 9989703 9484067 9005331 8579075 8157462
11028 8157462 7707494 7280097 6856061 6415757 6077161 5923466 5868351 5797430 5691752 5613574
11018 5613574 5699227 5973242 6206182 6257663 6227659 6201483 6213082 6277600 6356029 6478125 6703811
11007 6703811 7039137 7404254 7636849 7625889 7469176 7440717 7782056 8464087 9246750 10052702
10997 10052702 10904776 11637471 12121531 12415929 12551202 12535055 12476136 12485962 12502039 12259384
10987 12259384 11664736 10989434 10402128 9847828 9362421 8985764 8640955 8310560 8113832
10978 8113832 8098635 8177196 8278593 8459406 8733149 9050997 9436365 9879951 10172142 10131953
10968 10131953 9788918 9234300 8546449 7851399 7265649 6756559 6260358 5831443 5584098
10959 5584098 5512516 5523116 5498286 5412181 5250798 4955986 4608801 4348461 4181145 4104726
10949 4104726 4142826 4196808 4155197 4026630 3830627 3595923 3370337 3184258 3082680 3156303
10939 3156303 3371208 3517456 3478497 3263607 2906836 2482908 2131012 1910813 1705578 1450070
10929 1450070 1230104 1069134 973091 1059973 1339338 1590453 1586305 1355698 1176365 1286252
10919 1286252 1603167 1835400 1835296 1706788 1640168 1734466 1958932 2232850 2418328 2391577
10909 2391577 2272475 2292605 2438938 2541271 2539004 2567894 2753839 3074832 3360861 3428650
10899 3428650 3217824 2838881 2501742 2202136 1827777 1377782 944094 620406 496459
10890 496459 622758 875861 1082205 1138005 1087663 1099605 1112089 932139 582716 276915
10880 276915 179259 305067 545677 783843 970563 1138155 1340009 1520947 1548695 1387929
10870 1387929 1158917 961866 834881 785360 795137 862253 879127 794245 644643 513046
10860 513046 512233 601877 629540 635817 715489 771442 685300 538569 524353 675394 870370
10849 870370 980806 960617 865127 815335 824576 777255 650924 529350 497589 606705 774206
10838 774206 877453 904557 937414 1042430 1180867 1237068 1143852 936383 724927 591039
10828 591039 445897 182362 -62113 -150839 -213499 -238769 -87526 169954 324826 279282
10818 279282 105123 -34504 27734 279569 487020 479725 329570 134555 -43381 -128335
10808 -128335 -89012 9835 51818 -109276 -468221 -814653 -956409 -891403 -770486 -758953
10798 -758953 -883279 -998117 -991795 -881020 -696540 -495584 -385506 -364119 -311500 -235280
10788 -235280 -239328 -273803 -303331 -403264 -515510 -501285 -370561 -288572 -306212 -306806 -198729
10777 -198729 -18805 167155 286320 276883 108756 -184626 -489938 -697537 -735983 -564843
10767 -564843 -274500 -53801 11368 41732 142500 312598 521840 671098 689795 598686
10757 598686 406742 118552 -213839 -485698 -609839 -598123 -579504 -629980 -644844 -540449
10747 -540449 -428880 -425851 -470359 -537701 -643670 -714482 -678042 -532829 -410656 -445981 -588148
10736 -588148 -631841 -444013 -102904 228323 459391 600440 719649 846551 870182 749392
10726 749392 550697 304860 83788 -37712 -46468 18134 127273 334696 557739 670135
10716 670135 707745 721985 676860 536593 300063 -36360 -374210 -564160 -610063 -681064
10706 -681064 -802968 -859451 -866596 -859823 -779574 -517265 -109858 321924 718361 1017982 1159536
10695 1159536 1104652 874225 558723 210344 -160446 -555919 -969200 -1274369 -1346929 -1172890
10685 -1172890 -819697 -378165 62672 401236 549007 446094 164978 -79724 -153103 -74696
10675 -74696 62378 141958 188130 205451 184067 175697 135336 5434 -182345 -330927 -392706
10664 -392706 -379580 -265370 -20083 217948 266912 189407 121505 -12324 -293132 -624406
10654 -624406 -857192 -938112 -923733 -892104 -840118 -734144 -613846 -444191 -195759 -5254
10644 -5254 30802 -32316 -139759 -263371 -376368 -459846 -474921 -395234 -233117 -78373 10237
10633 10237 56492 92575 70635 -25771 -127473 -170662 -169967 -222234 -396786 -623303 -705765
10622 -705765 -628388 -513810 -376397 -166880 50293 162088 97957 -141686 -427990 -594762
10612 -594762 -594838 -504665 -400769 -284624 -196766 -295580 -623112 -1020376 -1314821 -1423800 -1359342
10601 -1359342 -1251279 -1183380 -1138808 -1002094 -684704 -227412 267326 715821 1020685 1172090
10591 1172090 1194446 1011762 638673 241417 -88935 -338541 -496849 -626898 -775018 -845568
10581 -845568 -706541 -382719 -17151 330429 665581 879191 843251 622008 429104 341318
10571 341318 296954 295431 352120 456854 558071 650039 762333 865135 871273 729623 504063
10560 504063 310190 182408 56750 -101271 -219522 -267034 -287633 -293866 -279145 -247024 -169169
10549 -169169 -76589 -57275 -48030 17327 29978 -87536 -306481 -605668 -913266 -1153951 -1262600
10538 -1262600 -1203747 -1033268 -808205 -511086 -211504 -10932 87881 106326 34685 -105030
10528 -105030 -188786 -91793 92419 145541 -8999 -284562 -567682 -717789 -687929 -578710
10518 -578710 -470265 -383862 -279280 -198907 -222821 -284509 -205201 28273 198960 245389 307627
10507 307627 472863 753666 1095620 1281432 1196781 925297 540631 146066 -166181 -407474
10497 -407474 -575605 -622418 -534695 -424866 -401295 -463734 -537008 -527537 -417773 -378834 -531400
10486 -531400 -779463 -969925 -1036897 -969457 -831168 -729875 -652006 -484351 -270000 -149760
10476 -149760 -178296 -326558 -465899 -487226 -468970 -458316 -382643 -224979 -22798 131044
10466 131044 156164 56066 -105120 -234094 -311814 -442241 -705571 -1025845 -1196070 -1137655
10456 -1137655 -997323 -806617 -530486 -304091 -235591 -288296 -402793 -483146 -482012 -404506
10446 -404506 -234560 -21621 124777 101453 -90591 -366514 -619911 -799128 -915868 -1008995
10436 -1008995 -1080124 -1097178 -1071193 -930876 -652488 -369471 -183297 -84980 -47544 -51216 14368
10425 14368 198858 317844 275599 214969 287260 459496 604716 760619 937656 1029375
10415 1029375 1051898 1101006 1111363 984394 702288 352241 117425 64343 87083 15592
10405 15592 -167117 -308544 -309389 -178671 -53287 -54300 -101310 -46241 39246 -21086 -170570
10394 -170570 -222241 -193082 -163984 -169691 -240890 -431315 -704023 -825539 -694624 -485667 -348320
10383 -348320 -304514 -343533 -464498 -554730 -477817 -239219 70338 334113 520817 682655
10373 682655 875325 1134290 1397735 1531076 1533619 1475599 1315261 996070 575857 141969
10363 141969 -132288 -126961 10682 117161 98484 86503 302156 631125 906343 1093994
10353 1093994 1126755 965795 650916 336925 137768 25605 -77121 -159896 -159490 -69305
10343 -69305 109952 399027 711167 973476 1242540 1484007 1569345 1506927 1376839 1172324
10333 1172324 920384 726188 631941 579056 507450 376503 201758 52401 -7590 105062
10323 105062 398262 728322 923147 882112 608569 267552 -15097 -238457 -436180 -602997
10313 -602997 -685735 -708780 -698457 -657106 -627720 -603756 -516953 -363224 -190612 -35557 38493
10302 38493 -30387 -156008 -247440 -295231 -309300 -291175 -153186 164725 515301 660979 507023
10291 507023 293755 271817 412239 566019 684075 845016 1064155 1293887 1468775 1538283
10281 1538283 1537277 1471292 1267415 1006664 834752 711157 520717 366295 425675 654305
10271 654305 833226 798400 616617 451553 356063 297263 278272 348796 527699 803249
10261 803249 1085316 1228600 1173758 933721 592989 246020 -128581 -515255 -801759 -885020
10251 -885020 -781366 -616178 -516579 -514917 -483764 -329320 -124276 40703 204168 350884
10241 350884 378642 341912 398836 541656 564014 374733 107595 -84943 -107107 27784
10231 27784 190786 291240 267466 112725 -56566 -207746 -380532 -493701 -506784 -486847
10221 -486847 -509790 -551160 -500403 -326227 -189818 -247626 -437452 -637709 -778261 -853170
10211 -853170 -970334 -1178177 -1360372 -1401576 -1307832 -1125961 -898054 -622390 -332947 -107408
10201 -107408 29639 66404 35527 -81673 -260261 -385292 -484849 -574149 -595127 -565886 -460127
10190 -460127 -216503 88696 256255 246562 170143 79216 -26398 -103767 -152700 -146320 -55402
10179 -55402 40054 32455 -161287 -491022 -790524 -992527 -1220905 -1530263 -1794224 -1867198
10169 -1867198 -1671315 -1360236 -1098848 -885809 -711669 -599885 -555948 -607712 -708733 -757735
10159 -757735 -742433 -649636 -479128 -326902 -290130 -430091 -706241 -1017555 -1268119 -1364751
10149 -1364751 -1309368 -1162952 -938585 -733699 -672051 -722339 -771998 -779031 -703127 -477093 -208047
10138 -208047 -3440 126837 217356 361729 523089 538974 414570 287937 182267 4163
10128 4163 -201604 -303988 -261791 -103924 50438 84885 66976 86810 173437 285595 430748
10117 430748 653985 876241 956115 888241 748342 587988 489138 537856 658551 653581 487980
10106 487980 256344 60749 -16635 5156 8198 -72188 -189175 -281576 -385659 -565130 -749273
10095 -749273 -836135 -858146 -880783 -891307 -896493 -902943 -881255 -819042 -684891 -528257 -475264
10084 -475264 -515140 -535117 -552655 -611713 -647581 -537112 -311250 -159263 -206711 -422989 -657603
10073 -657603 -774946 -852699 -948436 -948963 -821884 -729840 -802505 -934408 -987222 -949885 -848441
10062 -848441 -724626 -701025 -900844 -1233712 -1541472 -1728856 -1778055 -1733117 -1619968 -1516305
10052 -1516305 -1431811 -1378014 -1432135 -1534801 -1600323 -1708356 -1857266 -1886349 -1722490 -1531985
10042 -1531985 -1525346 -1688453 -1857377 -1961622 -2024749 -1940509 -1591777 -1049765 -570741 -411301
10032 -411301 -540326 -664109 -565149 -332687 -156115 -86436 -100223 -191761 -254989 -170044 -1617
10021 -1617 96192 77839 -1782 -53957 -4164 76507 39849 -119992 -263253 -319937 -257213
10010 -257213 -19100 309796 576979 703883 684608 638085 668562 720601 684827 534851
10000 534851 389084 377320 436819 458590 377003 261879 259616 360531 416459 348180 210308
9989 210308 56212 -54857 7231 243274 441964 543984 629083 669563 635397 576289 522663
9978 522663 475527 442925 371345 162793 -151839 -426299 -590224 -671032 -687341 -630794 -498929
9967 -498929 -368921 -264329 -113231 169172 503291 714364 712014 475411 150944 -75257
9957 -75257 -198418 -288298 -347578 -359007 -277539 -124618 10227 92942 85302 43269 110559
9946 110559 243340 261378 177799 120085 134173 177337 195726 233136 356944 510233 649076
9935 649076 807087 981495 1108455 1128501 1049410 920874 793919 746695 771608 795370 846613
9924 846613 936119 1049102 1164832 1234190 1233916 1148290 966698 756602 667474 732752 770137
9913 770137 629166 405750 266788 255085 379037 607335 835851 934986 843832 772535
9903 772535 928341 1134269 1137043 961175 684966 341627 14279 -251433 -446396 -527871
9893 -527871 -413543 -119326 223286 448265 444239 239434 -71533 -330061 -429945 -431190 -416317
9882 -416317 -343476 -206513 -6000 303962 673283 923822 976484 999778 1100945 1137939
9872 1137939 1051970 942922 858449 773014 675593 610035 548971 430597 279703 160274 59056
9861 59056 -85229 -303351 -636308 -996445 -1169561 -1096458 -910005 -643701 -264305 161816
9851 161816 482238 628338 689078 708256 694489 647669 561799 487901 522332 703669 937120
9840 937120 1038003 996583 952284 974075 992027 988470 1045453 1182222 1376676 1606767 1765435
9829 1765435 1780498 1638575 1418582 1179869 874916 528193 211867 -7177 -40018 66805
9819 66805 145369 29214 -302526 -662356 -890707 -919653 -728536 -407376 -119837 76272
9809 76272 180972 210570 243598 327203 445063 554698 712200 912226 1016909 980859 844429
9798 844429 620184 396802 307063 354016 431265 441266 371936 299926 233951 141628 107028
9787 107028 152554 150092 95805 114387 244794 495148 866304 1337484 1838910 2229539 2417486
9776 2417486 2395382 2241817 2036930 1889534 1914393 2029076 2173973 2329617 2432115 2487171
9766 2487171 2566601 2642754 2582872 2376206 2126891 1938707 1831023 1738620 1639402 1520379
9756 1520379 1312021 1015070 737362 544499 424245 343381 278525 193232 82489 22584
9746 22584 143788 491745 913757 1285000 1587548 1801397 1903196 1946374 2050597 2254423
9736 2254423 2524339 2781336 2948984 2994016 2867260 2643012 2438215 2290170 2238990 2250794
9726 2250794 2235174 2211522 2321748 2608187 2908579 3100583 3242140 3349004 3368423 3323679
9716 3323679 3202314 3040869 2927808 2871736 2870213 2895519 2933547 3027590 3219909 3562936 3964835
9705 3964835 4177407 4157701 4082476 4116986 4199749 4216557 4155937 4086012 4130221 4236726 4176065
9694 4176065 3896506 3568396 3341597 3174052 2961289 2706832 2454996 2217637 1988317 1781990
9684 1781990 1677932 1717443 1804645 1893577 2113785 2461863 2766758 2931274 2941379 2818669
9674 2818669 2684324 2703039 2829047 2920598 2902142 2799404 2737996 2784643 2853058 2832215 2702003
9663 2702003 2529643 2342707 2126541 2000335 2066761 2199748 2174226 1997854 1834318 1742484
9653 1742484 1725635 1763031 1789169 1858960 1940198 1943580 1936206 1929941 1853221 1704782 1557365 1454595
9641 1454595 1349560 1151672 890584 677770 566121 543496 570804 603507 630708 605706
9631 605706 438576 149107 -43029 11815 276800 627213 920422 1181639 1456101 1652163
9621 1652163 1731629 1725947 1620973 1448145 1308118 1339841 1569920 1864309 2129212 2211772
9611 2211772 2039134 1749955 1504071 1382451 1385675 1455108 1518239 1500267 1363786 1136003
9601 1136003 863364 616329 498998 595947 917913 1336298 1678397 1811102 1638091 1270006
9591 1270006 991786 896049 804348 563197 214955 -113133 -282487 -238274 -130192 -103024
9581 -103024 -115903 -132588 -91607 120193 497241 935193 1337080 1642674 1821911 1944895
9571 1944895 2067371 2109470 2049689 2031326 2168674 2414449 2657474 2799066 2780682 2534387
9561 2534387 2159709 1986932 2129267 2427683 2738692 3013782 3194197 3223685 3129368 3052091
9551 3052091 3079083 3109557 3073409 2934232 2597159 2066394 1540148 1188872 1008080 1025559
9541 1025559 1296667 1608826 1657262 1414896 1048233 690352 453108 367924 422038 625927
9531 625927 895760 1128369 1402929 1760597 2045685 2104097 1924770 1687709 1563520 1543225
9521 1543225 1548754 1625440 1849383 2098325 2194496 2196112 2227106 2262472 2262447 2185840 2017544 1853796
9509 1853796 1708995 1507625 1275816 1031088 832425 749587 786350 988503 1284761 1533043
9499 1533043 1718677 1889320 2006863 2013663 1969161 1890396 1711451 1517487 1416295 1425180 1508792
9488 1508792 1633259 1820683 2030753 2162593 2184337 2188508 2280660 2437201 2584244 2611157
9478 2611157 2497026 2256197 1917515 1549236 1210113 992601 952195 1000777 1049358 1074996
9468 1074996 1058161 966001 791852 614420 532429 513121 488936 543180 795142 1213888 1637928
9457 1637928 1979296 2219092 2355799 2412502 2333053 2165023 2131343 2293583 2429052 2340935
9447 2340935 2080459 1851233 1770335 1848042 2053455 2250985 2323030 2260869 2093903 1840446
9437 1840446 1505920 1143596 883326 819719 968881 1276853 1639797 1880273 1769176 1341866
9427 1341866 892546 607849 493546 480718 511395 612776 842157 1155218 1420488 1480839
9417 1480839 1367178 1282800 1283687 1291166 1206374 982205 681057 388805 152542 14947 41962
9406 41962 174962 283018 306617 293193 305852 390221 600298 883458 1076856 1094224 1042327
9395 1042327 1009912 948865 802837 621169 506071 452439 359895 197417 -33638 -209796
9385 -209796 -147109 77502 277142 363656 311637 126749 -125991 -280092 -192710 99852
9375 99852 426922 659972 778742 784277 704926 605597 457545 169069 -182655 -444088 -556292
9364 -556292 -541993 -449378 -337997 -266868 -203765 -142771 -131027 -111658 -7325 159876 288614
9353 288614 337705 296410 76819 -357333 -836520 -1122706 -1227117 -1342245 -1555723 -1812993
9343 -1812993 -2004046 -2003629 -1882745 -1791526 -1690058 -1469699 -1120303 -739707 -394199 -172869
9333 -172869 -101865 -53744 60812 245810 510638 794198 876107 659866 367782 205564
9323 205564 120056 4986 -94654 -94511 -39737 -25658 -57122 -81017 -55164 3506 66034 68203
9311 68203 -3119 -13508 88920 229497 255816 95946 -86111 -139713 -60518 67656 151111
9300 151111 196410 298045 445037 471769 325246 189504 314988 756073 1340664 1859298
9290 1859298 2144085 2121634 1898210 1734649 1775716 2025047 2484321 3085700 3704131 4249077
9280 4249077 4634724 4862256 4974445 4893345 4641321 4349918 4096000 3910637 3723953 3504606
9270 3504606 3254374 2981442 2726796 2445807 2081596 1773548 1644014 1659080 1781124 1950783
9260 1950783 2037768 1942045 1746848 1539271 1274060 1004275 796010 661751 579100 461238
9250 461238 277122 71753 -51065 -27298 98826 265227 478545 683167 761346 661299
9240 661299 371094 -33238 -340125 -343493 -56710 336940 639318 792986 784895 628711
9230 628711 449245 321071 289737 391781 548834 647049 657504 581950 400330 220406
9220 220406 146929 128316 103444 134098 309892 567404 894889 1296697 1673000 1871856
9210 1871856 1760165 1417271 1035820 754624 620606 577520 615332 703839 768099 835930
9200 835930 941896 1013074 973300 870999 772771 703146 669675 684343 818222 1060443 1242202
9189 1242202 1124828 686424 230701 -44135 -150070 -130192 -107658 -206450 -411184 -588952
9179 -588952 -620041 -556571 -462282 -295155 -66887 115141 183583 148069 47593 -78085 -143852
9168 -143852 -114726 -78560 -50340 -37278 -133107 -345675 -531986 -647339 -706349 -649194 -513079
9157 -513079 -430792 -490357 -697041 -888489 -896356 -688114 -321388 105629 469526 599838
9147 599838 445411 204380 52834 52592 119379 77280 -36217 3805 196692 360125 353785
9136 353785 125537 -182845 -347592 -325033 -145451 144055 416017 620020 817626 1052188
9126 1052188 1196342 1113111 897342 686013 453337 197094 4847 -12741 158509 449348
9116 449348 760668 994993 1154223 1247035 1246678 1287906 1466932 1661838 1788857 1818567 1765788
9105 1765788 1691335 1615683 1439420 1115692 776137 555098 454337 458085 512448 501812 346405
9094 346405 99071 -91301 -189866 -225517 -208067 -174423 -216139 -442832 -774325 -984321 -1010980
9083 -1010980 -960829 -849341 -624798 -307696 9608 231289 339410 385839 441464 511037
9073 511037 550534 539707 550071 613286 641963 566750 447790 356420 231957 2032 -231847
9062 -231847 -286039 -199008 -136843 -131677 -61287 72186 190214 248120 199259 15121 -230665
9051 -230665 -464262 -662988 -777634 -782178 -713183 -595729 -453463 -386376 -407929 -466985 -459405
9040 -459405 -327588 -156683 -39279 11477 73275 271408 611595 943971 1141286 1133333
9030 1133333 962488 745639 591840 591772 727716 920325 1048428 1002660 880947 807476 803669
9019 803669 905129 1089421 1240870 1306384 1285729 1196421 1121701 1161389 1251690 1246436 1102129
9008 1102129 885279 692333 568588 498396 422489 358551 322234 195689 -57745 -337188
8998 -337188 -568817 -665177 -681382 -787559 -963166 -1090021 -1208201 -1374456 -1483953 -1447706
8988 -1447706 -1336427 -1151859 -871774 -640253 -627510 -786677 -917371 -847122 -565988 -224468
8978 -224468 -16901 3289 -98170 -233477 -394591 -582894 -710705 -659953 -418912 -111527
8968 -111527 116464 125869 -91935 -370034 -564684 -678428 -735523 -698363 -607638 -563716 -521338
8957 -521338 -429374 -402367 -544792 -725810 -770901 -764227 -837601 -967215 -997617 -825212 -583584
8946 -583584 -469760 -530741 -735907 -1079350 -1454277 -1573205 -1321220 -893467 -490813 -159440
8936 -159440 67301 142271 62532 -149650 -397623 -615322 -779772 -894755 -1068898 -1265550
8926 -1265550 -1294616 -1054564 -694164 -387439 -117739 177619 408974 388804 84546 -306546
8916 -306546 -560123 -584186 -462358 -343153 -336030 -481670 -673858 -804064 -852641 -801029 -646128
8905 -646128 -427306 -191706 17814 166138 219304 179569 171388 331412 593369 745797
8895 745797 703854 621581 602288 589729 612291 729298 890657 1011179 1042478 932875 723804
8884 723804 523738 374832 375224 637615 1067439 1513601 1849725 2035300 2133246 2074433 1846335
8873 1846335 1543294 1205628 890262 704100 747774 921585 943554 715893 333732 -59038
8863 -59038 -391145 -633754 -760566 -810973 -838501 -874847 -882128 -698160 -344344 72519 485034
8852 485034 705965 658406 508804 390567 286043 214267 171376 57737 -153451 -338013
8842 -338013 -356110 -242415 -136620 -171682 -322390 -515492 -706703 -777971 -616924 -272947
8832 -272947 54847 239154 323907 314725 133133 -226879 -645904 -973908 -1159461 -1315789
8822 -1315789 -1472423 -1492195 -1315207 -1073908 -872960 -750373 -723228 -715364 -647979 -523370
8812 -523370 -434077 -395017 -318087 -166735 -24943 18213 -50985 -160516 -281845 -434304 -614377
8801 -614377 -809078 -1030558 -1247036 -1431892 -1624227 -1810813 -1914882 -1925202 -1868565 -1744410
8791 -1744410 -1556423 -1330618 -1160909 -1001459 -750123 -480068 -373564 -536924 -861229 -1179243
8781 -1179243 -1402154 -1462659 -1309264 -962438 -552239 -236898 -62570 57650 258388 550825
8771 550825 833958 1061647 1222376 1284829 1246927 1128946 927589 620649 285536 83808
8761 83808 48390 141945 243420 150691 -160724 -457588 -543440 -417672 -190781 12649 165663
8750 165663 291700 398834 456587 404072 216577 -22502 -173821 -141547 54003 270241
8740 270241 404473 471178 490090 524534 594635 685258 746593 762432 769497 723310 544360
8729 544360 209766 -108717 -221177 -129057 91143 341937 537336 627008 650432 704183
8719 704183 769142 734251 534947 262869 64112 6315 70834 182806 296780 409922
8709 409922 460312 463124 548123 691015 758029 705346 657625 664142 618707 466178 240833
8698 240833 40800 -59298 -91427 -116597 -59398 154020 388106 492124 488225 481416 459601
8687 459601 387574 323120 308138 352831 429813 540097 707013 899700 1056182 1175766 1305650
8676 1305650 1425843 1552088 1766660 2105725 2465513 2747481 2976571 3273105 3685594 4009764
8666 4009764 4061385 3884123 3638956 3451553 3331245 3288019 3340281 3440782 3499179 3418109
8656 3418109 3125152 2672467 2215064 1917381 1879624 2051000 2265620 2398729 2470442 2529838
8646 2529838 2541143 2369267 2009779 1584644 1158261 752031 409015 103150 -256004 -586742
8636 -586742 -764966 -781100 -661591 -410149 -66499 232354 371236 309439 76599 -251058
8626 -251058 -560498 -736982 -770030 -772455 -860989 -1048422 -1239680 -1336653 -1284427 -1027473 -692710
8615 -692710 -482723 -468903 -593927 -623789 -411025 -53357 280445 490111 568541 567737 511708
8604 511708 371605 226360 171769 175080 174371 234449 367997 508865 599534 601341 603803 621273
8592 621273 515206 210926 -89398 -237723 -341058 -501017 -698161 -875078 -987036 -1023755
8582 -1023755 -920892 -699165 -505004 -353853 -221465 -114381 -11717 97854 175475 123542
8572 123542 -95767 -312861 -362295 -234267 35725 324596 537409 657007 780598 970955
8562 970955 1098109 1022526 762591 453198 239033 144065 52716 -59155 -120068 -116197 -183670
8551 -183670 -423215 -711032 -838132 -803705 -769886 -791679 -884988 -1106791 -1364408 -1551247
8541 -1551247 -1615751 -1548716 -1534648 -1672874 -1810305 -1798583 -1641655 -1393853 -1051472 -670151
8531 -670151 -310852 -43406 66869 18507 -206866 -576344 -948303 -1162234 -1225659 -1223165
8521 -1223165 -1113723 -984119 -890928 -715992 -443481 -178704 -24693 13998 33116 68871
8511 68871 20238 -160659 -403871 -660042 -934371 -1212519 -1440027 -1516952 -1364436 -1106702
8501 -1106702 -903218 -774154 -767855 -861504 -957510 -975403 -914164 -920762 -1020390 -1088333 -1106651
8490 -1106651 -1133278 -1156293 -1127390 -1064155 -991386 -944376 -997603 -1179301 -1380830 -1438803 -1268626
8479 -1268626 -960829 -726397 -621602 -492193 -277062 -147973 -169888 -273559 -374236 -438482
8469 -438482 -464466 -384412 -160484 204676 563596 764847 884409 1050465 1256573 1409535
8459 1409535 1437039 1306209 1111652 1000056 907430 699777 360870 8810 -254881 -378809
8449 -378809 -403304 -461067 -578447 -626267 -570014 -460937 -267765 -10642 166373 243479 246250
8438 246250 191177 146646 152235 224781 283438 235288 68409 -249431 -684102 -989175 -981869
8427 -981869 -792550 -653812 -660251 -779915 -974110 -1131346 -1124352 -966717 -802259 -766002 -848789
8416 -848789 -936372 -988895 -1003749 -970743 -957803 -1026004 -1120321 -1151127 -1192455 -1272622 -1286515 -1225802
8404 -1225802 -1235301 -1368472 -1465447 -1361236 -1083546 -840368 -777272 -858587 -1002490 -1088184 -1062283
8393 -1062283 -1055749 -1142435 -1199827 -1109561 -926273 -774069 -705657 -667784 -566494 -305670 27218
8382 27218 194882 130982 -25963 -143906 -199999 -192817 -180956 -216528 -303857 -453676 -622275
8371 -622275 -752919 -889505 -1040819 -1100092 -960044 -762923 -770105 -911829 -938391 -786092
8361 -786092 -510491 -216197 4550 144353 227177 320317 521504 833940 1073157 1051559
8351 1051559 889097 791547 720012 601133 447795 235164 -40561 -280492 -436268 -517171
8341 -517171 -554707 -536302 -355493 30976 470801 746804 763908 514434 162473 -72053
8331 -72053 -88582 53607 235244 348556 300163 125778 44405 118822 266472 449283 624808
8320 624808 764250 821033 763567 615395 484284 475624 526413 514232 464197 346369 123186
8309 123186 -51729 -121446 -257639 -542283 -841621 -1033994 -1110839 -1133220 -1144212 -1069706 -903929
8298 -903929 -707018 -507659 -396907 -385468 -434282 -542966 -601144 -527519 -377647 -281035 -401063
8287 -401063 -662115 -836783 -788499 -558075 -303324 -56635 210124 362922 282435 61747
8277 61747 -187016 -445921 -643622 -689700 -644992 -612333 -574707 -527629 -463208 -329716 -127207
8266 -127207 92277 230754 218795 117076 48110 40692 -8154 -193671 -437667 -556391 -508004
8255 -508004 -431112 -482419 -655321 -755764 -702694 -568373 -391280 -187181 -37890 -41564 -185560
8244 -185560 -375052 -577061 -722705 -790718 -841565 -842815 -741860 -569823 -417346 -258209
8234 -258209 9928 256065 387914 492896 585843 565915 370851 106997 -94230 -179507
8224 -179507 -244157 -403246 -631301 -834163 -934330 -934373 -922038 -949396 -1021736 -1093115 -1030039
8213 -1030039 -802468 -476613 -117125 207233 385033 326583 87829 -183994 -326800 -237978
8203 -237978 3713 266923 483924 631773 753634 825447 759436 610268 442394 242874
8193 242874 31798 -98069 -30611 142391 240900 324365 500415 747272 978737 1031687
8183 1031687 746990 198307 -283614 -500694 -555069 -589860 -601341 -512559 -368541 -270358
8173 -270358 -295999 -501502 -808389 -1069685 -1183968 -1133730 -1013142 -999346 -1171866 -1397041
8163 -1397041 -1471262 -1278358 -864150 -445613 -248178 -269641 -362322 -438556 -487257 -493762 -393040
8152 -393040 -240050 -167079 -250610 -496527 -782373 -1022005 -1250458 -1428131 -1405521 -1153653
8142 -1153653 -843819 -559478 -272914 -84002 -35890 16561 140620 330780 486323 497763
8132 497763 423813 368792 344827 416020 609931 731428 624430 387985 201230 148649 203370
8121 203370 302574 371020 398129 443277 452299 365404 254232 243679 371323 564301 747459
8110 747459 866461 865959 718941 473964 297507 304716 340161 231891 -10636 -262748 -333633
8099 -333633 -201702 56030 334911 493125 591300 727201 900855 1069574 1110213 1063910
8089 1063910 1091235 1298173 1630435 1930140 2079848 2083613 2097322 2132863 2107578 2048090 1914606
8078 1914606 1691929 1388757 1079858 913144 900556 993811 1142700 1263349 1316032 1379290
8068 1379290 1591223 1968109 2424162 2834875 3062664 3101962 3079978 3071919 3039293 2877595
8058 2877595 2580257 2296506 2104102 1946389 1803233 1777438 1939930 2180782 2381389 2493731
8048 2493731 2521906 2516220 2502353 2477421 2458111 2454287 2488815 2566561 2648140 2822910 3135938
8037 3135938 3401252 3434456 3286808 3075745 2824857 2554342 2377006 2436784 2714925 3051073
8027 3051073 3315777 3523667 3733044 3911400 4097396 4336458 4604948 4827885 4983547 5080722
8017 5080722 5154727 5346073 5773828 6348904 6753739 6766140 6449757 5920302 5306073 4749056
8007 4749056 4346396 4103180 4043541 4140568 4272604 4449614 4689436 4915557 5074737 5191486
7997 5191486 5314423 5498788 5721760 5912481 6071286 6261705 6474976 6675067 6849259 6886124
7987 6886124 6703364 6475251 6454943 6706300 7109846 7501668 7787116 7964585 8084678 8205381
7977 8205381 8369639 8571575 8720274 8745398 8712620 8726141 8832532 8901551 8819608 8643030
7967 8643030 8488217 8468885 8629267 8909815 9141799 9305482 9542291 9877297 10207659 10503491
7957 10503491 10807418 11114424 11415072 11687896 11777494 11602913 11332947 11078964 10909654 10930347
7947 10930347 11128910 11426874 11753538 12023857 12183781 12227969 12229928 12217456 12069268 11748817
7937 11748817 11338683 10974220 10829813 10876360 10983082 11101220 11089945 10844304 10387671 9776996
7927 9776996 9084239 8457231 8044431 7855195 7705827 7414749 6982179 6553211 6272631 6165806
7917 6165806 6145352 6118786 6034716 5883647 5721093 5554369 5371432 5279022 5313816 5359981 5397459
7906 5397459 5522576 5716804 5878151 6025304 6160526 6183401 6044292 5743513 5330643 4923494
7896 4923494 4552060 4155516 3763640 3562752 3607939 3676737 3548784 3209079 2881452 2782210
7886 2782210 2900773 3110681 3258945 3275974 3144142 2881167 2566320 2286513 2093667 1983217
7876 1983217 1931324 1952742 2048165 2134894 2173717 2206026 2255079 2343650 2436780 2481056 2484461 2435416
7864 2435416 2326830 2160406 1920497 1614750 1284130 1005598 841990 767104 731143 755112
7854 755112 908087 1153157 1336133 1354904 1281319 1263213 1351561 1462402 1523967 1507268 1383931
7843 1383931 1119744 798295 638070 713659 870226 974484 1026236 1079052 1219933 1429929
7833 1429929 1635200 1831385 2064413 2340464 2563457 2654052 2650978 2602932 2585348 2652520 2798582
7822 2798582 3040453 3292987 3426883 3469632 3538882 3657224 3813459 3948104 3972747 3900849
7812 3900849 3837899 3882465 4079479 4304666 4387253 4365543 4272578 4078036 3918682 3893864 3984639
7801 3984639 4112703 4197315 4189512 4179560 4379730 4819110 5302992 5644992 5783220 5685110 5368717
7790 5368717 5021087 4813056 4751572 4775445 4910912 5222746 5691247 6230792 6656075 6796298
7780 6796298 6745434 6758038 6907075 7109785 7287429 7426933 7606565 7772689 7796534 7747527
7770 7747527 7834143 8157194 8623106 9137480 9668021 10220511 10664349 10856805 10907383 10930113
7760 10930113 10944917 10992523 11048965 11061127 11113365 11264798 11511436 11800446 11969601 12004425
7750 12004425 12016149 12028981 12070300 12215885 12490784 12831420 13126447 13339556 13542777 13840867
7740 13840867 14261102 14673226 14974429 15116476 15096594 14934692 14589346 14069210 13444627 12765280
7730 12765280 12110404 11623732 11382378 11289142 11207049 11141106 11133437 11135837 11032465 10681205 10080875
7719 10080875 9468278 9043977 8867138 8843293 8777245 8571164 8348325 8205456 8161546 8253456
7709 8253456 8489309 8880265 9361331 9702893 9790027 9714996 9615713 9534657 9418636 9276339
7699 9276339 9148691 8979793 8751587 8453873 8026643 7404832 6663407 6005735 5486176 4989532
7689 4989532 4453565 3970384 3590305 3332014 3274044 3413699 3587745 3628588 3542615 3429729
7679 3429729 3338112 3235700 3050653 2763947 2490880 2303124 2111449 1893263 1714328 1568667
7669 1568667 1420655 1345139 1435668 1547665 1502530 1344807 1240898 1274277 1455527 1751311
$$ [...]
##END NTUPLES=NMR SPECTRUM
##END=
