##TITLE=C13_11P153
 CDCl3, 22200 sc

 10.8.2023
##JCAMPDX= 6.0         $$ Bruker NMR JCAMP-DX V2.0
##DATA TYPE= NMR SPECTRUM
##DATA CLASS= NTUPLES
##ORIGIN= UXNMR, Bruker Analytische Messtechnik GmbH
##OWNER= root
$$ XWIN-NMR		Version 3.5
$$ Fri Aug 11 13:41:01 2023 Russian Standard Time (UT+4h)  she@DPX200
##.OBSERVE FREQUENCY= 50.327896
##.OBSERVE NUCLEUS= ^13C
##.ACQUISITION MODE= SIMULTANEOUS
##.ACQUISITION SCHEME= undefined
##.AVERAGES= 22201
##.DIGITISER RES= 17
##SPECTROMETER/DATA SYSTEM= spect
##.PULSE SEQUENCE= zgpg30
##.SOLVENT NAME= DMSO
##.SHIFT REFERENCE= (INTERNAL, DMSO, 0, 222.624)
##AUDIT TRAIL= $$ (NUMBER, WHEN, WHO, WHERE, WHAT)
$$ ##TITLE= Audit trail, XWIN-NMR		Version 3.5
$$ ##JCAMPDX= 5.01
$$ ##ORIGIN= Bruker BioSpin GmbH
$$ ##OWNER= she
$$ F:/spectra/data/she/nmr/c13/1/pdata/1/auditp.txt
$$ ##AUDIT TRAIL=  $$ (NUMBER, WHEN, WHO, WHERE, WHAT)
(   1,<2023-08-11 13:39:35.54 +0400>,<she>,<DPX200>,
      <created by zg, POWCHK disabled, PULCHK disabled
       terminated by command 'halt'
       configuration hash MD5:
       00 E9 B6 7A A2 85 ED C7 34 08 36 98 17 FE 4E 26
       data hash MD5: 32K
       A2 DF 9A A7 EB 4D 4E 3A 1F F6 C7 7E 3E 21 7D 63>)
(   2,<2023-08-11 13:39:39.42 +0400>,<she>,<DPX200>,
      <Start of raw data processing
       efp BC_mod = 2 LB = 2 FT_mod = 6 PKNL = 1 PHC0 = -378.957 PHC1 = 21.93753 SI = 32K 
       data hash MD5: 32K
       7C 1A AB 40 DC 0E C0 5A AF 59 C4 8E 49 0A 36 23>)
(   3,<2023-08-11 13:40:00.00 +0400>,<she>,<DPX200>,
      <pk PHC0 = 10.95432 PHC1 = 2.2 
       data hash MD5: 32K
       51 BE D7 C5 FE E1 15 0E 7D 20 01 02 0D 0A 22 71>)
(   4,<2023-08-11 13:40:03.65 +0400>,<she>,<DPX200>,
      <abs ABSG = 5 
       data hash MD5: 32K
       67 7B 75 97 05 C5 AA B9 7E 24 BD BE CB A1 69 6E>)
(   5,<2023-08-11 13:40:22.70 +0400>,<she>,<DPX200>,
      <pk PHC0 = -2.023632 PHC1 = 5.2 
       data hash MD5: 32K
       4F 17 FB C6 80 E6 3E 63 68 3D A7 92 8E 86 91 22>)
(   6,<2023-08-11 13:40:26.26 +0400>,<she>,<DPX200>,
      <abs ABSG = 5 
       data hash MD5: 32K
       39 CC 0E C1 49 D5 AB 0B F5 15 2B A9 10 6D 88 09>)
$$ ##END=
$$ 
$$ hash MD5
$$ 3F 7E 9B 70 46 87 A7 CC 1F 96 F5 D8 41 AA 31 F2
##$RELAX= 
##$RELAX= 
##$RELAX= 
##$RELAX= 
##$RELAX= 
##$RELAX= 
##$RELAX= 
##$RELAX= 
$$ Bruker specific parameters
$$ --------------------------
##$DU= <F:/spectra>
##$EXPNO= 1
##$NAME= <c13>
##$PROCNO= 1
##$TYPE= <nmr>
##$USER= <she>
##$AMP= (0..31)
100 100 100 100 100 100 100 100 100 100 100 100 100 100 100 100 100 100 
100 100 100 100 100 100 100 100 100 100 100 100 100 100 
##$AQSEQ= 0
##$AQ_mod= 1
##$AUNM= <au_zg>
##$AUTOPOS= <>
##$BF1= 50.322709
##$BF2= 200.13
##$BF3= 50.322709
##$BF4= 500.13
##$BF5= 500.13
##$BF6= 500.13
##$BF7= 500.13
##$BF8= 500.13
##$BYTORDA= 1
##$CFDGTYP= 0
##$CFRGTYP= 5
##$CHEMSTR= <none>
##$CNST= (0..31)
1 1 145 1 1 1 1 1 1 1 1 1 1 1 1 1 1 1 1 1 1 1 1 1 1 1 1 1 1 1 1 1 
##$CPDPRG= <waltz16>
##$CPDPRG1= <>
##$CPDPRG2= <waltz16>
##$CPDPRG3= <>
##$CPDPRG4= <mlev>
$$ [...]
##$SUBNAM4= <"">
##$SUBNAM5= <"">
##$SUBNAM6= <"">
##$SUBNAM7= <"">
##$SUBNAM8= <"">
##$SUBNAM9= <"">
##$SW= 239.972175391363
##$SWIBOX= (0..15)
0 1 3 0 0 0 0 0 0 0 0 0 0 0 0 0 
##$SW_h= 12077.2946859903
##$TD= 32768
##$TD0= 1
##$TE= 0
##$TE2= 300
##$TE3= 300
##$TEG= 300
##$TL= (0..7)
120 120 120 120 120 120 120 120 
##$TP= (0..7)
150 150 150 150 150 150 150 150 
##$TP07= 0
##$TPNAME0= <>
##$TPNAME1= <>
##$TPNAME2= <>
##$TPNAME3= <>
##$TPNAME4= <>
##$TPNAME5= <>
##$TPNAME6= <>
##$TPNAME7= <>
##$TPOAL= (0..7)
0.5 0.5 0.5 0.5 0.5 0.5 0.5 0.5 
##$TPOFFS= (0..7)
0 0 0 0 0 0 0 0 
##$TUNHIN= 0
##$TUNHOUT= 0
##$TUNXOUT= 0
##$USERA1= <user>
##$USERA2= <user>
##$USERA3= <user>
##$USERA4= <user>
##$USERA5= <user>
##$V9= 5
##$VALIST= <valist>
##$VCLIST= <CCCCCCCCCCCCCCC>
##$VD= 0
##$VDLIST= <DDDDDDDDDDDDDDD>
##$VPLIST= <PPPPPPPPPPPPPPP>
##$VTLIST= <TTTTTTTTTTTTTTT>
##$WBST= 1024
##$WBSW= 4
##$XGAIN= (0..3)
0 0 0 0 
##$XL= 0
##$YL= 0
##$YMAX_a= 120898310
##$YMIN_a= -62676373
##$ZGOPTNS= <>
##$ZL1= 120
##$ZL2= 120
##$ZL3= 120
##$ZL4= 120
##$ABSF1= 222.624
##$ABSF2= -17.3728
##$ABSG= 5
##$ABSL= 3
##$ALPHA= 0
##$AQORDER= 0
##$ASSFAC= 0
##$ASSFACI= 0
##$ASSFACX= 0
##$ASSWID= 0
##$AUNMP= <proc_1d>
##$AZFE= 0.1
##$AZFW= 0.5
##$BCFW= 0
##$BC_mod= 2
##$BYTORDP= 0
##$COROFFS= 0
##$CY= -3
##$DATMOD= 1
##$DC= 0
##$DFILT= <>
##$DTYPP= 0
##$F1P= 0
##$F2P= 0
##$FCOR= 0.5
##$FTSIZE= 32768
##$FT_mod= 6
##$GAMMA= 0
##$GB= 0
##$INTBC= 1
##$INTSCL= 4.134877e-10
##$ISEN= 128
##$LB= 2
##$LEV0= 0
##$LPBIN= 0
##$MAXI= 10000
##$MC2= 0
##$MEAN= 0
##$ME_mod= 0
##$MI= 0.1934396
##$NCOEF= 0
##$NC_proc= 2
##$NLEV= 6
##$NOISF1= 120.0001
##$NOISF2= 80.00006
##$NSP= 0
##$NTH_PI= 0
##$NZP= 0
##$OFFSET= 222.624
##$PC= 1.4
##$PHC0= -370.0263
##$PHC1= 29.33753
##$PH_mod= 1
##$PKNL= yes
##$PPARMOD= 0
##$PSCAL= 0
##$PSIGN= 0
##$REVERSE= no
##$SF= 50.3227315983092
##$SI= 32768
##$SIGF1= 140
##$SIGF2= 120
##$SINO= 11.81781
##$SIOLD= 32768
##$SREGLST= <13C.CDCl3>
##$SSB= 0
##$STSI= 32768
##$STSR= 0
##$SW_p= 12077.2946859903
##$SYMM= 0
##$S_DEV= 0
##$TDeff= 32768
##$TDoff= 0
##$TI= <>
##$TILT= no
##$TM1= 0
##$TM2= 0
##$TOPLEV= 0
##$USERP1= <user>
##$USERP2= <user>
##$USERP3= <user>
##$USERP4= <user>
##$USERP5= <user>
##$WDW= 1
##$XDIM= 32768
##$YMAX_p= 454072499
##$YMIN_p= -1758192
$$ End of Bruker specific parameters
$$ ---------------------------------
##NTUPLES= NMR SPECTRUM
##VAR_NAME=  FREQUENCY,     SPECTRUM/REAL,   SPECTRUM/IMAG
##SYMBOL=    X,             R,               I
##VAR_TYPE=  INDEPENDENT,   DEPENDENT,       DEPENDENT
##VAR_FORM=  AFFN,          ASDF,            ASDF
##VAR_DIM=   32768,         32768,           32768
##UNITS=     HZ,            ARBITRARY UNITS, ARBITRARY UNITS
##FACTOR=    0.368581032318806, 1,           1
##FIRST=     11203.0474430531, 0,            0
##LAST=      -874.247242937185, 0,           0
##MIN=       -874.247242937185, -1758192,    0
##MAX=       11203.0474430531, 454072499,    0
$$ Real data points
##PAGE= N=1
##DATA TABLE= (X++(R..R)), XYDATA
$$ [...]
18138 -499191 -442601 -401219 -366304 -277503 -129049 28124 126816 142523 105739 74084 72797
18127 72797 86928 99481 107010 66390 -67781 -271250 -520788 -792069 -1037926 -1139243 -990522
18116 -990522 -668091 -368861 -171123 -59170 40301 154086 153180 -11806 -238228 -418233
18106 -418233 -512355 -533188 -528765 -522743 -488489 -456160 -509807 -656682 -799663 -870761 -890461
18095 -890461 -912513 -904048 -784078 -560958 -295852 -102953 -76855 -165475 -246408 -289143 -320736
18084 -320736 -297793 -159177 50228 221369 283024 218111 95695 -15627 -113917 -189127
18074 -189127 -203396 -175481 -156136 -121647 -21003 83436 68046 -97336 -328222 -548486
18064 -548486 -748067 -874823 -822694 -601493 -307982 -54574 -11830 -156149 -259840 -247893
18054 -247893 -190989 -181217 -257069 -365936 -409993 -343550 -210417 -46452 80945 118962 83084
18043 83084 764 -113602 -235714 -360411 -509051 -710835 -903610 -948776 -815036 -578465
18033 -578465 -295559 -23524 162339 213791 136371 -34562 -228130 -378203 -517586 -648510
18023 -648510 -668876 -555882 -393179 -255408 -189205 -238987 -373290 -509190 -599088 -647232
18013 -647232 -668858 -680929 -707489 -729378 -736362 -779719 -841021 -850801 -799618 -713739 -629011 -536598
18001 -536598 -367792 -152979 -6073 64118 66803 5482 -59084 -129357 -248777 -374327 -415258
17990 -415258 -366185 -343877 -418176 -520522 -583367 -619227 -656453 -676463 -623138 -412451 -80725
17979 -80725 197083 361097 452895 483026 435183 321757 170856 19458 -42240 32446 186872
17968 186872 322165 397537 480786 626151 735060 717904 637175 551915 477062 459985 480134
17957 480134 427120 242188 -658 -212868 -365691 -451925 -492288 -464997 -307871 -85596
17947 -85596 44546 69303 78034 68073 -27973 -190840 -363385 -505061 -590225 -669909 -779419
17936 -779419 -855228 -834117 -730369 -638028 -610952 -604166 -584125 -545803 -460553 -340184 -242856
17925 -242856 -186545 -151641 -84516 27626 189699 332146 330121 178431 -5977 -89587 -64781
17914 -64781 -23288 8424 31209 21877 -31830 -83337 -101611 -134580 -195817 -288568 -463678 -739783
17902 -739783 -1009202 -1180608 -1260253 -1212941 -1010422 -753883 -583998 -570530 -643807 -648412 -513867
17891 -513867 -295898 -83743 98068 265838 329939 221901 -27940 -331435 -579184 -660412
17881 -660412 -515219 -248260 -37718 46466 18660 -62388 -120441 -116305 -75952 -30802 -11699
17870 -11699 -72648 -230365 -425329 -541835 -552576 -510669 -441737 -348561 -222641 -77191 39860
17859 39860 47519 -31615 -72163 -59326 -64242 -104421 -154111 -182493 -150389 -83160 -67847 -147567
17847 -147567 -315435 -535803 -706830 -735459 -644356 -524247 -402484 -268214 -155985 -125076
17837 -125076 -191747 -316734 -410707 -434320 -487629 -614419 -691991 -665035 -612231 -581206 -550433
17826 -550433 -484293 -428264 -436220 -501422 -554040 -561656 -555560 -529993 -503115 -513059 -544295 -529714
17814 -529714 -453241 -358238 -292847 -229608 -144053 -99832 -174161 -352205 -532616 -664578 -772258
17803 -772258 -846648 -799461 -621706 -461976 -404997 -374577 -323295 -292280 -287925 -285433 -250360
17792 -250360 -191987 -98989 46447 154145 145031 35759 -98105 -157676 -116722 -92528 -170281
17781 -170281 -265477 -321292 -342553 -292397 -198471 -146245 -169114 -259591 -375065 -465237 -510468
17770 -510468 -517470 -540454 -631165 -758892 -797896 -651928 -382636 -119603 77693 181794
17760 181794 164520 31117 -155866 -321847 -425360 -420295 -302084 -146891 -42354 -58424
17750 -58424 -172576 -244096 -162164 23376 149030 105150 -61434 -249737 -387628 -412059
17740 -412059 -267838 11797 323816 593450 749608 757110 612724 338589 65346 -97689
17730 -97689 -152315 -138222 -100798 -49126 51172 170448 222264 174694 82931 -15845 -119032
17719 -119032 -185763 -140346 6039 185004 354801 415114 277444 13995 -228393 -396165
17709 -396165 -508737 -553492 -540462 -553605 -639177 -732464 -771385 -792798 -841801 -878078 -870234
17698 -870234 -822926 -733004 -646179 -627605 -670626 -718331 -702302 -613189 -535255 -508516 -519193
17687 -519193 -527845 -495327 -371195 -150691 44404 79795 -35818 -202974 -348975 -418110
17677 -418110 -406185 -367199 -327683 -280932 -228605 -187788 -198740 -243914 -252700 -205933 -146346 -109680
17665 -109680 -57945 31799 124053 179064 178260 152775 133623 144967 215873 305806 305734 190677
17653 190677 30058 -172200 -421803 -615823 -647637 -523151 -295653 -12409 248406 407880
17643 407880 481506 544444 635474 720594 718028 593960 399823 199677 49392 -8415 23801
17632 23801 78272 42083 -112389 -290356 -396402 -355705 -191652 -50063 -12408 -55364 -165259
17621 -165259 -288618 -316012 -267498 -219355 -170357 -90755 75467 301013 480008 584290
17611 584290 611312 576751 498632 367482 238589 209583 253276 233184 109022 5201 11407
17600 11407 122723 285824 405272 427919 372296 250216 67030 -170166 -418541 -600509
17590 -600509 -713546 -771117 -726740 -562810 -375983 -300508 -359705 -513420 -696487 -792281
17580 -792281 -756050 -601817 -413705 -322188 -305448 -218613 -59211 78625 192861 271403
17570 271403 253818 152422 58960 -10154 -82651 -155682 -266006 -431940 -609998 -736729
17560 -736729 -802544 -845288 -899524 -936355 -861092 -660116 -444044 -302454 -247646 -219158 -170488
17549 -170488 -120401 -115579 -185416 -336231 -547972 -728397 -792280 -766193 -730650 -697428 -642390
17538 -642390 -548373 -424555 -348970 -338203 -314515 -210448 -23517 208288 419558 577078
17528 577078 668992 685086 667863 665616 658463 557449 339830 112691 -27808 -86513 -107333
17517 -107333 -84502 45771 229811 342379 382722 430784 484558 497308 478873 443178 401860
17506 401860 383506 381544 371881 320240 185996 -44330 -330206 -580490 -730165 -779166 -763647
17495 -763647 -720334 -670756 -608102 -557588 -557409 -601626 -663096 -695542 -675789 -565245 -397050
17484 -397050 -281453 -223628 -184001 -129318 -2493 168463 292270 307958 209584 21119
17474 21119 -160961 -251291 -236384 -173731 -117343 -42033 53690 123802 125993 57918 -40892 -94209
17462 -94209 -77719 -73223 -92691 -103358 -115666 -134269 -135019 -65629 60634 140276 139875 106673
17450 106673 113283 228002 361706 376889 261883 105232 -24583 -112881 -122986 -82338 -77366
17439 -77366 -134912 -229145 -261743 -194825 -130574 -154358 -254866 -357153 -367726 -259575 -67565
17428 -67565 92546 107652 -11881 -209818 -429616 -581043 -632426 -669555 -795374 -1008572
17418 -1008572 -1252347 -1478686 -1632970 -1697784 -1655952 -1464986 -1203680 -989988 -831735 -697938
17408 -697938 -563886 -399946 -233001 -126018 -144474 -255771 -289921 -137021 101340 218015
17398 218015 122860 -128915 -437172 -690184 -814660 -819768 -766460 -679652 -576272 -570928 -679597
17387 -679597 -766611 -777463 -773219 -756705 -646038 -444071 -239516 -113973 -95606 -158794 -259924
17376 -259924 -312937 -272718 -208115 -158634 -99451 -38414 -23292 -92431 -211589 -309991 -359994
17365 -359994 -303488 -138031 42000 177773 244907 256702 211271 80367 -87393 -185161
17355 -185161 -175136 -120642 -71434 -37570 -26685 -16527 20178 21226 -69347 -188986 -261337
17344 -261337 -310386 -351890 -396920 -486537 -580420 -626033 -638073 -606022 -498636 -343247 -201793
17333 -201793 -144475 -189470 -271014 -339888 -365268 -305967 -200915 -107734 -59226 -63475 -105215
17322 -105215 -157892 -188290 -182254 -103364 34527 139254 150598 102677 48627 -38193 -159251
17311 -159251 -241852 -276125 -271486 -178552 -72473 -66486 -150767 -261856 -323618 -344251 -335585 -267852
17299 -267852 -153928 -35392 37016 55354 83622 139408 156706 156778 206047 271062 322334 371562
17287 371562 425840 471343 497519 521373 533496 491682 427089 399279 359444 199178 -72890
17276 -72890 -347511 -536387 -589612 -540250 -490130 -490696 -516510 -518467 -457112 -334958 -213989
17265 -213989 -157335 -151587 -176668 -166619 -47114 135414 268529 316384 347597 416772 475581
17254 475581 467761 397636 327233 352325 507112 724286 889143 920918 829321 680574 567720
17243 567720 466806 327338 184604 25046 -161836 -286391 -308527 -290804 -259472 -226533
17233 -226533 -254020 -390233 -598825 -755930 -802786 -762596 -687882 -592522 -453101 -297656
17223 -297656 -232950 -237839 -197654 -104432 -46131 -42834 -9694 100921 267661 420380 512266
17212 512266 579861 619865 591230 552134 573631 641714 662775 597691 492172 370597 221767
17201 221767 75313 -2993 -14572 -31802 -44183 6984 115550 212674 227860 157584 97431
17190 97431 118482 174644 192071 161578 133323 139925 107165 -16437 -156576 -232011 -295331
17179 -295331 -412423 -530181 -564615 -475826 -285069 -72782 65928 99839 74536 49330
17169 49330 29872 7082 -6970 4460 30997 55305 84235 97749 87573 70696 44452 -15066
17157 -15066 -151620 -310782 -390320 -377675 -331126 -352785 -483410 -627608 -715808 -757336 -763690
17146 -763690 -724470 -623188 -484584 -361960 -265079 -231616 -321144 -521237 -756210 -941077
17136 -941077 -1009058 -908743 -702243 -559591 -541950 -569171 -564942 -518190 -450852 -373629 -330310
17125 -330310 -327269 -314607 -263219 -201600 -170939 -181974 -189866 -165617 -168105 -215228 -249532 -215295
17113 -215295 -125645 -8284 104375 161382 179788 200882 213016 205478 180553 154647 189424
17102 189424 269841 350651 488899 723852 965445 1105861 1108761 1033791 965057 896801 792424
17091 792424 636099 462735 328959 286165 319110 339757 290528 182680 85538 100910 194291
17080 194291 200441 83571 -34396 -92804 -162693 -295251 -436546 -548480 -672364 -804069
17070 -804069 -881739 -868981 -837463 -809675 -670442 -387066 -61457 228280 473634 685458
17060 685458 851766 986679 1101170 1148202 1073782 876125 601565 331109 132309 39805
17050 39805 57349 127763 207933 301177 377587 381164 330553 298581 315033 362382 422435 483650
17038 483650 528355 533901 498327 454403 422334 400485 329990 185756 51433 -5834 -25642
17027 -25642 -63343 -111724 -172157 -267765 -389637 -463163 -453005 -429794 -439936 -511819 -635446
17016 -635446 -716202 -753214 -818321 -865740 -825744 -674835 -414718 -143769 7480 31895 7615
17005 7615 -6243 -4568 -26692 -60720 -55443 -14945 -18471 -133672 -322543 -479889 -548687 -525871
16993 -525871 -419827 -267388 -132979 -31702 113048 297378 449012 551481 602369 594673
16983 594673 518800 420634 384656 429933 476855 409713 242077 122163 133522 247944 346514
16972 346514 398583 473467 537116 572284 609332 653869 732366 866265 958011 921551 801837
16961 801837 672972 623522 652090 679381 647372 497322 283102 136097 68984 61460 105391
16950 105391 105400 -30052 -300026 -563149 -641564 -571986 -493810 -456104 -449810 -425074 -336044 -205426
16938 -205426 -70206 36935 37322 -61564 -147294 -140317 -42077 104955 228300 285126 305323
16927 305323 252339 124400 47511 84236 167697 249802 309824 330657 299297 245861 250571
16916 250571 331307 443817 555675 618928 629758 603873 515809 421601 420676 498240 587781
16905 587781 678465 781181 860781 842466 742940 644463 548120 395528 187810 -23131 -230966
16894 -230966 -415749 -503432 -545526 -661728 -858592 -1030596 -1045915 -883311 -665066 -525753
16884 -525753 -467472 -423000 -407085 -473273 -612651 -774296 -921488 -1012212 -959034 -757751 -587302
16873 -587302 -596511 -754536 -949064 -1109626 -1160917 -1024747 -748178 -444507 -176721 49082
16863 49082 188128 174670 32102 -163381 -308791 -369080 -408975 -485905 -573339 -632632 -667912
16852 -667912 -694205 -728758 -786823 -871257 -923700 -899607 -823995 -739741 -694122 -707547 -745863
16841 -745863 -758091 -766298 -779197 -747923 -654103 -537213 -492086 -519094 -484225 -314173 -63362
16830 -63362 167964 285598 265193 191043 195324 269850 325346 352442 353924 257139 85766
16819 85766 -1210 64252 191540 270930 272005 239959 237993 293916 352593 320669 201786 79512
16807 79512 21418 16355 -1665 -94179 -293489 -511714 -608678 -592576 -526394 -381921 -134847
16796 -134847 127026 280391 320721 270834 101735 -132902 -325722 -398572 -343488 -251637
16786 -251637 -188950 -152128 -146761 -157722 -147110 -89209 9220 93544 136800 132971 87737 30694
16774 30694 -32822 -109393 -156251 -145691 -139104 -103856 12287 116248 118355 37077 -57852 -103139
16762 -103139 -129855 -164206 -147768 -84371 -37690 -43464 -59845 -37511 38923 152477 244410
16751 244410 234800 129001 39001 46275 132674 240105 340310 407136 397939 345541 294199
16740 294199 198493 12415 -212027 -360117 -343976 -194150 -34789 62187 78920 35265
16730 35265 17838 59996 71500 1414 -86547 -122447 -56527 94439 231956 276003 220882
16719 220882 133908 91233 51903 -53172 -143120 -159401 -130149 -71531 27788 118470 141415
16708 141415 109378 65310 28657 -31939 -137951 -214506 -216369 -212263 -255798 -351041 -476769
16697 -476769 -575571 -616483 -595907 -530467 -448752 -312627 -118056 60501 204491 251974 112737
16686 112737 -123777 -348127 -554492 -717779 -761341 -679920 -521865 -350549 -238667 -197479
16676 -197479 -234847 -337300 -429588 -477614 -537925 -629878 -684382 -658717 -603760 -573342 -570895
16665 -570895 -602623 -621428 -545657 -410540 -300573 -245420 -263097 -344437 -436004 -544042 -666680
16654 -666680 -713843 -622760 -413320 -138627 117353 272215 327339 319480 240564 75793 -122612
16643 -122612 -282919 -303544 -159898 35568 188304 240944 176972 82668 68685 142450 215487
16632 215487 205055 52973 -228509 -544507 -814983 -996342 -1067181 -1051446 -1006564 -968092
16622 -968092 -963733 -1014062 -1045400 -1014427 -947494 -867349 -792772 -660818 -411456 -157842 -72134
16611 -72134 -188425 -445625 -731136 -927871 -951138 -772275 -505299 -270627 -107169 -39228
16601 -39228 -49161 -81693 -149182 -253174 -346653 -375549 -318049 -222954 -144731 -117300 -142416 -170172
16589 -170172 -173708 -155184 -107874 -34483 14911 161 -69698 -165153 -198096 -112747 14484
16578 14484 67211 -4333 -81940 -46428 41295 77518 15740 -98944 -198926 -260289 -281639
16567 -281639 -290607 -331670 -383947 -407105 -399836 -424408 -479152 -463744 -370660 -306145 -311170 -325210
16555 -325210 -347220 -432802 -556563 -640525 -627175 -509480 -343515 -169770 -10469 116867
16545 116867 223277 306941 385160 496918 608847 639775 602075 530897 428494 336601 248317
16534 248317 175671 185626 240412 299197 400705 519660 598659 621322 586948 434901 106279
16523 106279 -258552 -470968 -506113 -434373 -335183 -264941 -218952 -153353 -85815 -83163 -160248
16512 -160248 -254378 -278359 -210828 -125711 -56555 32364 106323 118830 118466 168102 210336 124905
16500 124905 -48846 -200337 -307024 -312874 -102509 278276 606727 804364 933983 991539
16490 991539 931316 780402 633836 569959 617706 765094 906686 883732 674239 438332
16480 438332 372512 506714 660593 675240 570763 436147 376539 411899 449298 433419 364614
16469 364614 233393 39881 -194942 -406071 -476455 -430947 -423049 -490731 -501787 -361613 -119232
16458 -119232 104680 170924 56559 -138653 -333220 -498071 -582067 -545017 -450539 -384486
16448 -384486 -362526 -360569 -379472 -433241 -537653 -669468 -773191 -861202 -935215 -970248 -1046347
16437 -1046347 -1146365 -1094849 -886994 -662170 -504889 -443830 -478088 -567558 -644039 -668079
16427 -668079 -625257 -538236 -491755 -579312 -810639 -1075229 -1226197 -1194362 -1027106 -852450
16417 -852450 -791617 -851658 -934032 -944428 -871993 -779597 -692593 -599621 -523517 -458539 -398158
16406 -398158 -414761 -473402 -442584 -297856 -121567 36778 133793 135323 75772 20027 45874
16395 45874 181743 365181 453438 385956 255251 149234 104902 188377 356903 444853 382045
16384 382045 219482 27108 -135365 -247461 -315480 -361343 -392646 -412897 -438240 -485867 -571103
16373 -571103 -622649 -573551 -429495 -283980 -245806 -323295 -451010 -547787 -593257 -636496 -718394
16362 -718394 -850028 -985085 -989550 -817453 -615592 -479798 -402990 -373180 -343831 -298502 -256825
16351 -256825 -235414 -203965 -111550 -2182 35052 -49244 -216642 -383354 -520509 -662800
16341 -662800 -817397 -963777 -1067620 -1072512 -911368 -608961 -319042 -164099 -116968 -121449
16331 -121449 -166925 -243192 -356093 -437301 -418243 -345351 -299728 -323836 -416588 -506638 -545854
16320 -545854 -512427 -412706 -270241 -83306 140105 313423 339025 257961 186353 198114 246810
16309 246810 234362 101792 -103873 -244325 -316046 -376887 -391631 -314638 -184059 -90105 -84069
16298 -84069 -160517 -304146 -473590 -586960 -591183 -522267 -479741 -446101 -307099 -55891 227164
16287 227164 451976 526265 455552 343587 259337 230320 234625 222592 179093 130706 94269
16276 94269 21725 -94298 -174520 -144202 34562 291653 500698 598232 552849 391012 205514
16265 205514 94447 101516 201552 299383 325217 296078 275160 294926 340793 396375 457185
16254 457185 494112 444340 293290 114934 -24996 -133969 -235626 -360049 -503083 -602852
16244 -602852 -601181 -508419 -415971 -383466 -355192 -265200 -157794 -60573 25104 31515 -57032 -180157
16232 -180157 -289108 -362102 -372007 -309315 -175652 -14244 169023 367677 465588 382632 170602
16221 170602 -28269 -99995 -60336 55366 239641 425949 518671 482192 340474 132752
16211 132752 -86605 -242589 -258934 -174297 -108519 -116268 -156838 -154098 -70315 86977 303135
16200 303135 502919 576556 512265 404024 298427 165989 -6993 -153755 -210349 -219310
16190 -219310 -238387 -292052 -393648 -537019 -644301 -620829 -481285 -336577 -262025 -195618
16180 -195618 -35408 199813 440763 596282 549701 307686 35438 -96215 -42889 77346
16170 77346 137698 90640 -27044 -156042 -260323 -319481 -320161 -284123 -229309 -132979 -74195
16159 -74195 -108590 -159897 -196112 -206458 -191880 -226157 -319068 -432067 -535199 -621141 -736138
16148 -736138 -890593 -1050820 -1169521 -1201130 -1176723 -1122775 -1017594 -850426 -684033 -587694
16138 -587694 -550407 -557113 -600259 -598884 -487200 -274155 -33944 124857 154471 106133 92394
16127 92394 174986 291134 316506 169616 -71163 -240436 -234074 -92270 40369 89478 121801
16116 121801 202675 310935 401903 450074 472356 470682 436444 388504 292628 152713 60837
16105 60837 76151 165250 247101 344351 496321 624250 658556 588957 438292 251779 75463
16094 75463 -49669 -115631 -95691 -40250 -62748 -197866 -378147 -529145 -631837 -674191 -645827
16083 -645827 -594615 -564003 -542680 -501354 -415587 -298867 -188433 -102527 -37712 42931 109599
16072 109599 120271 103212 100776 104299 97656 124820 216559 354889 471813 534673 591421 657589
16060 657589 712692 757694 811019 857355 902021 929563 922644 933519 997939 1044915 964425 769799
16048 769799 540997 360529 239658 153606 108077 86526 99507 139105 132994 86003 57728
16037 57728 88761 218302 444070 690540 861426 897804 789479 602273 426175 318909
16027 318909 331343 442066 603246 753855 827246 812650 767624 740189 638515 387624
16017 387624 123240 -14554 -88692 -157866 -165629 -103365 -49580 -15144 96058 260533 315022
16006 315022 190485 -38303 -210708 -230741 -163036 -162313 -272182 -395019 -454454 -440225 -405595
15995 -405595 -343412 -258537 -212640 -234611 -270967 -267397 -211093 -99134 57333 211379 309406
15984 309406 305266 203194 60575 -80782 -169976 -205351 -211514 -187205 -104142 47060 206105
15973 206105 307325 382775 472144 480526 312734 74596 -98842 -189184 -213061 -223167 -265617
15962 -265617 -287302 -243835 -195013 -219509 -289668 -356095 -443484 -539425 -575728 -512075 -337342
15951 -337342 -98147 107913 224154 261604 274296 285695 277120 279786 312899 336094 316128
15940 316128 232137 94254 -82056 -295377 -524409 -728501 -921792 -1106275 -1214111 -1219946
15930 -1219946 -1144541 -1010130 -847482 -689295 -579560 -573166 -658152 -741870 -793878 -870010 -994236
15919 -994236 -1102449 -1144753 -1098792 -1027476 -1023630 -1017876 -940676 -819585 -688908 -574575 -513761
15908 -513761 -484432 -433291 -368584 -309172 -299487 -361493 -412960 -345042 -154312 58321 181061
15897 181061 184560 125218 87896 62570 6363 -39447 -39007 -83624 -220472 -365399 -453418 -486403
15885 -486403 -503857 -527400 -539304 -497905 -358192 -154361 -1163 52260 51468 60052 68411 24363
15873 24363 16024 102139 194694 195457 115564 3549 -113090 -181824 -209306 -212070 -179075 -165647
15861 -165647 -219645 -317899 -430176 -554440 -683272 -785371 -835184 -833286 -757695 -597790 -433161
15850 -433161 -315039 -237497 -235005 -390424 -650107 -842593 -906775 -898580 -849718 -728274 -547010
15839 -547010 -388950 -305272 -290748 -328298 -371570 -377038 -354828 -327135 -311974 -312466 -334180 -367191
15827 -367191 -388884 -398093 -418609 -464854 -538829 -581552 -561191 -522540 -478309 -437516 -433182 -489369
15815 -489369 -594802 -672441 -690886 -681307 -655504 -622596 -558113 -418870 -209410 -6103 131104
15804 131104 196265 137563 -90038 -356023 -434368 -290116 -90152 61781 132003 44071
15794 44071 -209438 -522093 -829846 -1167805 -1473776 -1598923 -1519174 -1328425 -1112350 -905829
15784 -905829 -725648 -584933 -495145 -474859 -476293 -413736 -302179 -236440 -255910 -376883 -552722
15773 -552722 -664127 -695058 -655357 -541685 -423685 -362502 -387508 -483175 -583606 -653856 -669379
15762 -669379 -618260 -584496 -627234 -696996 -757487 -800402 -781110 -645114 -429791 -249420 -151366
15751 -151366 -104038 -64265 -42520 -93900 -225448 -329664 -342126 -318763 -307968 -334557 -402046
15740 -402046 -435436 -373125 -287142 -223539 -147760 -61805 -54221 -166862 -287479 -335157 -346543
15729 -346543 -347290 -330066 -299110 -275591 -256783 -176959 -70847 7910 75152 133174 181448 233711
15717 233711 291195 348933 394955 431796 458122 458861 495027 596739 742863 854963 837112
15706 837112 757904 738836 776668 776495 703526 605387 481691 303266 124100 11725 -47018
15695 -47018 -94280 -143196 -155454 -142949 -175211 -240499 -233867 -132126 -24227 26350 -11746
15684 -11746 -114703 -245273 -337365 -300192 -137225 49469 142020 100268 -52989 -265374
15674 -265374 -417277 -384834 -249168 -204112 -265780 -312375 -265983 -184518 -146516 -149811 -152760
15663 -152760 -109693 -17925 92533 166020 167473 149148 172605 256539 380136 466002 447594
15652 447594 374352 323922 264588 146633 -39665 -321299 -636438 -835633 -887427 -867775
15642 -867775 -878786 -1002263 -1158186 -1221477 -1194160 -1090945 -942961 -851564 -875887 -930475 -912597
15631 -912597 -848764 -822358 -831457 -806409 -703749 -533651 -355287 -180734 -5002 77670 24003
15620 24003 -65642 -71385 7889 113406 213942 306175 393704 471996 483045 375648 221546
15609 221546 132967 92810 50908 33612 41790 1588 -143077 -354145 -580044 -765959 -848809
15598 -848809 -842374 -801983 -770900 -730237 -663692 -611407 -570114 -544811 -567454 -586995 -610006 -751441
15586 -751441 -1029004 -1326592 -1541959 -1634997 -1615980 -1525106 -1416655 -1344746 -1320085 -1282100 -1199326
15575 -1199326 -1062806 -880866 -710955 -574527 -477792 -405544 -345967 -321936 -346109 -374545
15565 -374545 -382390 -387864 -385596 -351734 -243603 -56863 120244 212122 192023 82892 -59410
15554 -59410 -189980 -263140 -291202 -285180 -213827 -114789 -68965 -58608 -2860 52804 32484 -45936
15542 -45936 -155211 -251520 -308919 -307189 -202829 -38340 66528 98370 105114 114210 122868 135693
15530 135693 197590 316940 438952 523184 580859 612373 625597 595361 487414 382165 357628
15519 357628 347910 243762 66399 -60241 -63810 31672 172699 355858 619955 911425
15509 911425 1109536 1182234 1147441 1011371 818580 621846 417449 254870 164192 114631
15499 114631 81199 70279 103743 181095 298650 429705 524568 540703 475056 343210 147586
15488 147586 -71108 -224760 -284159 -270750 -170573 -48366 21993 4411 -124422 -236449
15478 -236449 -242713 -242945 -310108 -357454 -298671 -197299 -122120 -47876 49872 102299 57858 -56358
15466 -56358 -217965 -399628 -497844 -468777 -391186 -290528 -132374 25983 68496 -19488 -147175
15455 -147175 -244469 -301674 -336760 -371071 -426304 -495900 -567834 -647695 -702331 -728397 -751450
15444 -751450 -758682 -748553 -710076 -617867 -468626 -264134 -7292 253407 437311 524324 527630
15433 527630 451116 314176 136790 -106197 -396518 -590459 -586317 -420007 -190878 -29186
15423 -29186 -43739 -177714 -272754 -292434 -267575 -279063 -419675 -586832 -606999 -464212 -257029
15412 -257029 -79367 -7280 -99784 -302700 -505095 -636602 -672148 -626374 -514573 -368158
15402 -368158 -190976 20913 197558 254392 178091 -12715 -273329 -472687 -538623 -544375
15392 -544375 -609469 -747763 -876453 -951852 -983941 -1000705 -959580 -818525 -646106 -522447
15382 -522447 -468730 -460765 -463695 -474945 -486256 -503803 -571498 -702977 -852892 -964211 -1031631
15371 -1031631 -1084565 -1060489 -911508 -705291 -511232 -376277 -289103 -217334 -161420 -108091
15361 -108091 -24600 87122 192360 222372 130987 -30493 -179970 -290061 -375694 -442326
15351 -442326 -491161 -581650 -717397 -794819 -788923 -780212 -782655 -748832 -703399 -676264 -643090 -599489
15339 -599489 -574338 -514900 -362828 -187425 -111468 -197833 -393972 -620754 -793552 -808604
15329 -808604 -677390 -539591 -462939 -440297 -446781 -453416 -494806 -630404 -849273 -1056683 -1153836
15318 -1153836 -1137971 -1075597 -1001132 -835267 -515841 -190978 -48637 -49517 -98832 -164789 -203143
15307 -203143 -190623 -118212 -34936 -4562 9023 65121 137662 175821 145177 12829 -170951
15296 -170951 -291295 -299568 -249570 -212602 -233170 -306742 -366246 -362681 -307927 -276386 -318126 -418698
15284 -418698 -520490 -539837 -417092 -195295 21105 150814 197560 232005 296194 349789
15274 349789 360798 360196 340728 292214 215842 110900 56093 131183 270628 314653 207792
15263 207792 5085 -234863 -407760 -439835 -422894 -435994 -423501 -346694 -257766 -190253 -195690
15252 -195690 -309077 -401262 -388001 -321702 -259893 -232288 -261584 -383985 -580635 -722576 -723947
15241 -723947 -650501 -592299 -581748 -597028 -609055 -662217 -768962 -850417 -861817 -886446 -972149
15230 -972149 -1061941 -1106718 -1063896 -961852 -817659 -590055 -357298 -236563 -205938 -183910
15220 -183910 -110517 20081 154099 222132 212977 160941 108635 29575 -101000 -249584 -429817
15209 -429817 -616488 -714469 -660822 -473073 -225236 -77409 -90375 -176017 -226535 -196964 -152281
15198 -152281 -130703 -155137 -231937 -297899 -302389 -302353 -346301 -347365 -241848 -107888 -59032 -107056
15186 -107056 -207765 -303966 -359313 -305420 -145308 17181 115369 154645 142703 85058 34950
15175 34950 31308 22931 -28095 -79493 -81111 -31024 24392 43077 -6037 -86649 -99495 -16247
15163 -16247 85840 129302 122401 104911 32296 -92814 -221401 -367613 -550184 -713375 -762273
15152 -762273 -616081 -378672 -240224 -222242 -262063 -345807 -430676 -484841 -526318 -547080 -549328
15141 -549328 -522544 -446658 -379303 -385866 -422478 -398310 -300143 -200241 -155115 -186846 -273864 -365023
15129 -365023 -431318 -446762 -466325 -553912 -624270 -513256 -206058 124573 358928 459615
15119 459615 480662 532779 599325 573783 461341 326425 131837 -98030 -241992 -255062
15109 -255062 -198070 -113648 -23514 24581 -2475 -140782 -381907 -648203 -851125 -970354
15099 -970354 -1022660 -991387 -870710 -746004 -637881 -491426 -301946 -85563 93511 143950
15089 143950 51989 -93830 -201607 -247056 -210164 -108233 -4067 44913 36009 24835 32943
15078 32943 44506 -4683 -109574 -180268 -170348 -95580 10216 139546 266330 323022 295549
15067 295549 237802 198465 189237 214859 313453 472123 619529 671385 566313 313020 13962
15056 13962 -227730 -362232 -342999 -166645 81406 242764 255840 182768 114764 67565 17365
15045 17365 7332 6260 -71687 -244025 -431657 -539599 -538257 -405968 -135444 177447 368422
15034 368422 382967 305221 221461 135479 88239 116863 182545 227301 216275 132870 -5389
15023 -5389 -131410 -176758 -124554 -15235 146689 370365 581203 683876 663758 558924
15013 558924 393956 207661 107249 97120 101950 152862 325466 610587 878656 1051327
15003 1051327 1143455 1151524 1041222 839569 625682 452767 334238 241134 131835 -662
14993 -662 -109952 -152151 -161176 -191433 -234044 -243540 -226001 -168286 -10368 202684 360346 441475
14981 441475 479126 479425 442601 357416 218311 59434 -54998 -79324 -70397 -79299 -97666 -140500
14969 -140500 -244833 -329609 -262953 -87032 79372 150215 129855 113088 164225 236807 220610
14958 220610 103208 49905 161070 338114 414807 367372 306939 287839 280956 292069 352517
14947 352517 356877 275646 224419 187877 80826 -74581 -230739 -337376 -345433 -284017 -226211
14936 -226211 -193100 -157575 -128377 -112411 -116935 -139786 -138848 -79433 -1857 3414 -61304 -88350
14924 -88350 -41541 54233 209792 385850 482626 424969 244793 53986 -57815 -96018 -167352
14913 -167352 -325340 -509527 -648651 -717246 -738924 -742205 -719896 -628746 -463296 -272578 -101903
14902 -101903 8720 58369 107857 183566 270600 356276 377651 301727 189992 98995 97888
14891 97888 258491 551444 878068 1146248 1299151 1327625 1235599 1020988 766315 560219
14881 560219 434172 403079 457773 550817 612215 609435 556402 477649 428316 473105 595973
14870 595973 707427 777821 802831 761226 638915 470305 298038 119951 -72229 -217340
14860 -217340 -259997 -202725 -50894 149931 295320 312625 243989 174253 142164 88263 -27539
14849 -27539 -135136 -194948 -267842 -356464 -402020 -415075 -409787 -342549 -209470 -53561 86937
14838 86937 218678 326353 399672 486539 539869 469466 331356 252375 286000 362405 351455
14827 351455 225340 61724 -84242 -181290 -208261 -184974 -122382 -53830 -19695 17023 133276
14816 133276 299727 399749 400014 347207 297131 292614 305952 199197 -39401 -242709 -326360
14805 -326360 -334560 -309871 -261240 -233874 -275863 -378114 -498922 -612202 -717845 -819063 -885675
14794 -885675 -861221 -679627 -360802 -40734 164154 171617 -42885 -336596 -534772 -598220
14784 -598220 -581469 -524716 -450061 -397186 -403871 -453355 -488377 -472923 -385979 -244935 -133138
14773 -133138 -91434 -82075 -72522 -98152 -175847 -253314 -280351 -263979 -251028 -277400 -315346 -312810
14761 -312810 -252382 -170492 -112539 -67706 -30513 -26351 -30825 -21879 -50165 -159730 -295309 -379502
14749 -379502 -427856 -490564 -546925 -565125 -541232 -484289 -408715 -349049 -349459 -403194 -460836 -489306
14737 -489306 -495809 -488896 -475229 -456533 -424168 -388100 -404868 -515889 -669162 -742985 -663326
14726 -663326 -489877 -324530 -244879 -287567 -378205 -419550 -446763 -558544 -739488 -921355
14716 -921355 -1078762 -1153602 -1096755 -961815 -853133 -833141 -846465 -797683 -660502 -516960
14706 -516960 -490234 -592486 -723999 -803552 -803958 -761652 -741520 -720422 -647483 -550059 -439411
14695 -439411 -315131 -190011 -60702 48402 91700 35628 -81363 -165633 -184142 -140578
14685 -140578 -75356 -32403 5463 12249 -103022 -351260 -629798 -865458 -1036618 -1086431 -983652
14674 -983652 -779692 -547726 -362485 -278504 -269056 -251770 -216155 -230370 -309216 -389641 -455003
14663 -455003 -523991 -559849 -552222 -462617 -291863 -143151 -88108 -92129 -111399 -193808 -351360
14652 -351360 -484830 -582112 -638921 -599498 -515491 -457573 -403706 -308030 -174036 -41552 55498
14641 55498 72857 48891 90329 185685 234655 211573 109655 -51398 -175339 -210092 -204412
14630 -204412 -255190 -411639 -659584 -916494 -1066517 -1070298 -978167 -873803 -785120 -713187 -648636
14619 -648636 -574655 -458796 -284992 -129965 -91187 -196430 -390765 -546010 -575257 -526747
14609 -526747 -459368 -430451 -464003 -514689 -559452 -584832 -561599 -506429 -489458 -563631 -685447
14598 -685447 -753383 -731019 -656502 -529288 -314790 -91450 -25667 -134265 -337376 -570951
14588 -570951 -748804 -855697 -903724 -854091 -710034 -561536 -451489 -359482 -350562 -491323
14578 -491323 -696912 -849984 -935084 -1021650 -1164480 -1292521 -1322640 -1249016 -1081168 -848042
14568 -848042 -593478 -349706 -112978 69878 105095 -20467 -196109 -287816 -313120 -423953
14558 -423953 -617484 -720410 -674685 -598786 -578307 -623010 -719991 -828133 -939579 -1047582
14548 -1047582 -1118611 -1122646 -1056752 -887018 -650847 -489355 -464752 -553930 -697201 -841307
14538 -841307 -927256 -924450 -849391 -701543 -530562 -420062 -381461 -372131 -404893 -436204 -379563
14527 -379563 -252406 -110990 4757 79341 146350 174147 122279 26459 -52162 -127942 -262676
14516 -262676 -491149 -754751 -955752 -1081961 -1143306 -1120472 -1007090 -855861 -751125 -694947
14506 -694947 -630307 -461367 -159005 135062 279917 268784 167449 19480 -147265 -294907
14496 -294907 -360951 -324571 -277597 -276986 -287398 -239991 -149185 -126456 -202073 -289505 -351573 -394895
14484 -394895 -424114 -413758 -331747 -217755 -123653 -75849 -95712 -218550 -412602 -607669 -747205
14473 -747205 -776610 -721295 -618704 -485323 -352437 -248854 -210357 -184200 -147162 -160466 -222053
14462 -222053 -233615 -183107 -160921 -215092 -295788 -369464 -436329 -485081 -526458 -606895 -722032
14451 -722032 -822756 -906796 -940847 -858076 -721692 -621534 -553210 -466682 -342802 -285036 -352505
14440 -352505 -429511 -418062 -367045 -367841 -427067 -453846 -411133 -338912 -281866 -314338 -388536 -344458
14428 -344458 -155345 81550 272582 420975 553989 653075 699155 676701 609562 528968
14418 528968 440197 349429 276094 241408 241162 268209 337251 450210 530965 511130 379658
14407 379658 171182 -32228 -192911 -353553 -531866 -659815 -677624 -608744 -467839 -284949
14397 -284949 -141213 -70190 14667 180496 359912 463286 494250 504637 489568 389246
14387 389246 197288 -21750 -228356 -387966 -463058 -481949 -467085 -415265 -431428 -590149
14377 -590149 -851421 -1128022 -1303331 -1327743 -1240613 -1132579 -1057032 -1000293 -893941 -750544
14367 -750544 -645048 -570293 -527484 -525681 -495207 -435808 -435910 -459145 -401447 -280675 -201124 -254525
14355 -254525 -417364 -591527 -729901 -838589 -859307 -709343 -452898 -299109 -343857 -464709
14345 -464709 -555532 -628636 -724613 -834006 -911980 -922758 -858398 -735398 -625432 -529807 -415098
14334 -415098 -314638 -244532 -171475 -85417 -32377 -25254 -6454 55203 94040 58758 -38936
14323 -38936 -222480 -459458 -593419 -590206 -598762 -709602 -844443 -909744 -859487 -684937 -482646
14312 -482646 -315626 -186576 -138721 -177732 -252843 -322063 -358882 -361827 -339494 -324937 -399284
14301 -399284 -596870 -794390 -825277 -691584 -502777 -316313 -143680 -28521 22291 37187
14291 37187 -5977 -90684 -161561 -242125 -339832 -345623 -268467 -244689 -284577 -312870 -316920 -332362
14279 -332362 -359189 -382175 -393114 -386389 -371519 -330967 -256802 -150617 -35025 4418 -75663
14268 -75663 -199327 -299997 -373237 -381945 -294227 -138327 41293 212078 369766 489455
14258 489455 530977 500006 409520 267079 154337 137675 208076 285071 305094 270701 167003
14247 167003 4219 -141117 -187955 -120843 -18851 38550 14184 -96269 -217992 -239512
14237 -239512 -72075 241620 532338 654586 555118 284666 -18475 -269771 -402583 -377540
14227 -377540 -265164 -144089 -16046 78333 33340 -112378 -216397 -197669 -77451 74445
14217 74445 212727 305804 322436 278131 240891 236972 238160 250095 315143 406796 456869 434007
14205 434007 340294 226739 149140 86055 11065 -43390 -46221 -23512 3924 55386 153970
14194 153970 231412 227109 193418 181235 195487 166255 84253 56191 102240 157063 197675 262022
14182 262022 407851 517555 415704 171053 -45419 -158676 -186104 -189151 -174770 -164221
14172 -164221 -182969 -225050 -296177 -423547 -602821 -726310 -718456 -634443 -549059 -427612 -232224
14161 -232224 -74938 -54388 -120996 -191371 -275932 -378158 -423854 -404884 -403221 -454231 -508038
14150 -508038 -546997 -570210 -536568 -474269 -431672 -406652 -389652 -375749 -385715 -387671 -355137 -313555
14138 -313555 -300862 -305960 -300283 -287221 -304805 -359851 -386707 -365252 -343029 -395519 -566945 -803351
14126 -803351 -970432 -1006715 -955926 -874709 -784665 -698915 -668465 -719065 -768685 -730432 -626993
14115 -626993 -484743 -298349 -108286 29590 96571 87393 29629 -50683 -173045 -335808
14105 -335808 -483996 -596038 -649052 -592147 -444091 -270164 -146808 -132376 -257624 -457096
14095 -457096 -608847 -698884 -774984 -825724 -802901 -729188 -718709 -786604 -818856 -738299 -594950
14084 -594950 -467688 -382508 -350383 -409848 -512227 -561168 -543134 -484523 -413941 -348776 -261154
14073 -261154 -116383 7910 3457 -137822 -329326 -459858 -515053 -502408 -350067 -121497
14063 -121497 20711 24150 -62307 -162236 -264585 -408839 -570040 -688042 -748942 -744692 -672160
14052 -672160 -553932 -397240 -212675 -17267 117035 136040 68146 -69261 -207694 -256182
14042 -256182 -213849 -189961 -252582 -343652 -361009 -297413 -217779 -149474 -119571 -183255 -339258
14031 -339258 -516606 -664423 -754313 -772563 -726928 -603034 -408383 -224427 -114908 -76728
14021 -76728 -37789 16833 46207 64325 102255 176718 283573 404585 526065 596983 559029
14010 559029 424915 256524 89691 -102120 -345877 -618077 -817282 -908836 -957268 -955523
14000 -955523 -831867 -589620 -347520 -213722 -207598 -273400 -310105 -280539 -213584 -136500 -137440
13989 -137440 -257780 -415065 -525228 -582463 -623395 -653110 -654178 -598492 -461974 -285212 -110829
13978 -110829 74750 226166 264596 195780 49295 -139271 -316740 -448318 -498095 -440683
13968 -440683 -232207 83284 356986 497987 539059 582754 638656 641607 512243 245961
13958 245961 21539 -47035 -22935 -9472 -40868 -87300 -137385 -190166 -270267 -361299 -438862
13947 -438862 -482316 -450112 -332842 -176092 -55174 21136 80092 109849 97461 67811 22506
13936 22506 -27532 -42257 -91225 -256352 -457279 -545415 -570690 -613246 -601255 -497380 -360939
13925 -360939 -262720 -272187 -365209 -423394 -361234 -211677 -63735 35236 96152 119583 116310
13914 116310 126306 125362 74706 -11185 -127993 -246489 -311132 -350391 -436093 -582884 -734096
13903 -734096 -823635 -797899 -647170 -423292 -222524 -80620 28934 139366 301627 521677
13893 521677 776281 1033470 1188536 1174708 1042424 845663 609959 380023 201221 109318
13883 109318 131808 187910 162101 77426 22717 52391 120622 108149 -13535 -167240 -251087
13872 -251087 -261944 -268643 -241136 -162054 -98004 -47624 20650 92714 170013 267518 332681 277495
13860 277495 86662 -171563 -441676 -691535 -857441 -864073 -770700 -679489 -590329 -488695
13850 -488695 -363957 -244675 -214594 -301984 -407187 -471550 -529035 -584680 -597094 -516220 -336717
13839 -336717 -120265 53274 133072 136935 153027 209182 290947 391413 461035 527775 628318
13828 628318 700101 685859 582266 422270 229020 -23432 -297301 -428397 -324315 -115349
13818 -115349 14829 -4894 -144982 -322317 -436053 -454791 -419031 -410858 -491357 -629239 -747429
13807 -747429 -733200 -571640 -390775 -260064 -165776 -126944 -174026 -246121 -309542 -429261 -586924
13796 -586924 -721268 -799510 -768685 -612959 -420460 -224894 -27778 49955 -56664 -246251
13786 -246251 -396052 -420354 -307046 -133801 103715 384061 523231 462955 261821 -59097
13776 -59097 -401852 -646621 -759195 -737839 -583811 -370076 -203248 -129892 -143137 -189684
13766 -189684 -216900 -257361 -308920 -284663 -214709 -160359 -147743 -178327 -175708 -96603 25044
13755 25044 185825 385376 555166 609152 569630 528345 472002 337224 164456 43127
13745 43127 -31649 -164299 -349374 -452667 -491388 -590875 -754305 -840788 -777906 -641993 -587852
13734 -587852 -691405 -850808 -943040 -965489 -918609 -753571 -505735 -321636 -236710 -155941
13724 -155941 -91248 -97669 -129077 -62556 120595 297827 364649 332073 280853 204346 68593
13713 68593 -95994 -228909 -364837 -528815 -616003 -612133 -636443 -730730 -860598 -976515 -1047171
13702 -1047171 -1021582 -881480 -704796 -608416 -607545 -616001 -567869 -458465 -351214 -291586 -288068
13691 -288068 -329917 -355778 -329560 -326347 -375690 -379210 -261882 -126411 -91082 -123078 -198363
13680 -198363 -272457 -318658 -388231 -477401 -576361 -715021 -894337 -1027340 -1045518 -943837 -785410
13669 -785410 -643412 -531202 -502344 -602238 -782393 -944867 -1033140 -1115315 -1237911 -1295545
13659 -1295545 -1221992 -1077547 -946500 -855435 -749930 -637859 -575710 -601693 -710034 -822040
13649 -822040 -872474 -797976 -566325 -283360 -96646 -20350 11784 47114 107558 188401 308684
13638 308684 480865 589572 485912 180527 -178124 -429558 -535996 -560846 -517670 -462573
13628 -462573 -471470 -524304 -513835 -373432 -154888 -3948 -53592 -261950 -497655 -701253
13618 -701253 -856026 -946160 -943373 -822584 -626634 -458681 -319740 -138885 29790 24932
13608 24932 -174908 -418779 -593774 -674605 -688073 -687728 -712632 -765115 -856739 -1017594 -1248299
13597 -1248299 -1434110 -1497794 -1511386 -1512584 -1454623 -1279509 -988784 -657496 -377144 -229560
13587 -229560 -220299 -264119 -264275 -160348 -7245 101638 168014 230761 323578 457697 611560
13576 611560 708854 655244 506875 374825 292781 267721 268431 244989 173721 64159 -84932
13565 -84932 -257319 -433289 -603654 -778892 -934841 -983529 -908364 -754347 -580317 -464265
13555 -464265 -448957 -495316 -523867 -542052 -603483 -696171 -830302 -1001096 -1087694 -1013989 -859143
13544 -859143 -698149 -596794 -560503 -485939 -350115 -203810 -74570 26206 39285 -53562
13534 -53562 -165416 -241885 -365253 -564695 -701362 -679713 -551971 -407259 -342996 -360050
13524 -360050 -398167 -449679 -490318 -441734 -279229 -91072 46898 132850 184241 210769 224280
13513 224280 260471 310658 338558 325371 313749 386075 499016 567819 611982 646329 610924
13502 610924 535327 515929 549947 545464 413283 169508 -57587 -172621 -184272 -140968 -56417
13491 -56417 66361 181521 245813 268554 294953 320043 352296 406944 413983 322840 162560
13480 162560 28630 -3003 17439 8813 -46689 -143617 -253193 -341064 -372475 -347236 -318603
13469 -318603 -313253 -342325 -385654 -410656 -394812 -385500 -463347 -586482 -612341 -485575 -313881
13458 -313881 -151662 575 83056 98985 45274 -93272 -211262 -188647 -54663 132088
13448 132088 347561 501155 497872 393965 297252 239409 225479 194116 92523 -17309 -46175
13437 -46175 6722 79746 132038 141528 81362 -55689 -250483 -457031 -618561 -704511 -723143
13426 -723143 -695214 -660585 -652294 -635440 -493001 -138108 312728 623108 702530 620586 426856
13415 426856 191159 64136 180406 476850 731355 778287 570194 217855 -105318 -305745
13405 -305745 -364576 -313002 -181386 -2696 136759 167782 80876 -87939 -246622 -342663
13395 -342663 -389749 -355694 -156374 150566 354076 371048 293659 190715 60618 -151035
13385 -151035 -431073 -633667 -717443 -750722 -746337 -648533 -439370 -182884 91664 372568
13375 372568 581070 644242 571921 464128 379659 304036 241761 200656 157322 142053 145246
13364 145246 144933 183463 234686 243327 268782 390704 596693 803436 1012550 1255808 1469271
13353 1469271 1593963 1602531 1499876 1344517 1233831 1211163 1200343 1157215 1162996 1226089 1250120
13342 1250120 1230047 1199699 1141163 1112757 1212605 1386451 1507447 1540020 1521819 1442893 1276308
13331 1276308 1074410 867138 676151 578053 633320 788931 950223 1093442 1249533 1420154
13321 1420154 1515203 1424483 1176620 951295 871421 838554 732541 582683 469397 403257
13311 403257 370204 405656 499726 597583 620279 576666 576113 629010 723642 845691 892022 822009
13299 822009 694820 551785 423172 369237 418769 491198 482907 394297 333370 369317 451006
13288 451006 489931 456683 399335 364099 350586 321902 238309 67579 -151602 -290448 -302697
13277 -302697 -257255 -194255 -95675 33774 187945 348252 475693 535147 521934 432950 326648
13266 326648 325829 450139 648698 857623 1056958 1212491 1261076 1218492 1144997 1084277 1088523
13255 1088523 1156666 1213620 1177199 1051452 940799 948149 1103962 1298608 1403589 1401934 1327467
13244 1327467 1223874 1116847 1062477 1076053 1054146 989208 996574 1060189 1120758 1209488 1334816
13233 1334816 1433031 1511499 1611469 1709268 1770529 1756213 1643673 1502254 1390926 1277624
13223 1277624 1164832 1112262 1113504 1053797 919636 816253 793527 834811 903957 972311 1011445
13212 1011445 1050435 1136548 1223448 1250044 1260221 1363910 1557725 1702539 1707509 1582123 1403203
13201 1403203 1265400 1219975 1227441 1253109 1329910 1410229 1373117 1226804 1059922 915317 825491
13190 825491 815626 825936 788186 768741 844013 1004549 1225181 1445253 1595847 1714352 1840731
13179 1840731 1940139 1969271 1942077 1946178 2037156 2140836 2138683 2009731 1806808 1583172 1408093
13168 1408093 1338247 1391494 1551249 1743910 1855542 1846523 1786099 1780049 1821088 1797630 1713152
13157 1713152 1672261 1709614 1791663 1859316 1860163 1819887 1799209 1790075 1760315 1692763 1655215 1690811
13145 1690811 1691547 1593848 1442867 1272479 1123559 1047460 1024841 1069109 1221906 1419618 1552367
13134 1552367 1645634 1772882 1869171 1855821 1704940 1480102 1320646 1273438 1279862 1277271 1313989
13123 1313989 1466509 1648889 1768181 1815666 1804962 1796349 1869174 1961249 1956288 1862900 1793938
13112 1793938 1828291 1897404 1914589 1902523 1891091 1915012 1980750 2036107 2057661 2093248 2158164
13101 2158164 2189143 2143355 2079305 2070479 2089395 2123072 2176622 2193997 2179204 2214586 2298714
13090 2298714 2375349 2413839 2417249 2420735 2459153 2565836 2739063 2954661 3170556 3329901 3433655
13079 3433655 3479005 3468676 3486971 3589479 3696728 3666446 3478386 3299202 3273295 3374072
13069 3374072 3442430 3442091 3467458 3589541 3763532 3879874 3952605 3982703 3887632 3683753 3490864
13058 3490864 3394771 3408383 3496492 3602166 3697034 3816936 3993777 4217270 4441032 4630187
13048 4630187 4772686 4874061 4918284 4912164 4908272 4937546 5035737 5219148 5399181 5488372 5529773
13037 5529773 5614335 5747994 5871391 5995923 6188464 6460191 6722892 6912226 7105795 7401907
13027 7401907 7766510 8138183 8487499 8835428 9189096 9463001 9638009 9787953 9978210
13018 9978210 10204415 10382071 10500056 10704681 11116665 11688756 12275967 12834456 13439383
13009 13439383 14164141 15021550 16015438 17133163 18273159 19344657 20343149 21367840 22606528
13000 22606528 24163420 26022985 28229089 30777580 33541541 36446719 39649291 43402616
12992 43402616 47923641 53375389 59876645 67543919 76485676 86865741 99044200 113594594
12984 113594594 131144640 152305151 177715267 208197513 244595418 287257126 335091279
12977 335091279 383885570 424651143 445055896 436672021 402147968 353037599 301321219
12970 301321219 254188790 214193994 181300871 154458164 132525097 114540087 99689646
12963 99689646 87384857 77210839 68772186 61700333 55716241 50609396 46204726 42425673
12955 42425673 39224230 36489428 34120817 32035488 30108852 28324202 26746709 25345658
12947 25345658 24066904 22929334 21995041 21243200 20586095 19986598 19474909 19100084 18817192
12938 18817192 18554472 18333888 18185755 18123210 18147203 18188236 18168567 18119791 18160184 18330256
12928 18330256 18584594 18917133 19368923 19906077 20485942 21173164 22030745 23086244 24350577
12919 24350577 25750414 27234986 28770053 30134793 31142467 31893447 32675508 33730525
12911 33730525 35150290 36957536 39171750 41861175 45139811 49103973 53839562 59417525
12903 59417525 65937035 73598650 82662577 93419605 106148425 121272695 139470430
12896 139470430 161516619 188249130 220551546 259162798 304196558 354017080 403172322
12889 403172322 440847482 454072499 436696925 395033264 342390783 290032811 243727872
12882 243727872 205044220 173515888 148098977 127653475 111019801 97250846 85731192
12875 85731192 76069531 67942605 61068343 55242252 50298831 46075783 42446857 39313841
12867 39313841 36554258 34040868 31706515 29566331 27681246 26070021 24686267 23473228
12859 23473228 22428070 21606088 20995740 20497144 19987066 19405812 18780401 18212383 17824751
12850 17824751 17632232 17526838 17398520 17278337 17228659 17260912 17355698 17481236 17617735 17744179
12840 17744179 17794740 17804518 17907872 18204220 18684332 19263250 19881446 20579139 21413631 22394356
12830 22394356 23472243 24596272 25774766 27050181 28427400 29959930 31779949 33964748
12822 33964748 36521450 39529883 43104662 47362228 52451809 58433606 65320181 73331477
12814 73331477 82851072 94235844 107856138 124152283 143671419 167150381 195377773
12807 195377773 229110239 268915918 314500888 363312455 408596509 438959781 443115592
12800 443115592 418408972 373475917 321279206 271350493 227912295 191788756 162373299
12793 162373299 138484193 118927326 102885842 89716705 78795642 69664430 61959445
12786 61959445 55353524 49638986 44678768 40388482 36771691 33789611 31284112 29064671
12778 29064671 27021478 25130136 23382591 21749525 20231765 18839527 17592529 16528888
12770 16528888 15607184 14786867 14096317 13485024 12836062 12138117 11507727 11005793 10527415
12761 10527415 9905195 9128560 8345305 7666736 7122498 6703344 6385418 6145002 5964990
12752 5964990 5817368 5655085 5485751 5340233 5147347 4873148 4588929 4392496 4306299 4265345
12742 4265345 4220926 4165183 4116470 4028464 3880393 3733074 3607616 3480869 3302342 3063462
12732 3063462 2858444 2744987 2708803 2705299 2690370 2635299 2538429 2434425 2350118 2322008 2387326
12721 2387326 2492354 2550477 2560532 2551257 2515014 2429937 2306217 2153921 1981294 1802237
12711 1802237 1645345 1579052 1608303 1626057 1587627 1553304 1541161 1552303 1571761 1557068 1485558
12700 1485558 1374636 1298041 1292427 1343298 1425463 1455491 1438353 1446333 1443371 1349011 1204367
12689 1204367 1112619 1114918 1148750 1154821 1117472 1078126 1094890 1172199 1270268 1331871 1312936 1231115
12677 1231115 1194326 1204183 1183120 1107792 990286 898236 868329 871098 868701 816232 712238
12666 712238 635883 611648 617669 653728 712550 732804 640113 453813 258351 148404 121180
12655 121180 104876 69678 18115 -33658 -24933 18102 12656 1109 44935 131373 277508 491327
12643 491327 700603 836017 911077 922936 845321 717921 584674 489976 456880 400820 310128
12632 310128 304244 444429 672107 840919 849568 765374 702114 669633 627745 569958 508117
12621 508117 379103 153635 -10535 -15000 51392 142317 275640 415044 554012 701195
12611 701195 789048 783284 689225 488565 231270 43744 25990 198135 493961 809038
12601 809038 1024594 1047529 930993 785570 713894 734372 755769 711042 622215 547774 516644
12590 516644 525425 514721 460536 409268 363369 268008 195421 294009 537883 752383 850331
12579 850331 874767 918055 950366 851707 687100 609743 588604 508278 387622 317011 319469
12568 319469 356310 327317 168130 -34042 -116207 1969 193412 283417 283730 311608 390165
12557 390165 462075 530020 635178 762142 823968 782342 686703 612574 598389 619697 622519
12546 622519 562549 509865 593210 729651 733428 600862 438202 303881 231607 264236 386013
12535 386013 518650 613183 635434 538914 353461 132744 -91067 -276059 -368963 -382918
12525 -382918 -436613 -536458 -540898 -373608 -151443 -17636 26683 69415 124708 117476 20633
12514 20633 -116950 -227510 -308096 -365934 -363454 -291627 -229298 -224823 -255945 -258326 -198668 -123359
12502 -123359 -31062 113814 277071 415487 519192 566032 565874 530343 484656 478657 513650
12491 513650 570470 636738 707246 766963 822821 827531 706170 586504 612589 703474 717009
12480 717009 617344 477226 387290 395323 536202 759889 956694 1056346 1036811 937406 794774
12469 794774 632787 501147 432562 449552 506510 526632 474523 355130 225364 122729
12459 122729 32601 -68894 -142720 -117210 -30530 9448 8597 35133 84859 137969 166139 104300
12447 104300 -37150 -100057 -19358 95822 175442 195270 138799 65739 58515 107091 183817
12436 183817 274053 343558 390057 465041 592869 744206 845795 880624 917926 998254 1040959
12425 1040959 960746 811262 703525 677993 724977 768442 727032 616250 480377 317351
12415 317351 119611 -96147 -253660 -313836 -355849 -432715 -479783 -413968 -236914 20606
12405 20606 356970 710639 939558 999669 951030 864625 793546 721810 562606 270322 -55598
12394 -55598 -293884 -425831 -448032 -373642 -250545 -145753 -97441 -66029 -3283 76784 125290
12383 125290 168016 230041 254200 171410 23095 -123107 -240631 -355773 -470852 -541613
12373 -541613 -560889 -550458 -533033 -478109 -403184 -389782 -376667 -284256 -169105 -73663 8164
12362 8164 81309 156314 226151 289766 336216 358324 385311 398722 376575 382976 450069 472796
12350 472796 397760 251680 63607 -117982 -278078 -381008 -372411 -279965 -189851 -129564 -87430
12339 -87430 -96874 -170335 -278063 -334821 -274597 -133189 -15193 35115 50089 56635 47111 -20967
12327 -20967 -140772 -269655 -353880 -347904 -294407 -212886 -82799 67905 160817 181169 211717
12316 211717 320604 496055 702235 868832 949366 974565 1003459 1067276 1153360 1189880 1133807
12305 1133807 1047176 1021306 1063251 1085325 1015650 911024 889368 949257 1039852 1147006 1227878
12294 1227878 1219166 1120762 999692 906904 864896 869107 870192 818986 708697 582037 491069
12283 491069 440959 397562 366689 387286 435886 376283 166837 -129916 -423417 -542787 -432667
12272 -432667 -218140 -25835 70162 125221 242937 419424 615791 792281 888915 925273
12262 925273 951412 972542 950754 854604 705749 548381 406239 283275 164569 -51456
12252 -51456 -403100 -715545 -817616 -760018 -681774 -602653 -455068 -233294 8828 154464
12242 154464 151609 42749 -148386 -326240 -357465 -203994 29312 207929 289846 312818
12232 312818 323561 350763 402304 461518 508502 515975 483454 447708 456275 574923 747721
12221 747721 812577 715408 555125 406805 269850 196078 243230 367186 482545 531591
12211 531591 488987 356305 167891 -14784 -149201 -257966 -310657 -307170 -315570 -334217 -370097
12200 -370097 -410721 -356834 -164257 31121 119685 169761 225357 236097 177791 82562 -34970
12189 -34970 -156230 -214159 -197510 -209633 -277987 -261051 -114491 61344 126931 42429 -52762
12178 -52762 -35133 58405 154334 244428 349585 374778 199767 -129905 -438863 -622071 -668635
12167 -668635 -576091 -374720 -154999 -25366 -41030 -137168 -202307 -220714 -260527 -391029 -593104
12156 -593104 -748410 -748304 -581894 -355948 -209867 -198862 -260433 -291839 -253894 -219312 -263132
12145 -263132 -314963 -257376 -106451 31900 127981 238442 389400 513708 542798 459106
12135 459106 334721 251025 233449 244816 214712 126004 -19795 -192548 -297970 -305177 -264918
12124 -264918 -216937 -172397 -56919 176916 431935 597264 647838 591553 473802 368034
12114 368034 308241 288504 283604 253028 212666 201580 188832 161672 139162 117512 22716 -188943
12102 -188943 -416893 -527350 -456464 -296572 -194927 -194993 -188394 -30498 190282 269379 175984
12091 175984 9436 -143286 -273002 -433361 -622221 -766985 -754387 -596119 -392779 -173917
12081 -173917 36434 224259 341905 328700 200932 13395 -168867 -286869 -334588 -365388
12071 -365388 -382463 -347504 -291812 -280336 -371911 -531831 -653525 -682246 -680371 -671416 -622706
12060 -622706 -547985 -457801 -346138 -221120 -134207 -128069 -97513 84015 359489 616560 792620
12049 792620 859640 834404 722540 528791 311315 85464 -142091 -298803 -303772 -195273
12039 -195273 -73733 16526 70520 98481 115159 99962 23500 -92720 -220560 -287787 -253973
12028 -253973 -196987 -175318 -169855 -130058 -24408 109168 177580 163444 176072 230333 196001
12017 196001 44379 -152734 -291306 -301854 -241757 -228308 -282579 -292411 -224189 -186305 -218037
12006 -218037 -223328 -134868 14422 158713 261146 328704 357734 336012 284171 217238 170780
11995 170780 181937 248181 316659 313181 214922 74975 -34627 -66825 1268 149258 312116
11984 312116 426633 481663 492230 434363 294569 92084 -99184 -201630 -195894 -100689 42808
11973 42808 191353 328375 459753 595359 739779 847052 887171 847727 768717 755092
11963 755092 806957 810276 728076 612867 498421 409788 349843 308283 324417 420609 518471
11952 518471 510234 369666 125976 -162080 -387101 -523549 -580524 -554381 -530524 -592758 -702531
11941 -702531 -804398 -843800 -806381 -759090 -770219 -842595 -871483 -790026 -667675 -613112 -622752
11930 -622752 -586218 -457879 -326410 -246763 -138089 51305 256828 432032 571119 656852
11920 656852 665328 558263 341648 120249 -8648 -93422 -225454 -389855 -507875 -531100
11910 -531100 -516113 -544881 -610166 -659719 -654752 -627439 -622276 -622716 -647170 -683374 -680161 -638294
11898 -638294 -571405 -481384 -391729 -347131 -369613 -414040 -468315 -530988 -605640 -710583 -819397
11887 -819397 -919259 -1013917 -1086814 -1106461 -1063274 -974685 -835624 -577216 -211464 110385 258202
11876 258202 239363 175678 192140 310268 425740 473128 477647 446291 453981 594663 792679
11865 792679 906165 915479 861167 726315 540583 393431 324640 275273 196058 102077 -5382
11854 -5382 -132238 -214024 -201699 -153890 -177204 -258423 -353495 -499134 -677067 -737221 -604060
11843 -604060 -388917 -176439 17432 167394 236927 214571 111549 -38691 -195228 -327416
11833 -327416 -366776 -299735 -167710 -34816 28660 69954 154988 257688 339134 386437 367217
11822 367217 279984 199119 175108 195382 176696 21268 -222921 -396562 -464782 -485171 -456497
11811 -456497 -360551 -262373 -207611 -159024 -92755 11395 142780 240635 229167 119984 30007
11800 30007 38708 97884 112206 49380 -52518 -141642 -215433 -254481 -200934 12227 487733
11789 487733 1177803 1845796 2311423 2467428 2231232 1694332 1126909 738091 546410 474705
11779 474705 445021 472349 569113 642175 633073 579532 478647 323429 159188 55290 7760
11768 7760 -49723 -88265 -88754 -105869 -134344 -114843 -44809 48980 159824 260754 312716 274371
11756 274371 128095 -45186 -160525 -194920 -170600 -101085 44460 263962 496705 685218
11746 685218 777192 723152 550693 364707 274137 354969 567018 758530 823543 788644 712086
11735 712086 643885 634186 659123 689513 718747 755778 796096 816393 823068 822239 811167 834866
11723 834866 945488 1073457 1063242 928867 785463 651515 495470 299278 88197 -53086
11713 -53086 -89983 -85230 -31077 50999 39719 -45654 -107225 -118705 -79844 -10178 58474 123816
11701 123816 151531 126277 102659 109480 136747 113788 -26791 -197674 -240113 -140078 -35817
11690 -35817 9146 57384 137909 172497 81368 -80064 -231409 -369996 -448502 -436721 -394873
11679 -394873 -387052 -425429 -444763 -369068 -157217 100120 264484 247469 78312 -87641 -132965
11668 -132965 -117852 -125516 -97474 -31634 13488 73251 154722 157607 65861 -10663 32595 164658
11656 164658 297937 363574 326465 209125 93112 47638 43438 41798 54036 76929 67981
11645 67981 511 -77640 -95476 -1065 203231 413412 545540 580864 483788 315660 187221
11634 187221 119807 60007 -53371 -229153 -436501 -581017 -593255 -505196 -375568 -232276
11624 -232276 -84565 69610 234622 357041 366284 278496 163512 53092 -51620 -112318
11614 -112318 -77108 10384 54793 28158 -24424 -96628 -181198 -206653 -139645 -34936 20210
11603 20210 29754 28567 11523 -30474 -117029 -205732 -237990 -261005 -298984 -325321 -338341 -343780
11591 -343780 -333256 -313102 -266885 -166127 -45316 44213 126963 186585 204334 309382 549111
11580 549111 704867 629002 446098 309481 261654 322036 452464 587800 656058 622753
11570 622753 494411 280251 34383 -159521 -238855 -193608 -48288 144444 316463 400408
11560 400408 344574 234907 229832 338068 473735 550378 571881 611108 712519 828942 893710
11549 893710 901046 868857 840413 864323 886480 798426 601147 432042 393729 465735 562455
11538 562455 617169 585556 464878 354482 290379 215180 167636 231473 416303 683918 967588
11527 967588 1113943 1017206 792187 644390 616662 630200 603776 506404 382301 291859 213223
11516 213223 52266 -186195 -391550 -455561 -351395 -145688 119763 384582 565476 606009
11506 606009 465608 285513 217826 225403 198656 119129 104947 167974 289180 487189 643795
11495 643795 677043 677037 694652 608129 398374 247013 245992 291919 324911 364545 368723 315783
11483 315783 257200 230937 200492 182685 266734 443989 569872 572867 469959 279211 61873
11472 61873 -116920 -258919 -345964 -338653 -293940 -254075 -180383 -47584 141130 314214 357285
11461 357285 261153 104911 -27200 -122588 -207908 -242372 -242280 -249767 -196074 -24614 226544
11450 226544 455571 602807 668360 641713 548673 487626 506786 507052 386623 220610 146445
11439 146445 197647 313479 413559 450107 436529 379844 312744 284370 272239 283906 332312
11428 332312 391174 455687 485404 443231 381451 308624 224388 141222 86253 90208 173626 300010
11416 300010 381017 372599 310035 264984 213520 71256 -177452 -417136 -540884 -520805 -382365
11405 -382365 -187767 -3220 93928 65548 6623 65562 213648 310793 323979 308377 252212
11394 252212 133687 -6050 -138923 -219762 -214646 -115571 62341 245398 325039 254848 56453
11383 56453 -166318 -306012 -310570 -216302 -141833 -167067 -284964 -430940 -582267 -736968 -841478
11372 -841478 -876424 -854967 -770931 -632588 -461679 -296552 -186335 -90539 197 22687 -28510
11361 -28510 -136316 -271124 -363384 -372103 -278120 -87484 85906 82591 -118051 -421105 -751044
11350 -751044 -1028593 -1193153 -1237822 -1196465 -1117631 -970510 -747554 -500369 -238929 -185
11340 -185 167229 266762 319811 359583 398717 397737 302054 95965 -188388 -474762 -665439
11329 -665439 -727342 -725694 -747990 -793316 -790493 -704187 -582276 -502716 -440084 -358474 -286785 -250451
11317 -250451 -269800 -327479 -370566 -413000 -505829 -662201 -826499 -934968 -984505 -962132 -796745
11306 -796745 -495682 -191479 49382 225230 269778 192221 161254 247930 371485 419582
11296 419582 349377 228153 173008 193952 234164 308363 407817 425573 362511 349896 427578
11285 427578 523949 603498 686637 752890 756983 692024 576511 474465 428734 411996 419687
11274 419687 461242 506246 474699 348807 184992 29247 -93473 -202883 -313808 -400106
11264 -400106 -454961 -451945 -389902 -256668 -32287 218270 370739 391875 380677 374908 332184
11253 332184 266017 215901 188565 217902 303816 364062 346750 293152 288736 402746 559694
11242 559694 586404 451397 289426 174641 107836 133738 225376 287203 324232 404560 540188
11231 540188 678352 740555 695326 558721 416880 342641 313051 278290 213638 176791 239194
11220 239194 300656 252737 109804 -80649 -278519 -446031 -545749 -573740 -543982 -451383 -274615
11209 -274615 -30287 240233 456436 535490 500253 438611 400155 390607 377319 348054 333092
11198 333092 364946 469570 603908 720460 773905 774901 793027 849044 923810 998601 1055458
11187 1055458 1089699 1100236 1092851 1090875 1124257 1177976 1219514 1291978 1373238 1366458 1227134 1030267
11175 1030267 892240 816006 687927 474124 278257 167294 124055 148625 223743 327109
11165 327109 450097 519437 474110 387580 301462 188349 70777 716 5088 102005 239712
11154 239712 297133 230075 123464 39776 28971 76065 53195 -106736 -318809 -514007 -719717
11143 -719717 -888155 -948204 -907756 -801382 -614192 -318239 25760 315965 494274 545808
11133 545808 456464 305369 208228 200365 294167 491573 741887 965510 1072588 1029640 848790
11122 848790 611247 400546 204832 33875 -118892 -289498 -476984 -599595 -567852 -449233
11112 -449233 -343688 -279698 -264681 -265269 -241655 -274513 -458513 -736517 -962326 -1075287 -1054818
11101 -1054818 -903460 -726405 -600350 -497393 -437026 -470338 -531005 -559374 -575225 -615352
11091 -615352 -655226 -679043 -718855 -751620 -715433 -614299 -514796 -444827 -377018 -300319 -266114
11080 -266114 -357688 -509029 -573666 -534431 -426758 -272241 -90899 89232 219339 312233
11070 312233 467335 683294 844997 906588 925307 925388 869445 767167 694609 712295 764279
11059 764279 743831 621812 446354 283638 122337 -31015 -104281 -142386 -227719 -351830
11049 -351830 -476851 -579653 -617596 -548106 -358994 -97679 164396 419244 668319 848934
11039 848934 909086 903243 937920 997646 1047337 1130836 1247285 1360393 1433618 1444064 1453784
11028 1453784 1497397 1519068 1510264 1493255 1414733 1238156 1052975 969478 978739 992929 999308
11017 999308 988314 892216 715251 513381 362535 283367 225854 190582 211496 275726 334528
11006 334528 400956 532076 689279 795198 853394 923654 1008776 1059126 1075345 1120418 1180721
10995 1180721 1166597 1055242 940022 910784 940741 984209 1008971 963327 876135 861060 944792
10984 944792 1025861 981248 792728 581322 448582 407236 427457 503927 650582 833842
10974 833842 1021593 1214525 1370795 1459147 1510967 1552958 1562617 1524719 1458671 1389757 1288800
10963 1288800 1148337 1008452 918675 862810 782826 662497 514001 380182 313551 360090
10953 360090 468163 533346 580835 675277 756914 721417 567667 347373 84826 -173012
10943 -173012 -386476 -528362 -607313 -640812 -570587 -414418 -259227 -114699 18802 124870
10933 124870 226707 333965 435064 540108 693307 882389 1016076 1014169 854611 647237
10923 647237 519657 513544 635832 864185 1090965 1223488 1253707 1241732 1249368 1245319 1192370
10912 1192370 1184431 1245438 1269901 1204217 1138024 1140785 1158421 1166637 1183242 1215843 1210132 1117951
10900 1117951 950547 774018 644076 525513 421991 401603 497335 697904 966426 1213973
10890 1213973 1414657 1619874 1828165 1986902 2069386 2046246 1892022 1667184 1423976 1179982
10880 1179982 960295 794629 704502 708310 813060 935285 1003701 1037244 1066021 1126968 1265519
10869 1265519 1422431 1503069 1537114 1582403 1637543 1672772 1629453 1487574 1305800 1141843
10859 1141843 1030259 976271 982215 1092652 1353546 1675867 1930935 2085119 2115253 2056863
10849 2056863 2026257 2094304 2227509 2329412 2293468 2118875 1891499 1668258 1471663 1337368
10839 1337368 1285430 1269510 1267246 1324510 1444001 1587258 1714508 1813655 1873824 1856333 1827749
10828 1827749 1864421 1924449 1967322 2001254 2013611 2045554 2179006 2389480 2529745 2576644 2653972
10817 2653972 2790993 2927832 2978005 2905707 2778077 2657043 2576950 2538966 2553779 2637276
10807 2637276 2723586 2754461 2784717 2828933 2811315 2715163 2619460 2622420 2762375 2946967 3066465
10796 3066465 3122004 3127218 3119401 3106549 3090230 3101451 3152691 3194110 3155962 3096633 3082344 3085414
10784 3085414 3052536 3003124 3025089 3157075 3313343 3354783 3260409 3090336 2883607 2694850
10774 2694850 2563944 2491643 2438431 2354862 2268625 2246369 2258768 2231103 2192817 2186670 2189466
10763 2189466 2173787 2138361 2102332 2064005 2039965 2092526 2247853 2478835 2777177 3137504
10753 3137504 3530101 3874738 4124794 4318328 4444530 4464497 4435925 4461066 4586248 4859839
10743 4859839 5332426 5934349 6545599 7119998 7627990 7920727 7850580 7522803 7148760 6832333
10733 6832333 6533903 6159493 5681054 5157756 4635491 4140061 3715332 3349342 3046815
10724 3046815 2841447 2725705 2656087 2613950 2588571 2527131 2399391 2289627 2278482 2363907
10714 2363907 2479554 2554298 2578897 2582854 2584211 2552427 2495015 2437829 2337455 2184935 2054382
10703 2054382 1968712 1888176 1806520 1757649 1717287 1582636 1328757 1100533 1028111 1054388 1092991
10692 1092991 1144757 1246667 1406649 1565176 1642397 1649146 1615664 1525798 1409171 1310425 1232703
10681 1232703 1128944 971286 824962 809606 943134 1133062 1267689 1295408 1235289 1181232
10671 1181232 1201707 1269387 1342837 1378547 1313802 1136851 923813 791810 794819 853833 841041
10660 841041 722671 555753 378351 214312 78121 -25364 -57558 33890 201663 348830
10650 348830 435567 488242 567712 710593 874449 945393 854683 709200 671922 754432 862954
10639 862954 953103 1005230 1003167 1003449 1027151 1049415 1038392 947753 778148 602618 477961
10628 477961 424986 427989 428396 330677 95467 -204113 -480158 -679416 -751628 -663938 -439694
10617 -439694 -153520 73544 123816 31056 -85657 -154394 -180440 -167368 -99261 -41278 -83488
10606 -83488 -205879 -298356 -284030 -188624 -72683 23786 93270 180187 286325 402117 484533
10595 484533 472254 361613 220127 161075 178559 219247 286470 366353 454762 536598 591716
10584 591716 636242 667482 686589 647819 499409 286565 102817 -8769 -73165 -135972 -215164
10573 -215164 -310572 -385259 -403058 -399495 -428328 -493170 -589676 -669715 -654909 -555276 -448119
10562 -448119 -392064 -397184 -451995 -548649 -642909 -662421 -621335 -558478 -428830 -199850 23006
10551 23006 99804 32703 -59064 -78477 29579 212456 341662 387197 397665 359382 264036
10540 264036 146804 53967 -9174 -93017 -168141 -189698 -170026 -130635 -80800 -87370 -191216
10529 -191216 -313507 -378235 -390574 -364169 -295935 -208859 -117933 -6634 98347 164812 244166
10518 244166 360195 422410 369278 249979 134448 40351 -39491 -129816 -221224 -247438 -204370
10507 -204370 -105118 28027 152520 256608 319678 337156 359142 388734 387681 347709 289832
10496 289832 249868 242345 267523 253139 134897 14604 -3273 81185 205485 324042 456249
10485 456249 596312 673882 623614 456276 256724 57739 -103562 -90591 127421 402571
10475 402571 587474 570671 351818 112104 -36569 -140481 -196734 -167824 -70112 35419
10465 35419 78255 49446 8273 -69362 -225076 -419112 -602154 -737312 -725237 -554528 -368455
10454 -368455 -265535 -281660 -392056 -511055 -568520 -542660 -460159 -360028 -279588 -256510 -273011
10443 -273011 -283412 -308097 -420929 -556393 -640668 -718551 -810064 -850796 -748906 -542781 -376865
10432 -376865 -296415 -288550 -306676 -274839 -242945 -304276 -367509 -299066 -156291 -59205 -47608
10421 -47608 -136649 -267816 -337274 -341021 -286923 -133994 52359 150171 200669 296372 448210
10410 448210 590557 654231 620186 547930 523280 552246 586908 599847 605143 569901 436502
10399 436502 260992 113540 -36419 -257388 -517379 -726131 -836777 -810792 -631460 -355452
10389 -355452 -116654 -10426 -17166 -87720 -168995 -204159 -201864 -167863 -59822 67058 176488
10378 176488 259983 239875 94354 -80501 -165764 -115649 63136 296035 433981 412507
10368 412507 293210 186212 108888 14047 -77275 -116025 -127430 -173955 -265729 -344781 -384976
10357 -384976 -408775 -406394 -327410 -172430 -24146 70314 101990 126944 237541 455977 675029
10346 675029 772093 707279 519059 319596 192721 97436 -5645 -20778 121339 317513
10336 317513 426264 399392 260012 65893 -142451 -340176 -480015 -497146 -392423 -250785
10326 -250785 -144258 -127383 -170889 -159467 -73274 -556 629 -65727 -160500 -247630 -338249
10315 -338249 -452134 -546835 -574107 -550666 -514449 -498669 -526667 -569517 -594212 -600365 -594277 -579474
10303 -579474 -580196 -586918 -535198 -438777 -378233 -362789 -351319 -395017 -564426 -795757 -961371
10292 -961371 -969775 -812868 -614283 -494348 -439998 -376681 -249904 -79505 54591 76535
10282 76535 -24370 -200255 -381806 -493469 -563194 -630412 -628359 -535727 -419311 -264928 -21437
10271 -21437 247408 382028 299929 119827 12279 -17760 -70366 -150894 -181893 -148158 -77720
10260 -77720 -3729 37949 45241 28847 -12702 -146485 -388719 -626511 -789469 -935504 -1118277
10249 -1118277 -1317246 -1462024 -1467105 -1328978 -1077498 -773533 -512382 -358115 -376659 -555410
10239 -555410 -773043 -959299 -1181060 -1382121 -1467185 -1461361 -1344633 -1086435 -803905 -657636
10229 -657636 -676150 -731415 -737588 -735752 -720683 -623074 -437341 -239457 -100358 12940 90169
10218 90169 86978 15396 -109496 -309602 -551784 -737382 -821416 -789678 -672685 -545369 -435994
10207 -435994 -317728 -194540 -122039 -141295 -197476 -228831 -242965 -228336 -118695 44954 144776
10196 144776 135478 91908 118858 229866 347148 402180 323506 107791 -118621 -241356 -272107
10185 -272107 -282466 -258168 -153378 18217 168034 228547 218796 136741 -1276 -91557 -123659
10174 -123659 -167835 -183640 -88146 70946 162719 169078 181966 209095 160705 15423 -145418
10163 -145418 -252056 -280525 -267888 -267050 -280509 -288325 -296250 -296325 -237827 -97965 67327 196911
10151 196911 236962 171422 45727 -79339 -126192 -70982 -18668 -62953 -164956 -267876 -366078
10140 -366078 -472076 -577042 -647706 -684608 -719398 -774293 -848823 -938512 -986926 -949960 -901322
10129 -901322 -897355 -833790 -663925 -488417 -349717 -259868 -270912 -362942 -444206 -456852 -429072
10118 -429072 -411817 -333289 -166574 -14296 72213 167184 298153 346447 252159 82535 -59352
10107 -59352 -90055 -55151 -71158 -196291 -379247 -475893 -403776 -263799 -176621 -114735 -59709
10096 -59709 -30929 -74227 -190078 -289017 -279358 -141365 -4562 51991 57242 26439 -24257
10085 -24257 -33052 57689 205910 291024 254610 144470 54838 38053 61662 95478 150715
10074 150715 224234 271155 234195 68677 -180701 -431323 -673500 -931354 -1199021 -1436396
10064 -1436396 -1581035 -1566497 -1448060 -1340033 -1265274 -1165687 -1010846 -858421 -783835 -760276
10054 -760276 -717196 -602397 -426292 -282765 -219922 -176150 -133111 -148094 -236432 -362703 -467931
10043 -467931 -505341 -487886 -491494 -543695 -598106 -641165 -722467 -828423 -906538 -959073 -983290
10032 -983290 -953431 -842425 -635460 -359599 -144702 -114291 -225483 -352164 -387780 -313026
10022 -313026 -211297 -186077 -265283 -411355 -560257 -648637 -685693 -728977 -808564 -914616 -982428
10011 -982428 -945475 -820207 -672171 -549319 -417943 -291323 -256784 -331000 -463920 -609219
10001 -609219 -736357 -841564 -966754 -1093453 -1084181 -945278 -841741 -824815 -827826 -795297 -734542
9990 -734542 -672140 -655396 -708501 -787966 -850080 -903885 -909932 -814828 -709062 -660083 -615787 -546689
9978 -546689 -505822 -505917 -498290 -490509 -488661 -471488 -439021 -388771 -371047 -438301 -539936 -566012 -496996
9965 -496996 -416435 -396100 -453573 -556238 -656809 -687195 -616524 -481852 -322989 -183351 -96370
9954 -96370 -43796 43824 191722 354693 492375 569378 582784 578743 553139 453905 280235
9943 280235 103642 30722 103720 242841 353910 365841 216897 -53602 -331215 -507388
9933 -507388 -585039 -605988 -492120 -204275 110647 286737 298880 210162 67102 -49886
9923 -49886 -71233 -22399 8699 -18402 -59260 -42156 70610 227332 329133 390776 462798
9912 462798 515779 507790 395168 245597 207891 260573 258425 163064 51045 35414 144185
9901 144185 249261 274823 292785 370756 498839 654900 843140 1040068 1192785 1256140
9891 1256140 1221830 1156757 1112591 1077609 1080511 1126474 1183591 1219565 1235338 1249383 1212828 1102353
9879 1102353 968350 817952 646117 506923 442400 470882 582883 790067 1036169 1143748
9869 1143748 1063284 920424 834828 744241 543753 320581 189776 158906 220149 358277
9859 358277 492771 517421 422732 339998 341290 347928 288561 201421 139210 139231 225650 357804
9847 357804 476805 527642 481866 358232 217456 129246 125133 209119 341929 434966 431321
9836 431321 353180 282768 242636 221436 212496 254446 374497 499421 583327 631397 615474
9825 615474 485313 272998 48327 -140816 -212726 -144999 -3062 132204 179299 86189
9815 86189 -122162 -374494 -580019 -640510 -545096 -391185 -275857 -200836 -154251 -172169 -251945
9804 -251945 -364149 -482013 -575589 -604440 -597963 -540234 -415384 -322043 -303547 -308758 -288284
9793 -288284 -224451 -130603 -45398 -8801 -34405 -41302 14549 86103 142714 186726 195520 140844
9781 140844 55230 -11933 -36291 30271 168142 275078 297305 217286 17024 -250779 -457596
9770 -457596 -520841 -477519 -436649 -447006 -449779 -407197 -349239 -283985 -293018 -464170 -690589 -808103
9758 -808103 -734434 -505526 -266744 -102083 43325 185750 255414 233741 155340 55655 -4943
9747 -4943 9438 83291 130150 124014 124794 148942 151515 92426 -22085 -125882 -127952 -43741 16953
9734 16953 60724 149763 298407 479031 626959 689640 674527 625833 551110 449029 310931
9723 310931 187449 75243 -105704 -288829 -335997 -221374 -53867 29984 27823 27698 28491
9712 28491 61 7366 119336 369795 716202 1028386 1234571 1373086 1522279 1651872
9702 1651872 1652774 1522968 1314817 1103142 960719 904052 873934 788266 658081 538960 430674
9691 430674 346137 371868 521940 729067 946834 1159568 1399378 1614005 1713689 1713434 1653340
9680 1653340 1617528 1659522 1700543 1691163 1646103 1551270 1404135 1230822 1032451 812904 578177
9669 578177 388559 340268 441039 634939 822814 867461 714526 484236 340346 325669
9659 325669 415847 576700 729732 775467 704997 635315 648577 750903 885659 981102 1022006
9648 1022006 1019075 984434 943716 921730 914174 923334 967108 1029313 1042154 1026327 1063888 1135218
9636 1135218 1156357 1095475 1013994 919353 781519 672680 667219 729819 844185 1001247 1155154
9625 1155154 1272133 1329172 1280748 1170632 1120070 1118223 1088945 1036593 980964 875113 711491
9614 711491 514427 294550 68277 -109230 -169243 -130670 -83459 3391 193803 422041
9604 422041 630096 810694 964615 1092002 1169601 1168628 1102200 967297 769006 574219 456897
9593 456897 418770 370224 259932 135110 50041 14052 7334 23942 63879 121767 159864
9582 159864 157171 182456 266512 351291 362518 284757 198514 150780 136745 159451 224402 316809
9570 316809 412331 484596 486655 460260 521222 679866 830161 912548 971530 1052679 1153685
9559 1153685 1238001 1290090 1323065 1339303 1323823 1275681 1225403 1185023 1133304 1056569 1017120
9548 1017120 990019 854069 658414 528868 441079 312089 122726 -35609 -41814 101821
9538 101821 266717 366511 396550 400698 448302 525057 549351 510919 466389 405660 319419 242175
9526 242175 180032 183866 295257 450702 551481 554833 498987 472061 514567 653129 864702
9515 864702 997386 938732 736240 501081 290704 150702 137112 209979 214867 76159 -125764
9504 -125764 -250614 -209275 -29058 202063 438955 640104 765509 798222 788882 828290 927077
9493 927077 1029585 1084369 1089199 1038480 933416 818351 728253 652305 580826 510707 399438
9482 399438 208496 33438 -15242 24014 55649 71912 142462 280932 381874 363456 265562
9471 265562 140945 47725 8632 19644 60658 140620 297496 508869 700970 831197 889350
9460 889350 853669 785317 743941 691674 618812 540240 480543 478253 531582 559757 532785 515616
9448 515616 564426 670790 786047 892238 971041 982461 936813 937055 1062182 1289370 1518616
9437 1518616 1583919 1434307 1177971 885138 581997 346416 277042 346606 413399 395984
9427 395984 301214 161817 46666 31867 116287 229410 293170 274546 192833 74317 -54102
9416 -54102 -150649 -183803 -125419 21955 178363 260581 270337 252650 216028 162984 101369 97679
9404 97679 134226 111683 54318 26959 19916 16773 33852 22676 -26160 -49553 -47566 -54245 -73468
9391 -73468 -61543 9542 94053 113765 75192 41235 5895 -35592 -35420 100151 418329 798248
9379 798248 1097087 1292388 1371091 1331992 1211108 1041461 811135 542930 311412 136268
9369 136268 9458 -78465 -81272 56054 293397 477155 510119 452162 381641 325432 261026
9358 261026 194874 151094 163885 220752 225426 138677 -15777 -149887 -203088 -190727 -143030
9347 -143030 -110204 -122954 -182448 -265239 -369065 -524509 -713930 -920066 -1149526 -1346645
9337 -1346645 -1457394 -1484661 -1414121 -1236242 -996220 -772205 -631065 -520086 -396500 -347892
9327 -347892 -406371 -485544 -488247 -456238 -442873 -423904 -432657 -507303 -570666 -490653 -297083 -91199
9315 -91199 110726 302354 486503 647311 696004 602305 461332 353562 337226 422206 557660
9304 557660 682672 762368 840511 887839 842106 763184 694867 644129 638642 683500 752825 777425
9292 777425 716511 638685 630456 640452 601444 565298 590406 646197 687812 723211 724342 631573
9280 631573 447341 236938 69064 -28570 -57505 -84841 -154312 -185391 -111114 61514 287525
9269 287525 538388 729294 775047 699170 562052 426701 337403 300694 311712 312501 274949
9258 274949 266052 335467 426448 461990 393547 307319 335671 438456 554004 654416 648143
9247 648143 509241 340944 233089 182935 134275 61955 -11031 -72942 -133776 -149421 -152675
9236 -152675 -205604 -264578 -242853 -105623 58367 166605 268188 428969 619837 805274
9226 805274 966425 1082252 1133533 1107860 961754 727190 559498 495011 421974 301997
9216 301997 163162 37349 -39768 -87648 -151456 -199646 -201275 -224737 -290199 -326652 -316468
9205 -316468 -258134 -111226 87565 286694 492278 655888 656680 466383 227448 56833
9195 56833 9827 71885 136319 159327 174797 255541 417611 583636 682029 760097 840610
9184 840610 892762 946493 1028484 1110790 1126935 1039030 917639 859989 847006 823821 778875
9173 778875 674468 511706 354837 289678 321033 341235 252675 56640 -167241 -378201
9163 -378201 -553850 -604564 -470567 -269471 -120717 -29195 18478 31180 27759 24290 26158
9152 26158 26517 33233 83614 190635 271249 209394 69678 432 20667 51084 34339 -65712
9140 -65712 -302102 -552807 -635539 -572564 -449515 -305397 -151109 8642 131784 212978
9130 212978 276432 309665 290337 246803 244971 270706 261917 217208 208606 264253 309609 301688
9118 301688 260248 233762 268271 400850 651249 950881 1182876 1249289 1106105 800125
9108 800125 457575 202722 106489 163256 267655 278542 165906 5109 -197155 -426765
9098 -426765 -587225 -652145 -650676 -566712 -432699 -298614 -136379 32762 147443 200851 218562
9087 218562 206271 169836 148135 136856 100343 58589 60791 123061 226435 322888 407707 499136
9075 499136 529501 467942 395650 351901 331340 366429 478670 611295 697758 714484 650404
9064 650404 492017 228999 -91920 -327439 -368625 -301888 -214643 -141998 -83287 -31964 -4060
9053 -4060 11952 -51738 -217087 -356718 -379662 -326380 -291394 -279430 -214917 -130673 -135242 -239525
9041 -239525 -349379 -408298 -419849 -399261 -421662 -531335 -638201 -658583 -611574 -502008 -361108
9030 -361108 -263197 -250841 -239724 -158757 -45186 28155 75411 176670 326118 469950 564895
9019 564895 594483 630750 706446 737479 688625 614316 504772 325637 157336 73746 52746
9008 52746 93765 202899 315560 360720 312931 195089 86825 44052 56298 127689 219627
8997 219627 260103 221802 168266 130553 44378 -77877 -177533 -238291 -244087 -195045 -97249 42993
8985 42993 180454 212687 117294 14511 15709 148132 289863 326516 290342 260181 312145
8974 312145 425531 509853 519614 480636 456981 452637 405734 290581 137894 32658 13356
8963 13356 37095 20426 -77476 -171474 -211368 -246681 -269395 -183075 -20424 80621 63806
8952 63806 5883 4680 62544 104079 95574 26469 -107916 -261236 -352633 -299479 -124193 108626
8940 108626 276580 262404 114121 -46308 -149185 -198744 -247779 -309067 -398337 -510264 -558260
8929 -558260 -510820 -463059 -459683 -433225 -369960 -349935 -396830 -453701 -501119 -591293 -693302 -732495
8917 -732495 -686858 -562448 -369426 -119030 85979 167202 206204 281954 387650 427329 324643
8906 324643 134323 -90637 -306322 -474060 -608267 -721314 -802561 -840552 -870716 -850769
8896 -850769 -688007 -446261 -230186 -72304 1477 -38946 -182124 -367009 -522230 -586290
8886 -586290 -573757 -584363 -626574 -617749 -550544 -452246 -320067 -184335 -43055 128863 288964
8875 288964 384780 419214 441797 482815 526812 530977 449379 307234 219511 232089 214787 90156
8863 90156 -73457 -209840 -293605 -286196 -174418 -32250 59959 71608 28593 -8673 1334
8852 1334 64920 155264 206418 186396 151311 151062 190255 247679 274292 251791 204069 215312
8840 215312 285124 288040 168574 44319 -7406 -38973 -94938 -176609 -267864 -359082 -414524
8829 -414524 -399918 -331236 -283959 -292036 -311616 -276861 -176657 -78917 -49867 -82423 -154647 -291438
8817 -291438 -454963 -559670 -568468 -466157 -307204 -186633 -123748 -73475 45261 228897
8807 228897 342540 319133 254351 216070 170735 111941 82096 113710 176397 179844 112577 41307
8795 41307 -4843 -32634 -11305 73128 127237 108275 53607 -57743 -205085 -296295 -248403
8784 -248403 -72839 114830 249861 303963 238864 75454 -113367 -293833 -428337 -439295
8774 -439295 -305714 -154513 -73823 5843 146892 340050 529289 680908 770214 756047
8764 756047 669923 574967 479230 388032 311813 250355 220036 282024 445972 587732 610492
8753 610492 554843 500374 505026 642725 827435 893136 832820 698993 511351 300278 131101
8742 131101 6210 -138422 -285444 -357249 -325505 -241404 -162477 -50395 145276 377559
8732 377559 592730 755815 849149 886736 879629 827715 750658 711630 717022 689937 591636 463429
8720 463429 320069 129435 -74310 -209838 -265164 -259467 -184848 -39831 107602 189755 251799
8709 251799 330736 409187 487885 609979 766632 877232 864735 701985 462653 253451
8699 253451 149987 139434 135535 92239 88904 169325 245061 261957 260535 251292 233081 274717
8687 274717 389294 529904 638957 691991 714914 767662 902049 1072996 1166161 1095378 901890
8676 901890 706773 576193 517857 507622 512180 486421 445435 471614 530580 508584 424072
8665 424072 379434 322438 126541 -164229 -381870 -447029 -417240 -385521 -364205 -279928 -109766
8654 -109766 74215 195517 227016 249975 295488 344278 438281 566098 689431 788944 849323
8643 849323 850944 833614 840960 857993 867734 815651 680838 504000 361023 308810 286774 242771
8631 242771 200727 195435 189386 145248 56918 -103697 -314269 -449541 -436632 -368669 -360764 -392866
8619 -392866 -394346 -373837 -382839 -492056 -650648 -718880 -689881 -670145 -721078 -795250 -817674 -753886
8607 -753886 -654157 -564394 -481614 -395565 -302027 -234412 -209113 -212344 -264275 -364166 -495139 -642447
8595 -642447 -761270 -837693 -844304 -746155 -597430 -482515 -362423 -152265 116344 327342
8585 327342 454213 494381 445443 344102 165390 -107903 -343954 -405328 -344241 -266346 -215369
8574 -215369 -202461 -219013 -236464 -241785 -197780 -81906 58385 220719 441708 680627 825789
8563 825789 803033 667443 511180 384923 322918 317722 334856 385291 445028 436889 356924
8552 356924 234236 69423 -84625 -179324 -272405 -406028 -519043 -609906 -729086 -846679
8542 -846679 -867613 -767187 -659675 -637348 -692546 -740807 -736876 -690225 -643010 -655235 -695809
8531 -695809 -714590 -710405 -675478 -647899 -676974 -690825 -603099 -452100 -316549 -272711 -318285
8520 -318285 -394202 -503478 -575303 -512507 -323020 -115250 19097 57808 18481 -97545 -270640
8509 -270640 -446791 -622027 -785264 -902998 -986421 -1068695 -1113719 -1112240 -1154936 -1273007 -1390538
8498 -1390538 -1408336 -1278587 -1055980 -831474 -648864 -527779 -522019 -607020 -707347 -807306
8488 -807306 -868221 -854432 -769713 -660378 -588624 -524741 -460960 -447946 -540099 -767508 -1033665
8477 -1033665 -1164344 -1095112 -855669 -522319 -258347 -152214 -128691 -94919 -68121 -105575
8467 -105575 -208324 -332079 -441482 -466595 -347482 -163103 -44098 -11204 -1081 39676
8457 39676 130424 265519 375364 354651 208653 65914 -6137 -20298 -14996 -8844 34078
8446 34078 129761 223696 289978 335015 317977 220270 120193 140224 230080 219808 115469
8435 115469 45665 43189 41194 2048 -49263 -47730 10226 57335 76210 138037 299659 451420
8423 451420 474870 414709 338454 233646 99509 2973 37908 214238 391894 416680 280148
8412 280148 89324 -76612 -200995 -254904 -273837 -350140 -480230 -572064 -559849 -494365 -399822
8401 -399822 -237833 -53756 81001 144101 148190 133061 139935 198306 299813 369744 340063
8390 340063 205068 24257 -82690 -29050 129370 264081 319069 325364 313606 293948 237475
8379 237475 106130 -99198 -299169 -398015 -366175 -222427 -26602 131731 216483 256334
8369 256334 300579 318295 279636 242519 257892 310458 348734 339824 256687 106477 -27500
8358 -27500 -50966 42599 183178 303102 382437 463214 518185 481104 388506 323479 292554
8347 292554 226567 116528 6125 -81640 -157761 -260091 -400286 -539193 -601896 -576328 -511436
8336 -511436 -390155 -188309 44012 239380 415027 544932 586812 653605 848094 1081840
8326 1081840 1179555 1099639 872595 562675 325542 250473 276605 284919 271308 255891 202807
8315 202807 134069 41990 -98231 -214576 -242769 -203660 -139900 -54265 79693 181156 159743
8304 159743 54862 -55928 -140670 -212084 -290400 -354900 -363104 -363370 -405931 -427173 -343470 -179709
8292 -179709 -54071 -45193 -102097 -102468 -32691 -20256 -116565 -262600 -358600 -347050 -295516 -328938
8280 -328938 -460797 -620799 -763237 -873588 -968689 -1054363 -1057873 -926445 -764461 -700142 -655327
8269 -655327 -521989 -343084 -158246 -18373 34458 19466 25386 122789 279075 446391 600327
8258 600327 703238 717216 648806 531737 472210 529134 581407 517637 331394 66506 -201410
8247 -201410 -416888 -514237 -438665 -235293 -25066 115644 205244 260284 250993 137705 -70295
8236 -70295 -329781 -530239 -583938 -502800 -418702 -435581 -485510 -484435 -471918 -486483 -463986 -371680
8224 -371680 -222903 -484 290178 617382 887145 1009431 931370 696710 431731 271133
8214 271133 226741 197434 176036 233771 380119 522253 615411 642683 574789 410373 224636
8203 224636 158005 208997 295080 350041 263965 62970 -85426 -88340 38 104355 185204
8192 185204 185991 112791 19320 -45883 -52295 -79029 -191066 -291507 -299681 -252089 -246219 -316296
8180 -316296 -403099 -434870 -403901 -333799 -250712 -197499 -182879 -179000 -224611 -350043 -487977
8169 -487977 -585450 -627167 -615959 -597816 -612816 -611338 -513242 -322126 -106637 95257 278531
8158 278531 383702 333745 207336 128236 124432 164359 224974 289820 312955 267432 184346
8147 184346 113987 79324 38265 -50187 -152147 -206155 -213888 -144304 -29971 84443 266027
8136 266027 487161 622624 590453 418480 253275 191199 177032 152371 194856 342302 468572
8125 468572 500748 501982 496222 463591 438984 488111 576892 616952 562283 471783 437411 461182
8113 461182 504942 565389 577367 478514 289202 34500 -231607 -390790 -363311 -255305 -170918
8102 -170918 -101557 -140672 -340900 -552874 -632846 -548693 -349787 -121682 75728 202696
8092 202696 279830 382080 528171 676309 754098 770412 787469 801742 774512 711371 684088
8081 684088 738651 793501 743080 634517 556976 480461 367087 299015 360053 494609 602709
8070 602709 731158 939776 1195629 1422658 1564450 1671617 1815943 2058934 2400261 2720904
8060 2720904 2923847 2980633 2872208 2683829 2556913 2495123 2462505 2431652 2345832 2268712 2284614
8049 2284614 2300924 2241064 2186668 2195208 2216880 2204319 2124475 1964594 1841878 1873645 2076903
8038 2076903 2408254 2735687 2920014 2976575 3006334 3045643 3065737 3062204 3069894 3096481 3097997
8027 3097997 3071054 3074305 3103507 3097354 3031916 2958162 2989629 3173423 3404895 3563690 3663090
8016 3663090 3832527 4085898 4254399 4263724 4162117 4016949 3880647 3773559 3719074 3735026
8006 3735026 3824385 3972384 4141905 4258806 4272148 4161217 3920978 3624120 3353762 3118206
7996 3118206 2967410 2956674 3095933 3325052 3555019 3724218 3795351 3833718 3882756 3875127 3814959
7985 3814959 3784194 3853370 3994455 4065990 4009056 3874933 3725374 3628092 3613862 3661042 3727345
7974 3727345 3758258 3648709 3353307 3007896 2722255 2528492 2471176 2511236 2542229 2554820
7964 2554820 2579354 2608319 2635502 2640804 2575252 2403600 2170314 1994967 1897012 1836917 1849913
7953 1849913 1939205 2010532 1982147 1908071 1880697 1912040 2003780 2150326 2315705 2443220 2512235
7942 2512235 2531853 2467329 2325531 2184217 2063246 1909645 1708497 1474853 1232948 1033714
7932 1033714 891453 814783 848208 1012743 1231093 1403710 1469865 1438468 1391520 1327459 1184018
7921 1184018 934934 606560 332339 181030 88112 8903 -69960 -154920 -196648 -127002 49948
7910 49948 225516 328629 414781 498614 494934 451430 481293 558355 572779 524285 457059 366507
7898 366507 290873 262045 292203 463594 772585 1068913 1208468 1164794 1037459 942276 919449
7887 919449 920831 894703 845137 805189 724142 550294 402277 400346 548459 765249 908569
7876 908569 941053 930757 892031 760996 544753 333196 210913 200936 263393 377748 507191
7865 507191 564876 562199 613507 808951 1123388 1446546 1661186 1734965 1728351 1706857 1666915
7854 1666915 1536168 1321134 1129169 1029901 1047058 1178571 1336415 1435430 1473388 1433897
7844 1433897 1282293 1068169 906135 833787 812160 806024 869408 1020023 1191673 1374123
7834 1374123 1583459 1772943 1871113 1901268 1907462 1919215 1995298 2155084 2310827 2357753 2370992
7823 2370992 2442319 2510147 2514661 2466097 2387620 2291265 2225576 2198546 2176961 2144986 2181788 2394931
7811 2394931 2727582 3017761 3186370 3216546 3188141 3240095 3392442 3580741 3751654 3873629
7801 3873629 3942345 4000977 4113388 4310298 4566682 4806809 4953334 4985192 4926368 4830504
7791 4830504 4733384 4569999 4371083 4244134 4197185 4272900 4457659 4645679 4746537 4713821
7781 4713821 4542970 4282567 4014268 3826424 3744974 3748810 3841308 4032616 4228826 4354265
7771 4354265 4462508 4627234 4848386 5031723 5125382 5169481 5224489 5286538 5344031 5355586 5302734
7760 5302734 5215633 5116429 5028549 4923598 4798724 4713562 4712343 4762893 4764351 4624641 4371023
7749 4371023 4112456 3911526 3809012 3807658 3818674 3754845 3583988 3330978 3053052 2725851
7739 2725851 2306199 1817217 1371279 1115363 1066629 1139808 1252166 1353059 1398073 1365132
7729 1365132 1331579 1392242 1469909 1412828 1231195 1033839 861755 768435 866405 1133465 1411914
7718 1411914 1596428 1692588 1715405 1690906 1689184 1723703 1707856 1612382 1534972 1488170 1393830
7707 1393830 1241756 1051145 808423 535994 331571 234192 200752 255014 435182 676834
7697 676834 854977 903563 824532 628375 365997 145629 124256 339866 609222 746582
7687 746582 693048 529765 359138 250090 262706 374211 474598 534866 544614 485831 386774
7676 386774 273927 205857 189828 191194 236337 342853 463845 537885 523949 432486 287947
7665 287947 143160 107990 238871 458112 632968 711987 761880 853917 951856 987418 967063
7654 967063 935119 949765 1054277 1220500 1322047 1251795 1020079 772165 666816 713095
7644 713095 791974 790139 714024 608174 482808 366377 297160 242378 138322 -23976 -244713
7633 -244713 -470513 -614865 -664503 -648033 -612276 -550349 -418553 -219275 -38396 72438
7623 72438 119633 91094 15752 683 84501 211105 329702 413576 438369 372755 241055
7612 241055 106711 51322 116995 228780 311235 339294 285616 246230 335420 523996 750727
7601 750727 961482 1079043 1070921 987259 899177 812333 714870 640901 654389 788468 992514
7590 992514 1144690 1179786 1148522 1098478 1021499 924426 852562 843167 907814 995207 1030127 1032963
7578 1032963 1082736 1160818 1220663 1261176 1277214 1293549 1301857 1241376 1105306 1029802 1122003
7567 1122003 1283187 1388226 1388773 1336761 1286636 1188275 1045869 946531 933436 971429 1007943
7556 1007943 1048832 1100855 1117593 1069393 1016070 1011074 1024512 968577 840202 717398 610227
7545 610227 539886 572036 681574 789300 831017 782204 688388 645317 684962 764863 848422
7534 848422 952166 1020948 961755 844473 787928 769253 704977 636676 671056 787526 887180
7523 887180 982046 1158347 1407050 1642142 1799308 1882415 1975868 2104946 2160144 2064795 1861796
7512 1861796 1634873 1444321 1269757 1090042 954620 926247 946257 859001 637688 403086
7502 403086 231655 163747 233011 381275 500949 544032 552617 548186 457587 280291 123856
7491 123856 78237 166639 330679 516114 693963 844239 960773 978879 866002 710515
7481 710515 591860 480744 345471 241550 190981 125191 32742 -35524 -76101 -107873 -129320
7470 -129320 -143992 -154918 -105343 12208 150783 318579 473043 505106 381943 177393
7460 177393 -26459 -197200 -294555 -228164 -27587 174689 368439 565547 672882 649699
7450 649699 541203 456077 484397 568483 568726 461472 365001 339514 352031 378599 409574 447031
7438 447031 479333 463415 396276 344337 326911 320648 328487 330112 308668 307417 338264 316883
7426 316883 195665 42186 -45364 -43006 7774 40380 19525 -57074 -128617 -143064 -114747
7415 -114747 -24988 81784 139357 126857 28861 -176147 -417163 -562860 -563464 -448299 -211419
7404 -211419 145802 539458 853227 1044894 1178266 1300857 1378315 1337438 1193668 1044680
7394 1044680 941490 852632 729640 550340 354251 183477 77358 41156 42552 43322 18363
7383 18363 -43262 -111651 -118485 5806 296584 615636 775491 756221 661976 568741 490344
7372 490344 430553 399292 419732 449173 407985 335798 315425 337811 357983 388011 399559 384422
$$ [...]
##END NTUPLES=NMR SPECTRUM
##END=
