##TITLE=C13_LR-785-R3-C2-1
 CDCl3, 21345sc

 17.2.2025
##JCAMPDX= 6.0         $$ Bruker NMR JCAMP-DX V2.0
##DATA TYPE= NMR SPECTRUM
##DATA CLASS= NTUPLES
##ORIGIN= UXNMR, Bruker Analytische Messtechnik GmbH
##OWNER= root
$$ XWIN-NMR		Version 3.5
$$ Tue Feb 18 13:44:54 2025 Russian Standard Time (UT+4h)  she@DPX200
##.OBSERVE FREQUENCY= 50.327896
##.OBSERVE NUCLEUS= ^13C
##.ACQUISITION MODE= SIMULTANEOUS
##.ACQUISITION SCHEME= undefined
##.AVERAGES= 21346
##.DIGITISER RES= 17
##SPECTROMETER/DATA SYSTEM= spect
##.PULSE SEQUENCE= zgpg30
##.SOLVENT NAME= CDCl3
##.SHIFT REFERENCE= (INTERNAL, CDCl3, 0, 222.646)
##AUDIT TRAIL= $$ (NUMBER, WHEN, WHO, WHERE, WHAT)
$$ ##TITLE= Audit trail, XWIN-NMR		Version 3.5
$$ ##JCAMPDX= 5.01
$$ ##ORIGIN= Bruker BioSpin GmbH
$$ ##OWNER= she
$$ F:/spectra/data/she/nmr/c13/1/pdata/1/auditp.txt
$$ ##AUDIT TRAIL=  $$ (NUMBER, WHEN, WHO, WHERE, WHAT)
(   1,<2025-02-18 13:39:55.26 +0400>,<she>,<DPX200>,
      <created by zg, POWCHK disabled, PULCHK disabled
       terminated by command 'halt'
       configuration hash MD5:
       00 E9 B6 7A A2 85 ED C7 34 08 36 98 17 FE 4E 26
       data hash MD5: 32K
       72 4E 97 91 EE 21 B3 07 71 9E FB 31 71 27 38 93>)
(   2,<2025-02-18 13:40:26.21 +0400>,<she>,<DPX200>,
      <Start of raw data processing
       efp BC_mod = 2 LB = 2 FT_mod = 6 PKNL = 1 PHC0 = -418.4723 PHC1 = 52.08833 SI = 32K 
       data hash MD5: 32K
       D1 07 AE 52 B0 22 82 9E 3A 6C A9 A9 36 6C 8F 3F>)
(   3,<2025-02-18 13:41:03.75 +0400>,<she>,<DPX200>,
      <pk PHC0 = 19.69805 PHC1 = -23.20001 
       data hash MD5: 32K
       83 81 A8 94 8A 97 89 2A 5C A3 FE C8 C2 E1 F4 B8>)
(   4,<2025-02-18 13:41:24.01 +0400>,<she>,<DPX200>,
      <abs ABSG = 5 
       data hash MD5: 32K
       DA 04 80 52 9D 84 3F EF 88 C3 F8 AC 23 62 91 2B>)
(   5,<2025-02-18 13:41:57.53 +0400>,<she>,<DPX200>,
      <pk PHC0 = -1.395705 PHC1 = 2 
       data hash MD5: 32K
       E4 DF 9A 6F C0 16 71 87 BF 1C 6A 9E AC C1 19 24>)
(   6,<2025-02-18 13:42:02.12 +0400>,<she>,<DPX200>,
      <abs ABSG = 5 
       data hash MD5: 32K
       C9 B2 4F 5C 97 D7 3E 74 4D 0A B2 03 8D 20 F0 5F>)
$$ ##END=
$$ 
$$ hash MD5
$$ F3 CC 36 31 20 02 0A 22 C7 32 5A 5D 6D 53 45 AB
##$RELAX= 
##$RELAX= 
##$RELAX= 
##$RELAX= 
##$RELAX= 
##$RELAX= 
##$RELAX= 
##$RELAX= 
$$ Bruker specific parameters
$$ --------------------------
##$DU= <F:/spectra>
##$EXPNO= 1
##$NAME= <c13>
##$PROCNO= 1
##$TYPE= <nmr>
##$USER= <she>
##$AMP= (0..31)
100 100 100 100 100 100 100 100 100 100 100 100 100 100 100 100 100 100 
100 100 100 100 100 100 100 100 100 100 100 100 100 100 
##$AQSEQ= 0
##$AQ_mod= 1
##$AUNM= <au_zg>
##$AUTOPOS= <>
##$BF1= 50.322709
##$BF2= 200.13
##$BF3= 50.322709
##$BF4= 500.13
##$BF5= 500.13
##$BF6= 500.13
##$BF7= 500.13
##$BF8= 500.13
##$BYTORDA= 1
##$CFDGTYP= 0
##$CFRGTYP= 5
##$CHEMSTR= <none>
##$CNST= (0..31)
1 1 145 1 1 1 1 1 1 1 1 1 1 1 1 1 1 1 1 1 1 1 1 1 1 1 1 1 1 1 1 1 
##$CPDPRG= <waltz16>
##$CPDPRG1= <>
##$CPDPRG2= <waltz16>
##$CPDPRG3= <>
$$ [...]
##$SUBNAM4= <"">
##$SUBNAM5= <"">
##$SUBNAM6= <"">
##$SUBNAM7= <"">
##$SUBNAM8= <"">
##$SUBNAM9= <"">
##$SW= 239.972175391363
##$SWIBOX= (0..15)
0 1 3 0 0 0 0 0 0 0 0 0 0 0 0 0 
##$SW_h= 12077.2946859903
##$TD= 32768
##$TD0= 1
##$TE= 0
##$TE2= 300
##$TE3= 300
##$TEG= 300
##$TL= (0..7)
120 120 120 120 120 120 120 120 
##$TP= (0..7)
150 150 150 150 150 150 150 150 
##$TP07= 0
##$TPNAME0= <>
##$TPNAME1= <>
##$TPNAME2= <>
##$TPNAME3= <>
##$TPNAME4= <>
##$TPNAME5= <>
##$TPNAME6= <>
##$TPNAME7= <>
##$TPOAL= (0..7)
0.5 0.5 0.5 0.5 0.5 0.5 0.5 0.5 
##$TPOFFS= (0..7)
0 0 0 0 0 0 0 0 
##$TUNHIN= 0
##$TUNHOUT= 0
##$TUNXOUT= 0
##$USERA1= <user>
##$USERA2= <user>
##$USERA3= <user>
##$USERA4= <user>
##$USERA5= <user>
##$V9= 5
##$VALIST= <valist>
##$VCLIST= <CCCCCCCCCCCCCCC>
##$VD= 0
##$VDLIST= <DDDDDDDDDDDDDDD>
##$VPLIST= <PPPPPPPPPPPPPPP>
##$VTLIST= <TTTTTTTTTTTTTTT>
##$WBST= 1024
##$WBSW= 4
##$XGAIN= (0..3)
0 0 0 0 
##$XL= 0
##$YL= 0
##$YMAX_a= 57797398
##$YMIN_a= -102999055
##$ZGOPTNS= <>
##$ZL1= 120
##$ZL2= 120
##$ZL3= 120
##$ZL4= 120
##$ABSF1= 222.646
##$ABSF2= -17.35081
##$ABSG= 5
##$ABSL= 3
##$ALPHA= 0
##$AQORDER= 0
##$ASSFAC= 0
##$ASSFACI= 0
##$ASSFACX= 0
##$ASSWID= 0
##$AUNMP= <proc_1d>
##$AZFE= 0.1
##$AZFW= 0.5
##$BCFW= 0
##$BC_mod= 2
##$BYTORDP= 0
##$COROFFS= 0
##$CY= -3
##$DATMOD= 1
##$DC= 0
##$DFILT= <>
##$DTYPP= 0
##$F1P= 0
##$F2P= 0
##$FCOR= 0.5
##$FTSIZE= 32768
##$FT_mod= 6
##$GAMMA= 0
##$GB= 0
##$INTBC= 1
##$INTSCL= 4.134877e-10
##$ISEN= 128
##$LB= 2
##$LEV0= 0
##$LPBIN= 0
##$MAXI= 10000
##$MC2= 0
##$MEAN= 0
##$ME_mod= 0
##$MI= 0.1934396
##$NCOEF= 0
##$NC_proc= 2
##$NLEV= 6
##$NOISF1= 120.0001
##$NOISF2= 80.00006
##$NSP= 0
##$NTH_PI= 0
##$NZP= 0
##$OFFSET= 222.646
##$PC= 1.4
##$PHC0= -400.1699
##$PHC1= 30.88832
##$PH_mod= 1
##$PKNL= yes
##$PPARMOD= 0
##$PSCAL= 0
##$PSIGN= 0
##$REVERSE= no
##$SF= 50.3227304950709
##$SI= 32768
##$SIGF1= 140
##$SIGF2= 120
##$SINO= 11.81781
##$SIOLD= 32768
##$SREGLST= <13C.CDCl3>
##$SSB= 0
##$STSI= 32768
##$STSR= 0
##$SW_p= 12077.2946859903
##$SYMM= 0
##$S_DEV= 0
##$TDeff= 32768
##$TDoff= 0
##$TI= <>
##$TILT= no
##$TM1= 0
##$TM2= 0
##$TOPLEV= 0
##$USERP1= <user>
##$USERP2= <user>
##$USERP3= <user>
##$USERP4= <user>
##$USERP5= <user>
##$WDW= 1
##$XDIM= 32768
##$YMAX_p= 382594749
##$YMIN_p= -1998006
$$ End of Bruker specific parameters
$$ ---------------------------------
##NTUPLES= NMR SPECTRUM
##VAR_NAME=  FREQUENCY,     SPECTRUM/REAL,   SPECTRUM/IMAG
##SYMBOL=    X,             R,               I
##VAR_TYPE=  INDEPENDENT,   DEPENDENT,       DEPENDENT
##VAR_FORM=  AFFN,          ASDF,            ASDF
##VAR_DIM=   32768,         32768,           32768
##UNITS=     HZ,            ARBITRARY UNITS, ARBITRARY UNITS
##FACTOR=    0.368581032318806, 1,           1
##FIRST=     11204.1544572324, 0,            0
##LAST=      -873.140228757911, 0,           0
##MIN=       -873.140228757911, -1998006,    0
##MAX=       11204.1544572324, 382594749,    0
$$ Real data points
##PAGE= N=1
##DATA TABLE= (X++(R..R)), XYDATA
$$ [...]
$$ plain form
15937 -317875 -395052 -406262 -378379 -326099 -267132 -165392 -1686 160001 233983 215005 189803
15926 189803 239304 365021 481978 511786 459356 306377 87062 -104024 -234760 -255819
15916 -255819 -112285 136896 348138 443395 423126 287394 76621 -97401 -134160 -78036
15906 -78036 -17180 69358 235158 482133 769144 959589 980314 877013 707154 561439
15896 561439 453601 330899 213462 178676 194700 178027 96058 -44915 -195203 -341745
15886 -341745 -470107 -558045 -592698 -582861 -544608 -524438 -587003 -716210 -832478 -878905 -854014
15875 -854014 -764659 -589857 -379850 -237651 -152838 -95485 -80963 -95174 -85797 -41397 44717
15864 44717 153104 242489 317346 397738 478303 538325 554033 515571 423403 259053 89403
$$ packed form
15937c17875p7177j1210K7883N2280N8967J01740J63706J61687P3982j8978k5202
15926A89803M9501J25717J16957K9808n2430j52979k19315j91086j30736k1059
15916b55819J43534K49181K11242R5257k0269j35732k10773j74022l6759N6124
15906g8036O0856Q6538J65800K46975K87011J90445K0725j03301j69859j45715
15896E61439j07838j22702j17437l4786J6024j6673q1969j40973j50288j46542
15886c41745j28362q7938l4653R837L8253K0170o2565j29207j16268m6427K4891
15875h54014Q9355J74802K10007J42199Q4813N7353J4522j4211R377M4400Q6114
15864D4717J08387Q9385P4857Q0392Q0565O0022J5708l8462r2168j64350j69650
$$ plain form
15853 89403 6805 63435 219816 328845 308236 180205 2604 -115284 -123487 -117344 -178743
15842 -178743 -258770 -277897 -268152 -283041 -298526 -271194 -199101 -141820 -124733 -87988 31326
15831 31326 238230 432404 503837 432855 220959 -67525 -310167 -462239 -577388 -711978
15821 -711978 -807811 -751027 -514752 -231055 -43776 81773 252607 481543 712498 835366
15811 835366 801796 662491 475404 296060 200984 186201 147293 71083 12953 -50315 -155405
15800 -155405 -260657 -306936 -281081 -217416 -172307 -195582 -291431 -393325 -434987 -393138 -305520
15789 -305520 -203223 -90208 -964 76075 166042 152101 -17588 -204685 -279162 -216353 -63286
15778 -63286 78685 110112 -8935 -246370 -499225 -700294 -794435 -759302 -641245 -492505
$$ packed form
15853H9403q2598N6630J56381J09029k0609j28031j77601j17888q203O143o1399
15842a78743q0027j9127R745j4889j5485K7332P2093N7281J7087L6745J19314
15831C1326K06904J94174P1433p0982k11896k88484k42642j52072j15149j34590
15821g11978r5833N6784K36275K83697J87279J25549J70834K28936K30955J22868
15811H35366l3570j39305j87087j79344r5076j4783l8908p6210n8130o3268j05090
15800a55405j05252m6279K5855O3665M5109k3275r5849j01894m1662M1849Q7618
15789c05520J02297J13015Q9244P7039Q9967j3941j69689j87097p4477O2809J53067
15778f3286J41971L1427j19047k37435k52855k01069r4141L5133J18057J48740
$$ plain form
15768 -492505 -367629 -285284 -199075 -85392 -15549 -39165 -74538 -72129 -71371 -101232 -175693 -282938
15756 -282938 -415018 -585273 -803520 -1011145 -1082928 -973004 -751664 -495162 -271681 -152060
15746 -152060 -150352 -194966 -199102 -174073 -132560 -15875 211414 493536 738942 924931 1021055
15735 1021055 978845 840674 681920 524709 415872 401133 472728 589425 684553 712559
15725 712559 696410 677937 668938 653800 567541 394656 175462 -43419 -231863 -389436 -508312
15714 -508312 -639117 -804565 -874439 -755427 -540251 -376593 -288055 -181725 -8007 154606
15704 154606 262412 370407 521026 712225 898553 1007008 1002341 897209 717460 532474
15694 532474 425085 434771 491841 467900 344343 210707 145003 124585 66058 -48492 -215892
$$ packed form
15768d92505J24876Q2345Q6209J13683O9843k3616l5373K409P58k9861p4461j07245
15756b82938j32080j70255k18247k07625p1783J09924K21340K56502K23481J19621
15746a52060J708m4614m136K5029M1513J16685K27289K82122K45406J85989R6124
15735A021055m2210j38171j58754j57211j08837j4739P1595J16697R5128K8006
15725G12559j6149j8473q999j5138q6259j72885k19194k18881j88444j57573j18876
15714e08312j30805j65448o9874J19012K15176J63658Q8538J06330J73718J62613
15704A54606J07806J07995J50619J91199J86328J08455m667j05132j79749j84986
15694E32474j07389R686N7070k3941j23557j33636o5704k0418n8527j14550j67400
$$ plain form
15683 -215892 -400552 -505762 -482243 -363458 -215518 -141984 -182435 -244788 -277422 -347059 -485657
15672 -485657 -631019 -684866 -629715 -586923 -619811 -662812 -664936 -654319 -666227 -690323 -704692
15661 -704692 -705836 -710094 -670941 -527610 -354201 -254574 -234742 -246870 -313535 -439165 -548162
15650 -548162 -569163 -518517 -474123 -463171 -475760 -464763 -380874 -249973 -84484 142855 365662
15639 365662 471445 479257 438262 298886 87691 -60225 -94792 -79715 -69010 -81257 -120653
15628 -120653 -140984 -85568 -15025 9213 27614 77855 132180 143359 114385 74645 70274 112838
15616 112838 158439 175670 210375 287782 401821 523052 609687 630720 583371 540899 502335
15605 502335 419066 335846 299972 269299 169782 10244 -107725 -142381 -105024 5857 158802
$$ packed form
15683b15892j84660j05210K3519J18785J47940P3534m0451o2353l2634o9637j38598
15672d85657j45362n3847N5151M2792l2888m3001k124J0617j1908k4096j4369
15661g04692j144m258L9153J43331J73409R9627J9832j2128o6665j25630j08997
15650e48162k1001N0646M4394J0952j2589J0997Q3889J30901J65489K27339K22807
15639C65662J05783P812m0995j39376k11195j47916l4567J5077J0705j2247l9396
15628a20653k0331N5416P0543K4238J8401N0241N4325J1179k8974l9740m371M2564
15616A12838M5601J7231L4705P7407J14039J21231Q6635K1033m7349m2472l8564
15605E02335q3269q3220l5874l0673r9517j59538j17969l4656L7357J10881J52945
$$ plain form
15594 158802 316187 454953 563309 610113 540390 406761 307698 304678 395891 463032 409112
15583 409112 252484 81144 -16594 -13536 70612 155634 173337 149956 115154 59292 13054
15572 13054 8219 31655 65433 63475 22694 -11363 -53874 -126113 -178554 -190304 -183117 -137993
15560 -137993 -2107 163245 236365 255906 302193 281414 131473 -58188 -179238 -198533
15550 -198533 -146027 -45268 98426 229564 298360 357597 459437 566586 625133 620052 587146
15539 587146 577078 551572 429944 211455 -47658 -327768 -600358 -850001 -1050107 -1097160
15529 -1097160 -978542 -762734 -527551 -351493 -286057 -286591 -252417 -180716 -108309 -16302 84445
15518 84445 123208 96921 118198 189369 229946 208697 153769 119717 154595 277391 459468
$$ packed form
15594A58802J57385J38766J08356M6804o9723j33629r9063l020R1213O7141n3920
15583D09112j56628j71340r7738L058Q4148Q5022J7703k3381l4802n5862m6238
15572A3054m835K3436L3778j958m0781l4057m2511p2239n2441j1750P187M5124
15560a37993J35886J65352P3120J9541M6287k0779j49941j89661j21050j9295
15550a98533N2506J00759J43694J31138O8796N9237J01840J07149N8547n081l2906
15539E87146j0068k5506j21628k18489k59113k80110k72590k49643k00106m7053
15529a097160J18618K15808K35183J76058O5436n34L4174P1701P2407R2007J00747
15518H4445L8763k6287K1277P1171M0577k1249n4928l4052L4878J22796J82077
$$ plain form
15507 459468 661362 809441 843343 752161 569295 355675 230221 275256 448562 589797
15497 589797 552180 403331 268868 190571 153017 97461 -17575 -190530 -418539 -669839
15487 -669839 -873644 -995019 -1032160 -962879 -834838 -730560 -618469 -479259 -391567 -390145
15477 -390145 -382803 -285607 -178184 -153997 -122379 47652 275865 425075 508764 525417 411085
15466 411085 175071 -38650 -61222 105411 265919 277552 204886 152623 123858 71234 17981
15455 17981 -8137 -51211 -139543 -256557 -354795 -393546 -372401 -332698 -310197 -292832 -244129
15444 -244129 -189537 -142945 -94777 -44117 44781 148456 189484 119904 -82111 -370579 -624923
15433 -624923 -773634 -866462 -963292 -1017204 -951420 -864209 -882302 -980195 -1044041 -1009695 -921495
$$ packed form
15507D59468K01894J48079L3902r1182j82866k13620j25454M5035J73306J41235
15497E89797l7617j48849j34463p8297l7554n5556j15036j72955k28009k51300
15487f69839k03805j21375l7141O9281J28041J04278J12091J39210Q7692J422
15477c90145P342R7196J07423K4187L1618J70031K28213J49210Q3689J6653j14332
15466D11085k36014k13721k2572J66633J60508J1633p2666n2263k8765n2624n3253
15455A7981k6118m3074q8332j17014r8238l8751K1145L9703K2501J7365M8703
15444b44129N4592M6592M8168N0660Q8898J03675M1028o9580k02015k88468k54344
15433f24923j48711r2828r6830n3912O5784Q7211j8093r7893o3846L4346Q8200
$$ plain form
15422 -921495 -806196 -650320 -470101 -390491 -526307 -770279 -926365 -949295 -899752 -773423
15412 -773423 -611979 -484070 -394753 -322951 -282294 -296299 -376703 -465260 -504611 -520134 -517852
15401 -517852 -486844 -461882 -439869 -340324 -156915 8204 112171 207184 296130 300738 176666
15390 176666 -4813 -130478 -194261 -200900 -96589 57949 141748 121138 84984 107600 161070
15379 161070 211117 229753 214465 215105 239378 260618 278550 262992 218662 182699 115344 13180
15367 13180 -55313 -53613 12053 132647 284664 398076 416788 382024 349411 313927 259499
15356 259499 217645 220956 249048 243425 178778 99531 13591 -137524 -324234 -438299 -422779
15345 -422779 -329704 -278557 -291728 -316602 -338350 -359382 -361680 -314577 -193246 -57731 13930
$$ packed form
15422i21495J15299J55876J80219P9610j35816k43972j56086k2930M9543J26329
15412g73423J61444J27909Q9317P1802M0657j4005q0404q8557l9351j5523K282
15401e17852L1008K4962K2013R9545J83409J65119J03967R5013Q8946M608j24072
15390A76666j81479j25665o3783o639J04311J54538Q3799k0610l6154K2616N3470
15379A61070N0047J8636j5288O40K4273K1240J7932j5558m4330l5963o7355j02164
15367A3180o8493J700O5666J20594J52017J13412J8712l4764l2613l5484n4428
15356B59499m1854L311K8092n623o4647p9247q5940j51115j86710j14065J5520
15345d22779R3075N1147j3171k4874k1748k1032k298M7103J21331J35515P1661
$$ plain form
15334 13930 71264 242046 508766 747204 893380 935142 862368 694274 506663 380980
15324 380980 354898 401110 387902 229604 4585 -191237 -308209 -373899 -428400 -448510 -423625
15313 -423625 -438365 -556813 -708089 -739991 -614944 -456171 -376253 -424026 -563203 -716948
15303 -716948 -849693 -920819 -881114 -792129 -739672 -767172 -878506 -989864 -979709 -838599 -685505
15292 -685505 -622876 -637370 -611799 -520116 -459876 -463672 -456939 -454334 -490681 -480302 -395053 -302659
15280 -302659 -216569 -116883 38580 242775 414839 519489 527088 401538 195819 -14569
15270 -14569 -169975 -178346 -65387 49278 109179 129863 106691 42006 -9738 -78571 -284885
15259 -284885 -583111 -766521 -785957 -750464 -732637 -739387 -755159 -757305 -746215 -706714 -554132
$$ packed form
15334A3930N7334J70782K66720K38438J46176M1762p2774j68094j87611j25683
15324C80980k6082M6212j3208j58298k25019j95822j16972o5690n4501k0110K4885
15313d23625j4740j18448j51276l1902J25047J58773P9918m7773j39177j53745
15303g16948j32745p1126L9705Q8985N2457k7500j11334j11358J0155J41110J53094
15292f85505O2629j4494K5571R1683O0240l796O733K605l6347J0379Q5249R2394
15280c02659Q6090R9686J55463K04195J72064J04650P599j25550k05719k10388
15270a4569j55406q371J12959J14665N9901K0684k3172o4685n1744o8833k06314
15259b84885k98226j83410j9436L5493J7827o750j5772k146J1090L9501J52582
$$ plain form
15248 -554132 -264959 -223 98824 9273 -199709 -435354 -570640 -506181 -313262 -157713
15238 -157713 -127504 -237831 -404228 -495681 -500877 -470700 -410927 -364375 -353559 -283588 -74077
15227 -74077 196958 346062 346612 380967 564059 817958 984516 977973 846002 657174 443364
15216 443364 232621 85173 -8681 -91639 -146538 -226876 -383097 -508298 -501265 -364323 -209522
15205 -209522 -145308 -121738 -105167 -137119 -200577 -260165 -273499 -197761 -61338 -2263 -79174
15194 -79174 -203711 -301702 -384656 -493312 -619937 -747472 -832324 -804851 -710662 -670498 -667687
15183 -667687 -628954 -593025 -592060 -594641 -553072 -417511 -251698 -111406 27470 134402 148190
15172 148190 80519 -25991 -139910 -225572 -247689 -212173 -168739 -132705 -72635 11798 52699
$$ packed form
15248e54132K89173K64736R9047q9551k08982k35645j35286O4459J92919J55549
15238a57713L0209j10327j66397r1453n196L0177N9773M6552J0816O9971K09511
15227g4077K71035J49104N50L4355J83092K53899J66558o543j31971j88828k13810
15216D43364k10743j47448r3854q2958n4899q0338j56221j25201P033J36942J54801
15205b09522O4214K3570J6571l1952o3458n9588j3334P5738J36423N9075p6911
15194g9174j24537r7991q2954j08656j26625j27535q4852K7473R4189M0164K811
15183f67687L8733L5929R65k581M1569J35561J65813J40292J38876J06932J3788
15172A48190o7671j06510j13919q5662k2117L5516M3434L6034O0070Q4433M0901
$$ plain form
15161 52699 11315 -68849 -127407 -125855 -112158 -184973 -317915 -365164 -214341 24513 187708
15150 187708 266775 329104 387822 398506 346021 271168 204684 120190 42608 6891 -38824
15139 -38824 -120196 -166294 -142438 -129793 -195839 -275097 -340908 -414611 -458517 -433881 -317359
15128 -317359 -166970 -62233 -24784 -64454 -167104 -313707 -487977 -607115 -605628 -495850
15118 -495850 -370121 -332813 -412972 -606576 -848639 -1010723 -992405 -820694 -596099 -368821
15108 -368821 -152911 -25341 -55030 -152368 -200808 -194824 -155150 -92057 -51379 -99348 -219050
15097 -219050 -314263 -358022 -386585 -477785 -659002 -847823 -926858 -854957 -687259 -546473 -545349
15086 -545349 -634795 -653183 -537976 -330947 -113189 33494 80893 43980 -43804 -128790 -120587
$$ packed form
15161E2699m1384q0164n8558J552J3697p2815j32942m7249J50823K38854J63195
15150A87708P9067O2329N8718J0684n2485p4853o6484q4494p7582l5717m5715
15139c8824q1372m6098K3856J2645o6046p9258o5811p3703m3906K4636J16522
15128c17359J50389J04737L7449l9670j02650j46603j74270j19138J487J09778
15118d95850J25729L7308q0159j93604k42063j62084J8318J71711K24595K27278
15108c68821K15910J27570k9689r7338m8440N984L9674O3093M0678m7969j19702
15097b19050r5213m3759k8563r1200j81217j88821p9035P1901J67698J40786J124
15086e45349q9446j8388J15207K07029K17758J46683M7399l6913q7784q4986Q203
$$ plain form
15075 -120587 32226 238220 393443 507611 611871 692761 692410 592656 471432 405519 409174
15064 409174 463999 555995 671985 772788 828012 882049 975874 1065256 1070511 975594 812659
15053 812659 562263 271183 79585 50833 105818 125015 46367 -109244 -289744 -422757
15043 -422757 -475495 -505776 -501779 -436369 -402747 -471466 -630107 -753811 -716349 -570438 -437911
15032 -437911 -365388 -308280 -216582 -120478 -88490 -153684 -272384 -393025 -426745 -340063 -245077
15021 -245077 -264268 -378014 -506107 -576186 -576790 -554816 -519895 -517859 -606772 -702300 -706784 -633565
15009 -633565 -534283 -476847 -486147 -532282 -538782 -499208 -462189 -445885 -417187 -344321 -249952 -200051
14997 -200051 -219166 -238311 -195557 -125253 -118011 -171126 -204573 -171065 -120142 -153080 -279448
$$ packed form
15075a20587J52813K05994J55223J14168J04260Q0890l51r9754j21224o5913L655
15064D09174N4825R1996J15990J00803N5224N4037R3825Q9382N255r4917j62935
15053H12659k50396k91080j91598k8752N4985J9197p8648j55611j80500j33013
15043d22757n2738l0281L997O5410L3622o8719j58641j23704L7462J45911J32527
15032d37911P2523N7108R1698R6104L1988o5194j18700j20641l3720Q6682R4986
15021b45077j9191j13746j28093p0079o04K1974L4921K036q8913r5528m484P3219
15009f33565R9282N7436r300m6135o500L9574L7019J6304K8698P2866R4369M9901
14997b00051j9115j9145M2754P0304P242n3115l3447L3508N0923l2938j26368
$$ plain form
14986 -279448 -406143 -453275 -439644 -441636 -510358 -651700 -817967 -952284 -1006588 -927669 -692199
14975 -692199 -345232 -9572 188136 231304 186401 137612 146701 199412 234454 270632 344363
14964 344363 385138 355828 286293 175507 -13952 -278718 -545927 -711299 -739515 -690755
14954 -690755 -627809 -574406 -489505 -339073 -184709 -120838 -181179 -320193 -436658 -447922 -382851
14943 -382851 -305233 -249515 -211854 -153773 -93237 -74417 -47687 19983 110884 221307 318439
14932 318439 356330 345767 359836 406156 421037 370404 264054 154764 76921 18834 -8097
14921 -8097 29538 107260 173895 157437 38157 -109365 -228111 -326281 -402946 -435659 -428471
14910 -428471 -415943 -431028 -454177 -464253 -474252 -493103 -527272 -535269 -466277 -344748 -209394
$$ packed form
14986b79448j26695m7132J3631j992o8722j41342j66267j34317n4304P8919K35470
14975f92199L46967L35660J97708M3168m4903m8789R089N2711L5042L6178P3731
14964C44363M0775k9310o9535j10786j89459k64766k67209j65372k8216M8760
14954f90755O2946N3403Q4901J50432J54364O3871o0341j39014j16465j1264O5071
14943c82851P7618N5718L7661N8081O0536J8820K6730O7670R0901J10423R7132
14932C18439L7891j0563J4069M6320J4881n0633j06350j09290p7843n8087k6931
14921h097L7635P7722O6635j6458j19280j47522j18746r8170p6665l2713P188
14910d28471J2528j5085k3149j0076r999j8851l4169p997O8992J21529J35354
$$ plain form
14899 -209394 -120745 -124590 -153254 -128673 -34506 112109 295644 458777 520748 460496 359609
14888 359609 322607 372119 464227 530306 512185 411034 299824 229765 217202 204115 109311
14877 109311 -44103 -191360 -329930 -452747 -502492 -484748 -471681 -479820 -437845 -276332 -9494
14866 -9494 260625 426677 412947 237115 7767 -162615 -214333 -199543 -139718 -25136 108831
14855 108831 207972 284258 383820 469733 387124 80451 -233747 -329762 -214297 -53887 14764
14844 14764 -52076 -211369 -378804 -524712 -630861 -656780 -640784 -663177 -745494 -897420 -1119095
14833 -1119095 -1368193 -1552989 -1549315 -1414853 -1330767 -1304387 -1232421 -1072040 -866088 -673355
14823 -673355 -496233 -344231 -300456 -353056 -400087 -359081 -189351 80030 321587 427097
$$ packed form
14899b09394Q8649l845k8664K4581R4167J46615J83535J63133O1971o0252j00887
14888C59609l7002M9512R2108O6079j8121j01151j11210p0059j2563j3087r4804
14877A09311j53414j47257j38570j22817m9745J7744J3067q139M1975J61513K66838
14866i494K70119J66052j3730j75832k29348j70382n1718J4790N9825J14582J33967
14855A08831R9141P6286R9562Q5913q2609l06673l14198r6015J15465J60410O8651
14844A4764o6840j59293j67435j45908j06149k5919J5996k2393q2317j51926k21675
14833a119095k49098j84796L674J34462Q4086K6380P1966J60381K05952J92733
14823f73355J77122J52002M3775n2600m7031M1006J69730K69381K41557J05510
$$ plain form
14813 427097 427970 409959 414567 418084 391280 367797 365310 329027 233635 139247 75628 -23607
14801 -23607 -203848 -413950 -577356 -682379 -752937 -815170 -849542 -817625 -711849 -588414
14791 -588414 -537460 -563445 -627144 -715685 -847969 -989477 -1046723 -974722 -812181 -624577 -430762
14780 -430762 -219929 -11637 135017 172963 100280 -21986 -101650 -145924 -235224 -362508
14770 -362508 -489290 -592562 -680313 -780463 -879365 -950636 -1003282 -1034120 -1007108 -902206 -769203
14759 -769203 -642295 -517763 -444036 -387164 -283923 -189200 -93574 82779 241440 223736
14749 223736 41210 -216987 -518803 -821161 -1045779 -1158015 -1127198 -1006878 -928266 -916009
14739 -916009 -885519 -797290 -719531 -694220 -675713 -651641 -597179 -468598 -303582 -189670 -153537
$$ packed form
14813D27097Q73j8011M608L517k6804k3483k487l6283r5392r4388o3619r9235
14801b3607j80241k10102j63406j05023p0558o2233l4372L1917J05776J23435
14791e88414N0954k5985o3699q8541j32284j41508n7246P2001J62541J87604J93815
14780d30762K10833K08292J46654L7946p2683j22266p9664m4274q9300j27284
14770c62508j26782j03272q7751j00150r8902p1271n2646l0838K7012J04902J33003
14759g69203J26908J24532P3727N6872J03241R4723R5626J76353J58661j7704
14749B23736j82526k58197l01816l02358k24618j12236L0817J20320P8612J2257
14739i16009L0490Q8229P7759K5311J8507K4072N4462J28581J65016J13912L6133
$$ plain form
14728 -153537 -130686 -67611 2204 55094 123103 203465 232448 188315 150270 179391 223893
14717 223893 211620 107609 -107300 -391836 -647674 -777726 -768184 -672717 -544351 -448864
14707 -448864 -418618 -418544 -407340 -426035 -485663 -515199 -481767 -478888 -595204 -799882 -1008302 -1152846
14695 -1152846 -1190080 -1104544 -953044 -791323 -659157 -624136 -685236 -747074 -726379 -647409 -580881
14684 -580881 -586328 -635677 -677031 -707478 -726477 -780963 -930774 -1139854 -1288459 -1328656 -1316378
14673 -1316378 -1255822 -1102902 -882398 -677597 -557476 -536750 -602937 -683034 -684930 -572464
14663 -572464 -361901 -108854 147634 400997 617225 784003 868400 860018 818211 783744
14653 783744 722434 576044 348195 84427 -187491 -439804 -538918 -414372 -178606 46419
$$ packed form
14728a53537K2851O3075O9815N2890O8009Q0362K8983m4133l8045K9121M4502
14717B23893j2273j04011k14909k84536k55838j30052R542R5467J28366R5487
14707d48864L0246P4J1204j8695n9628k9536L3432K879j16316k04678k08420j44544
14695a152846l7234Q5536J51500J61721J32166L5021o1100o1838K0695P8970O6528
14684e80881n447m9349m1354l0447j8999n4486j49811k09080j48605m0197J2278
14673a316378O0556J52920K20504K04801J20121K0726o6187q0097j896J12466
14663e72464K10563K53047K56488K53363K16228J66778Q4397q382m1807l4467
14653G83744o1310j46390k27849k63768k71918k52313r9114J24546K35766K25025
$$ plain form
14643 46419 201501 276801 307252 355793 406574 418552 403325 355303 301484 288192 284629 287559
14631 287559 289555 253030 153910 -31991 -284056 -505073 -603942 -563876 -439176 -307167 -195831
14620 -195831 -119266 -95887 -108642 -112705 -71174 28451 215924 500850 803899 1025179 1134550
14609 1134550 1168949 1169697 1155426 1123733 1052031 945948 864160 862120 892570 867909 816834 761302
14597 761302 681059 555962 363310 124929 -88494 -191501 -169352 -102302 -68354 -48292
14587 -48292 -29032 -53136 -118086 -181641 -200683 -149479 -81883 -43682 26212 130189 174285
14576 174285 124092 12464 -124007 -232299 -257139 -175294 -7741 183108 372245 552215
14566 552215 683439 729235 668649 518762 334406 166912 73848 61576 77616 89689 95602
$$ packed form
14643D6419J55082P5300L0451M8541N0781J1978j5227m8022n3819j3292l563K930
14631B87559J996l6525r9120j85901k52065k21017r8869M0066J24700J32009J11336
14620a95831P6565K3379j2755m063M1531R9625J87473K84926L03049K21280J09371
14609A134550L4399P48j4271l1693p1702j06083q1788k040L0450k4661n1075n5532
14597G61302q0243j25097j92652k38381k13423j03007K2149O7050L3948K0062
14587d8292J9260k4104o4950o3555j9042N1204O7596L8201O9894J03977M4096
14576A74285n0193j11628j36471j08292k4840Q1845J67553J90849J89137J79970
14566E52215J31224M5796o0586j49887j84356j67494r3064j2272J6040J2073N913
$$ plain form
14555 95602 95678 66674 -12826 -107974 -137903 -95240 -45419 -49 54146 98930 72212 -44607
14543 -44607 -110368 -21443 126385 226234 266169 279319 274643 255522 214389 111403 -68984
14532 -68984 -252823 -391467 -502286 -574668 -575221 -513236 -399369 -263525 -136130 -21761 86301
14521 86301 234590 427052 586794 627310 526954 346437 198259 112312 33910 -56771
14511 -56771 -133926 -185850 -269790 -416163 -530510 -536598 -461311 -344338 -218756 -106225 -51532
14500 -51532 -47069 2864 104770 174071 173809 113533 -60533 -363225 -656309 -810313 -783650
14489 -783650 -623989 -444595 -340982 -296648 -266503 -271111 -295359 -281202 -211748 -118503 -23732
14478 -23732 59950 136562 189266 176437 89655 -53718 -215312 -362320 -477940 -525087 -558063
$$ packed form
14555I5602P6k9004p9500r5148k9929M2663M9821M5370N4195M4784k6718j16819
14543d4607o5761Q8925J47828R9849L9935J3150m676j9121m1133j02986j80387
14532f8984j83839j38644j10819p2382n53O1985J13867J35844J27395J14369J08062
14521H6301J48289J92462J59742M0516j00356j80517j48178q5947p8402r0681
14511e6771p7155n1924q3940j46373j14347o088P5287J16973J25582J12531N4693
14500e1532M463M9933J01906O9301k62o0276j74066l02692k93084j54004K6663
14489g83650J59661J79394J03613M4334L0145m608k4248J4157O9454R3245R4771
14478b3732Q3682P6612N2704j2829q6782j43373j61594j47008j15620m7147l2976
$$ plain form
14467 -558063 -685744 -864357 -947778 -886516 -761297 -695722 -720279 -783425 -893299 -992832 -1009722
14456 -1009722 -989182 -919521 -745987 -520138 -323845 -202124 -176376 -193377 -238026 -286023
14446 -286023 -293807 -247513 -145321 -46737 -29324 -111422 -273408 -465793 -634832 -695686 -640027
14435 -640027 -544599 -477391 -415822 -270481 -108247 -102004 -202118 -239611 -205227 -178387 -165758
14424 -165758 -119030 -24487 46446 19207 -87980 -218706 -290034 -235942 -120861 -99747 -211744
14413 -211744 -308005 -299365 -234953 -179192 -207007 -342513 -495926 -527115 -391670 -189340 -36745
14402 -36745 35660 91903 143163 89170 -62642 -186737 -185992 -70489 49119 87602 87636 119014
14390 119014 179334 250558 345906 455095 523431 468880 323228 236107 237599 257505 255810
$$ packed form
14467e58063j27681j78613q3421O1262J25219O5575k4557o3146j09874r9533j6890
14456a009722K0540O9661J73534K25849J96293J21721K5748j7001m4649m7997
14446b86023p784M6294J02192R8584J7413q2098j61986j92385j69039o0854N5659
14435f40027R5428O7208O1569J45341J62234O243j00114l7493L4384K6840J2629
14424a65758M6728R4543P0933k7239j07187j30726p1328N4092J15081K1114j11997
14413b11744r6261Q640O4412N5761k7815j35506j53413l1189J35445K02330J52595
14402c6745P2405N6243N1260n3993j51812j24095P45J15503J19608L8483L4L1378
14390A19014O0320P1224R5348J09189O8336n4551j45652q7121J492J9906j695
$$ plain form
14379 255810 247244 230227 148975 -266 -148257 -297041 -449533 -552309 -600309 -633591 -657805
14368 -657805 -634559 -577807 -508455 -436928 -379994 -335052 -293077 -268780 -315036 -397353 -475417
14357 -475417 -600951 -747438 -793140 -707659 -577246 -499515 -535907 -661917 -805412 -920190
14347 -920190 -985195 -1002276 -995433 -925285 -740527 -495578 -279743 -175590 -245221 -433796 -594595
14336 -594595 -661627 -678523 -644859 -505545 -283712 -46484 206958 487367 729941 804535
14326 804535 705172 558225 431977 291999 126716 -34773 -140892 -147989 -87030 -31685
14316 -31685 -5359 24335 86269 155491 162734 153024 211843 371694 581688 721211 725524 644306
14304 644306 518235 323956 107530 -39821 -97252 -86286 -22656 20482 7601 -1525 -23424
$$ packed form
14379B55810q566j7017q1252j49241j47991j48784j52492j02776m8000l3282k4214
14368f57805K3246N6752O9352P1527N6934M4942M1975K4297m6256q2317p8064
14357d75417j25534j46487m5702Q5481J30413P7731l6392j26010j43495j14778
14347i20190o5005j7081O843P0148J84758K44949K15835J04153o9631j88575j60799
14336e94595o7032j6896L3664J39314K21833K37228K53442K80409K42574P4594
14326H04535r9363j46947j26248j39978j65283j61489j06119p097O0959N5345
14316c1685K6326K9694O1934O9222P243r710N8819J59851K09994J39523M313q1218
14304F44306j26071j94279k16426j47351n7431J0966O3630M3138j2881r126k1899
$$ plain form
14293 -23424 -143692 -317809 -447381 -531571 -605664 -711993 -808662 -798565 -687970 -548016
14283 -548016 -398817 -217899 -43407 106656 262057 425052 541591 572720 576954 615525
14273 615525 620529 488189 250850 39467 -84780 -148844 -161967 -105424 -8755 30086 -31166
14262 -31166 -99702 -69296 66242 207349 245801 146728 -37777 -219716 -348954 -485187
14252 -485187 -707051 -924765 -959208 -781216 -510113 -280793 -163770 -154673 -220012 -340564
14242 -340564 -475947 -552880 -574317 -591978 -623338 -628247 -549710 -406340 -281032 -241466 -276196
14231 -276196 -313759 -277321 -174198 -74661 -15928 -27321 -139902 -335779 -482330 -482200 -404186
14220 -404186 -366706 -391028 -374814 -235596 -24720 191583 334525 313600 150394 -85006
$$ packed form
14293b3424j20268j74117j29572q4190p4093j06329r6669J0097J10595J39954
14283e48016J49199J80918J74492J50063J55401J62995J16539L1129M234L8571
14273F15525N004j32340k37339k11383j24247o4064j3123N6543R6669L8841o1252
14262c1166o8536L0406J35538J41107L8452r9073j84505j81939j29238j36233
14252d85187k21864k17714l4443J77992K71103K29320J17023R097o5339j20552
14242c40564j35383p6933k1437j7661l1360m909P8537J43370J25308L9566l4730
14231b76196l7563L6438J03123R9537N8733j1393j12581j95877j46551J30P8014
14220d04186L7480k4322J6214J39218K10876K16303J42942k0925j63206k35400
$$ plain form
14210 -85006 -315460 -487319 -559322 -510957 -410897 -377948 -437268 -468727 -393318 -272608 -148735
14199 -148735 -32527 53627 139198 225073 263422 210710 85439 -9837 9294 108494 215733
14188 215733 287932 264843 179130 171856 303211 515661 709212 840608 926482 978350 963715
14177 963715 887602 781771 632279 391562 75673 -215400 -382287 -419675 -458487 -592967
14167 -592967 -775850 -895519 -953901 -1051449 -1223266 -1403470 -1518906 -1612622 -1761945 -1919146
14157 -1919146 -1998006 -1970917 -1782856 -1395282 -933159 -574753 -361465 -267468 -275544 -323112
14147 -323112 -316597 -232424 -140629 -116877 -196644 -331725 -423548 -398991 -313863 -275059 -287461
14136 -287461 -333740 -434239 -530594 -538918 -510542 -550111 -616316 -599463 -513029 -428005 -378759
$$ packed form
14210h5006k30454j71859p2003M8365J00060L2949n9320l1459P5409J20710J23873
14199a48735J16208Q6154Q5571Q5875L8349n2712j25271r5276J9131R9200J07239
14188B15733P2199k3089q5713p274J31355K12450J93551J31396Q5874N1868j4635
14177I63715p6113j05831j49492k40717l15889k91073j66887l7388l8812j34480
14167e92967j82883j19669n8382r7548j71817j80204j15436r3716j49323j57201
14157a919146p8860K7089J88061L87574M62123L58406K13288R3997q076m7568
14147c23112O515Q4173R1795K3752p9767j35081r1823K4557Q5128L8804j2402
14136b87461m6279j00499r6355q324K8376l9569o6205J6853Q6434Q5024M9246
$$ plain form
14125 -378759 -343552 -282332 -219812 -255367 -405709 -595177 -741475 -762875 -648562 -466054
14115 -466054 -284355 -161764 -109532 -140244 -286140 -501423 -646264 -637308 -504835 -327551
14105 -327551 -200353 -148838 -95388 -27856 6458 30777 62869 64897 18789 -70234 -181143
14094 -181143 -297914 -408004 -502740 -553040 -518911 -417852 -283233 -146515 -52044 52110
14084 52110 199574 311441 340318 316967 305318 331442 389083 479182 550000 567152 551338
14073 551338 505825 436751 346137 289148 277775 244741 162517 79736 43981 59028 71272
14062 71272 18472 -100332 -252149 -420650 -620405 -868736 -1142961 -1377129 -1466993 -1360850
14052 -1360850 -1118739 -838949 -598351 -476267 -478673 -497430 -474991 -414480 -334171 -263506 -190238
$$ packed form
14125c78759L5207O1220O2520l5555j50342j89468j46298k1400J14313J82508
14115d66054J81699J22591N2232l0712j45896k15283j44841Q956J32473J77284
14105c27551J27198N1515N3450O7532L4314K4319L2092K028m6108q9023j10909
14094a81143j16771j10090r4736n0300L4129J01059J34619J36718R4471J04154
14084E2110J47464J11867K8877k3351j1649K6124N7641R0099P0818J7152j5814
14073E51338m5513o9074r0614n6989j1373l3034q2224q2781l5755J5047J2244
14062G1272n2800j18804j51817j68501j99755k48331k74225k34168q9864J06143
14052a360850K42111K79790K40598J22084k406j8757K2439O0511Q0309P0665P3268
$$ plain form
14041 -190238 -132751 -120948 -127868 -131036 -130817 -144881 -200257 -264069 -238422 -120324 8440 67181
14029 67181 14483 -37175 -8995 54811 140370 258942 386617 501129 559385 558930 521038
14018 521038 432884 289982 96337 -103245 -256355 -300603 -212075 -51870 53857 95216
14008 95216 131650 117829 35973 -70197 -156123 -189322 -152524 -121772 -194492 -303901 -339937
13997 -339937 -277361 -104338 172881 472677 734184 942156 1071254 1088010 981122 771383
13987 771383 530023 333324 215760 167482 151746 181801 232899 234519 176655 90968 -21728
13976 -21728 -160752 -259555 -231310 -56984 188771 396207 519250 584065 612834 607031 544192
13965 544192 446886 385021 371937 427381 564678 701461 724133 643939 565297 543344 554464
$$ packed form
14041a90238N7487J1803o920l168K19j4064n5376o3812K5647J18098J28764N8741
14029F7181n2698n1658K8180O3806Q5559J18572J27675J14512N8256m55l7892
14018E21038q8154j42902j93645j99582j53110m4248Q8528J60205J05727M1359
14008I5216L6434j3821q1856j06170q5926l3199L6798L0752p2720j09409l6036
13997c39937O2576J73023K77219K99796K61507K07972J29098J6756j06888k09739
13987G71383k41360j96699j17564m8278j5736L0055N1098J620n7864q5687j12696
13976b1728j39024r8803K8245J74326K45755K07436J23043O4815K8769n803o2839
13965E44192r7306o1865j3084N5444J37297J36783K2672q0194p8642k1953J1120
$$ plain form
13954 554464 529468 458357 398275 379416 376577 376450 330869 193936 39230 -28569 -45643 -114360
13942 -114360 -269108 -449121 -583251 -662675 -648757 -538177 -403620 -279923 -149759 -26794
13932 -26794 46288 74777 82583 63222 48848 68855 64152 -11378 -171699 -325774 -326354 -203334
13920 -203334 -55077 73756 161556 214073 272741 403982 578619 691062 721303 725077 726107
13909 726107 708924 668343 587668 454319 309869 240940 288872 409620 525278 620069 762942
13898 762942 973186 1130871 1160666 1131946 1109146 1070683 1023138 986189 924010 821571 742482
13887 742482 693476 642800 604385 651250 857431 1139882 1350819 1480839 1626010 1789118
13877 1789118 1926537 2039957 2142057 2221660 2270866 2319639 2432753 2618290 2821364 3072605
$$ packed form
13954E54464k4996p1111o0082j8859k839j27m5581j36933j54706o7799j7074o8717
13942a14360j54748j80013j34130p9424J3918J10580J34557J23697J30164J22965
13932b6794P3082K8489P806j9361j4374K0007m703p5530j60321j54075n80J23020
13920b03334J48257J28833Q7800N2517N8668J31241J74637J12443L0241L774J030
13909G26107j7183m0581q0675j33349j44450o8929M7932J20748J15658R4791J42873
13898G62942K10244J57685K9795k8720k2800l8463m7545l6949o2179j02439p9089
13887G42482m9006n0676l8415M6865K06181K82451K10937J30020J45171J63108
13877A789118J37419J13420J02100P9603M9206M8773J13114J85537K03074K51241
$$ plain form
13867 3072605 3389873 3749755 4125033 4470085 4707845 4766810 4680383 4548781 4459815 4467572
13857 4467572 4488249 4404463 4217161 3937597 3603651 3288761 3055562 2984280 3120043 3410041
13847 3410041 3754536 4108257 4427623 4579633 4543374 4438543 4379041 4434235 4594628 4823438
13837 4823438 5086963 5392316 5728766 6048845 6320310 6493969 6590324 6664208 6729173 6811898
13827 6811898 6959408 7196196 7512401 7856965 8181583 8502414 8868764 9264133 9669863
13818 9669863 10130494 10688649 11276324 11781853 12181316 12457024 12530137 12332767 11876213 11264491
13808 11264491 10577080 9832669 9071367 8379412 7843815 7530412 7436466 7501623 7694587 8023188
13798 8023188 8429832 8807537 9096837 9247316 9235838 9102382 8931073 8825463 8851067 8995019
$$ packed form
13867C072605L17268L59882L75278L45052K37760N8965q6427j31602q8966P757
13857D467572K0677q3786j87302k79564l33946l14890k33199p1282J35763K89998
13847C410041L44495L53721L19366J52010l6259j04831n9502N5194J60393K28810
13837D823438K63525L05353L36450L20079K71465J73659R6355P3884O4965Q2725
13827F811898J47510K36788L16205L44564L24618L20831L66350L95369M05730
13818I669863M60631N58155N87675N05529L99463K75708P3113j97370m56554o11722
13808A1264491o87411p44411p61302o91955n35597l13403r3946O5157J92964L28601
13798H023188M06644L77705K89300J50479j1478j33456j71309j05610K5604J43952
$$ plain form
13788 8995019 9183574 9392254 9676399 10064514 10508553 10900736 11070219 10888297 10376167
13779 10376167 9652039 8837996 8070671 7489018 7137951 6917042 6638601 6244666 5875485
13770 5875485 5667929 5590317 5489002 5277288 4956099 4539264 4092754 3658840 3204250 2781791
13760 2781791 2497948 2321670 2143216 1948373 1771618 1646346 1578700 1510195 1390569 1242374
13750 1242374 1113019 1036114 1011466 986824 926061 814106 625441 461464 419333 431521
13740 431521 417597 380788 324854 242766 168011 173944 283994 426977 517759 539439 549077
13729 549077 567530 565698 548804 570409 658699 790152 880617 907776 920629 910274 823081
13718 823081 667814 461296 235935 44905 -73549 -123138 -177892 -224896 -173850 -9361
$$ packed form
13788H995019J88555K08680K84145L88115M44039L92183J69483j81922n12130
13779A0376167p24128q14043p67325n81653l51067k20909k78441l93935l69181
13770E875485k07556p7612j01315k11714l21189m16835m46510m33914m54590m22459
13760B781791k83843j76278j78454j94843j76755j25272o7646o8505j19626j48195
13750A242374j29355p6905k4648k4642o0763j11955j88665j63977m2131J2188
13740D31521j3924l6809n5934q2088p4755N933J10050J42983R0782K1680R638
13729E49077J8453j832j6894K1605Q8290J31453R0465K7159J2853j0355q7193
13718H23081j55267k06518k25361j91030j18454m9589n4754m7004N1046J64489
$$ plain form
13708 -9361 239751 504753 691976 777167 785601 768786 760534 783897 837387 865311 871439 874869
13696 874869 881747 872146 794536 690248 629805 635203 685624 683240 491080 160610 -109747
13685 -109747 -253315 -351636 -461607 -541623 -558765 -542365 -511480 -462910 -405209 -317073 -213363
13674 -213363 -165284 -197932 -261800 -253551 -123919 2594 23304 -40722 -141623 -229396 -268478
13663 -268478 -246981 -197456 -154242 -108700 -24144 93874 242769 436582 586262 636266 602045
13652 602045 494670 322162 158139 100356 135356 223917 366056 471233 482157 451848
13642 451848 415055 409783 446191 481550 499856 500385 445116 357983 355853 507015 759868 1028466
13630 1028466 1245521 1370592 1400634 1415674 1489802 1552780 1501928 1369397 1244686 1132987
$$ packed form
13708i361K49112K65002J87223Q5191Q434j6815q252K3363N3490K7924O128L430
13696H74869O878r601p7610j04288o0443N398N0421k384j92160l30470k70357
13685a09747j43568r8321j09971q0016j7142J6400L0885M8570N7701Q8136J03710
13674b13363M8079l2648o3868Q249J29632J26513K0710o4026j00901q7773l9082
13663b68478K1497M9525M3214M5542Q4556J18018J48895J93813J49680N0004l4221
13652F02045j07375j72508j64023n7783L5000Q8561J42139J05177J0924l0309
13642D51848l6793n272L6408L5359J8306N29n5269q7133k130J51162K52853K68598
13630A028466K17055J25071L0042J5040P4128O2978n0852j32531j24711j11699
$$ plain form
13620 1132987 1020260 885051 745359 635329 595664 630776 643486 578439 490654 410977
13610 410977 338967 352209 422503 392809 256829 121689 14471 -94004 -170594 -173645 -140665
13599 -140665 -138523 -149233 -83450 61138 161220 146781 44168 -97442 -190361 -141594 40076
13588 40076 257255 404725 480862 523162 481178 300962 23177 -246342 -465942 -633536
13578 -633536 -710427 -643390 -452240 -222424 -2568 238507 533938 781818 893682 924988
13568 924988 917281 877659 869746 930341 1014092 1084429 1094735 1020318 876742 679192 486299
13557 486299 354864 280825 224975 133334 39765 -28401 -108029 -212473 -297761 -300746 -219343
13546 -219343 -121695 -86172 -165441 -351191 -540965 -666299 -756898 -820079 -854914 -869698 -844388
$$ packed form
13620A132987j12727j35209j39692j10030l9665L5112J2710o5047q7785p9677
13610D10977p2010J3242P0294k9694j35980j35140j07218j08475p6590l051L2980
13599a40665K142j0710O5783J44588J00082j4439j02613j41610r2919M8767J81670
13588D0076K17179J47470P6137M2300m1984j80216k77785k69519k19600j67594
13578f33536p6891O7037J91150K29816K19856K41075K95431K47880J11864L1306
13568I24988p707l9622p913O0595Q3751P0337J0306p4417j43576j97550j92893
13557D86299j31435p4039n5850r1641r3569o8166p9628j04444q5288k985Q1403
13546b19343R7648L5523p9269j85750j89774j25334r0599o3181l4835j4784K5310
$$ plain form
13535 -844388 -803703 -798991 -871569 -977935 -1031064 -990040 -876385 -744561 -637332 -497633 -264318
13524 -264318 -25497 107889 116297 67685 20464 -38154 -129211 -182304 -143403 -77856 5159
13513 5159 103370 148913 121525 56771 34513 100379 168277 151556 117848 129936 198471 358717
13501 358717 554215 657457 612705 452939 316397 288808 387080 590224 746937 723401
13491 723401 565821 438524 380282 327506 257803 182267 108270 14955 -99619 -167776 -106094
13480 -106094 48866 200644 334691 438908 436532 305519 101122 -70657 -99294 -23240
13470 -23240 42218 57871 47503 70364 91172 -105 -249431 -529153 -684276 -695525 -626682
13459 -626682 -528968 -415731 -257969 -60171 94348 186399 285183 408148 545179 656854
$$ packed form
13535h44388M0685M712p2578j06366n3129M1024J13655J31824J07229J39699K33315
13524b64318K38821J33386Q408m8612m7221n8618r1057n3093L8901O5547Q3015
13513E159R8211M5543k7388o4754k2258O5866O7898j6721l3708J2088O8535J60246
13501C58717J95498J03242m4752j59766j36542k7589R8272K03144J56713k3536
13491G23401j57580j27297n8242n2776o9703p5536p3997r3315j14574o8157O1682
13480a06094J54960J51778J34047J04217k376j31013k04397j71779k8637P6054
13470b3240O5458J5653j0368K2861K0808r1277k49326k79722j55123j1249O8843
13459f26682R7714J13237J57762J97798J54519R2051R8784J22965J37031J11675
$$ plain form
13449 656854 671185 604287 605721 704401 748395 660559 504803 368180 262440 159379 63377
13438 63377 43036 190478 492071 790589 892181 775666 597505 429966 269155 153704
13428 153704 123553 161279 235148 321124 372447 357265 276703 214290 258917 358145 456627
13417 456627 501550 464702 389641 335346 300476 272611 246995 229069 284812 423862 579628
13406 579628 666929 665252 636549 608788 563866 485506 393857 333146 303913 299966 365767 497628
13394 497628 611785 651519 633713 615562 595342 572828 617022 721270 800872 816206 772851
13383 772851 686114 561396 407473 297725 293430 399230 555795 645037 616500 548180 510525
13372 510525 528270 574982 571815 504671 499326 639123 828633 983522 1112350 1172166 1090858
$$ packed form
13449F56854J4331o6898J434R8680M3994q7836j55756j36623j05740j03061r6002
13438F3377k0341J47442L01593K98518J01592j16515j78161j67539j60811j15451
13428A53704l0151L7726P3869Q5976N1323j5182q0562o2413M4627R9228R8482
13417D56627M4923l6848p5061n4295l4870k7865k5616j7926N5743J39050J55766
13406E79628Q7301j677k8703k7761m4922p8360r1649o0711k9233l947O5801J31861
13394D97628J14157L9734j7806j8151k0220k2514M4194J04248P9602J5334m3355
13383G72851q6737j24718j53923j09748m295J05800J56565Q9242k8537o8320l7655
13372E10525J7745M6712l167o7144n345J39797J89510J54889J28828N9816q1308
$$ plain form
13361 1090858 889222 682557 551091 463082 406651 354752 312131 385255 590953 843030
13351 843030 1018716 1016147 872092 695989 583545 581904 705566 885379 1015493 1091910
13341 1091910 1173673 1291849 1426796 1488202 1399356 1252444 1211015 1288824 1364294 1352003 1267125
13330 1267125 1147360 1047492 1012793 1051187 1152722 1292857 1393179 1389957 1293735 1171877
13320 1171877 1048412 912748 854859 896973 931834 875214 731111 599118 585914 677921
13310 677921 754145 713479 592590 505295 529204 704247 904728 992107 951986 782051 561541
13299 561541 393267 303949 297259 334991 344623 339460 359758 353046 289998 233325 193427 161100
13287 161100 150046 197207 343229 571026 777950 891758 947235 937354 874478 872124 1005828
$$ packed form
13361A090858k01636k06665j31466q8009n6431n1899m2621P3124K05698K52077
13351H43030J75686k569j44055j76103j12444j641J23662J79813J30114P6417
13341A091910Q1763J18176J34947O1406q8846j46912m1429P7809P5470j2291q4878
13330A267125j19765r9868l4699L8394J01535J40135J00322l222r6222j21858
13320A171877j23465j35664n7889M2114L4861n6620j44103j31993j3204R2007
13310F77921P6224m0666j20889q7295K3909J75043K00481Q7379m0121j69935k20510
13299E61541j68274q9318o690L7732R632n163K0298o712o3048n6673l9898l2327
13287A61100j1054M7161J46022K27797K06924J13808N5477r881o2876k354J33704
$$ plain form
13276 1005828 1196486 1325248 1378309 1379671 1385267 1451541 1552563 1586051 1535170 1480827 1465014
13265 1465014 1449353 1366575 1192929 974824 803921 735036 812212 1031481 1270641 1409683
13255 1409683 1463991 1516476 1543110 1486698 1368979 1217631 1008308 798225 741912 848822
13245 848822 1041154 1272061 1440477 1504353 1486082 1429079 1412714 1494251 1642099 1774790
13235 1774790 1840861 1784756 1580372 1356229 1262812 1298059 1409274 1500690 1477147 1357109
13225 1357109 1238539 1215356 1286657 1372961 1407880 1402361 1394690 1373526 1341622 1299552 1200300
13214 1200300 1095348 1122690 1315973 1576035 1818182 2020733 2165552 2186991 2034632 1778773
13204 1778773 1575200 1503912 1513776 1560584 1636735 1756798 1886925 1947598 1912770 1838562 1782738
$$ packed form
13276A005828J90658J28762N3061J362N596O6274J01022L3488n0881n4343j5813
13265A465014j5661q2778j73646k18105j70903o8885P7176K19269K39160J39042
13255A409683N4308N2485K6634n6412j17719j51348k09323k10083n6313J06910
13245H48822J92332K30907J68416O3876j8271n7003j6365Q1537J47848J32691
13235A774790O6071n6105k04384k24143r3417L5247J11215R1416k3543j20038
13225A357109j18570k3183P1301Q6304L4919n519p671k1164l1904m2070r9252
13214A200300j04952K7342J93283K60062K42147K02551J44819K1439j52359k55859
13204A778773k03573p1288R864M6808P6151J20063J30127O0673l4828p4208n5824
$$ plain form
13193 1782738 1732988 1658964 1564356 1485253 1453800 1434315 1405825 1428393 1525740 1641245 1685630
13182 1685630 1587469 1364400 1098344 888643 799641 848413 982449 1127449 1289800 1460361
13172 1460361 1605082 1701126 1792083 1955024 2182290 2362977 2428741 2411585 2354970 2260397
13162 2260397 2141493 2032949 1950990 1884722 1868801 1915050 1925776 1872425 1755434 1589158
13152 1589158 1484526 1524684 1635414 1696428 1701220 1730229 1759532 1763371 1858934 2091873 2327478
13141 2327478 2467772 2559132 2633143 2659737 2672334 2724056 2797465 2874113 2965565 3020850 2967577
13130 2967577 2809292 2589452 2397769 2350453 2498521 2727270 2857126 2801666 2613587 2424585
13120 2424585 2334865 2397367 2578809 2764563 2814906 2681255 2478524 2342584 2344883 2495714
$$ packed form
13193A782738m9750p4024r4608p9103l1453j9485k8490K2568R7347J15505M4385
13182A685630r8161k23069k66056k09701q9002M8772J34036J45000J62351J70561
13172A460361J44721R6044R0957J62941K27266J80687O5764j7156n6615r4573
13162B260397j18904j08544q1959o6268j5921M6249J0726n3351j16991j66276
13152A589158j04632M0158J10730O1014M792K9009K9303L839R5563K32939K35605
13141B327478J40294R1360P4011K6594J2597N1722P3409P6648R1452N5285n3273
13130B967577j58285k19840j91683m7316J48068K28749J29856n5460j88079j89002
13120B424585q9720O2502J81442J85754N0343j33651k02731j35940K299J50831
$$ plain form
13110 2495714 2741106 2978785 3084466 3029265 2898736 2777696 2729172 2803359 2975333 3149419
13100 3149419 3281661 3423074 3601684 3748545 3801807 3830538 3898046 3966733 3972928 3906808 3795952
13089 3795952 3695725 3703826 3816662 3911797 3879381 3723327 3579708 3565970 3618584 3631342 3597369
13078 3597369 3562214 3598663 3826166 4233661 4638506 4892039 4949396 4856842 4681913 4475475
13068 4475475 4311762 4247243 4291951 4401314 4513735 4582340 4549686 4368806 4072370 3776978
13058 3776978 3651367 3771122 4060706 4381972 4602423 4680891 4678046 4676545 4695403 4692485 4683027
13047 4683027 4694367 4737503 4849969 5056104 5318161 5596293 5855162 6006717 5998790 5902218
13037 5902218 5776176 5621943 5449817 5288151 5201048 5191009 5218028 5339341 5627245 6021917
$$ packed form
13110B495714K45392K37679J05681n5201j30529j21040m8524P4187J71974J74086
13100C149419J32242J41413J78610J46861N3262K8731O7508O8687O195o6120j10856
13089C795952j00227Q101J12836R5135l2416j56054j43619j3738N2614J2758l3973
13078C597369l5155L6449K27503M07495M04845K53533N7357r2554j74929k06438
13068D475475j63713o4519M4708J09363J12421O8605l2654j80880k96436k95392
13058C776978j25611J19755K89584L21266K20451P8468k845j501J8858k918r458
13047D683027J1340M3136J12466K06135K62057K78132K58869J51555p927r6572
13037E902218j26042j54233j72126j61666q7103j0039K7019J21313K87904L94672
$$ plain form
13027 6021917 6445061 6835882 7177331 7495629 7748759 7926730 8092153 8262841 8445428
13018 8445428 8641106 8808038 8942572 9102961 9284047 9491280 9793216 10190871 10641013
13009 10641013 11142000 11710776 12308102 12923498 13589566 14345567 15257584 16415604 17840064
13000 17840064 19448669 21145724 22877550 24694625 26832768 29523824 32804158 36636325
12992 36636325 41067497 46302953 52702752 60630068 70431522 82536258 97557162 116277382
12984 116277382 139592761 168349543 203045835 243468152 287832576 331172699 364223165
12977 364223165 376177869 361975448 326833415 281974277 237194114 197626715 164734751
12970 164734751 138112051 116731874 99623822 85943430 74950909 66028587 58655884
$$ packed form
13027F021917M23144L90821L41449L18298K53130J77971J65423J70688J82587
13018H445428J95678J66932J34534J60389J81086K07233L01936L97655M50142
13009A0641013N00987N68776N97326O15396O66068P56001R12017J158020J424460
13000A7840064J608605J697055J731826J817075K138143K691056L280334L832167
12992C6636325M431172N235456O399799P927316R801454J2104736J5020904J8720220
12984A16277382K3315379K8756782L4696292M0422317M4364424M3340123L3050466
12977C64223165J1954704j4202421l5142033m4859138m4780163l9567399l2891964
12970A64734751k6622700k1380177j7108052j3680392j0992521q922322p372703
$$ plain form
12963 58655884 52438585 47129465 42597384 38784109 35632764 32986426 30641693 28504019
12955 28504019 26596395 24950067 23516151 22216193 21041631 19973779 18982351 18090929
12947 18090929 17349607 16780390 16370789 16050627 15735194 15434078 15191280 15006728 14862771
12938 14862771 14756786 14692146 14611497 14470460 14357715 14411057 14624811 14956087 15404641 15994904
12928 15994904 16681139 17428127 18363341 19611211 21204253 23137653 25387825 27882719
12920 27882719 30386608 32512286 33778475 33953998 33300827 32297222 31386345 30893246 30906001
12911 30906001 31401271 32368775 33788091 35720221 38309640 41644689 45842936 51098828
12903 51098828 57620880 65697167 75754820 88366179 104228250 124130803 148894479
$$ packed form
12963E8655884o217299n309120m532081l813275l151345k646338k344733k137674
12955B8504019j907624j646328j433916j299958j174562j067852r91428q91422
12947A8090929p41322n69217m09601l20162l15433l01116k42798j84552j43957
12938A4862771j05985o4640q0649j41037j12745N3342K13754L31276M48554N90263
12928A5994904O86235P46988R35214J247870J593042J933400K250172K494894
12920B7882719K503889K125678J266189J75523o53171j003605r10877m93099J2755
12911C0906001M95270R67504J419316J932130K589419L335049M198247N255892
12903E1098828O522052Q076287J0057653J2611359J5862071J9902553K4763676
$$ plain form
12896 148894479 179288797 215788464 258017032 303700213 346784932 376713072 382594749
12889 382594749 361412818 321026020 273670649 228485512 189582014 157716304 132117402
12882 132117402 111644764 95281364 82161768 71507631 62707869 55386017 49275606
12875 49275606 44108958 39709082 36041058 33054844 30610050 28585578 26847615 25247822
12867 25247822 23783083 22485198 21323367 20268272 19285397 18333822 17411704 16566054 15835840
12858 15835840 15220967 14685082 14187424 13778243 13513200 13378414 13354178 13399831 13429430 13366357
12848 13366357 13192890 12947201 12717500 12582277 12543469 12609017 12773107 12973755 13215997 13574596
12838 13574596 14030137 14472361 14865433 15198212 15468989 15731843 16089662 16634864 17347279
$$ packed form
12896A48894479L0394318L6499667M2228568M5683181M3084719K9928140N881677
12889C82594749k1181931m0386798m7355371m5185137l8903498l1865710k5598902
12882A32117402k0472638j6363400j3119596j0654137q799762p321852o110411
12875D9275606n166648m399876l668024k986214k444794k024472j737963j599793
12867B5247822j464739j297885j161831j055095r82875r51575r22118q45650p30214
12858A5835840o14873n35885m97658m09181k65043j34786k4236M5653K9599o3073
12848A3366357j73467k45689k29701j35223l8808O5548J64090K00648K42242L58599
12838A3574596M55541M42224L93072L32779K70777K62854L57819N45202P12415
$$ plain form
12829 17347279 18188434 19174401 20294331 21518301 22837251 24325360 26162232 28415041
12821 28415041 31088024 34370673 38501951 43615953 49747175 57030438 65785518 76513763
12813 76513763 89848689 106538492 127435394 153311362 184725570 221981111 264425678
12806 264425678 308996368 348554826 372293648 371122772 344919902 302942889 256632002
12799 256632002 213615048 176995135 147107453 123180718 104133084 88894650 76563619
12792 76563619 66467341 58149125 51289563 45575085 40724122 36572248 33007030 29951317
12784 29951317 27342749 25057936 22976940 21095616 19485458 18112338 16871245 15721672
12776 15721672 14637084 13578695 12567180 11610662 10699322 9909002 9306654 8825416 8440479
$$ packed form
12829A7347279Q41155R85967J119930J223970J318950J488109J836872K252809
12821B8415041K672983L282649M131278N114002O131222P283263Q755080J0728245
12813G6513763J3334926J6689803K0896902K5875968L1414208L7255541M2444567
12806B64425678M4570690L9558458K3738822j170876k6202870m1977013m6310887
12799B56632002m3016954l6619913k9887682k3926735j9047634j5238434j2331031
12792G6563619j0096278q318216o859562n714478m850963m151874l565218l055713
12784B9951317k608568k284813k080996j881324j610158j373120j241093j149573
12776A5721672j084588j058389j011515r56518r11340p90320o02348m81238l84937
$$ plain form
12767 8440479 8158167 7913659 7710483 7542504 7317435 6960549 6487084 5975288 5512615
12758 5512615 5186650 5045058 5018960 4999942 4944474 4890782 4904439 4970002 5013046 4978791 4842356
12747 4842356 4632002 4390873 4123021 3807878 3465165 3188513 3064044 3113280 3220012 3191457
12737 3191457 2992990 2743201 2546720 2391160 2228821 2078862 1948536 1845362 1857639 2037966
12727 2037966 2339857 2678686 2926900 3015897 3000674 2947169 2877800 2834297 2859685 2921895 2918096
12716 2918096 2795035 2624462 2568345 2648146 2727832 2734723 2642393 2436963 2146110 1883925
12706 1883925 1734109 1649754 1620998 1660815 1732950 1790652 1806685 1805787 1810408 1773894 1658328
12695 1658328 1536157 1467762 1427165 1412863 1409726 1347337 1232628 1142291 1096094 1089290 1124354
$$ packed form
12767H440479k82312k44508k03176j67979k25069l56886m73465n11796m62673
12758E512615l25965j41592k6098j9018n5468n3692J3657O5563M3044l4255j36435
12747D842356k10354k41129k67852l15143l42713k76652j24469M9236J06732k8555
12737C191457j98467k49789j96481j55560j62339j49959j30326j03174J2277J80327
12727B037966L01891L38829K48214Q8997j5223n3505o9369m3503K5388O2210l799
12716B918096j23061j70573n6117P9801P9686O891r2330k05430k90853k62185
12706A883925j49816q4355k8756L9817P2135N7702J6033q98M621l6514j15566
12695A658328j22171o8395m0597j4302l137o2389j14709r0337m6197o804L5064
$$ plain form
12684 1124354 1206811 1290655 1345034 1344846 1286175 1240509 1202129 1128279 1037150 978596 973540 1000479
12672 1000479 988984 927411 891155 961506 1117539 1202701 1113315 966899 910290 928908 948859
12661 948859 941897 954419 1008808 1061106 1051520 931080 730366 555194 500560 554551 640605
12650 640605 716895 792472 878040 966588 1044051 1102570 1095363 1013749 970301 1095922 1366751
12639 1366751 1613031 1727315 1732186 1684931 1609266 1473436 1280945 1077382 914010 865546
12629 865546 956177 1085512 1114803 1028624 911206 838708 820280 801982 735519 622544 539777
12618 539777 546233 620662 719332 772369 734471 610212 431509 310137 313910 403030 528182
12607 528182 662650 819382 994140 1127677 1197214 1173905 1014553 747997 475092 298721
$$ packed form
12684A124354Q2457Q3844N4379j88n8671m5666l8380p3850r1129n8554n056K6939
12672A000479j1495o1573l6256P0351J56033Q5162q9386j46416n6609J8618J9951
12661I48859o962J2522N4389N2298r586j20440k00714j75172n4634N3991Q6054
12650F40605P6290P5577Q5568Q8548P7463N8519p207q1614m3448J25621K70829
12639A366751K46280J14284M871m7255p5665j35830j92491k03563j63372m8464
12629H65546R0631J29335K9291q6179j17418p2498j8428j8298o6463j12975q2767
12618E39777O456P4429R8670N3037l7898j24259j78703j21372L773Q9120J25152
12607E28182J34468J56732J74758J33537O9537k3309j59352k66556k72905j76371
$$ plain form
12597 298721 216270 122628 -35700 -195522 -265441 -222139 -152727 -107563 -92063 -129947 -244327
12586 -244327 -358129 -346711 -239027 -145527 -92793 -34792 76387 221037 368649 523732
12576 523732 653844 740732 764463 680522 555756 496860 467032 429700 423375 473462 539025
12565 539025 597022 647598 659857 651718 618736 538666 501229 548630 582450 550723 468734 354441
12553 354441 266362 275629 379168 486599 533692 512404 452325 397226 364237 337765 328942
12542 328942 319048 267518 224926 270044 362012 364845 227711 -8480 -275965 -458388 -514030
12531 -514030 -489186 -447746 -456713 -510123 -516198 -420755 -283719 -203584 -211550 -278287 -336344 -280822
12519 -280822 -127932 16293 150020 287148 333747 258060 126230 -40042 -219184 -338832
$$ packed form
12597B98721q2451r3642j58328j59822o9919M3302O9412M5164J5500l7884j14380
12586b44327j13802J1418J07684R3500N2734N8001J11179J44650J47612J55083
12576E23732J30112Q6888K3731q3941j24766n8896k9828l7332o325N0087O5563
12565E39025N7997N0576J2259q139l2982q0070l7437M7401L3820l1727q1989j14293
12553C54441q8079R267J03539J07431M7093k1288o0079n5099l2989k6472q823
12542C28942r894n1530m2592M5118R1968K833j37134k36191k67485j82423n5642
12531e14030K4844M1440q967n3410o075R5443J37036Q0135p966o6737n8057N5522
12519b80822J52890J44225J33727J37128M6599p5687j31830j66272j79142j19648
$$ plain form
12509 -338832 -363912 -330177 -258206 -125966 78367 348136 627227 838537 921279 857070
12499 857070 694773 507996 382776 351110 401045 427866 399572 423904 539231 665826
12489 665826 725355 724818 692460 613695 442348 131912 -232119 -503420 -617025 -547456 -327370
12478 -327370 -66334 85535 88095 -7063 -158872 -350793 -570047 -800020 -951904 -886913
12468 -886913 -597621 -239037 30458 148660 170383 219123 279384 245653 110141 -24569
12458 -24569 -94551 -101975 -106376 -159312 -229958 -282710 -302635 -268934 -174524 -50976 104141 260464
12446 260464 342413 369786 374764 342413 252755 148433 61314 -114694 -388980 -575702 -554575
12435 -554575 -407287 -240223 -77453 59084 138640 140821 94434 47804 -7484 -31522 5183
$$ packed form
12509c38832k5080L3735P1971J32240K04333K69769K79091K11310Q2742o4209
12499H57070j62297j86777j25220l1666M9935K6821k8294K4332J15327J26595
12489F65826N9529n37l2358p8765j71347l10436l64031k71301j13605O9569K20086
12478c27370K61036J51869K560r5158j51809j91921k19254k29973j51884O4991
12468h86913K89292L58584K69495J18202K1723M8740O0261l3731j35512j34710
12458b4569o9982p424m401n2936p0646n2752j9925L3701R4410J23548J55117J56323
12446B60464Q1949K7373M978l2351q9658j04322q7119j76008k74286j86722K1127
12435e54575J47288J67064J62770J36537P9556K181m6387m6630n5288k4038L6705
$$ plain form
12424 5183 31564 17301 -8207 -18425 14407 38890 -18989 -143047 -228565 -163623 22279
12413 22279 156468 164669 107065 111214 220568 310460 281588 181361 143017 252512 420535
12402 420535 480972 376750 125562 -195848 -481271 -673410 -713369 -601493 -414663 -279677
12392 -279677 -219524 -123120 50973 219237 319892 375450 407934 419250 422252 401718 340196
12381 340196 261444 150082 4272 -147085 -345388 -521361 -514868 -316655 -77046 92356
12371 92356 180495 262038 364375 393121 285169 80452 -107899 -199136 -205570 -222193 -241797
12360 -241797 -188939 -117869 -155898 -291004 -416600 -490324 -542019 -594614 -620762 -635745 -663805
12349 -663805 -670431 -592257 -426228 -261279 -109879 7885 43487 6005 -48437 -60357 -5602
$$ packed form
12424E183K6381j4263k5508j0218L2832K4483n7879j24058q5518O4942J85902
12413B2279J34189Q201n7604M149J09354Q9892k8872j00227l8344J09495J68023
12402D20535O0437j04222k51188l21410k85423j92139l9959J11876J86830J34986
12392b79677O0153R6404J74093J68264J00655N5558L2484J1316L002k0534o1522
12381C40196p8752j11362j45810j51357j98303j75973O493J98213K39609J69402
12371I2356Q8139Q1543J02337K8746j07952k04717j88351r1237o434j6623j9604
12360b41797N2858P1070l8029j35106j25596p3724n1695n2595k6148j4983k8060
12349f63805o626P8174J66029J64949J51400J17764L5602l7482n4442j1920N4755
$$ plain form
12338 -5602 95560 194341 287603 397129 465749 459962 414687 323531 191389 88488 40853
12327 40853 55978 132765 176394 166002 90119 -62024 -235224 -348616 -378704 -379171 -399315
12316 -399315 -434130 -423073 -333816 -224181 -115650 -875 101678 180348 236836 278214 323649
12305 323649 373000 379369 310483 187573 46071 -107766 -255606 -387706 -508111 -571503
12295 -571503 -529381 -395722 -235964 -103595 -15748 48498 108288 161060 202027 247740 303129
12284 303129 327197 315368 372409 580041 824216 954601 943860 846545 750432 719478 713409
12273 713409 663811 579415 471233 333945 153659 -67373 -286322 -451712 -550055 -619487
12263 -619487 -637136 -532470 -329898 -112953 43530 155023 279063 419000 551528 600840
$$ packed form
12338e602J01162R8781R3262J09526O8620n787m5275r1156j32142j02901m7635
12327D0853J5125P6787M3629j0392p5883j52143j73200j13392l0088m67k0144
12316c99315l4815J1057Q9257J09635J08531J14775J02553P8670N6488M1378M5435
12305C23649M9351O369o8886j22910j41502j53837j47840j32100j20405o3392
12295e71503M2122J33659J59758J32369Q7847O4246N9790N2772M0967M5713N5389
12284C03129K4068j1829N7041K07632K44175J30385j0741r7315r6113l0954o069
12273G13409m9598q4396j08182j37288j80286k21032k18949j65390r8343o9432
12263f19487j7649J04666K02572K16945J56483J11493J24040J39937J32528M9312
$$ plain form
12253 600840 543688 392894 165063 -86753 -234325 -174213 10833 179066 294068 372179
12243 372179 411675 375995 233742 44897 -99224 -182128 -245517 -318648 -364281 -387492 -437949
12232 -437949 -467618 -431597 -392980 -408597 -421302 -355894 -256450 -142985 32660 243508 387943
12221 387943 389880 297821 233798 232622 267817 304363 259622 80771 -156881 -344525 -448341
12210 -448341 -459818 -356636 -171097 -2014 74349 27778 -110251 -225097 -272635 -323031
12200 -323031 -437411 -608282 -778194 -922050 -999861 -978660 -927179 -862569 -771525 -687602 -586206
12189 -586206 -468174 -375190 -237696 -26884 153430 222743 238118 262754 259487 177049 33530
12178 33530 -141513 -291898 -362059 -444729 -601589 -758710 -849032 -864114 -858228 -857446 -874464
$$ packed form
12253F00840n7152j50794k27831k51816j47572O0112J85046J68233J15002P8111
12243C72179L9496l5680j42253j88845j44121q2904o3389p3131m5633k3211n0457
12232d37949k9669L6021L8617j5617j2705O5408R9444J13465J75645K10848J44435
12221C87943J937r2059o4023j176L5195L6546m4741j78851k37652j87644j03816
12210d48341j1477J03182J85539J69083P6363m6571j38029j14846m7538n0396
12200c23031j14380j70871j69912j43856p7811K1201N1481O4610R1044Q3923J01396
12189e86206J18032R2984J37494K10812J80314O9313J5375K4636l267q2438j43519
12178C3530j75043j50385p0161q2670j56860j57121r0322j5082N886P82j7018
$$ plain form
12167 -874464 -955495 -1064815 -1050402 -832862 -524673 -281379 -176397 -211494 -286223 -305691
12157 -305691 -270590 -208227 -177464 -208009 -265820 -294718 -270550 -173051 -11361 121076 188607
12146 188607 222036 222942 212964 244953 349547 500153 619743 655710 592659 431231 196927
12135 196927 -33605 -202419 -387464 -616787 -735828 -663315 -510926 -383924 -288830 -194220
12125 -194220 -137458 -148216 -189018 -207390 -223217 -291284 -374471 -408709 -416181 -414170 -353807 -223590
12113 -223590 -82536 29107 68907 45316 24521 17355 14737 34376 87367 134499 183963
12102 183963 282619 361463 369161 304760 161035 -27743 -188962 -316124 -445295 -527231 -510070
12091 -510070 -407904 -280844 -154261 -29762 76783 133836 102290 33764 6446 15918 49526
$$ packed form
12167h74464q1031j09320J4413K17540L08189K43294J04982l5097p4729j9468
12157c05691L5101O2363L0763l0545n7811k8898K4168R7499J61690J32437O7531
12146A88607L3429R06r978L1989J04594J50606J19590L5967o3051j61428k34304
12135A96927k30532j68814j85045k29323j19041P2513J52389J27002R5094R4610
12125a94220N6762j0758m0802j8372j5827o8067q3187l4238p472K011O0363J30217
12113b23590J41054J11643L9800k3591k0795p166k618J9639N2991M7132M9464
12102A83963R8656P8844P698o4401j43725j88778j61219j27162j29171q1936J7161
12091e10070J02166J27060J26583J24499J06545N7053l1546o8526k7318R472L3608
$$ plain form
12080 49526 106825 161041 152391 87041 76602 222722 482112 678275 702594 584682 409272
12069 409272 241193 179706 334630 605522 796636 818963 683132 468409 288307 254437
12059 254437 339809 394112 356313 259254 126076 -10703 -112538 -169202 -207227 -266062 -313859
12048 -313859 -273180 -138145 31978 178353 313163 426996 481408 496483 432001 253524
12038 253524 16584 -178468 -325979 -486661 -633332 -685455 -603773 -459663 -328885 -216318
12028 -216318 -119548 -91762 -123222 -143825 -140174 -75258 85070 281186 401981 414494 351115
12017 351115 286954 278751 266009 158671 -12983 -172937 -345519 -562303 -716325 -761704
12007 -761704 -773383 -764616 -687787 -587917 -556180 -583405 -568334 -484331 -408201 -393015 -413025 -384284
$$ packed form
12080D9526N7299N4216q650o5350j0439J46120K59390J96163K4319j17912j75410
12069D09272j68079o1487J54924K70892J91114K2327j35831k14723j80102l3870
12059B54437Q5372N4303l7799r7059j33178j36779j01835n6664l8025n8835m7797
12048c13859M0679J35035J70123J46375J34810J13833N4412J5075o4482j78477
12038B53524k36940j95052j47511j60682j46671n2123Q1682J44110J30778J12567
12028b16318R6770K7786l1460k0603L651O4916J60328J96116J20795J2513o3379
12017C51115o4161q203j2742j07338j71654j59954j72582k16784j54022m5379
12007g61704j1679Q767P6829R9870L1737k7225J5071Q4003P6130J5186k0010K8741
$$ plain form
11995 -384284 -302521 -245742 -241404 -273352 -335447 -398967 -397890 -312308 -158182 -256 87572
11984 87572 88892 20332 -97117 -233549 -327362 -344145 -313781 -279936 -234824 -205708 -226311
11973 -226311 -271627 -312378 -318260 -319237 -369903 -507667 -702884 -805847 -764844 -692181 -666741
11962 -666741 -622147 -469322 -206690 83915 299294 372947 337657 273915 242775 220935 179578
11951 179578 141548 69358 -73404 -224581 -309172 -307060 -243352 -143608 -60103 36281 195896
11940 195896 373186 528624 657928 754554 804445 825071 813975 744691 601619 403636
11930 403636 198121 8675 -169323 -270857 -260518 -239563 -252928 -264986 -293144 -320122 -291950
11919 -291950 -193501 -11381 226351 387553 378612 208111 -45323 -289905 -474579 -631403
$$ packed form
11995c84284Q1763N6779M338l1948o2095o3520J077Q5582J54126J57926Q7828
11984H7572J320o8560j17449j36432r3813j6783L0364L3845M5112K9116k0603
11973b26311m5316m0751n882r77n0666j37764j95217j02963M1003P2663K5440
11962f66741M4594J52825K62632K90605K15379P3653l5290o3742l1140k1840m1357
11951A79578l8030p2190j42762j51177q4591K112O3708R9744Q3505R6384J59615
11940A95896J77290J55438J29304R6626M9891K0626j1096o9284j43072j97983
11930D03636k05515j89446j77998j01534J0339K0955j3365j2058k8158k6978K8172
11919b91950R8449J82120K37732J61202q941j70501k53434k44582j84674j56824
$$ plain form
11909 -631403 -789725 -886228 -873821 -788923 -648650 -459940 -289273 -185473 -125340 -4204
11899 -4204 179386 373165 563161 724325 798935 736546 575761 353986 103905 -87476
11889 -87476 -194938 -257373 -300886 -300116 -257700 -265544 -377263 -481423 -481739 -470626 -537824 -685864
11877 -685864 -870790 -1025160 -1115946 -1142131 -1125284 -1073201 -988485 -906438 -820020 -705932 -579258
11866 -579258 -436803 -270208 -111895 -8779 -17537 -183242 -418260 -577689 -644314 -613250
11856 -613250 -472439 -245768 -37178 111124 199157 166053 70411 41974 73335 85797 39296
11845 39296 -28223 -79130 -145564 -187634 -128745 14307 242280 548632 812683 890934 692421
11834 692421 274654 -128772 -365845 -526825 -697033 -809025 -784251 -702228 -639317 -658778
$$ packed form
11909f31403j58322r6503J2407Q4898J40273J88710J70667J03800O0133J21136
11899d204J83590J93779J89996J61164P4610o2389j60785k21775k50081j91381
11889h7476j07462o2435m3513P70M2416p844j11719j04160l16J1113o7198j48040
11877f85864j84926j54370r0786k6185J6847N2083Q4716Q2047Q6418J14088J26674
11866e79258J42455J66595J58313J03116q758j65705k35018j59429o6625L1064
11856f13250J40811K26671K08590J48302Q8033l3104r5642k8437L1361J2462m6501
11845C9296o7519n0907o6434m2070N8889J43052K27973L06352K64051P8251j98513
11834F92421m17767m03426k37073j60980j70208j11992K4774Q2023O2911j9461
$$ plain form
11824 -658778 -795209 -964585 -1110789 -1215309 -1239531 -1178288 -1073084 -956470 -842580 -710718
11814 -710718 -526969 -331108 -234631 -263430 -373656 -563965 -790492 -944661 -949752 -852357
11804 -852357 -712407 -548612 -401030 -324778 -327929 -339963 -303780 -264235 -271740 -310114 -379113
11793 -379113 -507250 -672519 -830463 -901058 -843876 -790537 -866060 -962614 -968744 -961395 -1036494
11782 -1036494 -1175964 -1235659 -1065123 -693959 -309617 -60982 18145 -12643 -76209 -121162
11772 -121162 -106145 -7560 101991 129200 93644 101293 174516 195335 151793 117213 60959
11761 60959 -52917 -165722 -272904 -390912 -491814 -536135 -536258 -549467 -577783 -583685 -527669
11750 -527669 -433789 -357256 -302165 -282726 -307949 -281139 -175457 -26547 191288 459372 665467
$$ packed form
11824f58778j36431j69376j46204j04520k4222O1243J05204J16614J13890J31862
11814g10718J83749J95861R6477k8799j10226j90309k26527j54169n091R7395
11804h52357J39950J63795J47582P6252l151j2034L6183L9545p505l8374o8999
11793c79113j28137j65269j57944p0595N7182N3339p5523r6554o130P349p5099
11782a036494j39470n9695J70536L71164L84342K48635P9127l0788o3566m4953
11772a21162J5017R8585J09551K7209l5556P649P3223K0819m3542l4580n6254
11761F0959j13876j12805j07182j18008j00902m4321j23j3209k8316n902N6016
11750e27669R3880P6533N5091J9439k5223K6810J05682J48910K17835K68084K06095
$$ plain form
11739 665467 763257 811477 819006 756222 641282 535848 445512 368278 358827 384214 357003
11728 357003 216185 -41723 -311616 -504240 -625521 -716018 -775363 -768133 -696268 -613891 -568245
11717 -568245 -552543 -502210 -418405 -332805 -270757 -263424 -277822 -306909 -349236 -332098 -202715
11706 -202715 -19064 141708 256538 333266 360579 340273 264502 129671 -27524 -167889
11696 -167889 -265954 -307046 -227775 -11728 203121 304062 338801 381160 356856 195504 -30852
11685 -30852 -186540 -192040 -112768 -36862 37528 53675 -22950 -40144 153138 401978 435163
11674 435163 309663 170531 45226 -38249 -91350 -151345 -191041 -139207 -22231 86943
11664 86943 158716 166067 82023 -67201 -223036 -329400 -326763 -220794 -93895 33915 159583
$$ packed form
11739F65467R7790M8220P529o2784j14940j05434r0336p7234r451K5387k7211
11728C57003j40818k57908k69893j92624j21281r0497n9345P230P1865Q2377M5646
11717e68245J5702N0333Q3805Q5600O2048P333j4398k9087m2327J7138J29383
11706b02715J83651J60772J14830P6728K7313k0306p5771j34831j57195j40365
11696a67889r8065m1092P9271K16047K14849J00941L4739M2359k4304j61352k26356
11685c0852j55688n500P9272P5906P4390J6147p6625j7194J93282K48840L3185
11674D35163j25500j39132j25305q3475n3101n9995l9696N1834J16976J09174
11664H6943P1773P351q4044j49224j55835j06364K637J05969J26899J27810J25668
$$ plain form
11653 159583 241438 236569 155733 70069 6477 -57882 -93035 -56991 6674 43460 76262 175767
11641 175767 352290 579991 888405 1224956 1496234 1746475 2029451 2252225 2303676 2206739
11631 2206739 2062767 1963143 1916303 1955485 2109934 2291718 2386166 2395250 2474577 2746118 3169010
11620 3169010 3617039 4007638 4388221 4883757 5477920 6041680 6530215 7043607 7692023
11611 7692023 8411596 9045547 9545615 9969458 10361949 10732990 11070194 11399103 11715776
11602 11715776 11973734 12185422 12371035 12506788 12692105 13043446 13494768 13957796 14345313
11593 14345313 14554220 14576521 14423002 14064127 13526819 12924002 12332679 11779262 11244209
11584 11244209 10728093 10313082 10078980 10019469 10080035 10134121 10089864 10034916 10110131 10345972
$$ packed form
11653A59583Q1855m869q0836q5664o3592o4359l5153L6044O3665L6786L2802R9505
11641A75767J76523K27701L08414L36551K71278K50241K82976K22774N1451r6937
11631B206739j43972r9624m6840L9182J54449J81784R4448R084P9327K71541M22892
11620C169010M48029L90599L80583M95536N94163N63760M88535N13392O48416
11611G692023P19573O33951N00068M23843L92491L71041L37204L28909L16673
11602A1715776K57958K11688J85613J35753J85317L51341M51322M63028L87517
11593A4345313K08907K2301j53519l58875n37308o02817n91323n53417n35053
11584A1244209n16116m15011k34102n9511O0566N4086m4257n4948P5215K35841
$$ plain form
11574 10345972 10709815 11196466 11795059 12462749 13171073 13922005 14737271 15674304 16763637
11565 16763637 18016075 19425342 20937134 22436456 23850621 25121654 26085544 26545227
11557 26545227 26407500 25669781 24421818 22847452 21117766 19360117 17642886 15921450
11549 15921450 14203227 12598855 11177738 9948138 8874484 7927930 7121591 6463677
11541 6463677 5903832 5362355 4837109 4381812 4045321 3826970 3646524 3428746 3171753
11532 3171753 2884187 2578566 2359381 2323791 2387964 2374385 2256176 2126165 2051747 2032340
11522 2032340 1978613 1855589 1691814 1469727 1271438 1200088 1155416 1040569 963759 1031010
11512 1031010 1235037 1567482 1960464 2283056 2475343 2552087 2526181 2445725 2388379 2361081
$$ packed form
11574A0345972L63843M86651N98593O67690P08324P50932Q15266R37033J089333
11565A6763637J252438J409267J511792J499322J414165J271033R63890M59683
11557B6545227j37727p37719j247963j574366j729686j757649j717231j721436
11549A5921450j718223j604372j421117j229600j073654r46554q06339o57914
11541F463677n59845n41477n25246m55297l36491k18351j80446k17778k56993
11532C171753k87566l05621k19185l5590O4173j3579j18209j30011p4418j9407
11522B032340n3727j23024j63775k22087j98289p1350m4672j14847p6810O7251
11512A031010K04027L32445L92982L22592J92287P6744k5906q0456n7346k7298
$$ plain form
11502 2361081 2320051 2280670 2304972 2362674 2344246 2198084 2005981 1886361 1825728 1771172 1756420
11491 1756420 1775921 1780513 1760285 1696903 1569839 1435992 1370066 1356124 1317035 1203273 1046862
11480 1046862 941631 940222 998134 1020542 917559 704906 489910 322272 194874 104925
11470 104925 69803 103653 163104 166179 134384 151713 176548 101875 -49443 -169483 -208505
11459 -208505 -157864 -25226 169977 353103 484356 597808 697348 759805 786190 751692
11449 751692 649423 569206 566246 554839 457789 294804 105046 -89687 -239057 -309050 -305593
11438 -305593 -215181 -72173 78008 183701 191043 116883 7818 -99091 -207354 -387585
11428 -387585 -667277 -900066 -969487 -933241 -852792 -702139 -455006 -154703 78526 179082
$$ packed form
11502B361081m1030l9381K4302N7702j8428j46162j92103j19620o0633n4556j4752
11491A756420J9501M592k0228o3382j27064j33847o5926j3942l9089j13762j56411
11480A046862j05231j409N7912K2408j02983k12653k14996j67638j27398q9949
11470A04925l5122L3850N9451L075l1795J7329K4835p4673j51318j20040l9022
11459b08505N0641J32638J95203J83126J31253J13452R9540O2457K6385l4498
11449G51692j02269q0217k960j1407r7050j62985j89758j94733j49370o9993L457
11438c05593R0412J43008J50181J05693P342p4160j09065j06909j08263j80231
11428c87585k79692k32789o9421L6246Q0449J50653K47133L00303K33229J00556
$$ plain form
11418 179082 177532 83086 -111063 -385278 -675711 -853842 -861515 -798508 -754881 -759345 -803306
11407 -803306 -822217 -758275 -637642 -498832 -383751 -331995 -258097 -93991 71787 162156
11397 162156 171451 139990 99279 25751 -81544 -171289 -220488 -249057 -316987 -444596 -550105
11386 -550105 -580003 -559139 -508214 -406835 -276465 -203887 -226768 -290605 -371977 -475408 -543727
11375 -543727 -535250 -411371 -164647 77275 194463 203208 139987 4768 -214805 -454165
11365 -454165 -597412 -590647 -456800 -303050 -264983 -372111 -538239 -661788 -705339 -704190 -649192
11354 -649192 -490659 -296517 -154943 -48373 66309 198507 345818 487022 611319 750502
11344 750502 853708 843058 751343 645114 554204 448684 300124 92377 -204470 -545866
$$ packed form
11418A79082j550r4446j94149k74215k90433j78131p673O3007M3627m464m3961
11407h03306j8911O3942J20633J38810J15081N1756P3898J64106J65778R0369
11397A62156R295l1461m0711p3528j07295q9745m9199k8569o7930j27609j05509
11386e50105k9898K0864N0925J01379J30370P2578k2881o3837q1372j03431o8319
11375e43727Q477J23879K46724K41922J17188Q745o3221j35219k19573k39360
11365d54165j43247O765J33847J53750L8067j07128j66128j23549m3551J149N4998
11354f49192J58533J94142J41574J06570J14682J32198J47311J41204J24297J39183
11344G50502J03206j0650r1715j06229r0910j05520j48560k07747k96847l41396
$$ plain form
11334 -545866 -811668 -927831 -944054 -881313 -737229 -556605 -396523 -310656 -306705 -311638 -255328
11323 -255328 -147976 -31109 52577 81119 34292 -106860 -304369 -457572 -554615 -639553
11313 -639553 -707648 -752742 -750937 -644813 -465145 -328989 -301290 -330051 -360982 -384066 -420316
11302 -420316 -558841 -798309 -1016882 -1142471 -1132566 -972380 -715347 -459839 -330034 -375661
11292 -375661 -478217 -488585 -406649 -335436 -285968 -232971 -228785 -268515 -286641 -238153 -153396
11281 -153396 -111160 -161069 -290750 -446157 -545103 -538846 -468441 -438017 -421007 -350068 -262506
11270 -262506 -184121 -114491 -65550 -73904 -119386 -147878 -185902 -267974 -345680 -406558 -458214 -476178
11258 -476178 -440216 -334958 -197506 -50558 95469 211009 316349 367551 309347 189476
$$ packed form
11334e45866k65802j16163j6223O2741J44084J80624J60082Q5867L951m933N6310
11323b55328J07352J16867Q3686K8542m6827j41152j97509j53203r7043q4938
11313f39553o8095m5094J805J06124J79668J36156K7699k8761l0931k3084l6250
11302d20316j38525k39468k18573j25589R905J60186K57033K55508J29805m5627
11292c75661j02556j0368Q1936P1213M9468N2997M186l9730j8126M8488Q4757
11281a53396M2236m9909j29681j55407r8946O257P0405L0424J7010P0939Q7562
11270b62506P8385O9630M8941q354m5482k8492l8024q2072p7706o0878n1656j7964
11258d76178L5962J05258J37452J46948J46027J15540J05340N1202n8204j19871
$$ plain form
11248 189476 88041 49680 51101 89894 160464 197739 163695 72214 -6069 41 40750 50448
11236 50448 58045 63998 13705 -87400 -188704 -252318 -249792 -171792 -59104 25317 57887 60429
11224 60429 62207 68963 90726 141861 159917 72531 -37584 -87216 -104499 -143336 -185789 -143742
11212 -143742 -70227 -77428 -182315 -355994 -546270 -746971 -993483 -1228012 -1339250 -1270749
11202 -1270749 -1066680 -791114 -483722 -173075 142249 440058 636149 705027 677973 585652
11192 585652 495785 491287 561416 577612 462212 264391 61801 -122743 -260398 -343720 -375734
11181 -375734 -370649 -359554 -324683 -233839 -113807 -19152 44445 93387 67761 -75826 -282354
11170 -282354 -464350 -581244 -593143 -471436 -231700 63724 320654 478677 520234 474100
$$ packed form
11248A89476j01435l8361J421L8793P0570L7275l4044r1481p8283O110M0709R698
11236E0448P597N953n0293j01105j01304o3614K526P8000J12688Q4421L2570K542
11224F0429J778O756K1763N1135J8056q7386j10115m9632j7283l8837m2453M2047
11212a43742P3515p201j04887j73679j90276k00701k46512k34529j11238O8501
11202a270749K04069K75566L07392L10647L15324K97809J96091O8878k7054r2321
11192E85652q9867m498P0129J6196j15400j97821k02590j84544j37655q3322l2014
11181c75734N085J1095L4871R0844J20032R4655O3597M8942k5626j43587k06528
11170b82354j81996j16894j1899J21707K39736K95424K56930J58023M1557m6134
$$ plain form
11160 474100 379836 262552 170101 169158 224279 250277 247481 236137 188429 82719 -73153
11149 -73153 -214265 -257507 -193533 -96683 -22421 8578 -26784 -127931 -259479 -396014 -513252
11138 -513252 -602686 -700105 -771690 -732487 -573777 -370787 -189049 -37196 112602 230415
11128 230415 260064 206304 89261 -61387 -216859 -338177 -369840 -309829 -205547 -87143
11118 -87143 -5182 -10848 -120943 -286889 -460735 -638015 -792663 -876396 -885006 -847847 -764823
11107 -764823 -697067 -752323 -872122 -918582 -913624 -925475 -897872 -783471 -602386 -455762 -454136
11096 -454136 -523741 -485038 -278442 16279 279082 452517 552603 584603 496662 282409
11086 282409 41194 -158967 -290920 -361204 -415069 -474402 -509090 -547827 -666718 -847719
$$ packed form
11160D74100r4264j17284r2451r43N5121K5998k796j1344m7708j05710j55872
11149g3153j41112m3242O3974R6850P4262L0999l5362j01147j31548j36535j17238
11138e13252q9434r7419p1585L9203J58710K02990J81738J51853J49798J17813
11128B30415K9649n3760j17043j50648j55472j21318l1663O0011J04282J18404
11118h7143Q1961n666j10095j65946j73846j77280j54648q3733q610L7159Q3024
11107g64823O7756n5256j19799m6460M958j1851K7603J14401J81085J46624J626
11096d54136o9605L8703K06596K94721K62803J73435J00086L2000q7941k14253
11086B82409k41215k00161j31953p0284n3865n9333l4688l8737j18891j81001
$$ plain form
11076 -847719 -1033341 -1119942 -1054429 -933278 -881674 -896602 -881804 -783586 -634898 -486824 -330441
11065 -330441 -169148 -73689 -65445 -106940 -172668 -207367 -186539 -156100 -173228 -236071 -285460
11054 -285460 -288438 -286982 -279880 -225134 -129540 -48456 -12949 43604 173395 326437 418728 409213
11042 409213 292519 138292 39179 3006 18242 16775 -52166 -151997 -283375 -442580 -513039
11031 -513039 -429621 -240833 -29834 135520 248087 295184 285158 289073 311781 311768 269846
11020 269846 172697 43135 -71063 -139209 -188003 -247677 -290105 -361506 -491533 -573255 -548371
11009 -548371 -464230 -399587 -382247 -382727 -397464 -410890 -413422 -439570 -503034 -542790 -510094 -411285
10997 -411285 -275468 -191835 -225636 -327407 -408511 -417814 -353974 -247484 -126915 -21123 92061
$$ packed form
11076h47719j85622q6601O5513J21151N1604j4928J4798R8218J48688J48074J56383
11065c30441J61293R5459Q244m1495o5728l4699K0828L0439j7128o2843m9389
11054b85460k978J456P102N4746R5594Q1084L5507N6553J29791J53042R2291r515
11042D09213j16694j54227r9113l6173J5236j467o8941r9831j31378j59205p0459
11031e13039Q3418J88788K10999J65354J12567M7097j0026L915K2708j3m1922
11020B69846r7149j29562j14198o8146m8794n9674m2428p1401j30027q1722K4884
11009e48371Q4141O4643J7340m80j4737j3426k532k6148o3464l9756L2696R8809
10997d11285J35817Q3633l3801j01771q1104r303O3840J06490J20569J05792J13184
$$ plain form
10986 92061 246429 370060 389856 339125 303368 275450 217490 123463 558 -123668 -192756
10975 -192756 -157840 -49270 33504 8169 -85050 -144110 -92038 -7366 -46003 -253711 -564751
10964 -564751 -838077 -948415 -882375 -742011 -634075 -617237 -706571 -819200 -869544 -862569 -780638
10953 -780638 -574952 -306349 -125189 -97053 -136318 -180743 -225469 -263089 -321376 -425943 -515303
10942 -515303 -504306 -406145 -289210 -168944 -34278 54744 33741 -65410 -151220 -176434 -140211
10931 -140211 -48563 28973 -2861 -128629 -190684 -70381 118340 218512 263772 355842 521833
10920 521833 658311 675873 642461 655992 746472 895378 995655 943698 722799 386494
10910 386494 98279 -23373 -84456 -194357 -272557 -271122 -284368 -351013 -385613 -344865 -240073
$$ packed form
10986I2061J54368J23631J9796n0731l5757k7918n7960r4027j22905j24226o9088
10975a92756L4916J08570Q2774k5335r3219n9060N2072Q4672l8637k07708l11040
10964e64751k73326j10338O6040J40364J07936J6838q9334j12629n0344O975Q1931
10953g80638K05686K68603J81160K8136l9265m4425m4726l7620n8287j04567q9360
10942e15303J0997R8161J16935J20266J34666Q9022k1003r9151q5810k5214L6223
10931a40211R1648P7536l1834j25768o2055J20303J88721J00172M5260R2070J65991
10920E21833J36478J7562l3412J3531R0480J48906J00277n1957k20899l36305
10910C86494k88215j21652o1083j09901p8200J435j3246o6645l4600M0748J04792
$$ plain form
10899 -240073 -80907 89457 211955 240011 158325 -24058 -262455 -512537 -747150 -875971
10889 -875971 -873483 -822320 -757694 -691399 -627770 -542741 -428372 -339659 -347953 -434707 -486329 -443894
10877 -443894 -357659 -322105 -390536 -505488 -570884 -557553 -507613 -479774 -494648 -523579 -553345
10866 -553345 -572592 -519976 -394554 -344395 -461847 -664025 -830459 -918932 -915686 -807840 -623016
10855 -623016 -436376 -310738 -217779 -138665 -59626 31860 89043 62914 -55195 -243494 -452906
10844 -452906 -646833 -793337 -871294 -872967 -821674 -778876 -787933 -835799 -874950 -867578 -814802 -704500
10832 -704500 -547107 -451186 -463071 -517379 -532008 -519574 -504109 -439316 -296091 -95749 61523
10821 61523 78463 -26229 -156070 -225440 -213942 -193980 -215531 -279538 -357787 -408173 -445397
$$ packed form
10899b40073J59166J70364J22498K8056q1686j82383k38397k50082k34613j28821
10889h75971K488N1163O4626O6295O3629Q5029J14369Q8713q294q6754n1622M2435
10877d43894Q6235L5554o8431j14952o5396J3331M9940K7839j4874k8931k9766
10866e53345j9247N2616J25422N0159j17452k02178j66434q8473L246J07846J84824
10855f23016J86640J25638R2959P9114P9039R1486N7183k6129j18109j88299k09412
10844d52906j93927j46504p7957j673N1293M2798r057m7866l9151P372N2776J10302
10832g04500J57393R5921j1885n4308j4629J2434J5465O4793J43225K00342J57272
10821F1523J6940j04692j29841o9370J1498J9962k1551o4007p8249n0386l7224
$$ plain form
10810 -445397 -473176 -433560 -332067 -258146 -224712 -143440 -10512 97786 170552 221862 245976
10799 245976 243041 242536 305866 437420 564485 586970 455989 232334 44535 -18036 21755
10788 21755 51206 -31026 -208077 -400744 -567751 -717833 -897918 -1102750 -1215072 -1181940
10778 -1181940 -1040530 -796503 -527208 -360383 -351522 -503577 -750177 -953934 -965750 -722047
10768 -722047 -340029 18875 269097 330163 184423 -57506 -227721 -268668 -259718 -291210
10758 -291210 -376583 -463924 -490866 -477095 -482216 -512568 -549431 -588797 -685076 -817726 -843744
10747 -843744 -758873 -672133 -634111 -625488 -609464 -566968 -501837 -405904 -306037 -235018 -230260 -315710
10735 -315710 -422471 -498069 -510192 -414783 -239656 -94159 -74151 -152426 -230894 -249962 -215655
$$ packed form
10810d45397k7779L9616J01493P3921L3434Q1272J32928J08298P2766N1310K4114
10799B45976k935n05O3330J31554J27065K2485j30981k23655j87799o2571L9791
10788B1755K9451q2232j77051j92667j67007j50082j80085k04832j12322L3132
10778a181940J41410K44027K69295J66825Q861j52055k46600k03757j1816K43703
10768g22047L82018L58904K50222O1066j45740k41929j70215m0947Q950l1492
10758b91210q5373q7341k6942J3771n121l0352l6863l9366r6279j32650k6018
10747h43744Q4871Q6740L8022Q623J6024M2496O5131R5933R9867P1019M758q5450
10735c15710j06761p5598j2123R5409J75127J45497K0008p8275p8468j9068L4307
$$ plain form
10724 -215655 -173350 -80176 75921 173446 124077 -62285 -355774 -653513 -828537 -866611
10714 -866611 -796535 -665990 -478539 -225667 -16549 53570 13365 -106781 -293889 -486948
10704 -486948 -619127 -725691 -818007 -860223 -834673 -761291 -656327 -528345 -370300 -181952
10694 -181952 12494 198958 356712 493104 610695 722283 845407 921930 898949 793828
10684 793828 640745 429315 175645 -29149 -124397 -144100 -157719 -199853 -262252 -333176 -376618
10673 -376618 -296956 -17844 336062 584060 665197 595682 453404 314167 256182 305325
10663 305325 395807 437117 418276 377311 318354 236944 181126 186997 245680 324342 365534 427692
10651 427692 613258 844111 955952 893550 742968 592251 482445 457484 518141 572170
$$ packed form
10724b15655M2305R3174J56097R7525m9369j86362k93489k97739j75024l8074
10714h66611P0076J30545J87451K52872K09118P0119m0205j20146j87108j93059
10704d86948j32179j06564r2316m2216K5550P3382J04964J27982J58045J88348
10694a81952J94446J86464J57754J36392J17591J11588J23124P6523k2981j05121
10684G93828j53083k11430k53670k04794r5248j9703j3619m2134o2399p0924m3442
10673c76618P9662K79112L53906K47998Q1137o9515j42278j39237n7985M9143
10663C05325R0482M1310j8841m0965n8957q1410n5818N871N8683P8662M1192O2158
10651D27692J85566K30853J11841o2402j50582j50717j09806k4961O0657N4029
$$ plain form
10641 572170 553241 496477 432922 357396 270855 152916 -6259 -187480 -331952 -351073 -211503
10630 -211503 10744 202185 302814 305037 258314 232782 239019 259465 319281 421548 539177
10619 539177 665899 795744 872364 825817 707439 656164 744505 897604 982754 928010 776489
10608 776489 670078 658468 622951 502351 381478 331721 303679 281894 358579 568849 836119
10597 836119 1093801 1306033 1399795 1320893 1110183 887239 755149 652113 486761 304339
10587 304339 185936 129503 67991 -45850 -193542 -336591 -400540 -336324 -203781 -45304
10577 -45304 105292 172735 179604 208237 286834 379793 405222 352200 269560 206171 162320 95560
10565 95560 31375 42242 124049 159262 100564 64310 127689 258770 336836 255343 54505
$$ packed form
10641E72170j8929n6764o3555p5526q6541j17939j59175j81221j44472j9121J39570
10630b11503K22247J91441J00629K223m6723k5532O237K0446N9816J02267J17629
10619E39177J26722J29845P6620m6547j18378n1275Q8341J53099Q5150n4744j51521
10608G76489j06411j1610l5517j20600j20873m9757k8042k1785P6685K10270K67270
10597H36119K57682K12232R3762p8902k10710k22944j32090j03036j65352j82422
10587C04339j18403n6433o1512j13841j47692j43049o3949O4216J32543J58477
10577d5304J50596O7443O869K8633P8597R2959K5429n3022q2640o3389m3851o6760
10565I5560o4185J0867Q1807L5213n8698l6254O3379J31081P8066q1493k00838
$$ plain form
10554 54505 -142993 -303775 -458536 -594042 -663446 -655026 -565391 -391967 -185525 26907
10544 26907 207395 276655 216193 72875 -129772 -399623 -653807 -778094 -722721 -481886
10534 -481886 -165266 72423 184233 249537 342418 391098 375271 337025 253160 172704 146414
10523 146414 131201 86619 -18441 -207428 -394694 -495029 -502028 -468141 -413292 -317624 -215350
10512 -215350 -126329 -3099 159854 327688 452119 465074 336670 135749 -6200 -37523
10502 -37523 647 11226 -90366 -287275 -471534 -567288 -538402 -428652 -358010 -387792 -416116
10491 -416116 -298767 -71055 140723 315684 466848 560566 536522 360601 71751 -224756
10481 -224756 -442000 -539005 -502701 -377215 -271338 -287067 -410343 -534455 -576095 -573381 -526834
$$ packed form
10554E4505j97498j60782j54761j35506o9404Q420Q9635J73424K06442K12432
10544B6907J80488O9260o0462j43318k02647k69851k54184j24287N5373K40835
10534d81886L16620K37689J11810O5304R2881M8680j5827l8246q3865q0456k6290
10523A46414j5213m4582j05060j88987j87266j00335o999L3887N4849R5668J02274
10512b15350Q9021J23230J62953J67834J24431J2955j28404k00921j41949l1323
10502c7523L8170J0579j01592j96909j84259r5754K8886J09750P0642k9782k8324
10491d16116J17349K27712K11778J74961J51164R3718k4044j75921k88850k96507
10481b24756k17244r7005L6304J25486J05877j5729j23276j24112m1640K714M6547
$$ plain form
10470 -526834 -402471 -211002 19044 220101 344082 397343 458144 660172 973276 1227320
10460 1227320 1311313 1209505 938481 579900 239880 -27064 -200749 -274310 -248949 -184421
10450 -184421 -145984 -105016 -38400 -8176 -50973 -148058 -220207 -183226 -82928 -54236 -131410
10439 -131410 -243524 -325420 -340196 -274952 -201119 -181360 -174601 -141586 -99257 -44804 5505
10428 5505 29063 30566 19112 60829 162172 217727 169959 96231 83097 110657 100636 52925
10416 52925 18353 27539 79811 108623 81058 56041 98501 191565 281637 334684 345521 331805
10404 331805 305889 230745 134575 77967 41778 -29838 -198344 -457800 -761028 -1030227 -1214581
10393 -1214581 -1311204 -1316652 -1199717 -939164 -561591 -135738 210598 376387 365618 253807
$$ packed form
10470e26834J24363J91469K30046K01057J23981N3261O0801K02028L13104K54044
10460A227320Q3993j01808k71024l58581l40020k66944j73685p3561K5361O4528
10450a84421L8437M0968O6616L0224m2797r7085p2149L6981J00298K8692p7174
10439a31410j12114q1896j4776O5244P3833J9759O759L3015M2329N4453N0309
10428E505K3558J503j1454M1717J01343N5555m7768p3728j3134K7560j0021m7711
10416E2925l4572R186N2272K8812k7565k5017M2460R3064R0072N3047J0837j3716
10404C31805k5916p5144r6170n6608l6189p1616j68506k59456l03228k69199j84354
10393a214581r6623n448J16935K60553L77573M25853L46336J65789j0769j11811
$$ plain form
10383 253807 145962 127129 197388 324281 488249 624780 672058 632713 531643 372204
10373 372204 173646 -28079 -190274 -275624 -294279 -287115 -306615 -360369 -420001 -499658 -605791
10362 -605791 -692259 -716706 -623770 -447569 -338529 -342337 -368610 -327461 -258911 -243210 -254375
10351 -254375 -238294 -192480 -145469 -105509 -80503 -63614 -27384 74444 270903 483955 586050
10340 586050 544755 420084 255470 65897 -112951 -193560 -131010 -27205 24678 38255
10330 38255 67118 153721 272818 368724 400032 352150 255409 155140 49959 -44148 -79508
10319 -79508 -70428 -61827 -55172 -43452 -29741 -4997 46216 119500 177056 201075 230238 258465
10307 258465 173256 -35548 -217064 -304884 -321110 -260390 -117851 75705 297205 507012
$$ packed form
10383B53807j07845j8833P0259J26893J63968J36531M7278l9345j01070j59439
10373C72204j98558k01725j62195q5350j8655P164j9500n3754n9632p9657j06133
10362f05791q6468k4447R2936J76201J09040l808k6273M1149O8550J5701j1165
10351b54375J6081M5814M7011L9960K5006J6889L6230J01828J96459K13052J02095
10340E86050m1295j24671j64614j89573j78848q0609O2550J03805N1883J3577
10330C8255K8863Q6603J19097R5906L1308m7882r6741j00269j05181r4107l5360
10319g9508R080Q601O655J1720J3711K4744N1213P3284N7556K4019K9163K8227
10307B58465q5209k08804j81516q7820j6226O0720J42539J93556K21500K09807
$$ plain form
10297 507012 610179 565347 417182 265324 184431 174003 232292 331138 454366 552342 547192
10286 547192 434001 235641 33067 -52645 -21316 77462 277009 545112 829773 1110766
10276 1110766 1310049 1360744 1373344 1475830 1611161 1716180 1763220 1712787 1640651 1681698
10266 1681698 1808758 1916828 1957006 1891435 1759619 1627388 1492141 1323989 1103896 878397
10256 878397 723033 627075 520286 379267 243474 157233 98121 -8836 -141276 -204187
10246 -204187 -197430 -171731 -119992 -22896 92166 211336 386022 626510 866465 1041724
10236 1041724 1174737 1310457 1400038 1395927 1356395 1331336 1273543 1164405 1050934 937364
10226 937364 809917 680388 567774 465871 427172 453321 461509 451301 441153 463219 540795
$$ packed form
10297E07012J03167m4832j48165j51858q0893j0428N8289R8846J23228R7976n150
10286E47192j13191j98360k02574q5712L1329R8778J99547K68103K84661K80993
10276A110766J99283N0695J2600J02486J35331J05019M7040n0433p2136M1047
10266A681698J27060J08070M0178o5571j31816j32231j35247j68152k20093k25499
10256H78397j55364r5958j06789j41019j35793q6241n9112j06957j32440o2911
10246b04187O757K5699N1739R7096J15062J19170J74686K40488K39955J75259
10236A041724J33013J35720Q9581m111l9532k5059n7793j09138j13471j13570
10226I37364j27447j29529j12614j01903l8699K6149Q188j0208j0148K2066P7576
$$ plain form
10215 540795 615409 663963 680871 608594 459081 376457 428748 530127 581286 601354 669985
10204 669985 818074 955907 954878 796532 538384 226049 -100586 -350611 -466017 -489762
10194 -489762 -494704 -520264 -588668 -678345 -753886 -809674 -770685 -575764 -289071 -34200 113011
10183 113011 176735 196964 165659 27393 -226141 -498464 -709494 -833962 -820697 -669006
10173 -669006 -503081 -394883 -358285 -400119 -492515 -606353 -677682 -646143 -538004 -410362
10163 -410362 -302894 -259249 -261310 -245921 -202353 -139012 17738 269084 549662 850752 1135260
10152 1135260 1314550 1375150 1394129 1430229 1474396 1474681 1448955 1437771 1412770 1357035 1320334
10141 1320334 1345845 1437749 1592767 1801760 2022753 2215831 2401988 2624541 2918538 3323493
$$ packed form
10215E40795P4614M8554J6908p2277j49513q2624N2291J01379N1159K0068O8631
10204F69985J48089J37833j029j58346k58148l12335l26635k50025j15406k3745
10194d89762m942k5560o8404q9677p5541n5788L8989J94921K86693K54871J47211
10183A13011O3724K0229l1305j38266k53534k72323k11030j24468J3265J51691
10173f69006J65925J08198L6598m1834r2396j13838p1329L1539J08139J27642
10163d10362J07468M3645k061J5389M3568O3341J56750K51346K80578L01090K84508
10152A135260J79290O0600J8979L6100M4167K85k5726j1184k5001n5735l6701
10141A320334K5511R1904J55018K08993K20993J93078J86157K22553K93997M04955
$$ plain form
10131 3323493 3902451 4684111 5620139 6726928 8087555 9734220 11672206 13865241 16252289
10122 16252289 18777295 21363519 23797955 25679940 26518824 25994349 24203815 21603202
10114 21603202 18732493 16004598 13587995 11492838 9714092 8246442 7057892 6125098
10106 6125098 5438356 4940065 4537137 4136283 3682624 3196271 2748032 2375145 2075657
10097 2075657 1829671 1605735 1399210 1210109 974061 678855 415436 235504 108108
10088 108108 -7688 -81078 -41094 115984 335190 515665 526933 369787 162658 24701
10078 24701 23448 114287 186232 194440 168883 158815 173576 204401 258477 362422 534016 686937
10066 686937 700092 579907 403124 210770 39847 -81671 -153583 -191262 -196246 -185611 -186844
$$ packed form
10131C323493N78958P81660R36028J106789J360627J646665J937986K193035K387048
10122A6252289K525006K586224K434436J881985Q38884n24475j790534k600613
10114B1603202k870709k727895k416603k095157j778746j467650j188550r32794
10106F125098o86742m98291m02928m00854m53659m86353m48239l72887k99488
10097B075657k45986k23936k06525j89101k36048k95206k63419j79932j27396
10088A08108j15796p3390L9984J57078K19206J80475J1268j57146k07129j37957
10078B4701j253R0839P1945Q208k5557j0068J4761L0825N4076J03945J71594J52921
10066F86937J3155j20185j76783j92354j70923j21518p1912l7679m984J0635j233
$$ plain form
10055 -186844 -178614 -154169 -156733 -202891 -231493 -199928 -177507 -223455 -278861 -249797 -111496 85424
10043 85424 265004 314687 198440 29178 -102078 -196217 -274127 -380980 -501082 -527363
10033 -527363 -486544 -493519 -507074 -412277 -230906 -84742 -43848 -64776 -48339 24184 78076
10022 78076 63833 35224 43103 61977 72875 65233 49347 71653 102052 76350 -38790 -239517
10010 -239517 -476682 -686936 -809599 -818924 -744466 -636761 -532915 -458808 -402911 -351545 -343092
9999 -343092 -358954 -336100 -301272 -319337 -351000 -336061 -272206 -165371 -49705 40929 100873
9988 100873 148074 232316 356812 475959 567397 651687 698871 632804 509124 411338 304754
9977 304754 233551 299305 466527 624611 708079 717063 673951 613358 556749 496084 455348
$$ packed form
10055a86844Q230K4445k564m6158k8602L1565K2421m5948n5406K9064J38301J96920
10043H5424J79580M9683j16247j69262j31256r4139p7910j06853j20102k6281
10033e27363M0819o975j3555R4797J81371J46164M0894k0928J6437P2523N3892
10022G8076j4243k8609P879J8874J0898p642j5886K2306L0399k5702j15140k00727
10010b39517k37165k10254j22663r325P4458J07705J03846P4107N5897N1366Q453
9999c43092j5862K2854L4828j8065l1663J4939O3855J06835J15666R0634N9944
9988A00873M7201Q4242J24496J19147R1438Q4290M7184o6067j23680r7786j06584
9977C04754p1203O5754J67222J58084Q3468Q984m3112o0593n6609o0665m0736
$$ plain form
9966 455348 489588 579571 628706 619582 601065 598381 623954 694144 832566 1037243 1263351
9955 1263351 1446531 1558391 1647142 1731083 1778460 1809732 1854167 1860795 1793429 1667830 1505778
9944 1505778 1331526 1130309 908037 749689 708103 706316 645788 514672 385468 389133 484135
9933 484135 502080 396648 214877 -22905 -282080 -449876 -508377 -501016 -467399 -450463 -444988
9922 -444988 -418742 -321332 -137884 33787 127341 118539 33809 6271 138814 359607 502450
9911 502450 530021 516839 490083 435455 360082 263441 137778 9357 -87763 -151495 -213806
9900 -213806 -298059 -418699 -519708 -575703 -635030 -667642 -587519 -380797 -103220 161495 318775
9889 318775 338564 260480 154804 68416 10582 -30122 -63483 -102811 -97508 -1126 107854
$$ packed form
9966D55348L4240Q9983M9135r124j8517k684K5573P0190J38422K04677K26108
9955A263351J83180J11860Q8751Q3941M7377L1272M4435O628o7366j25599j62052
9944A505778j74252k01217k22272j58348m1586j787o0528j31116j29204L665R5002
9933D84135J7945j05432j81771k37782k59175j67796n8501P361L3617J6936N475
9922d44988K6246R7410J83448J71671R3554q802q4730k7538J32543K20793J42843
9911E02450K7571j3182k6756n4628p5373r6641j25663j28421r7120o3732o2311
9900b13806q4253j20640j01009n5995n9327l2612Q0123K06722K77577K64715J57280
9889C18775J9789p8084j05676q6388n7834m0704l3361l9328N303R6382J08980
$$ plain form
9878 107854 145167 111211 40605 -35055 -63421 -30900 46866 155328 274855 402626 554236
9867 554236 725722 927461 1153271 1340024 1460125 1556214 1643471 1683146 1645712 1530981
9857 1530981 1349976 1108694 842075 602297 428256 396570 526103 729641 927270 1045675
9847 1045675 1088683 1129883 1206870 1299533 1352573 1393709 1510874 1720012 1972104 2233403 2498541
$$ packed form
9878A07854L7313l3956p0606p5660k8366L2521P7766J08462J19527J27771J51610
9867E54236J71486K01739K25810J86753J20101R6089Q7257L9675l7434j14731
9857A530981j81005k41282k66619k39778j74041l1686J29533K03538J97629J18405
9847A045675M3008M1200P6987R2663N3040M1136J17165K09138K52092K61299K65138
$$ [...]
##END NTUPLES=NMR SPECTRUM
##END=
