##TITLE=31Pdec_LR-618-R4-RM1ef
 , 124 sc
 2.07.2021
##JCAMPDX= 6.0         $$ Bruker NMR JCAMP-DX V2.0
##DATA TYPE= NMR SPECTRUM
##DATA CLASS= NTUPLES
##ORIGIN= UXNMR, Bruker Analytische Messtechnik GmbH
##OWNER= root
$$ XWIN-NMR		Version 3.5
$$ Fri Jul  2 13:53:08 2021 Russian Standard Time (UT+4h)  she@DPX200
##.OBSERVE FREQUENCY= 81.013821
##.OBSERVE NUCLEUS= ^31P
##.ACQUISITION MODE= SIMULTANEOUS
##.ACQUISITION SCHEME= undefined
##.AVERAGES= 124
##.DIGITISER RES= 16
##SPECTROMETER/DATA SYSTEM= spect
##.PULSE SEQUENCE= zgpg30
##.SOLVENT NAME= CDCl3
##.SHIFT REFERENCE= (INTERNAL, CDCl3, 0, 248.564)
##AUDIT TRAIL= $$ (NUMBER, WHEN, WHO, WHERE, WHAT)
$$ ##TITLE= Audit trail, XWIN-NMR		Version 3.5
$$ ##JCAMPDX= 5.01
$$ ##ORIGIN= Bruker BioSpin GmbH
$$ ##OWNER= she
$$ F:/spectra/data/she/nmr/P31/1/pdata/1/auditp.txt
$$ ##AUDIT TRAIL=  $$ (NUMBER, WHEN, WHO, WHERE, WHAT)
(   1,<2021-07-02 13:51:14.42 +0400>,<she>,<DPX200>,
      <continue with go, POWCHK disabled, PULCHK disabled
       configuration hash MD5:
       00 E9 B6 7A A2 85 ED C7 34 08 36 98 17 FE 4E 26
       data hash MD5: 32K
       AB 12 46 B6 5B BB 1C E9 EE 95 0D 12 A8 CC 40 D0>)
(   2,<2021-07-02 13:51:17.17 +0400>,<she>,<DPX200>,
      <Start of raw data processing
       efp BC_mod = 2 LB = 1 FT_mod = 6 PKNL = 1 PHC0 = -7275.274 PHC1 = -202.7138 SI = 64K 
       data hash MD5: 64K
       6B 6C 25 2A 54 84 9B 4D A4 15 6B 61 B5 9D CD 27>)
(   3,<2021-07-02 13:51:49.37 +0400>,<she>,<DPX200>,
      <pk PHC0 = 84.92943 PHC1 = -231.0002 
       data hash MD5: 64K
       3F 62 47 91 27 55 4B 5E 6E 49 DB 98 C5 72 F1 63>)
(   4,<2021-07-02 13:51:54.85 +0400>,<she>,<DPX200>,
      <abs ABSG = 5 
       data hash MD5: 64K
       01 12 44 1D A3 87 B9 DD 22 05 9F 79 41 D6 B0 AE>)
(   5,<2021-07-02 13:52:16.06 +0400>,<she>,<DPX200>,
      <pk PHC0 = 4.949201 PHC1 = -9 
       data hash MD5: 64K
       FD 43 44 48 EB A8 27 FB 1D E3 26 13 38 9C 6A 7E>)
$$ ##END=
$$ 
$$ hash MD5
$$ 7F AA B7 9C 48 73 AD 63 22 E9 0C AC CF 4E D1 34
##$RELAX= 
##$RELAX= 
##$RELAX= 
##$RELAX= 
##$RELAX= 
##$RELAX= 
##$RELAX= 
##$RELAX= 
$$ Bruker specific parameters
$$ --------------------------
##$DU= <F:/spectra>
##$EXPNO= 1
##$NAME= <P31>
##$PROCNO= 1
##$TYPE= <nmr>
##$USER= <she>
##$AMP= (0..31)
100 100 100 100 100 100 100 100 100 100 100 100 100 100 100 100 100 100 
100 100 100 100 100 100 100 100 100 100 100 100 100 100 
##$AQSEQ= 0
##$AQ_mod= 1
##$AUNM= <au_zg>
##$AUTOPOS= <>
##$BF1= 81.014009
##$BF2= 200.13
##$BF3= 200.13
##$BF4= 200.13
##$BF5= 200.13
##$BF6= 200.13
##$BF7= 200.13
##$BF8= 200.13
##$BYTORDA= 1
##$CFDGTYP= 0
##$CFRGTYP= 5
##$CHEMSTR= <none>
##$CNST= (0..31)
1 1 145 1 1 1 1 1 1 1 1 1 1 1 1 1 1 1 1 1 1 1 1 1 1 1 1 1 1 1 1 1 
##$CPDPRG= <waltz16>
##$CPDPRG1= <>
##$CPDPRG2= <waltz16>
##$CPDPRG3= <>
##$CPDPRG4= <mlev>
##$CPDPRG5= <mlev>
##$CPDPRG6= <mlev>
##$CPDPRG7= <mlev>
##$CPDPRG8= <mlev>
##$CPDPRGB= <>
##$CPDPRGT= <>
##$D= (0..31)
$$ [...]
##$SUBNAM3= <"">
##$SUBNAM4= <"">
##$SUBNAM5= <"">
##$SUBNAM6= <"">
##$SUBNAM7= <"">
##$SUBNAM8= <"">
##$SUBNAM9= <"">
##$SW= 501.771253377433
##$SWIBOX= (0..15)
0 1 3 0 0 0 0 0 0 0 0 0 0 0 0 0 
##$SW_h= 40650.406504065
##$TD= 32768
##$TD0= 1
##$TE= 0
##$TE2= 300
##$TE3= 300
##$TEG= 300
##$TL= (0..7)
0 120 53 12 22 120 120 120 
##$TP= (0..7)
150 150 150 150 150 150 150 150 
##$TP07= 0
##$TPNAME0= <>
##$TPNAME1= <>
##$TPNAME2= <>
##$TPNAME3= <>
##$TPNAME4= <>
##$TPNAME5= <>
##$TPNAME6= <>
##$TPNAME7= <>
##$TPOAL= (0..7)
0.5 0.5 0.5 0.5 0.5 0.5 0.5 0.5 
##$TPOFFS= (0..7)
0 0 0 0 0 0 0 0 
##$TUNHIN= 0
##$TUNHOUT= 0
##$TUNXOUT= 0
##$USERA1= <user>
##$USERA2= <user>
##$USERA3= <user>
##$USERA4= <user>
##$USERA5= <user>
##$V9= 5
##$VALIST= <valist>
##$VCLIST= <CCCCCCCCCCCCCCC>
##$VD= 0
##$VDLIST= <DDDDDDDDDDDDDDD>
##$VPLIST= <PPPPPPPPPPPPPPP>
##$VTLIST= <TTTTTTTTTTTTTTT>
##$WBST= 1024
##$WBSW= 4
##$XGAIN= (0..3)
0 0 0 0 
##$XL= 0
##$YL= 0
##$YMAX_a= 38121
##$YMIN_a= -52776
##$ZGOPTNS= <>
##$ZL1= 120
##$ZL2= 120
##$ZL3= 120
##$ZL4= 120
##$ABSF1= 248.5645
##$ABSF2= -253.2056
##$ABSG= 5
##$ABSL= 3
##$ALPHA= 0
##$AQORDER= 0
##$ASSFAC= 0
##$ASSFACI= 0
##$ASSFACX= 0
##$ASSWID= 0
##$AUNMP= <proc_1d>
##$AZFE= 0.1
##$AZFW= 0.5
##$BCFW= 0
##$BC_mod= 2
##$BYTORDP= 0
##$COROFFS= 0
##$CY= -3
##$DATMOD= 1
##$DC= 0
##$DFILT= <>
##$DTYPP= 0
##$F1P= 0
##$F2P= 0
##$FCOR= 1
##$FTSIZE= 65536
##$FT_mod= 6
##$GAMMA= 0
##$GB= 0
##$INTBC= 1
##$INTSCL= 5.30512e-09
##$ISEN= 30
##$LB= 1
##$LEV0= 0
##$LPBIN= 0
##$MAXI= 10000
##$MC2= 0
##$MEAN= 0
##$ME_mod= 0
##$MI= 50
##$NCOEF= 0
##$NC_proc= -7
##$NLEV= 6
##$NOISF1= 182.463
##$NOISF2= 159.3651
##$NSP= 0
##$NTH_PI= 0
##$NZP= 0
##$OFFSET= 248.5645
##$PC= 4
##$PHC0= -7185.396
##$PHC1= -442.714
##$PH_mod= 1
##$PKNL= yes
##$PPARMOD= 0
##$PSCAL= 0
##$PSIGN= 0
##$REVERSE= no
##$SF= 81.014009
##$SI= 65536
##$SIGF1= 159.3651
##$SIGF2= -187.1042
##$SINO= 113.3802
##$SIOLD= 16384
##$SREGLST= <1H.CDCl3>
##$SSB= 0
##$STSI= 65536
##$STSR= 0
##$SW_p= 40650.406504065
##$SYMM= 0
##$S_DEV= 0
##$TDeff= 32768
##$TDoff= 0
##$TI= <>
##$TILT= no
##$TM1= 0
##$TM2= 0
##$TOPLEV= 0
##$USERP1= <user>
##$USERP2= <user>
##$USERP3= <user>
##$USERP4= <user>
##$USERP5= <user>
##$WDW= 1
##$XDIM= 65536
##$YMAX_p= 527495935
##$YMIN_p= -48070434
$$ End of Bruker specific parameters
$$ ---------------------------------
##NTUPLES= NMR SPECTRUM
##VAR_NAME=  FREQUENCY,     SPECTRUM/REAL,   SPECTRUM/IMAG
##SYMBOL=    X,             R,               I
##VAR_TYPE=  INDEPENDENT,   DEPENDENT,       DEPENDENT
##VAR_FORM=  AFFN,          ASDF,            ASDF
##VAR_DIM=   65536,         65536,           65536
##UNITS=     HZ,            ARBITRARY UNITS, ARBITRARY UNITS
##FACTOR=    0.620285442955139, 1,           1
##FIRST=     20137.2065510759, 0,            0
##LAST=      -20513.1999529892, 0,           0
##MIN=       -20513.1999529892, -48070434,   0
##MAX=       20137.2065510759, 527495935,    0
$$ Real data points
##PAGE= N=1
##DATA TABLE= (X++(R..R)), XYDATA
$$ [...]
13005d814433k84810K142277P71350j171998j63939L078181M446622J213251m348093
12996H68408o717063l357551J889440L677061K109431J269178J738758j8571m062936
12987b603845m960421k30381M801473M687762J511754J03582J31408j326539l071791
12978i56998k097365M0296l01948j919535q49201K043076K306049j01448q94588
12969b731662P54750J432415O16406J401790L350910K195261j658424k215861
12961C145585J568159K309532l987212r820433o466861K966954Q137656N703765
12953C557145J413696m37907k017678n504825p884641n170373J475589O610607
12945g958387O338562J842649k342588k881504n16721J566911J789458J397052
$$ y = [-4814433, -5099243, -2956966, -2185616, -3357614, -3521553, -443372, 4003250, 5216501, 868408, -5848655, -9206206, -7316766, -3639705, -1530274, -261096, 1477662, 1459091, -2603845, -7564266, -7794647, -2993174, 1694588, 3206342, 3309924, 3441332, 2114793, -956998, -3054363, -3014067, -3316015, -5235550, -6084751, -4041675, -1735626, -1837074, -2731662, -1976912, -544497, 71909, 1473699, 4824609, 7019870, 5361446, 3145585, 4713744, 7023276, 3036064, -6784369, -13251230, -10284276, -2146620, 3557145, 4970841, 4532934, 2515256, -2989569, -10874210, -16044583, -14568994, -7958387, -1619825, 222824, -2119764, -5001268, -5517989, -3951078, -2161620, -764568]
12937g64568J647440J667935J43389k222461l166416j240226K628765N339311
12929D033169L988082m73366k979457l66169L342305J645427m649858p591692
12921c051559l489961J524177R16853k336633r19285M844886O930831J318787
12913E738096o093968p105938r09622O030833P515062L036400l026542n832825
12905f48504l882308M05836L175861K219039j545808m715317m057663Q8555L466696
12896e493613K681881k22285n45670K014178K798434m10576l499869j975432K539788
12887b113164M951198L449352M14409j573549j539336M31978K508035J507777
12879H036700k792790n408879j996824M267622N964755J193528m353166n523173
$$ y = [-764568, 882872, 2550807, 2694196, 471735, -2694681, -3934907, -1306142, 4033169, 8021251, 7547885, 4568428, 4202259, 7544564, 9189991, 4540133, -3051559, -6541520, -5017343, -4100490, -6437123, -7356408, -2511522, 4419309, 5738096, -355872, -7461810, -8371432, -2340599, 5174463, 8210863, 5184321, -648504, -4530812, -4124976, -949115, 1269924, -275884, -4991201, -9048864, -8960309, -5493613, -2811732, -3034017, -3579687, -1565509, 1232925, 822349, -2677520, -4652952, -2113164, 2838034, 6287386, 6701795, 5128246, 3588910, 4020888, 6528923, 8036700, 5243910, -164969, -2161793, 2105829, 8070584, 9264112, 4910946, -612227]
12871f12227l548077k230737k104716j027293J693492M341191M952725K846112
12863D310470j079351m371351m406625j109930K350485K780028N39837j037560
12855b023997K93657K979486L328575k19447m811103n819959k071182K490222
12847e853748L412242J239568M61561K902590M723667J789526l856328o074127
12839a255049k968493N22209J4441j833520N4609M326442M443187j140009n835973
12830c672156m268588L94735K209748J144082J029439K286169K577393K380886
12822D081708L566699L937593L9993n274002n535887j242798K29193l089381m053272
12813g340154J447339O840203N097583j72476j004166K361287K892800j787095
$$ y = [-612227, -4160304, -6391041, -8495757, -9523050, -7829558, -3488367, 1464358, 4310470, 3231119, -1140232, -5546857, -6656787, -4306302, -1526274, -986437, -2023997, -1730340, 1249146, 4577721, 4358274, -452829, -6272788, -8343970, -5853748, -2441506, -1201938, -740377, 2162213, 6885880, 8675406, 4819078, -1255049, -4223542, -3701333, -3686892, -5520412, -5465803, -1139361, 3303826, 2163817, -3672156, -7940744, -7546009, -5336261, -4192179, -3162740, -876571, 1700822, 4081708, 7648407, 11586000, 11625993, 6351991, 816104, -426694, -197501, -3286882, -7340154, -5892815, 947388, 6044971, 5872495, 4868329, 7229616, 10122416, 8335321]
12805H335321o419460n863047o65947M633135N294651K3653o243738o030181R62992
12796e972621N827506K451749l322638k834036J861070K289580j681864j881605
12788c262859L574172O468776K077663k979570j570032K889312K788867j528059
12780H458270l338500o97635J099802j614991n228156m274812P89011M277281
12772e29730K812648o68296j504826K71326R76353j20460M73923L823901N176300
12763A0711139P61760n473094o664128k457963J338299J303026n55353j884969
12755b921283k887822l491040k292456L92682K199908K506575L095472M186427
12747G88463L472339L61753k265293k156112o38580J18201K20669O98282J068912
$$ y = [8335321, 1915861, -3947186, -4613133, 20002, 5314653, 5338306, -905432, -6935613, -5972621, -145115, 2306634, -1016004, -3850040, -1988970, 300610, -1381254, -3262859, 311313, 6780089, 8857752, 5878182, 4308150, 7197462, 9986329, 8458270, 5119770, 4422135, 5521937, 3906946, -1321210, -5596022, -4807011, -529730, 2282918, 1614622, 109796, 381122, 1357475, 1237015, 1710938, 5534839, 10711139, 11472899, 5999805, -664323, -3122286, -1783987, -480961, -1036314, -2921283, -5809105, -9300145, -11592601, -11199919, -9000011, -6493436, -3397964, 788463, 4260802, 4622555, 2357262, 201150, -437430, -319229, -98560, 599722, 1668634]
12738A668634R5548k013383l358479k177918R49363K683435J65193m713055o625824
12729a3326486l625482N09798K593294M350378O983349O425068j18375o885159
12721c093615o129393N26845M836379M068552K319429J202334j547095m366540
12713b183104k511445K365029K875444j789541l919012m80027J952699m06199
12705d096156j792585J530448L321886j009219m305226Q07629Q014312O335159
12697H806248k396488o893577l807337K3039R41678K285486M570574L115546k214265
12688D430904m604655j037369K779471K040564P9506J435395L932704L090815
12680A2147335o4264j178385J43733L32173k010393m121412l314414m56243J440352
$$ y = [1668634, 1764182, -249201, -3607680, -5785598, -4836235, -2152800, -1987607, -6700662, -13326486, -16951968, -16442170, -13848876, -9498498, -2515149, 3909919, 3791544, -3093615, -9223008, -8696163, -3859784, 208768, 2528197, 3730531, 2183436, -2183104, -4694549, -2329520, 545924, -1243617, -5162629, -5642656, -3689957, -4096156, -5888741, -4358293, -1036407, -2045626, -6350852, -5543223, 2471089, 8806248, 6409760, -483817, -4291154, -4268115, -3326437, -1040951, 3529623, 6645169, 4430904, -173751, -1211120, 1568351, 3608915, 3688421, 5123816, 9056520, 12147335, 12083071, 10904686, 11048419, 11380592, 9370199, 5248787, 1934373, 1478130, 2918482]
12671B918482Q20320q39229j042058L67955R51650o11360k338389k147786j237225
12662c157640j516948j581448Q28468L561031K141191k754507m936603j266652
12654h683108L827133M579450R70147k837932l978491k256826J140706L644944
12646c593977K512710j282142k808027L46479M008166L362810L00165r398J968427
12637D805213Q63584l770104n020961J128113Q486462Q220383M49401o700138
12629H461953p861900n146405k478006l70782K042562L593429K410524r80166
12621c28791l807719l699370o15774K953020L829939J558655n22073N00730K754687
12612B623304K380609j63171p74739J295227K030900o01205l473989l815979k968346
$$ y = [2918482, 3738802, 2899573, 1857515, 2225470, 3177120, 2565760, 227371, -1920415, -3157640, -4674588, -6256036, -5427568, -1866537, 274654, -2479853, -7416456, -8683108, -4855975, -276525, 693622, -2144310, -6122801, -8379627, -7238921, -3593977, -1081267, -2363409, -5171436, -4824957, -816791, 2546019, 2846184, 2836786, 4805213, 5668797, 1898693, -3122268, -1994155, 6492307, 14712690, 15162091, 8461953, 600053, -4546352, -7024358, -7395140, -5352578, -1759149, 651375, -328791, -4136510, -7835880, -8451654, -5498634, -1668695, -110040, -632113, -131383, 2623304, 5003913, 4840742, 4066003, 5361230, 7392130, 6790925, 3316936, -499043, -3467389]
12603c467389k239912k17332K795246L180041N36341j17146K822318L110287k909457
12594C492997q342517o176066j035039n68244j276391M363814J1079307O585364
12586H123225o590391j1468016j999982P494912M647957l392617l984103J262799
12578e906216K398488j439793k795572M14211L032773K553349J759379K018216
12570B034835J155222j621420l729705k696357R60232L858701K205278l361935
12562a195149n853734P7196Q557851Q419461n25040o634449m343396j654910m563129
12553g715299o078539M42963P861094O450093o667j473641J846564K761666J052941
12544E141175J262280J320387l176190p168309k690068N461703N283567k490509
$$ y = [-3467389, -5707301, -5924633, -3129387, 50654, 586995, 469849, 3292167, 6402454, 3492997, -4849520, -11025586, -12060625, -12628869, -13905260, -9541446, 1537861, 8123225, 1532834, -9935182, -11935164, -4440252, 207705, -3184912, -7169015, -5906216, -3507728, -4947521, -7743093, -7328882, -4296109, -1742760, 16619, 2034835, 3190057, 1568637, -2161068, -4857425, -3897193, -38492, 2166786, -1195149, -7048883, -6971687, 1586164, 10005625, 9480585, 2846136, -1497260, -3152170, -7715299, -13793838, -13350875, -5489781, 960312, 953645, -519996, 1326568, 4088234, 5141175, 6403455, 7723842, 4547652, -2620657, -5310725, 150978, 5434545, 2944036]
12536B944036n124870J065319N722803K826390r24095l46039k55029l694023m495547
12527b281055R12273N233569K053162l250108k689164J773034L142317Q18623
12519E712651r04519j218206k354469l895691l556664j422452Q75413K834938
12511c928999L946219K898151K88783j260734j291813j701531j856304R59557
12503a946671M963421M334478j501776n787682m458788j458888q29274n88223
12495g273403J464476K758971J499003Q24330K527600K707816j173819m740564
12487a405590l599305m08119L06089p08585o82649k05441k34027J251771M582504
12478a103352N575761K359423n21249J16976M35066k574049m381432j153675J952242
$$ y = [2944036, -2180834, -1115515, 4607288, 7433678, 6509583, 6163544, 5908515, 2214492, -2281055, -1368782, 3864787, 5917949, 2667841, -21323, 1751711, 4894028, 5712651, 4808132, 3589926, 1235457, -2660234, -6216898, -7639350, -6763937, -3928999, 17220, 2915371, 3204154, 1943420, 651607, -1049924, -2906228, -1946671, 3016750, 7351228, 5849452, 61770, -4397018, -5855906, -6685180, -7273403, -5808927, -3049956, -1550953, -726623, 1800977, 4508793, 3334974, -1405590, -5004895, -5413014, -5106925, -5815510, -6498159, -6703600, -6937627, -5685856, -1103352, 4472409, 6831832, 6310583, 6427559, 6862625, 4288576, -92856, -1246531, 705711]
12469G05711q07090m833398k141542N193934Q345648N296960J485903o91903l394595
12460I159628n809572m513807r64985j60690j949171j515813J652614K964855
12452a136941R32180j073837j323108j181592m67024J794368K889389J43790k140471
12443a563246J806638P608889M940300n705421j1400614n234537L988986N669538
12435A10533J682600j49344Q98982L75409j497933o22934K637629L521069P84220
12426G740231j491492n40877J216419R5154l981298p539594o966589j704540M832811
12417h339775P891373N987222K398184J160087K340042K514790m57656m532980
12409H961287n871871l437236o5817J349194J273860J587163J705318j72837k540636
$$ y = [705711, -101379, -4934777, -7076319, -1882385, 6463263, 11760223, 13246126, 12554223, 9159628, 3350056, -1163751, -2128736, -2289426, -4238597, -5754410, -4101796, -1136941, -204761, -1278598, -2601706, -3783298, -4250322, -2455954, 433435, 577225, -1563246, 243392, 7852281, 12792581, 7087160, -4313454, -9547991, -5559005, 110533, 1793133, 1643789, 2542771, 2918180, 1420247, 797313, 3434942, 6956011, 7740231, 6248739, 5707862, 6924281, 7019435, 3038137, -4501457, -11468046, -13172586, -8339775, -448402, 5538820, 7937004, 9097091, 11437133, 13951923, 13494267, 8961287, 3089416, -347820, -413637, 935557, 2209417, 3796580, 5501898, 5329061, 2788425]
12400B788425j705080J727283K392679j558698m711281k464661J797648K280611
12392E46926n48795k248481j848372j088319O33579L874702M337940j898038r739253
12383g978111r750960j522975N406206M995273J547837J036932K630820K389979
12375a244999M0560j849846k037659r74215O46969J963708K396040K432242K203689
12366C576489M62152k434452k898061N48147L208563R39156k117672L57208N594559
12357G236089N352823n36166m030003k363607j286752l253575l072554J312446
12349f41299L913137J279447j231414R23926M005868L592741J599744K59064k623609
12340A1077605o531724n172699K352148O094334m37502q608422p136513Q42854
$$ y = [2788425, 1083345, 2810628, 5203307, 3644609, -1066672, -3531333, -1733685, 546926, -1869, -2250350, -4098722, -5187041, -4553462, -678760, 3659180, 1761142, -7978111, -17729071, -19252046, -13845840, -8850567, -7302730, -6265798, -3634978, -1244999, -1204439, -3054285, -5091944, -6066159, -5419190, -3455482, -1059442, 1372800, 3576489, 4038641, 1604189, -1293872, -745725, 2462838, 3401994, 1284322, 1641530, 7236089, 12588912, 12052746, 8022743, 5659136, 4372384, 1118809, -1953745, -641299, 3271838, 4551285, 3319871, 4243797, 8249665, 11842406, 13442150, 13701214, 11077605, 4545881, -626818, 1725330, 7819664, 7382162, -1226260, -8362773, -7519919]
12332g519919M127457J104613p65767Q27268J403333K66950J319130L910724L202581
12323G876370l95638j620837j56616p89589l622049l472625J86083J890205J52702
12314D8006j56464K682073L983308J433750j014094r06775j204063l230739l222011
12305a587009L11663K707081P75854j954833j756535m66506m48468L33417L274200
12296A188864M461695N96463m558127n110364j302187K060018K757586K189506
12288B283454J462156N90947k4707m36830j578858k634319r61450K915428M088228
12279E704049L87822l288101k073134J217958Q61760k369978k841800L83955K008577
12270h892j124472n424114n753368j552760L607566O093257M927621K162942P98873
$$ y = [-7519919, -3392462, -2287849, -3053616, -2226348, -823015, -556065, 763065, 4673789, 7876370, 7480732, 5859895, 5703279, 4913690, 1291641, -2180984, -1994901, -104696, 48006, -108458, 2573615, 6556923, 7990673, 6976579, 6069804, 4865741, 1635002, -1587009, -1275346, 1431735, 2207589, 252756, -1503779, -1970285, -2418753, -2085336, 1188864, 5650559, 6247022, 1688895, -3421469, -4723656, -2663638, 93948, 2283454, 3745610, 4336557, 4311850, 3875020, 2296162, -338157, -1299607, 1615821, 5704049, 6091871, 2803770, 730636, 1948594, 2810354, 440376, -2401424, -2017469, -8892, -1133364, -6557478, -12310846, -13863606, -10256040, -4162783, 764838, 2927780, 3726653]
12261C726653J283549R96722j580340m110117l840830j585791L95096K039342
12253b675716L633652L047090n56697k626830J149259O466844M811189l367529
12245I881262p634063k356806M845563M256652k460178o471651n088624l023511
12237h051356k434473k92156L540441L716206j621024n740443k465655M088013
12229i260447N209297M41207k310598Q31081M451304L129762m35833q94362J029030
12220B190441R66946r40794p36687J683319K095271m43711j810428l46759p9905
12211B577693l316361n659636k983254J345652J955641N35292K482315O564148
12203C501490N826282q51596n801006l663707J156950K085089l0963j60656J873154
$$ y = [3726653, 5010202, 6006924, 4426584, 316467, -3524363, -5110154, -4715058, -2675716, 957936, 4005026, 3448329, 821499, 1970758, 8437602, 13248791, 9881262, 2247199, -109607, 4735956, 8992608, 6532430, 60779, -5027845, -8051356, -10485829, -10777985, -7237544, -3521338, -5142362, -10882805, -13348460, -9260447, -4051150, -3609943, -5920541, -5089460, -638156, 2491606, 2055773, 1161411, 2190441, 3157387, 2216593, 1479906, 3163225, 5258496, 4814785, 3004357, 2657598, 2577693, -738668, -6398304, -9381558, -8035906, -6080265, -5544973, -3062658, 3501490, 9327772, 8476176, 2675170, -988537, 168413, 2253502, 2222539, 2061883, 3935037]
12194C935037J741743j531904l854616k566823j01085J91536j349872j901564
12186e437548q2833K567678L202858O49435k488525j827519L025085O307937K746951
12177H663519m748105q046177m306118R89642K364670Q32693j46373m56192j397515
12168f249956j766373l49387M58118j591141l327789j44247N837183P518099L071021
12159C455528j397652j088059R73373k71098l819554m471472o14585L698168M060589
12150E25238O97686k117490q91484K764540L382914j386912o497425n465784L41967
12141h646750L267883O13415j546771J705585O100253M673346j810343o317808
12133a961190n100494q55104K247083K410073J60068j922680o16953L654792N851760
$$ y = [3935037, 5676780, 4144876, 290260, -2276563, -2377648, -2186112, -3535984, -5437548, -5520381, -2952703, 250155, 899590, -1588935, -3416454, -391369, 5916568, 8663519, 3915414, -4130763, -8436881, -7447239, -5082569, -4249876, -4396249, -4852441, -6249956, -8016329, -8365716, -7907598, -9498739, -12826528, -12970775, -7133592, 384507, 3455528, 2057876, 969817, 1943190, 1672092, -2147462, -6618934, -7233519, -3535351, 525238, 1222924, -894566, -1786050, 978490, 4361404, 2974492, -3522933, -8988717, -8646750, -5378867, -4765452, -6312223, -4606638, 1493615, 6166961, 4356618, -1961190, -7061684, -7916788, -5669705, -3259632, -3099564, -5022244, -5639197, -1984405, 3867355]
12124C867355K950389j087049j214180P71678j65353l165365k889285R10915K687129
12115B666234N14776j077237M60219J320979j448443m285920k792683J305285
12107c336790L091777J369882r77954j431910J09573K024535J984215q90308m008661
12098b065641l828334p11893J827302K607697L277874L451546R93349k120017
12090C431883r36042L489434L555151k991490q122838n456336K23581J773410
12082e033247R08611K389198L350240j191028o580919m053507L869911N657271
12074f83470j052331n573260j320331M632862M364642J213720J576682K875719
12066F034233q36386o513389n581457K005165O500543K194630m860012n656667
$$ y = [3867355, 6817744, 5730695, 4516515, 5288193, 5122840, 1957475, -931810, -20895, 2666234, 3181010, 2103773, 2563992, 3884971, 2436528, -1849392, -4642075, -3336790, -245013, 1124869, 146915, -1284995, -1175422, 849113, 2833328, 1943020, -2065641, -5893975, -6605868, -4778566, -2170869, 1107005, 4558551, 5551900, 3431883, 2495841, 5985275, 9540426, 6548936, -1573902, -7030238, -6806657, -5033247, -4124636, -1735438, 1614802, 423774, -6157145, -10210652, -6340741, -683470, -1735801, -7309061, -8629392, -3996530, 368112, 1581832, 3158514, 6034233, 5197847, -1315542, -6896999, -4891834, 1608709, 3803339, -1056673, -6713340]
12058f713340K92824N647822M650934j103090n387606m073228Q76327L848650
12050a960707K068758j284290j461310J551018L304374J164969k261959k969916
12042a849063q93680M41386r90661k836695j356756L554913P667431P077638K552973
12033A3367486j766568l261245k813334k123311j289123j3054P89562M39213J80885
12024C510511J169053J727894m56932l611246l003006J836507M695461P28872
12016F597114n714401o063180M44647N091736J505001n758620p791238k900883
12008a4589824K823283M478339L091624J830297J808089K467133L035651K754182
12000G698774J715721J333153J805271L29671m671316q791897o217561R81185
$$ y = [-6713340, -6420516, -772694, 3878240, 2775150, -2612456, -6685684, -5809357, -1960707, 108051, -1176239, -2637549, -1086531, 2217843, 3382812, 1120853, -1849063, -2742743, -2301357, -3292018, -6128713, -7485469, -3930556, 3736875, 10814513, 13367486, 11600918, 8339673, 5526339, 3403028, 2113905, 2100851, 2890413, 3329626, 3510511, 4679564, 6407458, 5950526, 2339280, -663726, 1172781, 5868242, 6597114, 882713, -5180467, -4735820, 355916, 1860917, -3897703, -11688941, -14589824, -11766541, -7288202, -4196578, -2366281, -558192, 1908941, 4944592, 7698774, 9414495, 10747648, 12552919, 12882590, 8211274, -580623, -6798184, -5816999]
11992e816999M109092K2060m015541r78397N802752P956404L537456k214220n059690
11983C342917n233685l844364q84461K746502M765743L860669P93692k546971
11975C000042m003520k419831M67596J135787j227300l444036k981564j035755
11967a0508581P04619K789143N073644M980015J853127q80727j357269k537398
11959A16573n615990n538091P59224O624935M207767k906181m533023P30688M406819
11950a747279J879523k151585k931465j677927m52250J263053K738521J768515
11942a310894M7985J780060N434747M551046j386222n101187l097705m46686o61085
11933a89941N5892L685047M708412J2606l924081j458525K013090r55818o839241
$$ y = [-5816999, -1707907, -1685847, -5701388, -6679785, -877033, 7079371, 10616827, 8402607, 3342917, -1890768, -5735132, -6619593, -3873091, 892652, 4753321, 5547013, 3000042, -1003478, -3423309, -2955713, -1819926, -3047226, -6491262, -9472826, -10508581, -9803962, -7014819, -1941175, 3038840, 4891967, 4011240, 2653971, 116573, -5499417, -11037508, -10278284, -3653349, 554418, -2351763, -6884786, -6154098, -1747279, 132244, -2019341, -4950806, -6628733, -7080983, -5817930, -3079409, -1310894, -1262909, 517151, 5951898, 10502944, 9116722, 4015535, 917830, 471144, -189941, -134049, 3550998, 8259410, 8272016, 4347935, 2889410, 4902500, 3946682, -2892559]
11924b892559o740817n99115L833526L208378O61060j970319m965046n372651
11916a4837543Q1697P299533Q563696L960325Q67957J913123K046649j262066
11908H633371l655956k245578l23258k98780P38837M109017M827285p23662p480740
11899C580536p971152k571112J941298J777117r46573l119827l623117j895886
11891a2828716K211208O586848P829861M866803j5985l697122m380016k020760
11883a447879J325376K108627j285530n579194n569239q46244K892409J019708
11875g381966l462389l451063K689017Q407115P053914R26n733392o189916l545899
11866a1613653j098379J002137L750319N996614N539590K239115j729413m036793
$$ y = [-2892559, -9633376, -10232491, -6398965, -3190587, -2529527, -4499846, -9464892, -14837543, -14755846, -7456313, 1107383, 5067708, 5935665, 7848788, 9895437, 8633371, 4977415, 2731837, 2408579, 2109799, 2848636, 6957653, 11784938, 11061276, 3580536, -4390616, -6961728, -5020430, -3243313, -4189886, -7309713, -10932830, -12828716, -10617508, -4030660, 3799201, 8666004, 8650019, 4952897, 572881, -1447879, -122503, 1986124, 700594, -4878600, -10447839, -11294083, -8401674, -7381966, -10844355, -14295418, -11606401, -3199286, 3854628, 3855554, -1877838, -8067754, -11613653, -12712032, -11709895, -7959576, -1962962, 3576628, 5815743, 4086330, 49537]
11858D9537l618299r86460J790034K428639Q85182l38325P16728K865247L185264
11849F977547M32451l612397n750783m120469K1498L306413L634979J922649k49978
11840B561910k958018n907209o235203k041532L174001M109735J241557m8470
11832f103229K126117M156390L935385L533188L198358l45972o299132p468913
11824c267808p47107O108001M570539k491753n730376k719842J070337K283013
11816i24996K754553L275089J657081k067136m374820l439974j163715N92634
11808c691284J787420K058665Q24688l93741L88591J814863R62297j380056j521602
11799H49841J021284K658474J501969j88796l14291K1410r19006k733461l789756
$$ y = [49537, -3568762, -4555222, -2765188, -336549, 548633, 210308, 927036, 3792283, 6977547, 7409998, 3797601, -1953182, -6073651, -6052153, -2745740, 889239, 2811888, 2561910, -396108, -6303317, -12538520, -14580052, -11406051, -7296316, -6054759, -6103229, -3977112, 179278, 4114663, 7647851, 10846209, 10500237, 4201105, -3267808, -4014915, 2093086, 6663625, 4171872, -1558504, -4278346, -3208009, -924996, 1829557, 5104646, 6761727, 4694591, 319771, -3120203, -4283918, -3691284, -1903864, 154801, 979489, 585748, 974339, 2789202, 3751499, 2371443, 849841, 1871125, 4529599, 6031568, 5842772, 5528481, 5549891, 4630885, 1897424, -1892332]
11790a892332k944838j01427L192412M180520J798615j739291l850524m282714
11782e639579l279607k68566K939975J824890l633445n773371N97163Q658992
11774d573548P908444n04250n554202k557647J715245J181538j359777j184459
11766d928656Q52631J777021J561741R00859j229876m276770m535564j86846N300001
11757d765459P260028M630450n31091n084923n731907j754746K574123K332396
11749a071129j154853k272055L03056K533475K532975K656631L309978J609623
11741H447701k047700k900329L16857K805884J446443j127768k482818l831313
11733F26957n029809l059660J504249L365620Q87726j404911j424160k495453
$$ y = [-1892332, -4837170, -4938597, -1746185, 2434335, 4232950, 2493659, -1356865, -5639579, -8919186, -9187752, -6247777, -4422887, -8056332, -13829703, -13232540, -4573548, 3334896, 2830646, -2723556, -5281203, -3565958, -2384420, -3744197, -4928656, -4076025, -2299004, -737263, 163596, -1066280, -5343050, -9878614, -10065460, -4765459, 2494569, 7125019, 6593928, 1509005, -4222902, -5977648, -3403525, -1071129, -2225982, -4498037, -4194981, -1661506, 871469, 3528100, 6838078, 8447701, 6400001, 3499672, 3816529, 6622413, 8068856, 6941088, 4458270, 626957, -4402852, -7462512, -5958263, -2592643, -1704917, -3109828, -4533988, -7029441]
11725g029441m565268j974745N170702P566961J351077l989018q83080L242919
11717a109893p79247o641752k625220P353136Q530009j166717p883371l322398
11709g645453M460912N444696J137389j637227j428341p57665l27166K16153o275
11700e42977j010894j002151L61345J229931J202332J740883K313150O91190k210454
11691B772355k763418q10849k29833k112244k835613o84492J127018M90434J26530
11682d920112K073141L311272R24408k255111j678732J792438L199561O25503
11674C072368k787725l604552j875190J73285J136954J269017J214846R40565
11666d60432M06902P20145K899639N093321L502350k158269o620546n346636o81797
$$ y = [-7029441, -11594709, -13569454, -8398752, -831791, 519286, -3469732, -4352812, -1109893, -1889140, -8530892, -11156112, -3802976, 4727033, 3560316, -4323055, -7645453, -3184541, 2260155, 3397544, 1760317, 331976, -425689, -752855, -536702, -542977, -1553871, -2556022, -2194677, -964746, 237586, 1978469, 4291619, 4982809, 2772355, 8937, -801912, -1031745, -3143989, -5979602, -6664094, -5537076, -5046642, -4920112, -2846971, 464301, 1388709, -866402, -2545134, -752696, 2446865, 3072368, 284643, -3319909, -5195099, -5021814, -3884860, -2615843, -1400997, -460432, -53530, 666615, 3566254, 8659575, 12161925, 10003656, 3383110, -1963526, -2645323]
11657b645323J933026J929049K893766M918837L723743j473461m958430k394773
11649C926434K596731L554747J6591k935523k520918j300226k000770l108974
11641a771908j879672N30684M13388k270532k928293N88484L714198J852510j801338
11632c552479j090739K308609R71369m957133n954462J774227Q769989O388188
11624D657569k0430q19278K181177Q79168l270427j693789M831275N740897j846389
11615A0639773p870156n241624K82568J340884l0343P65293J667731p01569l136725
11606b284168j197896K484075K685031K94028o10210p91385l499176o702710n299568
11597a4921979J57063L936735L876523L237741L827008L488790J344347j00114
$$ y = [-2645323, -712297, 1216752, 4110518, 9029355, 12753098, 11279637, 6321207, 3926434, 6523165, 10077912, 10094503, 7158980, 4638062, 3337836, 1337066, -1771908, -3651580, -3120896, -2707508, -4978040, -7906333, -7317849, -3603651, -1751141, -3552479, -4643218, -2334609, -1363240, -6320373, -12274835, -10500608, -1730619, 4657569, 4637139, 3817861, 5999038, 6878206, 3607779, 1913990, 6745265, 12486162, 10639773, 2769617, -2472007, -2189439, -848555, -878898, -113605, 1554126, 852557, -2284168, -3482064, -997989, 1687042, 1981070, 1370860, 579475, -2919701, -9622411, -14921979, -14764916, -10828181, -6951658, -3713917, 113091, 3601881, 4946228, 4846114]
11589D846114L04115K56120j425101k271453n61974J093823o06358m453198n771299
11580h589211j988716M325469P724902M883888j872013o099379l619564K573754
11572b660870N319193J428492m880028p277233m309677J30798K021393J084763
11564i143169l61263q36360j018361j922692k670747j004203L596008Q021486
11556e339301Q105419L488244j319797k001999K78919P52486j919740l558535
11548a514304j019011K360762J501039k355882l405399n40733J091100r46810
11540d829238k116888J079671M524487K954785j461377k963478j227711r4094
11532d133843J30344J928254L715512J481563k987847l410491O03318K396290
$$ y = [4846114, 5150229, 5406349, 3981248, 1709795, 1147821, 2241644, 1635286, -2817912, -8589211, -10577927, -6252458, 1472444, 6356332, 4484319, -1615060, -5234624, -2660870, 2658323, 4086815, -793213, -8070446, -12380123, -12249325, -10227932, -9143169, -9504432, -10340792, -11359153, -13281845, -15952592, -16956795, -13360787, -5339301, 2766118, 6254362, 4934565, 2932566, 3211485, 3963971, 2044231, -1514304, -2533315, -172553, 1328486, -1027396, -4432795, -4973528, -3882428, -4829238, -6946126, -5866455, -1341968, 1612817, 151440, -2812038, -4039749, -4133843, -4003499, -2075245, 1640267, 3121830, 133983, -3276508, -2673190, -276900]
11524b76900m89186j966921J950143N574530K188755n215441q044240l645144
11516i924404K695434N279077L240169k94280j330898J188250L284902N14311
11508D652561m625565m882664N06595L499148k14403l898161j154489K720794
11500c396184k02555n747718l392194N783393R191613J710707o805291o515187
11492i373416m26740K928270J879397M59143M27608P23504J304109K248326J740390
11483A910591p67787k172742m33172J482760O34182l09436K156598M943580K314732
11474I759306m131161o544357k396633J802364M85961l269500l566480m01489
11466h261989K072289K717798L561562M297305K097261k634157n051537k384952
$$ y = [-276900, -766086, -2733007, -782864, 4791666, 6980421, 1764980, -6279260, -9924404, -7228970, -1949893, 1290276, 995996, -334902, 853348, 4138250, 4652561, 26996, -4855668, -4349073, -849925, -1064328, -4962489, -6116978, -3396184, -3598739, -9346457, -12738651, -6955258, 2236355, 3947062, -2858229, -9373416, -9800156, -6871886, -4992489, -4533346, -4105738, -3382234, -2078125, 170201, 1910591, 1142804, -1029938, -1463110, 19650, 653832, 344396, 2500994, 7444574, 9759306, 5628145, -916212, -3312845, -1510481, -1024520, -4294020, -7860500, -8261989, -6189700, -3471902, 89660, 4386965, 6484226, 3850069, -1201468, -3586420]
11458c586420J826408K756554J031035Q86036K888599K915223p73487l660963
11450D282985j230270L654052M023768j289485n787462m476055m55471M65153
11442h12785j837923k911355j011453J409134K550370K802270J533268k559245
11434h37719o928262o277230m50697L726005J839737j474964J64047M914746N985148
11425F60811K397542k68995O48169J302653j492053n072921n350019k469270L61099
11416i282984R96287l37035j628464l22996L477439N194400Q61666n944065p102086
11407a4087838r27733N101913M753799Q89765m31152J121101J646881p5218j964648
11398c973130k697682k225465J198L612465N620004L452716j455777n464424o418739
$$ y = [-3586420, -1760012, 996542, 2027577, 2913613, 5802212, 8717435, 7943948, 4282985, 3052715, 6706767, 10730535, 9441050, 3653588, -822467, -1277938, -812785, -2650708, -5562063, -6573516, -5164382, -2614012, 188258, 1721526, -837719, -7765981, -14043211, -14493908, -10767903, -8928166, -10403130, -10239083, -5324337, 660811, 3058353, 2789358, 3437527, 4740180, 3248127, -1824794, -7174813, -9644083, -9282984, -8286697, -8623732, -10252196, -10575192, -7097753, -1903353, -1041687, -6985752, -14087838, -15015571, -9913658, -5159859, -4270094, -4701246, -3580145, -1933264, -2008482, -3973130, -6670812, -8896277, -8895079, -5282614, 337390, 3790106, 2334329, -3130095, -9548834]
11389i548834l810987J837631P442328Q565477M986720J606439J069464K3367
11381A2171605l668655n508838j739554K997832K506723p14966l16259K175604
11373G903492O9892n633849o422240m8590N530628M368380J32584j650206j243321
11364C006770q07072K29489J618972K10709m018143n322498n60458M571004L200118
11355B128891k489862m544540n57215L916468L657012j49988k786858j890781
11347b716873P22206J914278J019051K68989J136861J770961J4420k523400k634925
11338a028432p97932l02780j416829r42769J883288L716165K674025J209493J456064
11329F450293J615032n45990l625624m504324k339606J044592L225584K868016
$$ y = [-9548834, -13359821, -11522190, -4079862, 4485615, 9472335, 11078774, 12148238, 12171605, 8502950, 2994112, 1254558, 4252390, 6759113, 6044147, 5727888, 7903492, 7973384, 2339535, -4082705, -4131295, 1399333, 5767713, 5900297, 4250091, 3006770, 2199698, 2429187, 4048159, 4258868, 240725, -5081773, -5642231, -1071227, 2128891, -360971, -4905511, -5462726, -1546258, 2110754, 1960766, -826092, -2716873, -1994667, -80389, 938662, 1207651, 2344512, 4115473, 4129893, 1606493, -1028432, -1826364, -2129144, -3545973, -4488742, -2605454, 1110711, 3784736, 4994229, 6450293, 8065325, 7519335, 3893711, -610613, -2950219, -1905627, 1319957, 4187973]
11321D187973Q34086m66454l19107r15116l068911l295198Q86268N372222M591733
11312G807496M0573k532924k513939l667581n482749l737247P55322K889268K757560
11303c684221M711438O640177J635236p697997r289633l76792O524861K924880
11295A387949k969971j610374K029989n76333n113926k708468L131946K559868
11287c869320k717494k494297L688970O030696J727530j245806Q67828J845995
11279C834102j880255m359165q84362L733465L331917l60319k175419j672885
11271d32921j623282k277285j777714Q9147J866506K598112K148130P76868p05989
11262F61572j650157k306952k578043j335942J195781K554403J938451K028499
$$ y = [4187973, 5022059, 4555605, 4236498, 3321382, 252471, -3042727, -2156459, 3215763, 7807496, 7848069, 5315145, 2801206, -866375, -6349124, -10086371, -9331049, -6441781, -3684221, 1027217, 7667394, 9302630, 1604633, -7685000, -8061792, -1536931, 1387949, -1582022, -3192396, -1162407, -1738740, -6852666, -9561134, -6429188, -3869320, -6586814, -9081111, -5392141, 638555, 2366085, 1120279, 1988107, 3834102, 1953847, -2405318, -3289680, 443785, 3775702, 3415383, 1239964, -432921, -2056203, -4333488, -6111202, -6022055, -4155549, -1557437, 590693, 1367561, 661572, -988585, -3295537, -5873580, -7209522, -6013741, -3459338, -1520887, 507612]
11254E07612L743724L092387k024477o008611l105769K624277K729385k440466
11246h81938m637603j020176K455950J641657n24476j149204j566381j790210
11238g472381J298355O655327P338097P27270n770002m570437J470010L892847
11230C569086M88966l339571l096296l4488K078281J429054r67380k889847k925236
11221e687431j304289J099693L490037M052172N24675n521110p566007j748101
11213a2660361O159755O860569k1770n497068l524413K273243N500637M695840
11205C786432J862574j445556l605120k639314P06918K852959K286716J221037
11197E026646J005377N9597j841585j767409J271805L546983J959922j351312
$$ y = [507612, 4251336, 7343723, 5319246, -689365, -3795134, -1170857, 1558528, -881938, -5519541, -6539717, -4083767, -2442110, -2966586, -4115790, -5682171, -7472381, -6174026, 481301, 7819398, 8546668, 2776666, -1793771, -323761, 3569086, 4058052, 718481, -2377815, -2412303, -334022, 1095032, 127652, -2762195, -5687431, -6991720, -5892027, -2401990, 1650182, 2174857, -3346253, -10912260, -12660361, -6500606, 359963, 338193, -5158875, -8683288, -6410045, -909408, 3786432, 5649006, 4203450, 598330, -2040984, -1334066, 1518893, 3805609, 5026646, 6032023, 6091620, 4250035, 2482626, 3754431, 7301414, 9261336, 7910024]
11189G910024k777359k397574k237400k173235q98563R94619J815865J329137
11181A565514M67606j66909j44152Q32148J805080J323544K0636Q0139J455191
11172G238797J396914j217609l812446l611890r20295J982005L081546J459378
11164E596400j744168l317189j608997N44352q0958j347352J021240N314748N191628
11155I569704k70868m472448l119612J28919N73751r14894j687722k302670l567309
11146f063149l118833O71400M867326N866982M053092J463493j629181m578592
11138A532538m558327p17431K926085K395136r85289l194452k677654l81477K243770
11129c417101K907184k32205m480443l968950K017043O515648M118118j746962
$$ y = [7910024, 5132665, 2735091, 497691, -1675544, -2574107, -1579488, 236377, 1565514, 2033120, 1866211, 1722059, 2554207, 4359287, 5682831, 5703467, 5783606, 7238797, 8635711, 7418102, 3605656, -6234, -926529, 1055476, 4137022, 5596400, 3852232, 535043, -1073954, -529602, -610560, -1957912, -936672, 4378076, 9569704, 9298836, 4826388, 1706776, 1835695, 2409446, 1494552, -193170, -2495840, -6063149, -9181982, -8510582, -3643256, 2223726, 6276818, 7740311, 6111130, 1532538, -3025789, -3743220, -817135, 1578001, 592712, -2601740, -5279394, -5660871, -3417101, -509917, -742122, -5222565, -9191515, -7174472, -658824, 3459294, 1712332]
11121A712332m594626l427691j136395J185585L237595K714902j038023l693837
11113e040158j458173K841738L985480J802063l07253j213668j636236j054293
11105b080500J35531j121497n116996o312110j466649L592765K287681j860096
11097a1941871r15929M368334O389820L448709R84485J037722K98760j184807
11089B485223P76143N203655N344163j72942m323906k889396m80082j798506m445933
11080c01581m415037k046585J083954M635291N804873P56451o656880o261456
11072g400970L139767Q942873K601062o492067n037046L510272N042479k444829
11064A861541o346545n3859P229379N521517j658463m499792j113153K446972
$$ y = [1712332, -2882294, -6309985, -7446380, -6260795, -3023200, -308298, -1346321, -5040158, -6498331, -3656593, 328887, 2130950, 1823697, 610029, -1026207, -2080500, -1944969, -3066466, -8183462, -14495572, -15962221, -12369456, -10081775, -11941871, -12857800, -8489466, -2099646, 1349063, 2333548, 3371270, 3670030, 2485223, 3261366, 8465021, 13809184, 13636242, 9312336, 6422940, 5942858, 4144352, -301581, -4716618, -6763203, -5679249, -1043958, 4760915, 5517366, -1139514, -7400970, -4261203, 4681670, 7282732, 790665, -4246381, -736109, 4306370, 1861541, -4485004, -4538863, 2690516, 8212033, 6553570, 2053778, 940625, 3387597]
11056C387597K075996o84291k639255j979405J168156L924504K330586l134173
11048D449715o138707k268835M118033N358550J123910j922260o96513M60541
11040D484434j659062l029985O02700N258675L781405k637178n187774m03866
11032A209349M507721K520925k797392l180693J708555M378369J310727k267898
11024G389663j210239J761038J002634k975861m275610l43898M400083M494480
11016A0242290O6423m159722m990113l823202l460390l635763j635051K777575
11008h617953N599352L596372o96257j925740Q33048L183999J999336p07902j717009
10999A547246r45783J41311J332867K288612J168446k242497m435497k667282
$$ y = [3387597, 5463593, 4779302, 2140047, 160642, 1328798, 5253302, 7583888, 4449715, -1688992, -3957827, 160206, 5518756, 6642666, 4720406, 4023893, 4484434, 2825372, -204613, 398087, 5656762, 9438167, 6800989, 1613215, 1209349, 5717070, 8237995, 5440603, 2259910, 3968465, 8346834, 9657561, 7389663, 6179424, 7940462, 8943096, 5967235, 1691625, 1347727, 5747810, 10242290, 10308713, 6148991, 1158878, -2664324, -6124714, -9760477, -11395528, -8617953, -3018601, 577771, -118486, -2044226, -1211178, 1972821, 3972157, 3264255, 1547246, 601463, 742774, 2075641, 4364253, 5532699, 3290202, -1145295, -3812577]
10991c812577N51011J233348J36871O54447K186676J198255j746698k193635L17285
10982a475017R45504j953812l355715Q4664M006645L210705l49003j729809j032863
10973a648701j289171j651991N21693K911893P48781m634468o697919l377248
10965a5117131O43836J988306K365085L073568K411821O30919R22678K766893
10957c14025R61411n063664p675209j866301O246538P784886L040900j408924
10949A705612l102128l897685l315569K03469L448393J988060j491612m73296
10941d934756M202372M933860j78699m242840l083250j241872k833486m430159
10933a1808830k171518R50203R58917K39121K330435M268300J640765k368181
$$ y = [-3812577, -3261566, -2028218, -1891347, -1236900, 949776, 2148031, 401333, -1792302, -1475017, -529513, -2483325, -5839040, -5754376, -1747731, 1462974, 1113971, -615838, -1648701, -2937872, -4589863, -4068170, -1156277, -407496, -5041964, -11739883, -15117131, -14473295, -12484989, -10119904, -7046336, -4634515, -4003596, -3080918, -314025, 647386, -4416278, -12091487, -13957788, -7711250, 73636, 3114536, 1705612, -1396516, -5294201, -8609770, -8406301, -4957908, -2969848, -4461460, -4934756, -732384, 4201476, 4022777, -220063, -3303313, -4545185, -7378671, -11808830, -13980348, -13030145, -12071228, -11832107, -9501672, -5233372, -3592607, -5960788]
10925e960788j267024L451783L950473j240155m726229k184908J229351O6958
10917f680539k689182j490574K175525K630212k05927p61256K690671M867551
10909E36481J788460k787325k824069J216321L392674R16468k541911k772465
10901c075366n51360P25225K51220k10484r2216n04025j186780j68208K701543
10892b110451M591950L560124J319603K58186k34488j877659l620208l089957
10884a202900j124883q29820j853063j53462M777260P158248L045742k753039
10876G064083l244649L496m49378n369384p042949j830222L546463K761688j80208
10867d741060J443899N019843K850873m426170p979780m038708J564099L244510
$$ y = [-5960788, -7227812, -3776029, 174444, -1065711, -5791940, -7976848, -6747497, -6680539, -9369721, -10860295, -8684770, -6054558, -6260485, -7021741, -4331070, 536481, 2324941, -462384, -3286453, -2070132, 1322542, 2239010, -302901, -3075366, -3626726, -2901501, -2650281, -2860765, -2952981, -3457006, -4643786, -4811994, -2110451, 2481499, 6041623, 7361226, 7619412, 7384924, 5507265, 1887057, -1202900, -2327783, -3157603, -5010666, -5164128, -386868, 6771380, 9817122, 7064083, 3819434, 3822930, 3373552, -1995832, -9038781, -10869003, -7322540, -4560852, -4741060, -3297161, 1722682, 4573555, 147385, -7832395, -11871103, -10307004, -7062494]
10859g062494K183168R64643p57351k233651l07574M088071M694146m36345m445050
10850c312437k055654J765235K05958l703070k039494M702933P970026L823558
10842G357055k496059n001995l371632j11167K842812L340773j51385n143250
10834b734848o344617j958319L895056N904049K708097k476323m410979k81931
10826e699815O036811O472853j023063p718748m850285L506582N601898r64751
10818A361482o065001k578617L582564L686414o41562j479946K271821L736031
10810C873186p00914n938780n828862j315972K185093K338913J055990j27485
10802d458831j450096j837930Q77734N083290N367769N06215l009386q3850M577087
$$ y = [-7062494, -4879326, -3914683, -4672034, -6905685, -7213259, -3125188, 1568958, 1132613, -3312437, -5368091, -3602856, -3396898, -7099968, -9139462, -4436529, 3533497, 7357055, 4860996, -140999, -3512631, -3623798, -780986, 2559787, 2408402, -2734848, -9079465, -11037784, -7142728, -1238679, 1469418, -1006905, -5417884, -5699815, 336996, 6809849, 5786786, -1931962, -6782247, -3275665, 2326233, 1361482, -4703519, -7282136, -3699572, -13158, -654720, -2134666, 137155, 3873186, 3172272, -2766508, -8595370, -9911342, -7726249, -5387336, -4331346, -4458831, -5908927, -7746857, -6869123, -1785833, 3581936, 4088151, 1078765, 994915, 5572002]
10793E572002L621739j100194k325979m22043k071534o556744n529201J541271
10785g270683M541609k15675l191579J280760M328186j309613o993689k712714
10777a1543398M864112L732279k567398j795707N264472P038114J611378j945676
10769D658176j018934j726764m234482k114233K935270J852192m668851n823563
10761a0141189J57347K826771j067157j776342M664929Q503954M031785o81578
10753F518520Q8400n13735o484171q539913p13950O563662L105575l613049j905731
10744e494392L985551K678710l890153m917227J43746K549013P29479J075760
10736c139513M218792M139698M55389n63176K391045L559606K34559m013969o310093
$$ y = [5572002, 9193741, 8093547, 5767568, 5345525, 3273991, -3282753, -8811954, -7270683, -2729074, -2944749, -6136328, -4855568, -527382, -1836995, -8830684, -11543398, -6679286, -2947007, -5514405, -7310112, -2045640, 4992474, 6603852, 4658176, 3639242, 1912478, -2322004, -4436237, -1500967, 351225, -4317626, -10141189, -9983842, -7157071, -8224228, -10000570, -5335641, 3168313, 7200098, 6518520, 6606920, 6093185, -390986, -8930899, -9644849, -3081187, 24388, -3588661, -5494392, -1508841, 1169869, -2720284, -7637511, -7493765, -4944752, -4215273, -3139513, 1079279, 5218977, 5674366, 5111190, 7502235, 11061841, 11296400, 7282431, 972338]
10727I72338o606241l712756K560616O492857K469737m875102n523517J210535
10719g011533N988651L867426J5707n90450J6220n75265J1501K929484L613710
10710H265451j242601o860012o147035L18737N243211M560547J794875J739975
10702G673148L555624K890171r64648l892946l315706j732608j740475j498958
10694I73602R46395K589130M17120j667801J627061O437946L823068n426238r816667
10685i6384l581923M979782N803352n1206m653968l910418P35458N906733P594115
10676A2725541L716800j856252l079407r01070j664623n226081m070647K934690
10668B578951O519175J741493l687322k480269P22759q99189l975918j847414
$$ y = [972338, -5633903, -9346659, -6786043, -293186, 2176551, -2698551, -8222068, -7011533, -1022882, 2844544, 2860251, 2269801, 2286021, 1710756, 1722257, 4651741, 8265451, 7022850, 162838, -5984197, -5665460, -422249, 4138298, 5933173, 7673148, 11228772, 14118943, 13154295, 9261349, 5945643, 4213035, 2472560, 973602, 1919997, 4509127, 4926247, 3258446, 4885507, 11323453, 15146521, 9720283, -96384, -3678307, 1301475, 7104827, 7053621, 2399653, -1510765, -775307, 5131426, 12725541, 16442341, 14586089, 11506682, 10605612, 8940989, 3714908, -355739, 2578951, 9098126, 10839619, 7152297, 4672028, 5394787, 4495598, 519680, -1327734]
10660a327734L057711L440613j053973m644678m284969j139191K841173M738315
10652A627267K074236j583547P13790P070604O358664m330315j2262957p184824
10644g517082L138020N433342J37857k971059j064900J216103J933609K013272
10636B319162P1308l675005l646842K264355O333218K402697l289481k370317
10628D09095J862517J652413j209062l41117K392679J159774j927007j149801
10620B849491J236807m63028l690677k195393J766367J405775k067364k141883
10612c299905J133437K633151J993574J891033O23874l542619n360165l75493
10604d303113N184314L062750l364439m914573j175646J556012J887524K182959
$$ y = [-1327734, 1729977, 5170590, 4116617, -528061, -4813030, -5952221, -3111048, 1627267, 3701503, 2117956, 2831746, 9902350, 16261014, 11930699, -332258, -7517082, -4379062, 1054280, 1192137, -1778922, -2843822, -1627719, 305890, 2319162, 2390470, -1284535, -4931377, -2667022, 3666196, 6068893, 2779412, 409095, 2271612, 3924025, 2714963, 2373846, 4766525, 5926299, 3999292, 2849491, 4086298, 3623270, -67407, -2262800, -496433, 909342, -1158022, -3299905, -2166468, 466683, 2460257, 4351290, 4975164, 1432545, -3927620, -4303113, 881201, 3943951, 579512, -4335061, -5510707, -3954695, -2067171, 115788]
10596A15788J103632k242857k650414K293610M705221j250070p543396m881102
10588a0349588J421337J417450k305948j794113O02106r32964j745782M009856
10580i677646Q590061K649309o011858m212504L618929L804894k067193j760677
10572e066685L987587L900766j593362j718395L564292M102242q03111k594185
10564C779149j066997l020708o029987k178457N081002N963205K110528J381447
10556F019182J079112m401950p124492J476893R778064K507809j0103745o811316
10548g580443Q036610J1667726J446071m430263j372632j932917o583900l075870
10540c825618N133087J927518r279651q749631L154514O069862k166026k299721
$$ y = [115788, 1219420, -1023437, -3673851, -1380241, 3324980, 2074910, -5468486, -10349588, -8928251, -7510801, -9816749, -11610862, -11008756, -11941720, -13687502, -9677646, -1087585, 1561724, -4450134, -8662638, -5043709, -1238815, -3306008, -5066685, -1079098, 2821668, 1228306, -490089, 3074203, 7176445, 6373334, 3779149, 2712152, -308556, -6338543, -8517000, -3435998, 2527207, 4637735, 6019182, 7098294, 2696344, -4428148, -2951255, 6826809, 9334618, -769127, -7580443, 456167, 12123893, 13569964, 9139701, 7767069, 5834152, -749748, -3825618, 1307469, 3234987, -6044664, -14794295, -11639781, -5569919, -7735945, -10035666]
10532a0035666Q074147R105195k800415p139721K309106O564592k132680p247032
10524c302474q22730L639718J24362m46071L043124j269636r252040l694841R805860
10515b174728P871916o617996p276086O007407O377427o805987n316108J0949088
10507C014933R951983r947028j2803213P120607J3516331j380440k775600J3034317
10499A9731890O956130j9640796j5323010J9738594J9392479k2864417k5394227
10492a7403357K8509515L7824878k7544376k5549180J29264600K59475263J42918592
10485E27495935j34837129k65859067j42805577K2748304L7654838l0089991l2702031
10478a8394718J7210234K1424710j5840860j9402046J1228340J6314611p097095
$$ y = [-10035666, -1961519, 7143676, 4343261, -2796460, -487354, 6077238, 3944558, -3302474, -4125204, -485486, -361124, -807195, 2235929, 966293, -8285747, -11980588, -2174728, 5697188, -920808, -8196894, -2189487, 4187940, -2618047, -7934155, 3014933, 12966916, 3019888, -9783325, -2662718, 10853613, 9473173, 6697573, 19731890, 26688020, 7047224, -8275786, 11462808, 30855287, 7990870, -17403357, 11106158, 48931036, 21386660, -4162520, 125102080, 384577343, 527495935, 392658806, 126799739, -16005838, 6742466, 44397304, 14307313, -18394718, -1184484, 20240226, 4399366, -15002680, -3774340, 12540271, 5443176]
10471E443176j1240270O825477Q186366q133969q218214P306923O800252r344438
10463b374697j0950179M234450R784327J113080j952333L233153J851941l961637
10455I78105n46373N602319o68099r714340k412308J1441336P930095p268548
10447E342187q439547M381621P691056k121615n387499K375446M241192m464600
10439C618241q570443k260673K563685M39030l32204K791251K419639j530945
10431h62419r70753L313947K671567k096493k395882J230974J243833j079975
10423A054799Q34655L865098J035317k882453O62407O333919L611227l078277
10415A1436692k136647L435307J994946m695301n699384j907644k312814m543525
$$ y = [5443176, -5797094, 1028383, 9214749, 1080780, -7137434, 169489, 6969741, -2374697, -13324876, -9090426, 693901, 1806981, -145352, 3087801, 4939742, 978105, 431732, 6034051, 5365952, -4348388, -6760696, 4680640, 12610735, 5342187, -3097360, 1284261, 8975317, 6853702, 1466203, 3841649, 8082841, 3618241, -4952202, -7212875, -4649190, -4210160, -4542364, -1751113, 668526, -862419, -1833172, 1480775, 4152342, 2055849, -340033, 890941, 2134774, 1054799, 1889454, 5754552, 6789869, 3907416, 4569823, 10903742, 14514969, 11436692, 9300045, 12735352, 14730298, 10034997, 4335613, 2427969, 115155, -4428370]
10407d428370j95895N542977J700633n763381k470029O893869M783729p032582
10399i69049q098300N698551J3864176M285957r127640j0561242l712763Q01821
10391g818489K260028L742760L134745k67468j199192K009877L091068j163138
10383C790191m968587l512072N3331J700126K239701K548621R44408j944903k795797
10374a944981j587086j222947j180617J102471L369746J271584k994676l263064
10366f449570L28092K046898L63957j189412j300081r92548R81722M719414M847245
10357C355717j377298o265812k318187M401609L422616k524622k753988K473535
10349a586430L421346j016507k349824R73058J630174j295245m21718M693348
$$ y = [-4428370, -4624265, 918712, 2619345, -3144036, -5614065, 1279804, 6063533, -969049, -9067349, -3368798, 10495378, 14781335, 5653695, -4907547, -8620310, -7818489, -5558461, -1815701, 1319044, 1051576, -147616, 1862261, 4953329, 3790191, -1178396, -4690468, -4637137, -2937011, -697310, 1851311, 2795719, 850816, -1944981, -3532067, -4755014, -5935631, -4833160, -1463414, -191830, -3186506, -6449570, -6121478, -4074580, -3710623, -4900035, -6200116, -7192664, -6210942, -1491528, 3355717, 1978419, -4287393, -6605580, -2203971, 1218645, -1305977, -4059965, -1586430, 1834916, 818409, -1531415, -558357, 1071817, -223428, -645146, 4048202]
10341D048202N331634m08106l632023m61342J699469j673750m446873j628495
10333a171284K336001K618908J364883R31188q88682m219123m608320j470146
10325e106575k28726k057330p63225N432670Q414385K624234n117540n339693
10317b141800O04580L860064R02898l308852l258033O63322L582861K200284j103755
10308B001569j425419J166242J309973k258913k948826K955073Q112139M466857
10300A3378695l686057o447366l617624k459085l584571j168243M301913N783019
10292B500681K318544L44061J610115J075466j947678j909608J670919K108696
10284G771196k410057n287452l349128j906075l884706l809443J993011P647563
$$ y = [4048202, 9379836, 8971730, 5339707, 4878365, 6577834, 4904084, 457211, -1171284, 1164717, 3783625, 5148508, 6079696, 5191014, 971891, -3636429, -5106575, -5335301, -7392631, -8155856, -2723186, 5691199, 8315433, 3197893, -2141800, -1537220, 2322844, 3225742, -83110, -3341143, -2677821, 905040, 3105324, 2001569, 576150, 1742392, 3052365, 793452, -2155374, 799699, 8911838, 13378695, 9692638, 3245272, -372352, -2831437, -6416008, -7584251, -3282338, 2500681, 4819225, 5163286, 6773401, 7848867, 5901189, 3991581, 5662500, 7771196, 5361139, 73687, -3275441, -5181516, -9066222, -12875665, -10882654, -3235091]
10276c235091O243383j82745m524927l821306n33241J790441J564214N12635J997447
10267a89190N065547L124354n914542j2356225o415530O002612J0135426L367243
10259B819695k699754j163858K200841K005680J265926K071349J98602n244574
10251A453907p290520k512156K265548J013018k130901j043456K422303L391289
10243b430968K353167K057520J581145m65957j670342j74263J106578o06014l016448
10234a265582k906048j095787L62779J703045K908042K114307m12266j280004
10226A28486K72042N28820k021476l473158j209055J427311R24100o56914K56282
10217c823562K833626L802887K318886j39413k191416k815848j660558k47751
$$ y = [-3235091, 3008292, 2825547, -1699380, -5520686, -6053927, -4263486, -2699272, -2186637, -189190, 4876357, 8000711, 2086169, -10270056, -16685586, -10682974, -547548, 2819695, 119941, -1043917, 1156924, 3162604, 4428530, 6499879, 6698481, 1453907, -5836613, -8348769, -6083221, -5070203, -7201104, -8244560, -5822257, -2430968, -77801, 1979719, 3560864, 3094907, 1424565, 1250302, 2356880, 1750866, -1265582, -4171630, -5267417, -4904638, -3201593, -293551, 1820756, 1408490, 128486, 400528, 929348, -1092128, -4565286, -5774341, -4347030, -3422930, -4079844, -3823562, -989936, 2812951, 5131837, 4992424, 2801008, -14840, -1675398, -1923149]
10209a923149l41173j043811n67488N0962r21098j550522P58305L469612K412004
10200C43642l62157M75634L698456K835274k796041o795440n884412l057201k06807
10191a1749052L448165N159958Q38062n392175m378187L402825P467821M109986
10183B907403J339306L126965K082187n391183r649011l222264N327773M442075
10175I63251k122319k396582M334480P727574L013101l873175o816072n776702
10167d946444k600218J597840M322910L170407P7540m47869K471812N082137L804587
10158A2532702j405297p290949r111474m493651K842331O115050L685431N01503
10150C375646Q9385K13999j339677k499624j730383j378183k242250o14863M466136
$$ y = [-1923149, -2264322, -3308133, -3875621, -3824659, -4745757, -6296279, -5537974, -2068362, 343642, -18515, 457119, 4155575, 6990849, 4194808, -2600632, -8485044, -11542245, -11749052, -8300887, -3140929, -2302867, -7695042, -12073229, -8670404, -1202583, 2907403, 4246709, 7373674, 9455861, 4064678, -5584333, -8806597, -3478824, 963251, -1159068, -3555650, 778830, 8506404, 11519505, 7646330, 830258, -4946444, -7546662, -5948822, -1625912, 1544495, 1622035, 1174166, 3645978, 8728115, 12532702, 11127405, 3836456, -5275018, -9768669, -6926338, -811288, 2874143, 3375646, 3465031, 3679030, 2339353, -160271, -1890654, -3268837, -5511087, -6125950, -1659814]
10141a659814O738911J516827n763091o479888r61489K910345J041209l027994
10133e684984m453936k152471J885275M490035L259582n77571k587395o62211
10125f483676K021394J865724K7141P378K429933M837061M816721J659832k877258
10116H304250m687634j454663K844837K038738k949298m598762j46137M109687
10108C461018K800692q61030j719638q17118j500112k479899p76889K030967K116239
10099B254230n44293k864220l015953p61744L437560O575609M328003k392321
10091G016871o372583l461407J451407K116347r6088j89349J620759J222785j872707
10082A436035m107691l509809j260522R84238J924095O86932j120450j15903L482030
$$ y = [-1659814, 5079097, 6595924, 832833, -5647055, -6608544, -3698199, -2656990, -5684984, -10138920, -12291391, -10406116, -5916081, -2656499, -3234070, -5821465, -6483676, -4462282, -2596558, -2569417, -2562039, -132106, 4704955, 9521676, 11181508, 8304250, 3616616, 2161953, 5006790, 7045528, 4096230, -502532, -648669, 3461018, 6261710, 5400680, 3681042, 2863924, 1363812, -1116087, -1892976, 137991, 2254230, 1709937, -1154283, -4170236, -4931980, -1494420, 5081189, 9409192, 7016871, 644288, -2817119, -1365712, 750635, 654547, 465198, 2085957, 3308742, 1436035, -2671656, -6181465, -7441987, -6457749, -4533654, -3846722, -4967172, -5083075, -1601045]
10073a601045M698046R85692l397134l551863k94632L146611N966835P127018
10065A3079528L218385n349555j0728319o802854J531696M786003J491608k292258
10057a065766l287496l313531k869697j89525L116015K489458j995500m192851
10049a1308893k94104N524419O481174J691909l155943k866723J179963K925144
10041A76946m26462m377523l314105J224024K862264J64211j693630K47918K463785
10032b672572J660446j92510m86555j47106j58382O19821J312961j110868m738160
10023e912925k808190M772074Q186931K234695m129524j257174N530028M454886
10015A1070801l781156p684865l249823J475630L95099k905325l535717k172319
$$ y = [-1601045, 3097001, 4082693, 685559, -2866304, -3160936, -14325, 5952510, 13079528, 16297913, 10948358, 220039, -6582815, -5051119, -265116, 1226492, -1065766, -4353262, -7666793, -10536490, -10726015, -7610000, -5120542, -7116042, -11308893, -11602997, -6078578, 402596, 2094505, -1061438, -3928161, -2748198, 176946, -249516, -4627039, -7941144, -6717120, -3854856, -3690645, -5384275, -5136357, -2672572, -1012126, -1204636, -1691191, -1838297, -1996679, -1376858, -63897, -1174765, -5912925, -8721115, -3949041, 4237890, 6472585, 2343061, 1085887, 6615915, 11070801, 7289645, -395220, -3645043, -2169413, -1774314, -4679639, -8215356, -10387675]
10007a0387675m98510K418421N586593M525529j583253o361456m278215J509077
9999i069489L766343J204058o47717J972675N715110N146571P46839j604229O35459
9990G865620K509387p65375n427272m201378J927944M275075n30845n677093m859137
9981d883074n87652J972462K575118K546523M09310l456230l804830J402016N445546
9972A619189K427260k724076j760362L732054N499349J899498j107911o48160
9964H936841K07053j95585m5463L18276j751084m957454m510972n894L289054
9955A284772K320786j17388r40546p47206o89389j4706J438899J938591N90993
9946E064806j310881k329312j911836L29648L708619N526712L948683R32043o37694
$$ y = [-10387675, -10886185, -8467764, -2881171, 1644358, 61105, -6300351, -10578566, -9069489, -5303146, -4099088, -4746805, -2774130, 2940980, 8087551, 8834390, 7230161, 7865620, 10375007, 9609632, 4182360, -19018, 1908926, 6184001, 5653156, -23937, -4883074, -5470726, -3498264, -923146, 1623377, 2032687, -1423543, -5228373, -3826357, 1619189, 4046449, 1322373, -437989, 3294065, 8793414, 10692912, 9585001, 8936841, 9143894, 8948309, 8902846, 9221122, 7470038, 2512584, -1998388, -2004282, 1284772, 3605558, 3488170, 2547624, 1800418, 1111029, 1096323, 2535222, 4473813, 5064806, 3753925, 1424613, -487223, -157575, 3551044, 9077756, 13026439, 13958482, 13320788]
9937A3320788j355671l378113n556446m724233j257751P09923j148430m588984
9929g978917n738153k856041K170857M801531K211042k107832j538216L917256
9921g118473N928146k87159p462780n707724L336449Q942587N935610l48180l310335
9912i1859k537437r24082K05107J023275J484830J246338p3535k392622m011142
9903f071127k655976J056848L649604L553714K539471J218525j979578n346886
9895d035405l711045K604396N367803L12962n212543l264587K314006K878963
9887b745450r67630j994964O68115J382082j017672j927568k07572K37466j610094
9878h183287k335284r61882k07882o12400k74233n62760n022717j1723238j3108764
$$ y = [13320788, 11965117, 8587004, 3030558, -1693675, -2951426, -2241503, -3389933, -7978917, -13717070, -16573111, -14402254, -9600723, -7389681, -9497513, -11035729, -7118473, -1190327, -1477486, -8940266, -14647990, -11311541, -2368954, 3566656, 3218476, -91859, -2629296, -3553378, -3348271, -2324996, -840166, 406172, 332637, -2059985, -6071127, -8727103, -7670255, -4020651, -466937, 2072534, 3291059, 1311481, -4035405, -7746450, -5142054, 225749, 538711, -4673832, -7938419, -5624413, -2745450, -3713080, -5708044, -5039929, -3657847, -4675519, -6603087, -6810659, -6573193, -8183287, -10518571, -11480453, -11688335, -12300735, -12574968, -13137728, -18160445, -29883683, -42992447]
9869d2992447n077987Q155950J8481808J9639499J0503456k619239r233570n401946
9861h544476J305589K605784Q85958K869763O727542N120601j734108o166921
9853C069732m967531j808869J036756L923214M008329j565919p261156m613114
9845h178558L695952O265922M66058m035635j543162J655532p5055k034244J326403
9836b456787N844455M107229k962822p582084n243218J058465N009439L236122
9828A010799j327951k558801Q53023L319850J100479j853670j711054j872490
9820c039815m713152l754506M954653J0952264L369475q851399q067320M108838
9812e040962R448730K943837j481716K136200J944226p276158j1797327k798798
$$ y = [-42992447, -48070434, -39914484, -21432676, -1793177, 8710279, 6091040, -3142530, -8544476, -7238887, -4633103, -3747145, -877382, 5850160, 10970761, 9236653, 3069732, -1897799, -3706668, -2669912, 1253302, 5261631, 3695712, -3565444, -8178558, -4482606, 1783316, 2249374, -1786261, -3329423, -1673891, -1748946, -3783190, -2456787, 3387668, 7494897, 4532075, -3050009, -8293227, -7234762, -2225323, 1010799, -317152, -2875953, -2022930, 1296920, 2397399, 543729, -1167325, -3039815, -7752967, -11507473, -6552820, 4399444, 7768919, -1082480, -9149800, -5040962, 4407768, 7351605, 5869889, 8006089, 9950315, 2674157, -9123170, -11921968]
9804a1921968O888985M127899l245656k196139L153543K135483j781334P88752
9796b050435N781944L092461l679881l168684L032351L469030k441786m231480
9788a96480K23090J804600k582637n213274k213510P04401J64143M23965L256451
9779c629251L720418M8406k192705q5040J348598j680479n000306l622599P20403
9770a0372555L548245L942962L115178J151509j410592k422905j319487m63071
9762d230716j367409k438145j970415p20137j80074l56179p5364J733571M700616
9753d904252O105255L312524j544275k724230Q75915L034931l93980m355639k573562
9744c167313J994346K157260j589388k808193o88885n26237l062387k837048J458008
$$ y = [-11921968, -5032983, -905084, -4150740, -6346879, -3193336, -1057853, -2839187, -2050435, 3731509, 6823970, 3144089, -24595, 3007756, 6476786, 4035000, -196480, 26610, 1831210, -751427, -5964701, -8178211, -7473810, -7309667, -6885702, -3629251, 91167, 139573, -2053132, -2138172, -789574, -2470053, -7470359, -11092958, -10372555, -6824310, -2881348, 233830, 1385339, -25253, -2448158, -3767645, -4230716, -5598125, -8036270, -10006685, -10726822, -10906896, -11263075, -11338439, -9604868, -4904252, 1201003, 4513527, 2969252, 245022, 1120937, 4155868, 3761888, -593751, -3167313, -1172967, 984293, -605095, -3413288, -4102173, -4628410, -7690797, -10527845, -9069837]
9735i069837L850259J100527j905090m40495K849911L066178K41265k393811l185967
9726e887060j916951J331265M442325M109959Q72749n36282J717634L360926R13316
9717H407881k492643k324691j69244r19960m376451n101573q61792L431598K313468
9708b093407k455400l814516J177529O768393N458815j949414o857954l969554
9700g735508K176265M264866J985076L54491J023666J126694o1081L79841K812243
9691F326553L103558o46303m181284l150721N62442K144043P08369q94990j205222
9682B766445j234575j393413r22090k21448o28469j579704q06314J876199L448855
9673A305486J660112j776615l503409k616710p55542P64761J829052K134680J254191
$$ y = [-9069837, -5219578, -4119051, -6024141, -6464636, -3614725, -548547, -307282, -2701093, -5887060, -7804011, -6472746, -2030421, 2079538, 2952287, 2416005, 4133639, 7494565, 8407881, 5915238, 3590547, 3421303, 2501343, -1875108, -6976681, -7838473, -4406875, -2093407, -4548807, -8363323, -7185794, -417401, 5041414, 3092000, -3765954, -7735508, -5559243, -1294377, 690699, 1045190, 2068856, 3195550, 3134469, 3514310, 6326553, 9430111, 8783808, 4602524, 1451803, 2014245, 4158288, 4866657, 3971667, 2766445, 1531870, 138457, -783633, -1005081, -1633550, -3213254, -4019568, -2143369, 1305486, 2965598, 1188983, -2314426, -4931136, -5686678, -4921917, -3092865, -958185, 296006]
9664B96006J64338M52507J473424N75610k799578n445291m413781r14330J607074
9655i004021J787577R32858N96149J277471K348657K088096m48271k732689r69570
9646d123743L602271M841906P65243k614004p76583J589830j099470m638607j708413
9637d161570M582289M759021j085452l339801O44008K543965j684987m919534
9629b662061k226520N30182j757810l926057p83917K658197N42422k630568l28118
9620a0584250L778619K822112k98503J347987N197609L883976m04596M75869M890983
9611A1109806L190170m856635q277975k821147K455032P75671k085716P20504
9603B09710N433249M948203K81549k747072k928912k933166l082500j893036j04642
$$ y = [296006, 460344, 912851, 2386275, 2961885, 162307, -5282984, -9696765, -10611095, -9004021, -7216444, -6283586, -5687437, -4409966, -2061309, 26787, -421484, -3154173, -4123743, -521472, 4320434, 5085677, 2471673, 1695090, 3284920, 2185450, -2453157, -4161570, 420719, 5179740, 4094288, 754487, 1398495, 3942460, 2257473, -2662061, -4888581, -4358399, -6116209, -10042266, -10826183, -8167986, -7625564, -10256132, -10584250, -6805631, -3983519, -4282022, -2934035, 2263574, 6147550, 5742954, 6218823, 11109806, 14299976, 9443341, 1165366, -1655781, 799251, 1574922, -510794, 209710, 5642959, 10591162, 10872711, 8125639, 5196727, 2263561, -818939, -2711975, -2816617]
9594b816617O38289Q74680J469257J201748o51289k059637j482188n94130j143092
9585d562979k049702k101771k188963k269555R1859M959104P628037M904293L54192
9576D764515r98192Q800m16732j680974l82334K437852K245784q29251j448089
9567C701379J700469K484676l152508r361224p593271J092466P048099M969889
9559H89975n9882j079257J469270K579689R41251o97462j446409k949359m394278
9550d746462k565612J750507K853052j512419n567438l273235K993056O181999
9542c886552M204443O92633j857762l862293m254096n41462N508646P656342L247697
9533F907596k494964l213939M69945K792691R21490k181523k530812J3986K345928
$$ y = [-2816617, -2178328, -1303648, 165609, 1367357, 716068, -1343569, -2825757, -3419887, -4562979, -6612681, -8714452, -10903415, -13172970, -13081111, -8122007, -493970, 4410323, 4764515, 3766323, 3775123, 3358391, 1677417, 1295083, 3732935, 5978719, 5149468, 3701379, 5401848, 7886524, 4734016, -4627208, -12220479, -11128013, -4079914, 889975, 830093, -249164, 1220106, 3799795, 4741046, 4043584, 2597175, -352184, -4746462, -7312074, -5561567, -2708515, -4220934, -9788372, -13061607, -10068551, -3886552, 317891, 1010524, -847238, -4709531, -8963627, -9505089, -3996443, 3659899, 6907596, 4412632, 1198693, 1668638, 4461329, 5382819, 3201296, 670484, 684470, 3030398]
9524C030398K025200l95204k452023k388365n72775J187015J336122p4533j225357
9515D70478k30414K269822L152474Q91981j568961o18679K140152J580617l020904
9506E066566o123350l822480N66198J904742O66871Q52295K847431L062248N1501
9497E072022l025330k643179Q61716L855520L025015j277963m708046l215944
9489b056189J729261M301327J624060k799859m416400l224985j817769r25424
9481g585978Q4759P06566L21047j15249K36633P01792J084352K263199L242461
9472I39582J410598k296800l140291q5114J827022N2626p43988K543592M638047
9463E145274O74985m271327k940780J859032K346500q08856p75443K219008J359319
$$ y = [3030398, 5055598, 4660394, 2208371, -179994, -752769, 434246, 1770368, 1695835, 470478, 240064, 2509886, 5662360, 6554341, 4985380, 4366701, 6506853, 8087470, 5066566, -1056784, -4879264, -4313066, -2408324, -1741453, -889158, 1958273, 5020521, 5072022, 2046692, -596487, 265229, 4120749, 7145764, 5867801, 1159755, -2056189, -326928, 3974399, 5598459, 2798600, -1617800, -4842785, -6660554, -7585978, -7501219, -6794653, -6473606, -6588855, -6352222, -5650430, -4566078, -2302879, 939582, 2350180, 53380, -3086911, -3172025, -1345003, -1292377, -2036365, 507227, 5145274, 5820259, 1548932, -1391848, 467184, 2813684, 2004828, 1229385, 3448393, 4807712]
9454D807712l630134n189060r87177K291400O34059j462217O3367K685231L336489
9445B549670K762255J018597l446927p553251n022931K621505N531637L59624
9437a179821l645236P59455P020201N371494k105662n878597l286949K97710J325141
9428a322264J054848O18960j81967m52679K59678j40613k480227l291235l53504
9419f289003K128885m94715n188479n212428P209M971043O185844M397772P23157
9410A229285l364295l878745J412874P653601Q049810L271929p03671k634840
9402A1035948n916687r014833n696532K934149O268255q14301q820989o527671
9394a6552661L095756Q143396N010501J019315J012094J039927k334589m914347
$$ y = [4807712, 1177578, -4011482, -4998659, -2707259, -2073200, -3535417, -3472050, -786819, 2549670, 5311925, 6330522, 2883595, -4669656, -9692587, -7071082, -1539445, -1179821, -4825057, -4065602, 2954599, 8326093, 6220431, 341834, -2945115, -2647405, -1322264, -267416, 351544, 169577, -283102, -23424, -164037, -2644264, -5935499, -6289003, -4160118, -4654833, -9843312, -15055740, -15048531, -10077488, -3891644, 506128, 1229285, -2135010, -6013755, -4600881, 3052720, 11102530, 14374459, 13670788, 11035948, 5119261, -3895572, -9592104, -6657955, -389700, -1204001, -10024990, -16552661, -13456905, -5313509, -303008, 716307, 1728401, 2768328, 433739, -4480608]
9386d480608k155112K368190K290621j212119j522129K215733L378677j307419
9378d24166n919468l895738K556350O239622M715921J311376j213872k618759
9370G51266k110964J028449L757352J595469m306281p159728l213710L677888
9362e980259P817316P893687N406198J105023l770358n998028l885986l21045
9354B266548Q65031n4994k06975R28972J354521M55535k07305K0370j94857j594928
9344C631918k785033k214589l63786J044446J273870J000676P56902J79253o33466
9335A890191l65537J197451J192205k806446p370175n793977K093011P566847
9327b396430M306466k453023l718148Q1313J301770j645526k345255J780106M887886
$$ y = [-4480608, -6635720, -4267530, -1976909, -3189028, -4711157, -2495424, 883253, -424166, -6343634, -10239372, -7683022, -1443400, 3272521, 4583897, 3370025, 751266, -1359698, -331249, 3426103, 5021572, 715291, -6444437, -9658147, -5980259, 1837057, 9730744, 15136942, 16241965, 12471607, 6473579, 2587593, 2266548, 3131579, 3076585, 2869610, 3798582, 5153103, 5608638, 5401333, 5421703, 5226846, 3631918, 846885, -1367704, -1731490, -687044, 586826, 1587502, 2344404, 2523657, 1890191, 1524654, 2722105, 3914310, 1107864, -6262311, -12056288, -9963277, -2396430, 1910036, -542987, -4261135, -4179822, -2878052, -4523578, -6868833, -5088727, -200841]
9318b00841K947008K60917J093148J986470j358310n202879l193416K718449M376260
9309C426806n89757n598035m720729j54061K033238K98306j079762J529174N499314
9300F44494M781183j399641n729550j961199N399901O088355j679432q504934
9292b360823o889814m10174L393468L178906K293346K137931K155799K540414
9284F039053K312110j311854p013669p633727k21884O956763N010036j900747
9276B236081k591693L650175O023848o29989p775522o006338K082152P016113
9268D004827M876697o41635m827399n643398l074558R81270L230401K286991M95053
9259A688249M65367J329613O14158j636735l093276k641531j387839n41174j75105
$$ y = [-200841, 2746167, 3007084, 4100232, 6086702, 4728392, -474487, -3667903, -949454, 3426806, 2837049, -2760986, -7481715, -7635776, -5602538, -5304232, -6383994, -4854820, 644494, 5425677, 4026036, -1703514, -3664713, 1735188, 7823543, 6144111, -2360823, -9250637, -9660811, -6267343, -3088437, -795091, 1342840, 3498639, 6039053, 8351163, 7039309, 25640, -7608087, -7829971, -873208, 4136828, 2236081, -355612, 3294563, 9318411, 8688422, 912900, -5093438, -3011286, 4004827, 8881524, 8239889, 3412490, -2230908, -5305466, -4324196, -1093795, 1193196, 1688249, 2153616, 3483229, 4097387, 2460652, -632624, -3274155, -4661994, -5203168, -5378273]
9250e378273j6054K3677J97768P66377J416566J529276Q73382n01901k495056
9241c584238m126598l195876J333680O429938O870902J707028l088698j403616
9233I42522M491876O154360K81608o584660o998464k100374J716059K123585J533537
9224A560049Q26754j177436k776289o68246L186331K690911k626741n545930j748463
9215f279060L700923M335688J072858j647881l283225n055254m713380J5414N511614
9206f342303O235036K903706P15594P41545o78532m336972o184236m027751j088328
9197a2062241j012977k960138l432720p05188L615438N993300M077192k02362
9189f689696j851182J030347M239889L236961l74471j716017J01593J951954K347871
$$ y = [-5378273, -5394327, -5370650, -5172882, -4406505, -2989939, -1460663, -587281, -1089182, -3584238, -7710836, -10906712, -9573032, -3143094, 3727808, 5434836, 2346138, 942522, 5434398, 11588758, 11870366, 5285706, -1712758, -3813132, -2097073, 26512, 1560049, 2386803, 1209367, -1566922, -2235168, 951163, 3642074, 1015333, -4530597, -6279060, -2578137, 1757551, 2830409, 1182528, -2100697, -7155951, -11869331, -11853917, -6342303, -107267, 2796439, 3512033, 4253578, 3575046, -761926, -6946162, -10973913, -12062241, -13075218, -16035356, -19468076, -20173264, -16557826, -10564526, -6487334, -6689696, -8540878, -7510531, -3270642, -33681, -408152, -2124169, -2022576, -70622, 2277249]
9180B277249K268746J349103j532920m125330k579489K125419M563767K604353
9172F950898j09011p04593j055982k946661l975567j765918J172037P88426k151473
9163c797844k844613P94508N121963N299987J184496k732426l035560j355510
9155a364999j170319k076562o86434K828105L899359J228770L1675L539025O240638
9146A2469258J859154n699351p230678k086027J607771M81195L24120M531498
9138F256940P040568K005577o031473p993511k512536L356114L631077q03230
9130D949526m702566l729161J641162N760009L369639l309945o306411k285437
9122d613184K964386L093708k39892j428911L46473J607923J198503R76041J283395
$$ y = [2277249, 4545995, 5895098, 4362178, 236848, -2342641, -217222, 4346545, 6950898, 6841887, 6137294, 5081312, 2134651, -1840916, -3606834, -2434797, -1646371, -3797844, -6642457, -5847949, -725986, 4574001, 5758497, 3026071, -9489, -1364999, -2535318, -4611880, -5298314, -2470209, 1429150, 2657920, 2689595, 6228620, 12469258, 14328412, 8629061, 1398383, -687644, 920127, 1401322, 1725442, 6256940, 13297508, 15303085, 9271612, 1278101, -1234435, 2121679, 5752756, 4949526, 246960, -3482201, -1841039, 3918970, 7288609, 3978664, -2327747, -4613184, -1648798, 1444910, 1205018, -223893, 122580, 1730503, 2929006, 3905047, 5188442]
9113E188442Q00490J88319J127784K077078k49512m832175o351577k445113K890079
9104a606185M731088K848033J13451j853322l053533k992042r09881K164522L463226
9095B905357J228614l040163n583300m005948J92294L395594L971780L112278
9087B176506J626107j293789m766302m997832n39144L842053K899485j166683
9079b219599j733234K015576M044733J503772q96550N93348K364081M80915j564165
9070D588877R66167M279367J106929o271781p698377q74715M184093L56995n618416
9061d980861m063304K475833L867229j391633m304243L24885O400942O050050
9053D378898K36710m004493k990206O82003K540056Q14339k460249l652548j634338
$$ y = [5188442, 5988932, 6177251, 7305035, 9382113, 9132601, 4300426, -2051151, -4496264, -1606185, 3124903, 5972936, 6086387, 4233065, 1179532, -1812510, -2722391, -557869, 2905357, 4133971, 1093808, -4489492, -8495440, -8303146, -4907552, -935772, 2176506, 3802613, 2508824, -2257478, -7255310, -7794454, -3952401, -1052916, -2219599, -3952833, -1937257, 2107476, 3611248, 2714698, 3308046, 5672127, 6153042, 4588877, 5555044, 9834411, 10941340, 4669559, -3028818, -3903533, 280560, 637555, -4980861, -9044165, -6568332, -2701103, -4092736, -8396979, -8072094, -1671152, 4378898, 4615608, 611115, -2379091, -1697088, 842968, 1657307, -802942, -4455490, -6089828]
9044f089828N41294k30519k234838j324849K358083M153992J819838j524488k520451
9035e051766j591223l73648R08193J813281J290317N24006K005257M198323K246521
9026E969261l648312o422578k537697J785318J60192l609082j989505L540610
9018f751793M821884K99442k876961o15019K332666Q88898k563377k805459J70179
9009g099540J963064M94430j619221j130232J558421L052591J545369n79583k48350
9000b063051J326527O03387j596992n69580L578161M021760k086840p304817m366386
8991h457831K492177M414172J701300J420117M129600L608325p09523j878623
8983F719714K156841M305493l7323n758055o696855m024649j399148J351301M631403
$$ y = [-6089828, -5548534, -5779053, -8013891, -9338740, -6980657, -2826665, -1006827, -2531315, -5051766, -6642989, -7016637, -6108444, -4295163, -3004846, -2480840, -475583, 3722740, 5969261, 2320949, -4101629, -6639326, -4854008, -4693816, -8302898, -10292403, -6751793, -1929909, -1630467, -4507428, -5122447, -2789781, -1900883, -4464260, -7269719, -7099540, -5136476, -4642046, -6261267, -7391499, -5833078, -2780487, -1235118, -1814701, -2063051, -736524, -133137, -1730129, -2299709, 1278452, 5300212, 3213372, -4091445, -8457831, -5965654, -1551482, 149818, 1569935, 5699535, 9307860, 8598337, 6719714, 8876555, 13182048, 13144725, 7386670, 689815, -3334834, -4733982, -3382681, 1248722]
8974A248722N274509J789067j691346j869757j758046m279226n389642l42227
8966g017946O805715P429167O43683n369041m429767P98382M088938L485384J915448
8957H349963K243686L578724K504417k220488p054371p360472l235557P63720
8949b430378J507184p5771k080645l565143l160128n7163K948460K049902j127602
8940e991284j008277K862844M554963J683638m73655J598782L408033R12061j671792
8931E875313N60356L683620J219379m415459n626876k064160k03147j723903j475240
8922d170117K264254L967797r3974n527168n868152o30707N351001P510522M711860
8913G515316n96766m158941l697645j182720J58483p4547m69460r05711j590221
$$ y = [1248722, 6523231, 8312298, 6620952, 4751195, 2993149, -1286077, -6675719, -7017946, -212231, 7216936, 7860619, 2491578, -1938189, -1139807, 2949131, 6434515, 8349963, 10593649, 14172373, 16676790, 14456302, 7401931, 41459, -3194098, -2430378, -923194, -998965, -3079610, -6644753, -9804881, -9862044, -6913584, -4863682, -5991284, -6999561, -4136717, 418246, 2101884, 1628229, 3227011, 6635044, 7547105, 5875313, 6435669, 10119289, 11338668, 6923209, 1296333, -767827, -970974, -2694877, -4170117, -1905863, 2061934, 1967960, -3559208, -9427360, -10058067, -4707066, 2803456, 7515316, 6918550, 2759609, -938036, -2120756, -1962273, -2036820, -2506280, -3411991, -5002212]
8904e002212j132621P90098J253892j133637k106680J978787O377785L746653
8896D772065l664820n956509k38566N133736L379351j586489k935003j084050
8888b180285o21633j853582j307474J803497M457738M059706P64947l122831m131250
8879b131167k05977N644146O913672J293119n708696p526288m441960j549544
8871g712695j041551o27792J211888K614809J903471P23162J613288L815541L774767
8862F274888J35446l689078l768131j322075r50764l153151l065928J314423M631934
8853c592436K290604j370797M35708N414846N372199k58950l304535l57689K021006
8844F649956r81424m340157k307809J832526K016052l62218N759K731764L364644
$$ y = [-5002212, -6134833, -5344735, -4090843, -5224480, -7331160, -5352373, 1025412, 4772065, 1107245, -4849264, -5087830, 45906, 3425257, 1838768, -1096235, -2180285, -2801918, -4655500, -5962974, -4159477, 298261, 4357967, 5122914, 2000083, -2131167, -2337144, 3307002, 10220674, 11513793, 5805097, -1721191, -6163151, -7712695, -8754246, -9382038, -8170150, -5555341, -3651870, -2928708, -1315420, 2500121, 6274888, 6410334, 2721256, -1046875, -2368950, -3319714, -6472865, -9538793, -8224370, -3592436, -1301832, -2672629, -2236921, 3177925, 8550124, 8291174, 4986639, 4628950, 6649956, 5668532, 1328375, -979434, 853092, 2869144, 2506926, 2512685, 5244449, 8609093]
8835H609093J758700J211629J167858j536681n031545l806840J746089M593689
8827H711992J631927j776117q02190J298006q93766n732788o625814j723157L353965
8818b557942K972258j605672m402394k305451J559919K351519k24924k060278
8810f272965o41260J694523J518708r75213k826582k189907M52100L406747M362067
8801a471782J691991k769166m240080p94585L303137L014895n87608k351460m58580
8792d663238K097604K584841J201792r03484k688742k638621m44598J455437J367325
8783b631684J780089M799761O095233K00237q512906q562036K256886J1227573
8775F653153P002838m601964q591243j176285O215724L469474n203192q336879
$$ y = [8609093, 10367793, 11579422, 12747280, 11210599, 6179054, 2372214, 4118303, 8711992, 10343919, 8567802, 7765612, 9063618, 8169852, 2437064, -4188750, -5911907, -2557942, 414316, -1191356, -5593750, -7899201, -6339282, -3987763, -4212687, -6272965, -6914225, -5219702, -3700994, -4676207, -7502789, -9692696, -9240596, -5833849, -1471782, 220209, -2548957, -6789037, -7583622, -4280485, -1265590, -1853198, -4204658, -4663238, -2565634, 19207, 1220999, 317515, -2371227, -5009848, -5454446, -3999009, -2631684, -851595, 3948166, 10043399, 10243636, 1730730, -6831306, -4574420, 6653153, 13655991, 9054027, 462784, -713501, 5502223, 8971697, 3768505, -4568374]
8767d568374k715968L572232K978228j625635k045649K876257N559950J331677
8759E362718m106064l256882J706155K871802o34371k129075O87762K262312k38014
8750B526343j654155J588393M438913J565738l740361n515538m381467l758315
8742h930449j926957L774058Q637437N789312k138941n688280k466888M84210
8734b466498j106301k904397o72303K879324L473734J530235m87749k152542l287621
8725e194118k272227Q53458K994643K122211j72787j683774j849925k37559L082066
8716b358012M875759J516976m289227n236958o2638L555648J42393n283420m730284
8707a1869763J585658O777078O696205K922015j266432l644352l492766k340474
$$ y = [-4568374, -7284342, -3712110, -733882, -2359517, -4405166, -1528909, 4031041, 5362718, 1256654, -2000228, -294073, 2577729, 1943358, -185717, 502045, 2764357, 2526343, 872188, 2460581, 6899494, 8465232, 4724871, -790667, -5172134, -8930449, -10857406, -7083348, 1554089, 7343401, 5204460, -483820, -2950708, -2466498, -3572799, -6477196, -7149499, -4270175, -796441, 733794, 246045, -1906497, -5194118, -7466345, -6612887, -3618244, -1496033, -1668820, -3352594, -5202519, -5440078, -2358012, 2517747, 4034723, -254504, -5491462, -5554100, -1998452, -1856059, -7139479, -11869763, -10284105, -3507027, 3189178, 6111193, 4844761, 1200409, -2292357, -4632831]
8699d632831k366524k449274O15349N353574N481999m42369n322972l897080m64615
8690h124743m34211p31616L396913P708528M976976k024550m077001q1479K492411
8681C101228R23020J57740J801703J025145l348942n773594l883665j828675p23752
8672h549792L740156R934509Q000977m083789j2880337p429696M125894O974873
8664a67205J429530o04824L721195N287891p7033n127215l955403k05517R79789
8655A281208J72965p75540k327832k877533J291522P633802P010521k867833j1200469
8646b659189q135477J326382N329005J874222j409193o76108P18137R01284J979273
8637g51664L300136J199017k751012j894653M024107O021662n55955p327999m686443
$$ y = [-4632831, -6999355, -9448629, -8833280, -3479706, 2002293, 1559924, -3763048, -7660128, -8124743, -8558954, -9290570, -5893657, 1814871, 6791847, 4767297, 690296, 608817, 3101228, 4024248, 4181988, 5983691, 7008836, 3659894, -2113700, -5997365, -7826040, -8549792, -4809636, 5124873, 13125850, 9042061, -3838276, -11267972, -7142078, -167205, 1262325, 657501, 4378696, 9666587, 9589554, 4462339, 506936, 301419, 1281208, 1454173, 678633, -1649199, -4526732, -3235210, 4398592, 11409113, 8541280, -2659189, -10794666, -9468284, -4139279, -2265057, -3674250, -4350358, -3632221, -2730937, -751664, 2548472, 3747489, 996477, -898176, 3125931, 9147593, 8591638, 1263639, -3422804]
8628c422804L665397O349855Q07492m721167m276096n85942K104357L619090M154943
8619G695125J936926k204683l588699o54581J624221q26228m654128m398857o96313
8610e767217J716912J421564O43492J88397p25085q63571J525410M249863L432287
8601E822052N8864j173537P2276j043640n495830o818399n10865P985418R994407
8592H890746N036715j42596k021762l395975n990827o462958k457925K200670
8584d343912K555280o7986k71228K934661M621344J615425k548060k690024R14354
8575B719854L623453K999338R54061j80520n31564j143512k097843k994381l423578
8566g4692k524631o2734J900616J044493j128499o32767K454428K840042k040461
$$ y = [-3422804, 242593, 6592448, 7399940, 2678773, -1597323, -2183265, -78908, 3540182, 7695125, 9632051, 7427368, 3838669, 3184088, 4808309, 3982081, -672047, -5070904, -5767217, -4050305, -2628741, -1985249, -1796852, -2521937, -3385508, -1860098, 2389765, 5822052, 5880916, 4707379, 4779655, 3736015, -1759815, -8578214, -9089079, -1103661, 8890746, 13927461, 13784865, 11763103, 8367128, 2376301, -4086657, -6544582, -4343912, -1788632, -1856618, -2127846, 806815, 5428159, 7043584, 4495524, 1805500, 2719854, 6343307, 9342645, 10296706, 10116186, 9584622, 8441110, 6343267, 3348886, -74692, -2599323, -2662057, -761441, 283052, -845447, -1478214, 976214, 3816256, 1775795]
8557A775795o929103n719208l40274K638242K145160K803448N371206M451052
8549F196318j790283o420363l306885K994889L524858j599250l616875J044308
8541b973283N410234L447242m28982N24596L198226m76605q618203r918982j043494
8532a0879251O772203M141208k433917j703961M148892M183904k178604m214787
8524b164313J560349N377619P71868m985867l700437Q50327J313861m79281R92111
8515d63763L257789M60146m646763m152128J803137N355418L366201K44648j073043
8506D151642j989104k228397K23946K809496O57128m167546m388749M32213K638811
8497a860560q29128l737661j633610J343798R66197J5330J748988L377122J550599
$$ y = [1775795, -5153308, -10872516, -11212790, -8574548, -6429388, -3625940, 1745266, 6196318, 4406035, -2014328, -5321213, -2326324, 1198534, -400716, -4017591, -2973283, 2436951, 5884193, 5455211, 5979807, 9178033, 8701428, 83225, -9835757, -10879251, -4107048, 34160, -2399757, -4103718, 45174, 4229078, 2050474, -2164313, -603964, 4773655, 5545523, 559656, -3140781, -2290454, -976593, -1455874, -463763, 2794026, 3254172, -1392591, -5544719, -3741582, 1613836, 4980037, 5224685, 4151642, 2162538, -65859, 158087, 2967583, 3624711, -542835, -4931584, -4499371, -1860560, -2689688, -6427349, -8060959, -6717161, -5750964, -5735634, -3986646, -609524, 941075]
8488I41075j556391k719727k823474l066747j663805J229508J369608j930204
8480a0220157k483406K662755O409297K117718m936688n090920J202882N390589
8472d947930M180517J669286P496k601435m840517k381763L482339N360764N03241
8463D31998m701691m061909K39011K342062J039852n56132n94668P7621M39937
8454e343919L39771j09287k13508J315234M320028N898357L135972k658377o159840
8445E24431l808786J371106K882473q29036l827302q49247M665859N149966J47424
8436E426888k981992l84051K649717M83383m005284m338740m02807K207264R66202
8427c79420q22991J48503K797771L779061J529239k236212l901324j477519K457803
$$ y = [941075, -615316, -3335043, -6158517, -9225264, -10889069, -9659561, -8289953, -10220157, -12703563, -10040808, -3631511, -1513793, -6450481, -11541401, -10338519, -4947930, -767413, 901873, 909369, -1692066, -6532583, -8914346, -5432007, -71243, 431998, -4269693, -8331602, -8092591, -5750529, -4710677, -5266809, -5861477, -5783856, -5343919, -5004148, -5113435, -5326943, -4011709, 308319, 6206676, 9342648, 6684271, 524431, -3284355, -1913249, 969224, 140188, -3687114, -4536361, 129498, 5279464, 5426888, 2444896, 2060845, 4710562, 5193945, 1188661, -3150079, -3552886, -1345622, -379420, -1202411, -1053908, 1743863, 5522924, 7052163, 4815951, 914627, -562892, 1894911]
8418A894911L020128p91330m511891m248892j527861j3158j12649L96047K294988
8409c599707L982459L329920p36853o509621q841023l681320N612638J0536167
8401I2660P545819J553278k107089l541652l793715j257691L106281L455736k330992
8392B722635p359922n250060K99035K195690R91212J441493K729761R87354j968559
8383c211361j631536K19409j000001k635548J289982P423950N890261l346155
8375B999001q377671k807861M968755M815270j323152m524577j548714L460153
8367b338796N820320M134712k2305l159834k789875n31837K94712k47962r1487
8358A067648l92249l359803n682557j873269N301315O422556l86080n739167l131203
$$ y = [1894911, 4915039, 4123709, -388182, -4637074, -6164935, -6178093, -6290742, -5894695, -3599707, 382752, 3712672, 2975819, -3533802, -12374825, -16056145, -10443507, 92660, 7638479, 9191757, 7084668, 3543016, -250699, -1508390, 1597891, 5053627, 2722635, -4637287, -9887347, -9588312, -7392622, -6401410, -4959917, -2230156, -1242802, -3211361, -4842897, -4623488, -5623489, -8259037, -6969055, 454895, 6345156, 2999001, -5378670, -8186531, -3217776, 1597494, 274342, -4250235, -5798949, -2338796, 3481524, 7616236, 7593931, 4434097, 1644222, 1112385, 1407097, 1159135, 1067648, 675399, -2684404, -8366961, -10240230, -4938915, 1483641, 1097561, -4641606, -7772809]
8349g772809J940098K209286k24769Q0640J649802J8268k963288k174443J428247
8340e808968K413382J39962q06724J238068K921820K098158O33068L25761N27325
8331C681852N83305R19152J006926n03512k878696l302618p25950K319346K688804
8322C788609K42570k089170j483716J446916K776605p0151m103040l759061J322601
8313a927837M792151J862548l910023n401048j532402J951994J051044j209218
8305d322791J28000M244758N318848Q91103l992597l480573N48161J155800k794168
8296b303459m298729R06979O963882O225747K95532l570358l490611k980546k516244
8287d767807L20231L266848J236225l525547k576767M985310R120841L364825
$$ y = [-7772809, -5832711, -3623425, -3848194, -3767554, -2117752, -2099484, -5062772, -7237215, -5808968, -3395586, -3255624, -4062348, -2824280, 97540, 2195698, 2828766, 3154527, 3681852, 4265157, 5184309, 6191235, 5687723, 2809027, -493591, -1219541, 1099805, 3788609, 4031179, 1942009, 458293, 1905209, 4681814, 4611663, 508623, -3250438, -1927837, 2864314, 4726862, 816839, -4584209, -6116611, -4164617, -3113573, -4322791, -4194791, 49967, 5368815, 6259918, 2267321, -1213252, -665091, 490709, -2303459, -6602188, -5695209, 1268673, 7494420, 7789952, 4219594, 728983, -2251563, -4767807, -4447576, -1180728, 55497, -3470050, -6046817, -1061507, 8059334, 11424159]
8279A1424159n481930p615700l287156M53768N08802r90002k010847j659398Q47691
8270g810613L872311L520494k94338k336487j24457J904104N12840l52309K627613
8261A519158M766077J159800l766324l105597O45799R1800l842555l528540J761212
8252d299170M221238L44814l918398l055284Q12442L341578L921708L366170J345542
8243F080640j062277j078140J093220J615138r53099l224865k408987L9247J959037
8234B059914L414896M139178K301869j708737l934918j817383K362039M853658
8226A1670516M383970J458497k760759n384513l471260J209925K864523o03727
8218I367172m364199l784737q15835K05941n37870m9636J581284J837776Q24342
$$ y = [11424159, 5942229, -1673471, -4960627, -4506859, -3998057, -4988059, -6998906, -8658304, -7810613, -3938302, -417808, -712146, -3048633, -3173090, -1268986, -756146, -1108455, 1519158, 6285235, 7445035, 3678711, 573114, 1218913, 1310713, -2531842, -6060382, -4299170, -77932, 266882, -3651516, -6706800, -5894358, -2552780, 1368928, 4735098, 6080640, 5018363, 3940223, 5033443, 6648581, 5695482, 2470617, 61630, 100877, 2059914, 5474810, 9613988, 11915857, 10207120, 6272202, 4454819, 6816858, 11670516, 16054486, 17512983, 14752224, 9367711, 5896451, 7106376, 9970899, 9367172, 5002973, 1218236, 402401, 608342, 70472, 20836, 1602120, 3439896, 4264238]
8209D264238R52448K185363J959355n0610j044152L18861J835331J355143l37583
8200A1438394j499499j994199k598179l576533m939016o214994n153213O77652
8192a3859587R102967J2838001P237741k660787o717808j560857N631925O336654
8184A6348249L87567n670874p185841n062114k210381J201J391866J741403R97230
8175G38306n40737k565748m302089m148749j451370J657219K195395K27571j128300
8166i318502J22319K599215L943587L563792K245191O81170o67715j389919j480664
8157B98474j149637k91779R02785J288815J22285j442685j761910q87864K66534
8148b654982J632459K709817J524269j884939l030932J332269O738248O131813
$$ y = [4264238, 5216686, 7402049, 9361404, 9310794, 8266642, 8585503, 10420834, 11775977, 11438394, 9938895, 7944696, 5346517, 1769984, -3169032, -9384026, -14537239, -13859587, -4756620, 8081381, 15319122, 12658335, 5940527, 4379670, 10011595, 16348249, 16735816, 11064942, 3879101, -1183013, -3393394, -3392193, -2000327, -258924, 738306, 197569, -2368179, -6670268, -10819017, -12270387, -10613168, -8417773, -8190202, -9318502, -9196183, -6596968, -2653381, 910411, 3155602, 3836772, 3169057, 1779138, 298474, -851163, -1142942, -240157, 1048658, 1170943, -271742, -2033652, -2921516, -2654982, -1022523, 1687294, 3211563, 1326624, -1704308, -372039, 6366209, 12498022]
8140A2498022O45069j861511N05820P16259m762780r078642n834883M20942J585768
8131e165936j629963k613611k21187J174674P62054J909533M312295L629372k76737
8122A880494k177718k44883R38809j247787k569902O01454M386188L233908j016845
8113C783718j851895J783321L995964J102588k898494k491196J295692K731478
8105G451176k56311l637839l533125j198563N512l86409p15316p16366r45535
8096c932776k62269K450577N088783M657011J980191J02012r91886l225880m973845
8087H91918k857916J111525J279363j796716j184121M282598O359674N51669n460085
8078C177909l392515K741663L702221m03359j919080J283573L727659J901510
$$ y = [12498022, 13143091, 11281580, 11787400, 12503659, 7740879, -1337763, -7172646, -6751704, -5165936, -6795899, -9409510, -9630697, -8456023, -7693969, -5784436, -1472141, 2157231, 1880494, -297224, -542107, 396702, -851085, -3420987, -2819533, 1566655, 4800563, 3783718, 1931823, 3715144, 7711108, 8813696, 5915202, 3424006, 4719698, 7451176, 7194865, 3557026, 23901, -1174662, -1169150, -1555559, -2270875, -2987241, -3932776, -4195045, -1744468, 3344315, 8001326, 9981517, 10083529, 9091643, 5865763, 891918, -1965998, -854473, 424890, -1371826, -2555947, 1726651, 8086325, 8637994, 3177909, -214606, 2527057, 6229278, 5825919, 3906839, 5190412, 8918071, 10819581]
8070A0819581k096851n668267p521104n519924M79877M966772K859664k184866
8062c865118k782270N97797J382983j071119q55359K856249L693282l62951l092216
8053c498722j058124P12275j409960k736484R69142N236038M150700K9288j083840
8044A310313R32001J809707N51089p59562j937445l570007l413587K73561L888342
8035i15588K722853j577279l401964j681696k55751n93714j75734J709509K348162
8026a821202Q90585J28729J341495J872419j37991k543744k953589k256605k047850
8017g527753j650143j83472J261313K018970L378429M876161K721701l724560
8009A170646p405613j979998P110558P958571r31837p677809m081389K801750
$$ y = [10819581, 8722730, 3054463, -4466641, -9986565, -9506688, -4539916, -1680252, -3865118, -6647388, -6049591, -4666608, -5737727, -6593086, -3736837, -43555, -406506, -3498722, -4556846, -3844571, -5254531, -7991015, -7021873, -1785835, 2364865, 2394153, 1310313, 2242314, 4052021, 4603110, 3843548, 1906103, -1663904, -5077491, -4803930, -915588, 1807265, 229986, -3171978, -4853674, -5109425, -5703139, -5878873, -4169364, -1821202, -930617, -801888, 539607, 2412026, 2274035, -269709, -3223298, -5479903, -7527753, -9177896, -9361368, -8100055, -6081085, -2702656, 2173505, 4895206, 1170646, -6234967, -8214965, -1104407, 6854164, 5922327, -1755482, -5836871, -3035121]
8001c035121K280144l872344n612286m44274M720275N576618M512841K847790
7993F973643j258597n647121m396665J817887M488116K49261l584204j286608
7985b644288K220323R64997j716371m95022J483474j101114m645457k131367M182127
7976c882698O026197K587689M17471J379912J038235j273628j021823J931989
7968G203344J943785k319337n240047m012350k642932l424586k573085J936119
7960i129089N522795M308210J086714k84117j038883l692305o515832n984998
7952a5727505j639488M205266Q548414Q160421K123131m763042n872839j535087
7944f500729J191388r89134l220887r20405L404085N038759L551022J062727j262515
$$ y = [-3035121, -754977, -4627321, -10239607, -10683881, -5963606, -386988, 4125853, 6973643, 5715046, 67925, -4328740, -2510853, 1977263, 2226524, -1357680, -2644288, -423965, 541032, -1175339, -1670361, -186887, -1288001, -5933458, -8064825, -3882698, 2143499, 4731188, 5148659, 6528571, 7566806, 6293178, 5271355, 7203344, 9147129, 6827792, 1587745, -2424605, -5067537, -8492123, -11065208, -9129089, -3606294, 701916, 1788630, 1504513, 465630, -3226675, -9742507, -15727505, -17366993, -13161727, -4613313, 3547108, 5670239, 907197, -4965642, -6500729, -5309341, -6298475, -9519362, -10439767, -7035682, -1996923, 1554099, 2616826, 1354311]
7935A354311k061389J92124L377994L010691l07164o85940K963997L663071k390346
7926I117349q308369o449987m9376K248193q51059l388120k130742N94407K368825
7917f848879K838554J573249j008218j866113P65474L392972K006243j141320
7909b88038j002378J599714J118353l193873n429436k138694K381335K740602
7901d212415J23037m70074J863817L061715Q72299j481313m43210J826455N13671
7892A653982l504092l645261K202013O976763M331131j502999k196041J775917
$$ y = [1354311, -707078, -514954, 2863040, 5873731, 5566567, 4880627, 7844624, 11507695, 9117349, 808980, -5641007, -5690383, -3442190, -4293249, -7681369, -9812111, -9217704, -6848879, -4010325, -2437076, -3445294, -5311407, -4545933, -1152961, 853282, -288038, -1290416, 309298, 1427651, -1766222, -7195658, -9334352, -6953017, -4212415, -4089378, -4559452, -2695635, 366080, 1238379, -242934, -686144, 1140311, 1653982, -1850110, -5495371, -3293358, 3683405, 8014536, 6511537, 4315496, 6091413]
$$ [...]
##END NTUPLES=NMR SPECTRUM
##END=
