##TITLE=31Pdec_3MBDP1404
 CDCl3, 24 sc
 17.4.2023
##JCAMPDX= 6.0         $$ Bruker NMR JCAMP-DX V2.0
##DATA TYPE= NMR SPECTRUM
##DATA CLASS= NTUPLES
##ORIGIN= UXNMR, Bruker Analytische Messtechnik GmbH
##OWNER= root
$$ XWIN-NMR		Version 3.5
$$ Mon Apr 17 15:44:00 2023 Russian Standard Time (UT+4h)  she@DPX200
##.OBSERVE FREQUENCY= 81.013821
##.OBSERVE NUCLEUS= ^31P
##.ACQUISITION MODE= SIMULTANEOUS
##.ACQUISITION SCHEME= undefined
##.AVERAGES= 24
##.DIGITISER RES= 16
##SPECTROMETER/DATA SYSTEM= spect
##.PULSE SEQUENCE= zgpg30
##.SOLVENT NAME= D2O
##.SHIFT REFERENCE= (INTERNAL, D2O, 0, 248.564)
##AUDIT TRAIL= $$ (NUMBER, WHEN, WHO, WHERE, WHAT)
$$ ##TITLE= Audit trail, XWIN-NMR		Version 3.5
$$ ##JCAMPDX= 5.01
$$ ##ORIGIN= Bruker BioSpin GmbH
$$ ##OWNER= she
$$ F:/spectra/data/she/nmr/P31/1/pdata/1/auditp.txt
$$ ##AUDIT TRAIL=  $$ (NUMBER, WHEN, WHO, WHERE, WHAT)
(   1,<2023-04-17 15:43:00.79 +0400>,<she>,<DPX200>,
      <created by zg, POWCHK disabled, PULCHK disabled
       configuration hash MD5:
       00 E9 B6 7A A2 85 ED C7 34 08 36 98 17 FE 4E 26
       data hash MD5: 32K
       DB 7E C5 02 F5 87 5C D5 6D 9E 49 8A A4 7F 1B AB>)
(   2,<2023-04-17 15:43:05.48 +0400>,<she>,<DPX200>,
      <Start of raw data processing
       efp BC_mod = 2 LB = 1 FT_mod = 6 PKNL = 1 PHC0 = -11201.99 PHC1 = 554.285 SI = 64K 
       data hash MD5: 64K
       8D 11 40 C6 4F 2F C1 D6 AC D4 7C 71 15 A2 97 81>)
(   3,<2023-04-17 15:43:22.15 +0400>,<she>,<DPX200>,
      <pk PHC0 = 29.20636 PHC1 = 0 
       data hash MD5: 64K
       E3 E3 95 44 07 92 42 DA 41 EF DB 04 67 0D D9 F5>)
$$ ##END=
$$ 
$$ hash MD5
$$ 7B A4 CF A4 5A B1 BA 26 55 68 59 9B BD 15 72 F6
##$RELAX= 
##$RELAX= 
##$RELAX= 
##$RELAX= 
##$RELAX= 
##$RELAX= 
##$RELAX= 
##$RELAX= 
##$RELAX= 
$$ Bruker specific parameters
$$ --------------------------
##$DU= <F:/spectra>
##$EXPNO= 1
##$NAME= <P31>
##$PROCNO= 1
##$TYPE= <nmr>
##$USER= <she>
##$AMP= (0..31)
100 100 100 100 100 100 100 100 100 100 100 100 100 100 100 100 100 100 
100 100 100 100 100 100 100 100 100 100 100 100 100 100 
##$AQSEQ= 0
##$AQ_mod= 1
##$AUNM= <au_zg>
##$AUTOPOS= <>
##$BF1= 81.014009
##$BF2= 200.13
##$BF3= 200.13
##$BF4= 200.13
##$BF5= 200.13
##$BF6= 200.13
##$BF7= 200.13
##$BF8= 200.13
##$BYTORDA= 1
##$CFDGTYP= 0
##$CFRGTYP= 5
##$CHEMSTR= <none>
##$CNST= (0..31)
1 1 145 1 1 1 1 1 1 1 1 1 1 1 1 1 1 1 1 1 1 1 1 1 1 1 1 1 1 1 1 1 
##$CPDPRG= <waltz16>
##$CPDPRG1= <>
##$CPDPRG2= <waltz16>
##$CPDPRG3= <>
##$CPDPRG4= <mlev>
##$CPDPRG5= <mlev>
##$CPDPRG6= <mlev>
##$CPDPRG7= <mlev>
##$CPDPRG8= <mlev>
##$CPDPRGB= <>
##$CPDPRGT= <>
##$D= (0..31)
0 1 0 0 0 0 0 0 0 0 0 0.03 2e-05 3e-06 0 0 0 0 0 0 0 0 0 0 0 0 0 0 0 0 
0 0 
##$DATE= 1681731780
##$DBL= (0..7)
120 120 120 11 120 120 24 19 
##$DBP= (0..7)
150 150 150 150 150 150 150 150 
##$DBP07= 0
##$DBPNAM0= <>
##$DBPNAM1= <>
##$DBPNAM2= <>
##$DBPNAM3= <>
##$DBPNAM4= <>
##$DBPNAM5= <>
##$DBPNAM6= <>
##$DBPNAM7= <>
##$DBPOAL= (0..7)
0.5 0.5 0.5 0.5 0.5 0.5 0.5 0.5 
##$DBPOFFS= (0..7)
$$ [...]
##$SUBNAM2= <"">
##$SUBNAM3= <"">
##$SUBNAM4= <"">
##$SUBNAM5= <"">
##$SUBNAM6= <"">
##$SUBNAM7= <"">
##$SUBNAM8= <"">
##$SUBNAM9= <"">
##$SW= 501.771253377433
##$SWIBOX= (0..15)
0 1 3 0 0 0 0 0 0 0 0 0 0 0 0 0 
##$SW_h= 40650.406504065
##$TD= 32768
##$TD0= 1
##$TE= 0
##$TE2= 300
##$TE3= 300
##$TEG= 300
##$TL= (0..7)
0 120 53 12 22 120 120 120 
##$TP= (0..7)
150 150 150 150 150 150 150 150 
##$TP07= 0
##$TPNAME0= <>
##$TPNAME1= <>
##$TPNAME2= <>
##$TPNAME3= <>
##$TPNAME4= <>
##$TPNAME5= <>
##$TPNAME6= <>
##$TPNAME7= <>
##$TPOAL= (0..7)
0.5 0.5 0.5 0.5 0.5 0.5 0.5 0.5 
##$TPOFFS= (0..7)
0 0 0 0 0 0 0 0 
##$TUNHIN= 0
##$TUNHOUT= 0
##$TUNXOUT= 0
##$USERA1= <user>
##$USERA2= <user>
##$USERA3= <user>
##$USERA4= <user>
##$USERA5= <user>
##$V9= 5
##$VALIST= <valist>
##$VCLIST= <CCCCCCCCCCCCCCC>
##$VD= 0
##$VDLIST= <DDDDDDDDDDDDDDD>
##$VPLIST= <PPPPPPPPPPPPPPP>
##$VTLIST= <TTTTTTTTTTTTTTT>
##$WBST= 1024
##$WBSW= 4
##$XGAIN= (0..3)
0 0 0 0 
##$XL= 0
##$YL= 0
##$YMAX_a= 3916
##$YMIN_a= -4097
##$ZGOPTNS= <>
##$ZL1= 120
##$ZL2= 120
##$ZL3= 120
##$ZL4= 120
##$ABSF1= 0
##$ABSF2= 0
##$ABSG= 0
##$ABSL= 0
##$ALPHA= 0
##$AQORDER= 0
##$ASSFAC= 0
##$ASSFACI= 0
##$ASSFACX= 0
##$ASSWID= 0
##$AUNMP= <proc_1d>
##$AZFE= 0.1
##$AZFW= 0.5
##$BCFW= 0
##$BC_mod= 2
##$BYTORDP= 0
##$COROFFS= 0
##$CY= -3
##$DATMOD= 1
##$DC= 0
##$DFILT= <>
##$DTYPP= 0
##$F1P= 0
##$F2P= 0
##$FCOR= 1
##$FTSIZE= 65536
##$FT_mod= 6
##$GAMMA= 0
##$GB= 0
##$INTBC= 1
##$INTSCL= 6.047779e-11
##$ISEN= 30
##$LB= 1
##$LEV0= 0
##$LPBIN= 0
##$MAXI= 10000
##$MC2= 0
##$MEAN= 0
##$ME_mod= 0
##$MI= 50
##$NCOEF= 0
##$NC_proc= -6
##$NLEV= 6
##$NOISF1= 182.463
##$NOISF2= 159.3651
##$NSP= 0
##$NTH_PI= 0
##$NZP= 0
##$OFFSET= 248.5645
##$PC= 4
##$PHC0= -11172.78
##$PHC1= 554.285
##$PH_mod= 1
##$PKNL= yes
##$PPARMOD= 0
##$PSCAL= 0
##$PSIGN= 0
##$REVERSE= no
##$SF= 81.0140089999694
##$SI= 65536
##$SIGF1= 159.3651
##$SIGF2= -187.1042
##$SINO= 113.3802
##$SIOLD= 16384
##$SREGLST= <1H.CDCl3>
##$SSB= 0
##$STSI= 65536
##$STSR= 0
##$SW_p= 40650.406504065
##$SYMM= 0
##$S_DEV= 0
##$TDeff= 32768
##$TDoff= 0
##$TI= <>
##$TILT= no
##$TM1= 0
##$TM2= 0
##$TOPLEV= 0
##$USERP1= <user>
##$USERP2= <user>
##$USERP3= <user>
##$USERP4= <user>
##$USERP5= <user>
##$WDW= 1
##$XDIM= 65536
##$YMAX_p= 504190522
##$YMIN_p= -15906193
$$ End of Bruker specific parameters
$$ ---------------------------------
##NTUPLES= NMR SPECTRUM
##VAR_NAME=  FREQUENCY,     SPECTRUM/REAL,   SPECTRUM/IMAG
##SYMBOL=    X,             R,               I
##VAR_TYPE=  INDEPENDENT,   DEPENDENT,       DEPENDENT
##VAR_FORM=  AFFN,          ASDF,            ASDF
##VAR_DIM=   65536,         65536,           65536
##UNITS=     HZ,            ARBITRARY UNITS, ARBITRARY UNITS
##FACTOR=    0.620285442955139, 1,           1
##FIRST=     20137.2065510682, 0,            0
##LAST=      -20513.1999529968, 0,           0
##MIN=       -20513.1999529968, -15906193,   0
##MAX=       20137.2065510682, 504190522,    0
$$ Real data points
##PAGE= N=1
##DATA TABLE= (X++(R..R)), XYDATA
$$ [...]
42837 289419 823619 1036302 666633 123270 130837 784086 1476701 1737153 1599087 1137020
42827 1137020 280705 -642976 -751438 442515 2123185 2782860 1821841 131469 -1033769
42818 -1033769 -1291373 -937194 -57781 1424547 3006534 3776714 3529440 2996207 2705459
42809 2705459 2354607 1705820 1279182 1473173 1714440 1372218 955002 1344708 2198839
42800 2198839 2274094 1257170 175687 -105520 192298 502135 651521 635771 467782
42791 467782 451379 850884 1222883 943527 394495 512828 1075233 805841 -446342 -1171737
42781 -1171737 -583135 8926 -624678 -1462174 -837743 781360 1460939 715558 -95919
42772 -95919 -161132 -217381 -902952 -1642532 -1683718 -1067868 -140372 827485 1175173 210510
42762 210510 -1431718 -1964654 -728199 763629 937628 330186 490026 1473727 1842235
42753 1842235 878697 -517134 -1223367 -1070281 -386144 634369 1643705 1974510 1363861
42744 1363861 450298 73415 325172 652418 671101 495965 360243 258043 50498 -228371
42734 -228371 -304940 33453 607433 994731 1080042 1177900 1386890 1183101 160745 -1055291
42724 -1055291 -1337452 -518033 368047 467140 44343 -248203 -322332 -375264 -277538 97368
42714 97368 343758 -9583 -763587 -1336137 -1506128 -1348605 -791629 145315 1031054 1604459
42704 1604459 2256059 3148047 3370230 2079071 115636 -845702 -636058 -622499 -1318114
42695 -1318114 -1592335 -737203 294807 566849 640528 1295937 2002113 1934136 1508599 1524551
42685 1524551 1566051 720578 -649145 -1280454 -829625 -33534 645041 1278744 1647207
42676 1647207 1414932 971486 928754 1011441 624776 173497 432502 922586 512871 -527167
42666 -527167 -827728 -259011 -56131 -392339 58585 1507377 2146990 993715 -294583
42657 -294583 59413 1201151 1147859 -168346 -1208814 -1355381 -1275086 -1200246 -592086 540742
42647 540742 1417545 1675380 1712014 1832789 1944260 1981115 1831379 1106120 -170280 -1026172
42637 -1026172 -687152 132321 208393 -263090 -33030 1056478 1738122 1316011 659988
42628 659988 767793 1433459 1862541 1716436 1057691 62724 -710537 -492822 707268
42619 707268 1832652 1967333 1337042 760169 596794 636201 581426 237868 -420237 -1014276
42609 -1014276 -917892 16247 1150105 1740891 1661668 1236447 712632 249159 192442 907819
42599 907819 2229358 3279894 3095683 1622721 19701 -377735 507407 1466441 1515352
42590 1515352 849894 56577 -759999 -1393593 -983086 783372 2501771 2501257 1194902
42581 1194902 513564 1093693 1687561 1549797 1530316 2088513 2061131 673868 -719711
42572 -719711 -524364 546353 592945 -458585 -855202 155980 1308484 1390146 788697
42563 788697 406356 262284 -79111 -536433 -713893 -579571 -396326 -313732 -352593 -454006
42553 -454006 -368244 84415 548591 485649 92757 153113 731348 842758 -100628 -1307307
42543 -1307307 -1762057 -1676801 -1888021 -2310666 -2089345 -1122247 -319158 -180104 -108439 458688
42533 458688 1061176 964702 333609 -41830 98517 281187 200018 202398 660496 1264940
42523 1264940 1338691 773109 269664 436548 899966 789684 100680 -110005 706052 1495701
42513 1495701 954265 -432581 -896393 38447 819711 213287 -891082 -997738 -326729
42504 -326729 -287617 -1173768 -1777675 -1191414 208858 1595816 2433947 2370404 1508276 913710
42494 913710 1685613 3249605 3743168 2487517 871914 229116 112564 -437760 -1116140
42485 -1116140 -1088865 -654493 -751939 -1267675 -1207808 -403341 212287 98914 -197885 -50940
42475 -50940 457236 1009233 1548795 1978281 1976434 1491469 1022348 1102105 1693662 2215287
42465 2215287 2042192 1064235 -79243 -497199 23779 851716 1433475 1882859 2319447
42456 2319447 2298399 1552380 714488 478380 521547 177617 -262786 12691 914647 1583584
42446 1583584 1714282 1581216 976322 -484006 -2022558 -2191646 -957394 138794 238267
42437 238267 104654 378024 555762 468651 1054672 2488860 3121617 1828258 118827
42428 118827 106052 1353061 1717733 669990 -356688 -616481 -809959 -1040325 -261135
42419 -261135 1523640 2504626 1647502 422387 605571 1647874 1795542 884354 245539
42410 245539 294908 47463 -885628 -1488548 -1084497 -567070 -1036148 -2099202 -2476625 -1763557
42400 -1763557 -660667 278934 1201699 2188834 2727529 2338901 1345472 614836 609704 912435
42390 912435 762250 30351 -478409 90632 1507671 2610225 2710859 2324348 2141555
42381 2141555 1914390 1124303 299046 562069 1913049 3068281 3254952 3111539 3365179
42372 3365179 3640443 3285312 2536953 2034868 1813969 1574382 1345861 1075419 216858
42363 216858 -1283366 -2198521 -1412873 295249 1111588 593249 -59216 -15669 277480
42354 277480 328784 384501 608016 649452 482098 642195 1220062 1617043 1705307 2137497
42344 2137497 2980199 3172923 2098585 705224 216299 570556 1006263 1377908 1878199
42335 1878199 2096031 1456554 256129 -658579 -956572 -789799 -87199 1218101 2522237
42326 2522237 3032716 2831645 2668211 2744359 2471181 1512121 429492 81581 700789
42317 700789 1642601 1911715 1107650 -23975 -332711 293512 780665 434761 -99404
42308 -99404 -11846 309301 -15425 -832781 -1197855 -896910 -705540 -1110146 -1613063 -1467718
42298 -1467718 -548989 581408 1123788 709475 -61472 -145181 485206 555303 -648040
42289 -648040 -1890275 -1561252 -33700 942971 865375 865205 1432852 1506935 449261 -585499
42279 -585499 -272318 946092 1627999 1316850 689536 200530 -340924 -977773 -1296136
42270 -1296136 -1013553 -290496 603329 1459512 1939824 1701387 889387 179277 114900 575268
42260 575268 1054270 1303464 1438262 1462744 1101347 374888 -6517 569103 1513785 1510429
42250 1510429 357084 -461521 331015 1992903 2732679 2069277 1190392 1093124 1450872
42241 1450872 1515323 1195279 839157 648003 700019 995475 1168106 745926 31280 57527
42231 57527 1154351 2142329 1662432 -41744 -1417140 -1547703 -1064893 -985306 -1307808
42222 -1307808 -1228563 -403908 602088 1152934 1272708 1247815 975807 315012 -202016 134923
42212 134923 974869 1126905 333162 -218468 206827 555695 -356203 -1738015 -1865030
42203 -1865030 -716944 128484 115688 360908 1315606 1677921 631736 -421313 159064
42194 159064 1635779 1992098 1104822 947533 2449469 3841420 3030234 561442 -1009462
42185 -1009462 -360660 1181094 1740068 1378863 1560243 2603791 3016124 1727996 -161175
42176 -161175 -846832 -314476 -141717 -1088410 -2193324 -2403503 -1893646 -1328646 -816022
42167 -816022 -187680 441073 989907 1676257 2438569 2695774 2210242 1606732 1467486 1471664
42157 1471664 1059025 436010 215418 436424 639584 650053 665192 786533 1006963 1415898
42147 1415898 1902994 1953541 1304371 538282 454807 1091156 1896588 2541367 2927351 2789195
42137 2789195 2121562 1710609 2228763 2902015 2229245 233388 -1171682 -627750 850192
42128 850192 1331918 472315 -507004 -849965 -998177 -1306999 -1320451 -805817 -447125 -712475
42118 -712475 -863039 -158237 533500 -286735 -2283278 -3312325 -2304847 -700443 -209532
42109 -209532 -451006 -60788 858231 1017515 186657 -517340 -532656 -483597 -679819 -440718
42099 -440718 562768 1501002 1570313 1054064 620812 382979 185559 83637 53437 -97082
42089 -97082 -210634 65603 417377 155166 -391152 -22108 1312681 2007922 1064220 -470966
42079 -470966 -1239522 -1392487 -1513891 -1078521 470366 2154334 2650207 2268857 2100983
42070 2100983 1929904 839444 -623478 -902283 86135 789597 385289 -443985 -1189374
42061 -1189374 -2162296 -3158386 -3244456 -2425112 -1952328 -2363502 -2648087 -1968626 -785795
42052 -785795 363657 1697184 2951658 2818002 800086 -1498715 -2141394 -1035525 635478
42043 635478 2137069 3167683 3090089 1672489 95509 -141006 905748 1881580 1955954
42034 1955954 1384746 639584 91204 278347 1313579 2145595 1585481 93421 -589554
42025 -589554 249857 1447742 1728935 1278643 1007848 1108360 1091673 766715 430883 249524
42015 249524 12390 -449583 -926294 -1012061 -544521 167114 585662 469300 76141 -215621
42005 -215621 -308936 -271498 -105194 56167 -195599 -984796 -1622307 -1284620 -262514 167797
41995 167797 -580992 -1493579 -1276250 -172598 320198 -504351 -1605910 -1640124 -731348
41986 -731348 -112877 -296955 -531150 -270376 -248290 -1307031 -2727332 -2842304 -1321896
41977 -1321896 220099 327464 -452921 -546684 407880 1226730 942463 23428 -419316
41968 -419316 -75472 323343 10719 -875083 -1421409 -967682 76084 599224 25029
41959 25029 -1040425 -1534929 -1092257 -244626 328215 434807 323467 284765 362028 354552
41949 354552 107365 -235522 -439518 -591444 -930284 -1208637 -773764 385326 1198794
41940 1198794 695788 -701115 -1655589 -1459519 -501386 561110 1349254 1587364 1202053
41931 1202053 696859 693975 986862 829701 315125 472339 1542462 2190207 1301388 -235999
41921 -235999 -681354 118994 735565 452004 152212 592036 1111731 887710 472534 926813
41911 926813 1923081 1994497 695923 -635827 -728271 -105534 -229991 -1405252 -2424292
41902 -2424292 -2269163 -1362134 -795984 -875393 -987034 -701667 -375883 -494730 -852869 -755788
41892 -755788 91939 1164977 1555672 719180 -1050134 -2670720 -3010821 -1971464 -754563
41883 -754563 -613121 -1375708 -1772236 -1247525 -625177 -596817 -485935 567498 1855951
41874 1855951 1856180 585455 -194248 528583 1598451 1511825 601472 331955 1069721 1753918
41864 1753918 1565705 841924 270771 68437 160799 504722 983516 1446319 1971856 2691904
41854 2691904 3368071 3611760 3464079 3224472 2810602 1960679 1004258 615313 730553
41845 730553 584040 -10214 -350220 -117453 63572 -160128 -131064 603455 1302502 1205121
41835 1205121 836070 1010076 1276857 717295 -238089 -323775 465814 897606 626870 634469
41825 634469 1255563 1516083 1097140 1231379 2516536 3358455 2150083 -93958 -1029017
41816 -1029017 -212237 766683 990601 1093976 1376892 1016051 -194911 -952679 -271223
41807 -271223 982096 1368255 759786 -23770 -630892 -1155149 -1319967 -796733 24295
41798 24295 528382 809756 1243625 1548233 1281212 905965 1204966 1828784 1659588 605535
41788 605535 -207098 -170211 118314 180567 409146 1005262 1365932 1195015 1135727 1532153
41778 1532153 1615670 862193 187578 640873 1673501 1979203 1510558 1327071 1759805
41769 1759805 2080984 1923025 1741929 1743970 1513544 978006 731199 1045427 1404665 1353761
41759 1353761 1059507 730512 223397 -427666 -757270 -499351 84781 735971 1428181
41750 1428181 1865497 1496562 385990 -611467 -928298 -880778 -833693 -544125 125646 591484
41740 591484 382919 29588 305985 972144 1080664 361560 -412078 -425754 290677 938560
41730 938560 629381 -776704 -2231644 -2296857 -777203 884277 1309011 733009 224261
41721 224261 11472 -354425 -593521 172499 1771622 2741023 2222680 1086025 538500
41712 538500 497910 163025 -484895 -775300 -610559 -599007 -928241 -1020949 -540200 23506
41702 23506 141358 15767 109050 397276 620859 870377 1291289 1507673 1095232 492412
41692 492412 601683 1422362 1938319 1582489 911667 438994 -202032 -1214464 -1729133
41683 -1729133 -1047171 -86111 -229294 -1109745 -1023510 492303 2008397 2392184 2162644
41674 2162644 2098384 1913829 1235656 711968 995503 1490045 1318896 878864 1135984 1812274
41664 1812274 1668740 512058 -399983 -188399 524509 748958 488845 386415 623582
41655 623582 834796 827722 800891 842183 640272 -43154 -744053 -536689 815595 2223030
41645 2223030 2342192 1228528 215238 36944 -8177 -568799 -917717 -92527 1328499
41636 1328499 1822375 1017451 -15838 -527376 -901994 -1447260 -1544210 -670493 530129
41627 530129 971623 493713 -139067 -355412 -321478 -429499 -678634 -676405 -106130 852651
41617 852651 1580614 1597926 1098662 780166 1113553 1874413 2383714 2142840 1289453 472635
41607 472635 167396 132318 -193251 -777384 -969658 -542100 -151517 -356332 -738533 -611593
41597 -611593 -166882 -200081 -951897 -1883055 -2402022 -2216963 -1226091 275385 1513810
41588 1513810 2024954 2239039 2596661 2555601 1489138 177096 58223 1053601 1561504
41579 1561504 867542 127016 381105 942878 676768 -181700 -618168 -554551 -780128 -1461386
41569 -1461386 -1804020 -1293610 -509508 -391876 -1024199 -1438632 -728964 701348 1396948
41560 1396948 682611 -268673 25922 1166425 1433079 466214 -125355 713621 1845540
41551 1845540 1760175 816918 446867 971199 1503697 1475935 1046009 383846 -301869 -342506
41541 -342506 637907 1758465 1778098 819218 131654 280996 712089 1024842 1390076 1565909
41531 1565909 848743 -564864 -1380999 -973813 -271274 -173337 -131573 715832 1820286
41522 1820286 1845285 607113 -747486 -1350110 -1346079 -1025875 -302479 632547 1064807 746499
41512 746499 479437 1048049 2008465 2258551 1563958 744785 389536 205074 -124467 -220795
41502 -220795 282342 861317 689636 -99673 -469354 155283 1168239 1598610 1184180
41493 1184180 416917 -134031 -302807 -319901 -477318 -737451 -753759 -409079 -66086 27454
41483 27454 203010 673135 767559 -215797 -1582270 -1798767 -590868 709469 1214906
41474 1214906 1538285 2155288 2155508 842555 -579234 -526377 467821 537272 -559303 -1133508
41464 -1133508 -359283 488430 250625 -289709 86353 925605 926812 190231 124976 1210307
41454 1210307 2200483 1918432 807937 63102 -79453 -326921 -912289 -1131370 -483288
41445 -483288 485410 960577 944416 905990 744385 6496 -959522 -1136057 -443544 -216125
41435 -216125 -1376093 -2881723 -2903547 -1138782 923440 1825032 1409691 395353 -485730
41426 -485730 -814510 -611059 -336664 -392684 -605838 -566550 -347986 -426419 -987721 -1754150
41416 -1754150 -2353130 -2422456 -1615925 -79812 1322439 1893155 1948778 2109531 2125413 1365297
41406 1365297 195279 -322491 -88094 -85021 -675237 -1051993 -778879 -584210 -964641 -1182501
41396 -1182501 -545451 311791 474738 312898 866650 2174046 3293793 3672714 3486297
41387 3486297 2867849 1829230 866817 647833 972196 888827 59433 -701008 -530901
41378 -530901 379766 1114461 1092487 547378 148556 271848 533734 139194 -1103375 -2322748
41368 -2322748 -2522556 -1800940 -1107688 -864595 -519040 310650 914828 340192 -1086770
41359 -1086770 -1784809 -722422 1201838 2062863 1136430 -304886 -659907 80348 698561
41350 698561 660318 643417 1057027 1144876 237271 -913357 -1013035 -40276 792754 769849
41340 769849 440339 549616 1019094 1325541 1299910 1112174 799793 224449 -593519 -1337967
41330 -1337967 -1620343 -1323015 -737692 -265521 66859 573514 1287708 1746361 1685652 1538301
41320 1538301 1749340 1977099 1662137 1111951 1120218 1544715 1282044 -27095 -1190359
41311 -1190359 -961238 324475 1308542 1348736 957004 761515 786817 762385 546138 133169
41301 133169 -326798 -441624 98285 993980 1487229 1200084 563185 256023 463365 880093
41291 880093 1253293 1634251 2100931 2429792 2178526 1161375 -123542 -666956 173687
41282 173687 1862227 2999961 2722931 1658051 1157051 1626256 2090113 1621750 723064
41273 723064 705681 1871640 3025072 3016113 2172911 1689368 1948545 2147305 1587513 668096
41263 668096 223926 282200 36383 -952903 -2001844 -2029074 -836562 674394 1560141
41254 1560141 1750597 1727615 1641342 1222274 476695 -102699 -215942 -183153 -372137 -594814
41244 -594814 -527887 -431208 -838349 -1622530 -2011502 -1657324 -1117801 -985963 -1015187 -559918
41234 -559918 383346 1084788 1017824 495157 229888 474235 771502 525575 -298005 -1109812
41224 -1109812 -1325563 -950922 -460904 -239977 -360630 -794431 -1409591 -1659519 -803410
41215 -803410 1079629 2586158 2190060 77444 -1771211 -1680446 -101001 1098309 909100
41206 909100 155054 161422 1090484 1989759 2087242 1475877 647255 -57945 -410910 -219157
41196 -219157 375246 812221 669484 145728 -275791 -449153 -495769 -268604 593283 1958156
41186 1958156 2987181 2949882 2069492 1271081 1148422 1407506 1345238 698966 -68026 -253457
41176 -253457 384406 1388267 1996279 1755071 806504 -310776 -1062673 -1178781 -691875
41167 -691875 96966 663210 481451 -493363 -1532469 -1660425 -733293 255761 306585 -371270
41157 -371270 -797441 -723475 -885817 -1571119 -1846377 -889381 582425 1147880 623795 197338
41147 197338 685443 1611462 2152308 2112874 1669231 979785 483126 815536 1872576 2630173
41137 2630173 2535413 2395629 3040454 3716865 3020800 1208091 234837 1184457 2790977
41128 2790977 3178421 2234579 1392703 1541495 2113671 2182638 1625493 939763 473397 239883
41118 239883 220261 453235 852992 1163906 1126624 618962 -264262 -1114359 -1318824 -606464
41108 -606464 450017 825125 186541 -599382 -445419 642833 1621006 1645330 790692
41099 790692 -360215 -1194964 -1102457 143194 1670335 1979356 741060 -553765 -501084
41090 -501084 319520 382522 -379308 -571372 402001 1535428 1922927 1843367 1612241 738252
41080 738252 -847335 -1886796 -1358278 -163099 39242 -822474 -1357103 -912348 -315114
41071 -315114 -353622 -699964 -656020 -104281 596667 1030898 879285 229222 -249856 -48590
41061 -48590 370487 251945 -131513 147862 995086 1200369 333095 -448098 -53745 1062728
41051 1062728 1765438 1721812 1310412 786176 303212 178739 416901 463856 31481 -382539
41041 -382539 -352161 -246848 -456973 -571482 -76008 729551 1243384 1383549 1203721 436437
41031 436437 -765255 -1454179 -1225036 -1057133 -1694527 -2145572 -1256986 115907 334217
41022 334217 -295473 -108033 966947 1341567 680578 461436 1176325 1387848 453087
41013 453087 -131571 597671 1182740 219745 -1071657 -756290 683940 1238410 469983
41004 469983 -344523 -559929 -615451 -484716 338009 1336057 1290707 305377 -116040 654781
40994 654781 1464535 1178400 127206 -720104 -961747 -702576 -219584 -31329 -427024
40985 -427024 -726953 -17931 1180337 1205419 -352163 -1803489 -1654824 -616557 -311386
40976 -311386 -852113 -927142 135401 1540414 2189569 1796996 799702 -163042 -569280
40967 -569280 -325303 91025 106624 -263857 -449162 -51205 667572 1068527 789586 78429
40957 78429 -515310 -774115 -992396 -1378310 -1519607 -865589 351890 1200372 1124419 466296
40947 466296 -179977 -584914 -661117 -241233 498232 872040 475927 -173686 -323785 -83367
40937 -83367 -242263 -1039284 -1708772 -1464403 -522318 200570 222703 -65561 -171371 -320693
40927 -320693 -1082868 -2267272 -2786361 -1930673 -344439 733080 860653 473712 -81399
40918 -81399 -756068 -1163427 -732720 278098 850400 693195 769579 1730313 2691611 2488780
40908 2488780 1466980 847207 697954 -52972 -1492226 -2054616 -687023 1398262 2170597
40899 2170597 1349825 389913 198308 166292 -329570 -723733 -324555 318200 203022 -409832
40889 -409832 -270249 918614 2000879 2092913 1712093 1629864 1607907 1130857 583870 608795
40879 608795 823319 384420 -455584 -623646 -20545 256229 -276831 -716662 -337110 205655
40869 205655 16054 -579955 -642802 -70656 500334 831068 1176217 1486655 1440657 1211731
40859 1211731 1321693 1615666 1224440 -106647 -1347810 -1413609 -655026 -464093 -1474710
40850 -1474710 -2779372 -3140230 -2473093 -1653264 -1137743 -493920 600427 1608775 1859480
40841 1859480 1503586 1109037 648823 -307789 -1505966 -1969748 -1247450 -592 925786
40832 925786 1422450 1781598 2013902 1986884 1877148 1957515 2047295 1585862 359535 -977873
40822 -977873 -1291855 -133506 1443868 1716098 285612 -1280034 -1410647 -553391 -244535
40813 -244535 -621903 -295927 1260577 2703429 2712107 1622551 482509 -392608 -1097845
40804 -1097845 -1377089 -1148455 -1021656 -1379930 -1629220 -1206777 -592765 -396306 -225633
40795 -225633 423301 893331 328201 -614262 -504833 615058 1232656 681333 27410
40786 27410 260828 848890 769061 111027 -136481 503283 1393699 1516228 557752 -730403
40776 -730403 -1305691 -994618 -587411 -662203 -864537 -703507 -378459 -168126 329551 1416687
40766 1416687 2274583 1855389 544871 -203896 160938 770846 836311 595564 534998 600880
40756 600880 545064 351636 10803 -584624 -1302524 -1749149 -1644018 -910610 354901 1556558
40746 1556558 1697315 538002 -741330 -853366 51680 1030226 1924401 3080224 4026491
40737 4026491 3957688 3272595 3079281 3334742 3095407 2451559 2347806 2497831 1606060 -45892
40727 -45892 -514795 654690 1504389 858005 108441 463843 736006 -253175 -1142172 -240797
40717 -240797 1352918 1425279 297767 134566 1278453 1946700 1375347 749034 812878
40708 812878 812255 266149 -126115 90895 395878 457255 584550 638530 -40116 -1168429
40698 -1168429 -1409203 -271696 1129812 1721876 1679019 1516452 1200226 731644 504828
40689 504828 501106 122295 -687863 -1145976 -863572 -350105 53939 576884 1000241 613147
40679 613147 -284090 -291016 920849 1811724 1322292 580773 1029220 2145129 2491399 1971994
40669 1971994 1477298 1144098 605427 315273 941392 1860334 1878030 1166791 916095 1265288
40659 1265288 1193962 416668 -208132 -250835 -160585 147 690578 1485878 1191494 -93368
40649 -93368 -623847 469433 1737829 1498320 139261 -791022 -796235 -497125 -231061 127989
40639 127989 354415 15799 -714223 -1211518 -1215680 -904124 -486265 -271519 -644562 -1326330
40629 -1326330 -1237717 87642 1493024 1542603 445752 -352670 -146697 515352 1008846
40620 1008846 1207471 1035149 566016 491926 1342880 2268977 1849072 232519 -841276
40611 -841276 -470228 298473 302313 -122650 -179189 -78289 -375354 -693037 -293432 589598
40601 589598 1078862 991476 872472 918982 809665 528332 502089 840588 1107880 974495
40591 974495 601946 289098 110344 -38467 -260833 -465457 -250126 694585 1862507
40582 1862507 2119212 1077946 -136478 -89760 1273633 2691902 3072856 2365809 1208892
40573 1208892 329737 159668 496657 643805 276541 -83131 109623 508277 396179
40564 396179 -194104 -565235 -334333 321818 1166255 1974425 2336060 2076398 1659824 1513241
40554 1513241 1275378 498659 -288995 -228534 423554 609306 120134 -226943 -79522 -16405
40544 -16405 -353262 -662409 -784016 -1164154 -1750425 -1646017 -454129 958162 1647326
40535 1647326 1738768 1811526 1923960 1905213 1966978 2360130 2872259 3148788 3085805 2594375
40525 2594375 1542874 276442 -386976 -52549 820587 1563386 1835392 1510799 791202
40516 791202 438110 950045 1495665 841345 -563423 -880894 387068 1593865 1551424
40507 1551424 1233356 1781784 2417368 1850312 532200 -153448 -26001 184694 475567
40498 475567 1227093 1813263 1278438 75935 -450972 -70069 368165 682760 1435268
40489 1435268 2334068 2289009 1323831 888648 1765947 2922309 3021338 2102728 1203146 1015647
40479 1015647 1354653 1491969 882610 -70145 -204001 887466 1970023 1662163 374839
40470 374839 -354913 -131054 53206 -230360 -97812 1058617 2383205 2535028 1205007
40461 1205007 -661463 -1730222 -1402543 -506797 -536678 -1692447 -2371208 -1425410 -4559
40452 -4559 157901 -589353 -609988 197298 418418 -309353 -868216 -783767 -679126 -523193
40442 -523193 359789 1304052 730690 -920148 -1193517 575023 1970040 1241246 -94509
40433 -94509 10161 1036312 1445278 1368607 1630975 1684885 702441 -532738 -865060 -736193
40423 -736193 -984172 -946883 130443 1050585 391780 -805653 -640958 262446 -200975
40414 -200975 -1756806 -1974522 -325513 979454 662780 94053 508981 1058720 799894
40405 799894 478297 977776 1678997 1643613 1080621 583426 184904 68671 856404 2229592
40395 2229592 2630149 1411075 32978 13086 883616 1361147 1376363 1596424 1915852
40386 1915852 1858687 1740886 2053611 2288997 1703474 746902 444579 779822 952568 877106
40376 877106 1127721 1645629 1786763 1526387 1388119 1274400 652739 -79588 214021 1573116
40366 1573116 2568904 2268825 1473165 1357343 1814097 1924558 1411701 822960 643118
40357 643118 871803 1250962 1458585 1303752 1032681 1110519 1446118 1328851 505535 -258262
40347 -258262 -254520 82885 -64828 -507955 -399316 216959 316603 -498997 -1350270 -1433677
40337 -1433677 -1113607 -1079647 -1202008 -984906 -565157 -417896 -489951 -478942 -617075 -1209845
40327 -1209845 -1627879 -880655 756957 1797191 1499704 781959 763888 1335832 1715568
40318 1715568 1589354 1062752 225343 -542922 -521334 348319 1052916 894851 623054 1236311
40308 1236311 2281395 2500766 1747891 1000423 692737 337002 -216356 -434865 -205097
40299 -205097 -83992 -150985 268270 1316711 2063450 1745800 706042 -318223 -983432
40290 -983432 -1065356 -381186 519555 558139 -396996 -1188821 -1080494 -753461 -886035 -911623
40280 -911623 -233738 412320 141111 -408425 -63663 872603 1191994 890112 997656 1547440
40270 1547440 1534007 953546 1006821 1881791 2183488 1300857 587519 1103393 1746355 1073940
40260 1073940 -230259 -386634 753564 1718625 1767992 1576169 1604842 1331507 423670
40251 423670 -522605 -841003 -501041 315612 1463928 2396605 2381070 1514825 701259 281589
40241 281589 -405503 -1659167 -2585907 -2339965 -1388262 -729145 -513758 -298535 -81791
40232 -81791 -129183 -195897 103610 466714 399418 248031 696763 1455688 1608759 1209737
40222 1209737 1282070 2051645 2414039 1576327 140467 -940277 -1450493 -1390159 -419082
40213 -419082 1359856 2894389 3318696 2959624 2502600 1915746 1045691 511573 936055
40204 936055 1832067 2294732 2315804 2377168 2281010 1611661 930562 1130303 1825502 1800242
40194 1800242 969691 435544 543174 431568 -220155 -570183 -242266 -79189 -578958
40185 -578958 -976006 -692231 -350747 -397597 -69824 1067161 1809641 1000490 -497229
40176 -497229 -1095722 -898264 -1064609 -1413787 -670901 1091647 2269053 2185305 1890558
40167 1890558 2049998 1800407 493757 -944444 -1414906 -1211275 -1149414 -1137516 -719105
40158 -719105 -225094 -211715 -330535 82675 682861 530659 -318510 -685749 194012 1784311
40148 1784311 2975663 3102127 2249637 1128005 608034 864377 1057581 359293 -903813
40139 -903813 -1725706 -1795803 -1617624 -1409211 -849682 -32724 297145 -149037 -633195 -404064
40129 -404064 309940 777054 708410 258180 -462819 -1355170 -2115784 -2478947 -2439242 -1989933
40119 -1989933 -1045845 67903 564646 140680 -417430 -116137 1027760 2127858 2492767
40110 2492767 2071377 1162905 248517 -142545 41433 203111 -57192 -271066 119345
40101 119345 734985 842745 635357 918799 1665204 1972592 1512867 896186 398484 -458901
40091 -458901 -1584914 -1788250 -457349 1115261 1160134 -286203 -1502736 -1270303 -90740
40082 -90740 748798 651567 113731 20728 651514 1320152 1143610 117919 -972440 -1671976
40072 -1671976 -2183251 -2464848 -1963381 -746229 58288 -202006 -514636 382617 1979902
40063 1979902 2636054 1962435 1260710 1524182 2233318 2514174 2463718 2669442 3039405 2810985
40053 2810985 1560016 -196474 -1413253 -1466803 -754340 -270647 -514155 -1048645 -1268782
40044 -1268782 -1166446 -1035499 -911065 -763356 -767507 -852776 -520056 265735 632746 74241
40034 74241 -501025 -65353 796559 815647 251708 534131 1789049 2490665 1892939 1123966
40024 1123966 1220530 1587289 1297791 656655 427835 482591 259367 -148077 -299569 -252764
40014 -252764 -324514 -496922 -661503 -911792 -1094960 -729541 136187 720032 662037 569839
40004 569839 891847 1185624 1120394 1163274 1507325 1428230 649933 209581 804415 1391643
39994 1391643 826438 -133329 -95816 545231 315479 -782571 -1366435 -1040839 -716843
39985 -716843 -653361 -186334 415777 -122297 -1742074 -2521089 -1358348 372567 828173
39976 828173 40546 -737833 -904659 -696789 -422370 -450655 -1179046 -2176983 -2168174 -710258
39966 -710258 893523 1224775 519622 -93513 -317376 -551126 -700336 -365672 167050
39957 167050 298728 228932 589240 1158299 1089548 378154 -43605 189501 361774 -26450
39947 -26450 -427077 -177351 535009 1168500 1623314 1962451 1906047 1293738 680373 754880
39937 754880 1350208 1715531 1693274 1872013 2428992 2604289 1817380 713106 350199 651109
39927 651109 533630 -412180 -1295186 -1278730 -694344 -215197 284122 1119207 1620901 791906
39917 791906 -982284 -2082820 -1717133 -747981 -117981 439300 1425730 2260328 1955450
39908 1955450 643339 -507942 -708203 -139127 683491 1393893 1659237 1275679 553907
39899 553907 182688 574617 1566137 2673027 3347671 3150710 2111126 899140 285912
39890 285912 420833 870721 1240400 1456797 1591827 1749012 1998729 2120658 1640077 527440
39880 527440 -396922 -319541 453318 840611 365144 -439027 -936121 -951662 -363208 970712
39870 970712 2474945 2850564 1499313 -495393 -1475976 -1030663 -123396 354507 487578
39861 487578 819991 1537283 2306176 2557231 1884764 525244 -588271 -706657 -210480
39852 -210480 -121134 -589580 -622711 313391 1242455 1061087 381482 777929 2304730 3124729
39842 3124729 2069412 354093 -171940 437781 691138 121551 -217270 257256 662647
39833 662647 227279 -333508 54280 1103794 1624757 1277227 821356 743289 647073 223147
39823 223147 -14926 551081 1668284 2474509 2546758 2248344 2032126 1793809 1189596 403600
39813 403600 94684 369327 306140 -858684 -2299542 -2252392 -291266 1910636 2568797
39804 2568797 1753975 698493 -97345 -1005664 -1948653 -2183709 -1485062 -550467 -21765
39795 -21765 105896 -49542 -538864 -1076102 -1061211 -465792 11127 3418 -54872 92590
39785 92590 -81625 -902006 -1633861 -1395279 -405862 427062 725636 697029 404221 -166887
39775 -166887 -608876 -511033 -161530 -21679 231076 1168939 2313607 2525264 1755794 1218243
39765 1218243 1488653 1610458 686543 -667547 -1278140 -1027670 -625517 -381725 -152614
39756 -152614 -64479 -322538 -567844 -334599 59244 -20096 -375292 -333962 -130811 -686320
39746 -686320 -1825777 -2054423 -696392 935442 1374563 982095 978991 1339102 1093820
39737 1093820 316266 200984 1059382 1694006 1244626 441002 331455 752190 885717
39728 885717 590544 308501 205671 233001 563264 1143761 1274201 527581 -330723 -346489
39718 -346489 76194 -201707 -1147952 -1642680 -1416480 -1357366 -1613578 -1061100 602161 1802188
39708 1802188 1283654 77346 -105907 595412 863362 625550 983483 2021008 2479691
39699 2479691 1730958 544149 -313259 -829617 -883199 -86346 1111480 1579194 1261909
39690 1261909 1376924 2264842 2574738 1492102 283265 365666 1118434 1113977 517615 570210
39680 570210 1325851 1620697 1014663 232603 -187718 -299778 57164 1061620 1963454
39671 1963454 1750638 818472 579965 1285042 1646687 868606 -391042 -1403464 -2226712
39662 -2226712 -2711862 -2204159 -964063 -418164 -1082280 -1603750 -901067 112523 206464
39653 206464 -82185 349509 945992 379592 -952437 -1299914 -264219 726409 767704
39644 767704 547891 664556 519231 -348320 -1153867 -1061329 -532483 -503584 -871142 -763664
39634 -763664 51754 918763 1333540 1508978 1782301 1951901 1515084 484883 -282112
39625 -282112 119898 1443018 2293599 1741964 565930 257316 1033461 1685557 1400111
39616 1400111 773413 685494 1017300 1074494 694673 278106 57929 -77205 -201043 -221276
39606 -221276 -34340 422886 1065326 1438940 988592 -160743 -1079648 -1080917 -546770 -268874
39596 -268874 -294891 -15914 770519 1521229 1730798 1550121 1435597 1499460 1428004 946555
39586 946555 264602 8888 559961 1432703 1652745 975558 362183 792274 1867740
39577 1867740 2221964 1282848 -18119 -466214 88171 924393 1493722 1758444 1775035
39568 1775035 1509717 1056478 644692 413289 445539 888334 1609062 1867418 1006926 -402863
39558 -402863 -878456 85068 1134014 793854 -470409 -954246 -212354 390706 -145585
39549 -145585 -928920 -521124 1010071 2242006 2143620 927736 -510653 -1324551 -1146483
39540 -1146483 -439346 -217144 -854448 -1447332 -966276 283515 1101577 1013478 575505
39531 575505 225138 -171191 -565662 -523467 -55838 175324 -169725 -641944 -817459 -854734
39521 -854734 -883626 -588788 87064 474005 34162 -766465 -1057419 -735330 -486979 -796046
39511 -796046 -1342127 -1353410 -415256 937689 1500135 661797 -667749 -1003828 -176455
39502 -176455 503501 139661 -615735 -776371 -465158 -405580 -653655 -679512 -296217 215981
39492 215981 587799 612206 169239 -250889 332816 1993992 3232244 2683562 1044329
39483 1044329 199626 731593 1487940 1542165 1305956 1416343 1637061 1444808 978367 825946
39473 825946 1256832 2002599 2493827 2180369 1009993 -301199 -862214 -525914 157320
39464 157320 810749 1495260 2129159 2319370 1941537 1343776 808748 281914 -287107 -830032
39454 -830032 -1397924 -1932631 -1843434 -605178 1118244 1861116 1205597 372233 467943 996869
39444 996869 841805 6838 -584956 -633480 -773573 -1358879 -1785060 -1297424 9637 1259559
39434 1259559 1651330 1159110 495087 347906 605095 525732 -224306 -1052516 -1201289 -678161
39424 -678161 -46306 416519 856210 1305701 1536753 1444538 1155498 728232 133629 -418881
39414 -418881 -523747 -98791 413831 525433 198434 -244343 -546355 -726302 -930193 -1143699
39404 -1143699 -1075085 -454172 452280 837406 187560 -949232 -1404922 -679194 541549
39395 541549 1273210 1287492 1043674 923696 965502 1157222 1454121 1494009 855591 -183357
39385 -183357 -653328 -71214 763326 699974 -240514 -911526 -594017 154895 407747 35338
39375 35338 -400282 -481935 -220778 206943 558795 526792 38497 -511397 -614585 -166803
39365 -166803 535130 1129193 1336648 1028489 399864 -119325 -298447 -198708 196180 890048
39355 890048 1280899 501227 -1163765 -2088686 -1333626 -20205 343308 54480 311274
39346 311274 842455 381976 -712409 -529123 1249188 2375565 1232432 -787104 -1422778
39337 -1422778 -597774 233498 617057 1192001 1957834 2221747 1990485 1890848 1863638 1331978
39327 1331978 577279 587375 1478154 2270798 2299043 1740736 833875 -185368 -436393 817433
39317 817433 2540097 2630560 721444 -1215065 -1677141 -1495634 -1919006 -2332953 -1391425
39308 -1391425 550239 1777906 1561708 708995 -23190 -697122 -1300480 -1316756 -595994
39299 -595994 163657 214080 -453845 -1312962 -1833725 -1698510 -952406 -108389 243315 39771
39289 39771 -292007 -435920 -426456 -344711 -150142 162594 509673 794056 866101 617580
39279 617580 330492 547965 1206200 1361812 418265 -793156 -1011057 -347824 -67408
39270 -67408 -606897 -947673 -226532 1068184 1992755 2350272 2401413 2135848 1534448 986376
39260 986376 758317 501447 -94794 -628745 -638798 -485744 -808283 -1417231 -1547019 -1027967
39250 -1027967 -412423 -13431 391977 838490 876172 232457 -699124 -1210548 -851207 278686
39240 278686 1461737 1778314 1056425 206455 82803 306874 -53593 -929271 -1382389
39231 -1382389 -1220311 -1312271 -2049903 -2616631 -2277710 -1399122 -596164 152665 791994 553270
39221 553270 -917631 -2488303 -2734577 -1749803 -663423 194373 1307056 2354231 2147069
39212 2147069 553316 -852201 -788813 54843 180956 -605307 -1197964 -921782 -315375
39203 -315375 -193740 -643683 -1133374 -1187006 -767316 -234992 -44534 -319868 -666297 -524906
39193 -524906 227399 1083601 1338128 732338 -268086 -849294 -610253 35841 334544
39184 334544 73188 -168690 274676 1323019 2143510 1980005 966468 46803 -54254
39175 -54254 274134 21261 -951868 -1483708 -673038 674129 1072569 561675 662536 1961999
39165 1961999 3078142 2738184 1666890 1210020 1003093 -334869 -2530256 -3512359 -2300532
39156 -2300532 -443002 231993 23469 403981 1585986 2400777 2195472 1539479 1057396
39147 1057396 681598 279320 89680 164189 76952 -396976 -822304 -673803 25062 872877
39137 872877 1499761 1622274 1151767 468713 135736 153370 37382 -186528 182917 1275460
39127 1275460 2036875 1603807 683696 664474 1723589 2743137 2890994 2357343 1582912
39118 1582912 679212 -241059 -913068 -1292250 -1505410 -1392967 -739801 31305 155015
39109 155015 -375585 -768322 -666658 -626584 -1062878 -1483335 -1202569 -217212 1005278 2044150
39099 2044150 2505909 2101850 1134845 369483 89592 -163515 -677835 -1105503 -1201737 -1204790
39089 -1204790 -1095383 -433630 493184 413928 -1131182 -2654219 -2497540 -1032347 134228
39080 134228 535730 980990 1627526 1547325 476500 -358340 208290 1749748 2859671
39071 2859671 2790064 2048000 1665208 2126158 2867251 2864127 1892959 936731 980532 1769155
39061 1769155 2314117 2276875 2104345 2013833 1695636 1046525 474243 345392 650646 1251589
39051 1251589 1993179 2581015 2744323 2468891 1840545 967563 287598 335317 766679 409591
39041 409591 -1001430 -2006883 -1347091 113947 653179 151583 -212546 -156633 -425988
39032 -425988 -1010722 -1063570 -606832 -550567 -865840 -513301 536338 1020063 564447 348651
39022 348651 961337 1355515 763586 18799 26939 418910 692228 1239378 2187873 2593093
39012 2593093 1915332 1065033 913613 1008231 814377 878001 1525760 1725361 634179 -840400
39002 -840400 -1365306 -987076 -371464 510890 1539415 1600399 239537 -1024805 -769232
38993 -769232 101237 9884 -606946 -381431 316353 190136 -350195 37892 794256 151185
38983 151185 -1547883 -2038038 -802883 205455 -16785 -116662 751367 1234390 249497
38974 249497 -1014863 -1047821 -264539 111990 4391 12839 224619 649753 1650043 2817608
38964 2817608 2633056 484838 -1985140 -2768056 -1867142 -706565 -40134 379431 749301
38955 749301 992696 1144653 1101786 454038 -775535 -1817110 -2141844 -2035596 -1709607
38946 -1709607 -841611 363696 819680 159992 -428746 -30527 447225 -207997 -1466657
38937 -1466657 -1990590 -1784762 -1823599 -2135939 -1951079 -1435272 -1596341 -2449187 -2781017 -1961966
38927 -1961966 -746924 -19518 208311 307153 460435 784898 1230132 1269576 468587 -628118
38917 -628118 -1003702 -565215 -152695 -131616 36214 617111 968550 509891 -379322 -877750
38907 -877750 -670465 -76843 403805 509230 471362 826750 1645930 2192981 1865178 1143761
38897 1143761 867591 874361 371697 -479341 -567005 380611 1190349 927499 181978 24170
38887 24170 505962 954281 1112944 1166924 1040733 485581 -282416 -663245 -370281 351658
38877 351658 1117678 1678414 1897910 1742483 1267916 545010 -222842 -519823 107302 1315549
38867 1315549 2063164 1756582 926641 449519 510195 744367 976660 1223768 1239528 727467
38857 727467 -70127 -597884 -787833 -1020875 -1224544 -729318 611435 1766368 1632071
38848 1632071 502064 -270671 -50015 363808 59356 -590135 -479217 608659 1693062
38839 1693062 1936417 1594369 1360267 1342380 1144020 572496 -221967 -1060354 -1724161 -1846214
38829 -1846214 -1306009 -589237 -272852 -284100 -171411 43862 -83536 -570049 -880564 -729794
38819 -729794 -332222 270340 1365718 2743597 3450543 2892036 1633492 596065 -31563
38810 -31563 -528266 -819830 -661936 -290665 -106989 87475 767195 1704770 2115130 1803319
38800 1803319 1396978 1313577 1265805 1028063 915236 1089755 1111211 757165 676029 1443457
38790 1443457 2365590 2130053 568925 -1077375 -1781594 -1818478 -1907082 -2023648 -1739341
38781 -1739341 -1278310 -1375136 -2117130 -2713506 -2653813 -2419341 -2570338 -2673874 -1895415 -427913
38771 -427913 540773 416673 -47941 34406 458210 546157 403542 626955 1022799 653776
38761 653776 -697879 -1993857 -2199272 -1390548 -273339 706221 1307020 1219983 518021
38752 518021 -61500 66797 559809 743011 575857 355807 -102549 -1077023 -1971007 -1800551
38742 -1800551 -719085 -48563 -480418 -1130377 -887681 -2128 345994 -308956 -1134431
38733 -1134431 -1022678 165555 1477542 1933075 1611307 1397038 1614224 1580688 996846
38724 996846 937753 2346677 4116171 4228215 2684550 1559564 1844660 2114175 1131127
38715 1131127 -66294 -43378 599920 418051 -365564 -452107 127100 185096 -359405 -352567
38705 -352567 421555 753914 16307 -935808 -1317928 -1458422 -1739027 -1748702 -1139773 -337251
38695 -337251 139447 203695 -252958 -1309590 -2181191 -1625395 263583 1773012 1711128
38686 1711128 772942 112174 -304251 -983372 -1535093 -1167236 15586 1161432 1691265
38677 1691265 1459106 458347 -876094 -1613694 -1333098 -702931 -438714 -328429 -5236
38668 -5236 80365 -571040 -1405777 -1569848 -1288819 -1379328 -1740220 -1518245 -646570 -81192
38658 -81192 -391678 -1013360 -1081945 -376502 640856 1238145 946113 89819 -459995 -423989
38648 -423989 -466349 -917928 -965576 -1530 1047704 1004105 388888 550379 1269377 1034509
38638 1034509 -322989 -1149597 -513879 544534 1000953 1388210 2290078 2780510 1859432
38629 1859432 478831 499469 2005339 3118267 2524459 1026346 292808 883727 1930942
38620 1930942 2350090 2004702 1738455 2337480 3503792 4055214 3209696 1402074 -276615
38611 -276615 -1102121 -1016398 -344756 410302 747700 497671 -111115 -816766 -1500471 -1918671
38601 -1918671 -1702241 -899228 -141493 73409 -18112 134651 671036 1323197 1839211 2039155
38591 2039155 1719625 909701 43740 -471438 -686766 -802749 -696052 -179513 486347
38582 486347 876113 1104023 1667376 2515254 2866111 2277720 1452357 1429667 2115142 2231619
38572 2231619 986474 -687831 -1129858 -34106 1168285 1211040 551157 448489 1057108
38563 1057108 1368351 886794 334968 429345 799692 631681 -168150 -954233 -1126916 -554054
38553 -554054 437888 1155799 1020745 338621 179985 1030956 1954297 1671669 213806
38544 213806 -1117691 -1285260 -422038 709757 1523945 1758208 1367257 594882 -58430
38535 -58430 -150445 416494 1316321 1869468 1409246 -54378 -1574764 -2013191 -1127525 245484
38525 245484 1055435 905593 159961 -535016 -816301 -849002 -989931 -1199908 -1076289 -608560
38515 -608560 -430956 -864805 -1111692 -144606 1708200 2865870 2351358 877560 -211859
38506 -211859 -490164 -484727 -606603 -649856 -293015 326380 687156 475055 78021 340091
38496 340091 1562208 2863354 2996422 1840581 567471 188531 530778 919920 1179775
38487 1179775 1401199 1336797 821499 383225 534982 719127 -2197 -1232252 -1371655
38478 -1371655 180580 1986075 2345348 1291380 60321 -708741 -1253602 -1608773 -1390430
38469 -1390430 -662902 -59006 151822 317045 512324 264220 -376594 -299716 1283841
38460 1283841 3354864 3949805 2524299 627907 -37591 497857 1067358 1266265 1803530
38451 1803530 2968528 3739298 3042228 1357222 252411 456964 1169722 1375101 1088670
38442 1088670 944389 1163206 1463116 1615692 1586497 1370537 1101389 1078153 1331565 1494824
38432 1494824 1478564 1800640 2675988 3267102 2668648 1344038 657258 1065805 1683411
38423 1683411 1666532 1135917 561657 86995 -238639 -248359 22090 333342 672948 1109503
38413 1109503 1256584 677571 -158047 -258046 425600 905370 729533 573109 967396 1564317
38403 1564317 2029204 2461220 2514259 1504928 2357 -271920 949848 1650074 602426
38394 602426 -418583 653807 2702879 2979621 1214686 -307771 -364718 16378 -9888
38385 -9888 85733 530553 555067 58347 81685 887714 1324574 890071 702640 1479033
38375 1479033 2201554 1921585 1369695 1492025 1749257 1301563 713779 911581 1351108
38366 1351108 866090 -273909 -744143 -243399 275805 253581 32501 -197297 -650064
38357 -650064 -1045863 -664833 405643 1055236 574985 -406632 -765572 -174121 686483
38348 686483 868849 49622 -1040138 -1201971 -145331 976349 924500 14017 -309657
38339 -309657 567850 1668893 1768964 850842 -74214 -160550 539894 1280999 1371940 873643
38329 873643 573231 1078502 1991429 2266896 1410390 55304 -716418 -423241 534922
38320 534922 1487632 2177612 2717659 2990347 2541186 1382560 480151 738819 1654592
38311 1654592 1817745 834563 -176874 -310211 -105452 -441134 -1063015 -1122797 -626833
38302 -626833 -404588 -914819 -1865043 -2786514 -3293305 -3021355 -2006431 -911217 -255605
38293 -255605 278767 1128410 1868207 1835444 1381738 1421949 1868969 1685679 634628 -153719
38283 -153719 221655 1181995 1562781 1078909 338368 -104388 -144361 133600 619570 1136277
38273 1136277 1464379 1427077 1021255 584356 581812 915064 782845 -218397 -1198552 -1001560
38263 -1001560 60643 535521 -41425 -497852 77398 894260 707918 -330396 -1051050
38254 -1051050 -975789 -612223 -265634 391148 1400143 2010361 1549135 411447 -221942
38245 -221942 418016 1922697 3109461 3180612 2489657 2039445 2215201 2345186 1737101
38236 1737101 770279 439696 969267 1494739 1230086 402471 -233810 -346034 -102969
38227 -102969 291532 598568 341162 -692892 -1759117 -1712314 -487290 662633 790614
38218 790614 421334 480801 745842 339261 -636178 -1141982 -828737 -437471 -406341 -272941
38208 -272941 136850 137732 -516253 -881676 -285268 456323 366467 -26310 327722 1052619
38198 1052619 939369 108700 -72345 782453 1525016 1377160 881326 532013 -68194
38189 -68194 -1011201 -1397167 -776477 -176054 -642884 -1632727 -1914771 -1350786 -655204 -11446
38179 -11446 783838 1165059 212024 -1664357 -2671921 -1750422 59382 876011 125235
38170 125235 -1033161 -1185034 -195452 746600 480605 -842728 -1952174 -1841250 -659475
38161 -659475 709364 1408235 891863 -724037 -2204002 -1994253 -254839 758027 -523494
38152 -523494 -2499955 -2254416 407585 2594676 2308664 930391 767267 1705347 1882208
38143 1882208 757133 -297868 -251648 373636 799838 1143580 1676641 1972630 1637400
38134 1637400 1278930 1824550 3027313 3440740 2100660 -219416 -1773620 -1709909 -824319
38125 -824319 -367311 -457638 -154408 964811 1985070 1821172 712380 -88248 112483
38116 112483 846323 1371212 1485450 1391369 1354360 1625499 2183104 2491634 2074626 1304551
38106 1304551 896724 658803 -212510 -1415628 -1465478 -2314 1149704 396622 -1230452
38097 -1230452 -1585339 -526530 236674 11471 -128146 435650 831809 485720 230079
38088 230079 728992 1235899 993529 606608 767731 718612 -508102 -2107148 -2443477
38079 -2443477 -1575148 -1124880 -1671127 -1961895 -1110212 -35086 79322 -408001 -335432
38070 -335432 461268 1120814 1145052 891549 802905 906694 1113960 1412354 1645805 1551967
38060 1551967 1146948 738260 484197 262033 8734 -187627 -390125 -729516 -876325
38051 -876325 -204488 1136237 1945699 1448517 501713 362752 654816 -62307 -1662954
38042 -1662954 -2056514 -161785 2192988 2618517 1320226 357872 535487 874069 855829
38033 855829 1175817 1982946 2214454 1375121 469301 346209 456898 176792 89513 782227
38023 782227 1414389 864462 -362752 -704116 370515 1981688 3226935 3819335 3558931
38014 3558931 2315433 619125 -584404 -880861 -551478 19090 481448 377578 -346154
38005 -346154 -888694 -456560 594955 1264890 1310743 1222349 993937 87889 -1259132 -1859080
37995 -1859080 -1154058 -58350 325669 69834 -128649 -198363 -561688 -1102112 -1169856 -654137
37985 -654137 -260245 -382206 -333000 647706 1963390 2161212 984514 -41829 345585
37976 345585 1368875 1426206 448783 -232890 -52209 238032 210687 439680 1151729 1624686
37966 1624686 1494046 1338297 1360066 883166 -88108 -305472 705056 1506417 873441
37957 873441 -295416 -572926 -194529 -74396 104257 957915 1632833 1030635 23071
37948 23071 335524 1769353 2597124 2273371 1691165 1160484 301847 -366438 -11668 542656
37938 542656 -199252 -1544971 -1291050 601157 1698841 924237 -31744 119581 399828
37929 399828 -25329 -188121 493023 771109 -41774 -469991 515701 1362723 490605 -856395
37919 -856395 -631029 614414 797000 -267893 -920293 -487245 176032 590163 1065640
37910 1065640 1412203 1031841 215356 -160317 -58806 -64230 -84168 330369 765915 523491
37900 523491 43775 229997 706148 395330 -432463 -466358 371146 795460 455321 493956
37890 493956 1364552 1859961 1105173 15272 -200917 206104 302910 72463 155090 589695
37880 589695 814446 630667 398144 430705 741206 1224154 1660812 1713360 1292664 787167
37870 787167 602473 611407 386546 -98014 -335219 59816 787173 1174157 1052589 1112060
37860 1112060 2147536 3982361 5402088 5292221 3723663 1851590 865035 1064136 1825566
37851 1825566 2395599 2668366 2998625 3299889 2937449 1896998 1369582 2310212 3846951
37842 3846951 4210437 3082935 1865728 1592523 1823987 1874969 1892844 2197035 2607753
37833 2607753 2985543 3482559 3789169 3206947 2020952 1597981 2339330 2737144 1525116
37824 1525116 -266535 -656599 632729 2119895 2641165 2304069 1730060 1442071 1809075
37815 1809075 2698490 3341032 3235159 2910851 3156177 3853024 4250527 4042405 3538229
37806 3538229 3107555 3017923 3463705 4276564 5000941 5580486 6389362 7306988 7580447 6997535
37796 6997535 6282669 5889499 5457497 4989991 5318842 6609677 7637751 7497050 6864701
37787 6864701 6607362 6400618 5832719 5516067 5746783 5391396 3715173 2135579 2383035
37778 2383035 3907655 4930980 5163121 5530780 5993427 5759321 5197440 5409403 6075525
37769 6075525 5711322 4120682 2853098 3049602 4252450 5435470 6014829 5916476 5694271
37760 5694271 6283729 7675393 8467036 7830547 7039813 7674854 9255109 10263064 10596422
37751 10596422 11200557 12085037 12629166 13225178 14803327 17321534 20285339 23832741 27757690
37742 27757690 30886054 33350859 37821750 46150332 56596458 67008450 78593820 93293195
37734 93293195 109887635 126981050 147640067 176310507 213779515 261095437 324252759
37727 324252759 403306738 475794929 504190522 468971510 389035268 303231783 236688449
37720 236688449 190561925 156945026 131593161 112496945 96480734 81730410 69297138
37713 69297138 59768323 51613808 43988038 38045506 34327507 31432883 28221921 25181892
37705 25181892 22922068 21124584 19365982 17449189 14984892 12129977 10260161 10240375
37697 10240375 10724197 10003513 8633789 8104621 7960329 6837672 5491053 5815775 7320548
37688 7320548 7615655 6282017 5233852 5137044 4554921 3129922 2599923 3716141 4769241
37679 4769241 4303558 3117096 2510975 2459046 2462975 2526954 2493077 1946963 1314961 1525527
37669 1525527 2339205 2738871 3008616 4283424 5926125 5916772 4334695 3702613 4961881
37660 4961881 5913904 5035290 4089083 4995804 6500889 6346840 4966874 4488922 5265463
37651 5265463 5829656 5598686 5420244 5737102 6019058 5898899 5488803 4763760 3767373
37642 3767373 3094289 3120151 3176715 2501041 1513272 1138884 1386656 1631245 1755376 1915106
37632 1915106 1703577 736138 -348367 -649990 -420034 -534845 -884254 -582441 339999
37623 339999 774486 219643 -497052 -463143 262252 1096211 1617026 1531463 740775 -190106
37613 -190106 -303332 547946 1271977 821577 -418837 -1051296 -365036 844525 1278745
37604 1278745 653025 -74919 72933 972951 1672265 1546545 877779 385313 532182
37595 532182 1309306 2385634 3340982 3884691 3897619 3309045 2227366 1305034 1461767
37586 1461767 2785335 4109473 4265180 3415096 2519855 1897101 1186190 442216 196458
37577 196458 477874 799506 1129911 1808452 2438392 2101513 966616 425666 1100492
37568 1100492 1897640 1745512 1149652 1098516 1385207 1158552 505324 295946 736030 1108539
37558 1108539 926076 548727 562488 1047825 1547063 1518162 874295 136705 -175322 -226515
37548 -226515 -446617 -558412 116626 1305516 1826322 1371822 1108018 1827440 2643999
37539 2643999 2486374 1835016 1690879 1642836 529611 -1372491 -2443503 -2044258 -1305764
37530 -1305764 -1259188 -1399219 -706632 754007 1921832 1974350 1022278 -145217 -739743
37521 -739743 -590076 -159721 191794 734953 1769973 2812764 3088644 2740299 2738455 3459930
37511 3459930 4123780 3943160 3150245 2434008 1944020 1450895 1091593 1208773 1519305
37502 1519305 1161931 -125627 -1324394 -1122911 492261 2076314 2300769 1334125 359822
37493 359822 39420 13219 -145452 -179453 319249 1104019 1492274 1208054 614253 167920
37483 167920 -53980 -260969 -555549 -718502 -446160 162728 568939 479438 314751 554396
37473 554396 891905 751208 475922 1011272 2281487 3012576 2622389 2135959 2418723
37464 2418723 2572938 1298707 -884349 -2171825 -1897617 -1086453 -680672 -501065 -112658
37455 -112658 431090 1004624 1610354 1893350 1373179 435897 160220 814839 1476368 1554942
37445 1554942 1676339 2422426 3190346 3191962 2781268 2736307 2800325 2110993 830257 222609
37435 222609 1045230 2698376 4056173 4467027 3950705 3117752 2914863 3769889 4987356
37426 4987356 5662868 6076348 7290750 9444003 11602983 13488368 16003479 19550142
37418 19550142 23331220 27365146 33634194 43209712 52901976 57088812 53365847 44849742
37410 44849742 36416707 30162756 25306028 20971478 17406787 14950303 13255191 11763721
37402 11763721 10238869 8698338 7250963 6042271 5135086 4517306 4271913 4416277 4541592
37393 4541592 4160546 3526562 3372288 3587349 3093332 1574037 340299 589135 1640896
37384 1640896 1992766 1449224 980668 993650 1121496 1421544 2287142 3174834 2874844 1333843
37374 1333843 -28004 -179577 410472 841161 896063 715207 356106 118706 425416
37365 425416 1016152 1137026 803429 873098 1540469 1868170 1281420 427275 10553 -102448
37355 -102448 -15372 753908 2155263 3073077 2832986 2180917 1824372 1175522 -265252
37346 -265252 -1426697 -1082518 124905 683352 544113 759910 1323847 1249776 616060
37337 616060 623638 1460091 1894440 1402038 1019257 1439102 1778734 1140219 134085 -219275
37327 -219275 -141309 -480299 -1067428 -883918 308508 1482738 1636210 971624 567128
37318 567128 1125204 2216670 2783021 2368256 1636414 1453888 1756829 1824923 1474338 1272469
37308 1272469 1544468 1901611 1979127 1983505 2144501 2138199 1482213 208646 -1139916 -1940871
37298 -1940871 -1799190 -807304 319749 732571 270032 -483398 -993342 -1185272 -1017597
37289 -1017597 -293362 793358 1483911 1281507 580297 85079 -19619 108158 590022
37280 590022 1639787 2865215 3359194 2664478 1340176 413186 423149 1094077 1802163
37271 1802163 2192394 2310961 2299390 2215702 2204729 2540426 3233554 3777685 3608049 2755065
37261 2755065 1808768 1336789 1544033 2287044 3100031 3433641 3269977 3263791 3802412 4242556
37251 4242556 3792099 2921255 2923403 3976873 4663430 3883348 2436049 2003253 3038216
37242 3038216 4349680 4585627 3599031 2366973 1869734 2115451 2287206 1915012 1575828
37233 1575828 1946804 2480987 1956793 389275 -687962 -281656 735489 1083219 967196
37224 967196 1476453 2660589 3415113 3173353 2646887 2667538 3060878 3020323 2179459 1034898
37214 1034898 438187 691059 1114228 798075 -98181 -342523 684070 1939170 2092148
37205 2092148 1411514 1251437 1932033 2352754 1815787 996960 606509 168918 -987338
37196 -987338 -2225329 -2149875 -493438 1423314 2236879 1908732 1309091 958689 677995
37187 677995 293358 88360 290758 504224 172511 -501053 -713827 -275228 4722 -453298
37177 -453298 -976401 -521988 789365 1775023 1660827 772040 -115225 -430967 53111
37168 53111 985285 1396002 710549 -220950 -12390 1276932 2078878 1475680 334002
37159 334002 -178072 -125053 -146796 -226853 -31808 235276 266006 397374 1033411 1749911
37149 1749911 1819356 1256231 598648 101800 -111143 325292 1363422 2124453 2129482 2249718
37139 2249718 3192352 3795125 2537077 281020 -536666 538731 1381259 707340 -49255
37130 -49255 714512 2256231 2946658 2741759 2560871 2303563 1253003 -176116 -758599
37121 -758599 -278444 325931 471465 426562 466212 600577 988210 1630357 1859280 1134273
37111 1134273 135303 21425 785126 1420388 1549111 1685988 1953132 1827045 1316006
37102 1316006 1122765 1297612 924690 -316185 -1312278 -948271 352067 1192683 868565
37093 868565 -25919 -353449 447460 1732570 2169960 1277801 179104 152544 807896
37084 807896 779668 -8178 -217793 632773 1362382 1148586 841257 1338888 1970885 1683252
37074 1683252 814296 400697 476185 364502 94936 202873 496461 333571 -56637 209427
37064 209427 1146552 1776697 1649771 1366343 1300717 867011 -387833 -1755359 -2124201
37055 -2124201 -1349311 -295144 247152 205134 -95244 -424977 -673463 -632503 -77640 855951
37045 855951 1589764 1606203 939887 12055 -774287 -980868 -108078 1664464 2985550
37036 2985550 2588921 1060721 238899 637119 781103 -310156 -1407157 -970025 397642
37027 397642 912096 282892 -228772 -45638 135512 -24422 63103 523774 539522 -181089
37017 -181089 -736388 -533840 -298887 -697047 -956603 -26466 1532816 2088849 1170585
37008 1170585 -162 -335632 -213099 -509610 -1062840 -881614 327210 1570637 1712663
36999 1712663 778313 -208806 -474756 -217735 -115835 -419672 -643660 -81774 1311197
36990 1311197 2523773 2323946 781335 -496231 -258538 661686 472428 -942442 -1801526
36981 -1801526 -1061881 115642 258895 -280700 -186355 705705 1395889 1321890 812404 274166
36971 274166 -28077 312956 1295680 1922717 1249589 -137196 -772158 -337303 103720
36962 103720 -82304 -256209 232424 996738 1303991 1052984 620129 289930 163879 199511
36952 199511 169228 -32623 -62484 417354 1069997 1258471 980752 811461 1045999 1535357
36942 1535357 2132452 2553219 2113237 588148 -871049 -795166 666701 1938028 2104796
36933 2104796 1670178 1233118 728543 205831 91485 303532 223882 -145149 -135973 234679
36923 234679 155240 -436889 -602970 -103012 169499 -5179 389603 1547254 1972016 860031
36913 860031 -292119 81411 1258874 1758562 1816159 2352156 2662782 1509854 -211086
36904 -211086 -420232 758296 1074118 -189384 -1120402 -414389 655402 700265 601346
36895 601346 1732983 3283273 3331045 1810888 477869 176838 -56270 -964955 -1747530
36886 -1747530 -1440849 -435433 328327 865241 1718658 2445894 1851386 -48774 -1422736
36877 -1422736 -672355 1597944 3398763 3637560 2784658 1715459 961351 967453 1920276
36868 1920276 3089585 3337057 2597266 1936887 1855109 1618887 795938 264856 816753
36859 816753 1747963 1924590 1456601 1149078 972095 416044 -98632 361817 1559668
36850 1559668 2211789 1855447 1284636 983607 499695 -216584 -192029 1069014 2486344
36841 2486344 2721262 1902727 1171857 1024675 998091 708359 343901 157758 116750 100769
36831 100769 -12677 -440091 -1203254 -1759671 -1456451 -508048 -22850 -702296 -1841556
36822 -1841556 -2077733 -993361 496386 1346178 1438651 1253372 1031739 758440 617712
36813 617712 831778 1140687 1008278 340362 -484553 -1224129 -1843814 -2072823 -1623414 -883606
36803 -883606 -586773 -676802 -397128 303195 543572 116650 93001 1004536 1585467 556864
36793 556864 -1178658 -1569723 -194681 1391730 1872571 1377905 518627 -449693 -1247022
36784 -1247022 -1451105 -1116502 -737870 -458929 -66511 281667 244141 142722 552568 1080071
36774 1080071 803308 14082 67452 1167742 1878821 1463559 1057144 1495495 1622954
36765 1622954 319417 -1131829 -712569 1077353 1804470 719513 -341976 49793 1018311
36756 1018311 1200936 759382 491846 284753 -241329 -483791 341596 1681830 2236831
36747 2236831 1794451 1276853 1108529 771209 65135 -387929 -241888 11597 31385 219977
36737 219977 738855 824954 -101104 -1324052 -1718753 -1253299 -731049 -471036 -233624 -144018
36727 -144018 -558768 -1067214 -745354 422795 1377552 1492122 1293722 1337977 1325327 861776
36717 861776 251079 -103555 -378674 -760712 -838532 -268638 495312 846343 917494 1132478
36707 1132478 1349738 1237834 1072768 1279013 1489449 1016507 121757 -140258 591039
36698 591039 1488796 1708110 1345547 992600 903630 899983 735095 343033 -69243 -161940
36688 -161940 99104 288418 103112 -121228 118397 741390 1294457 1665160 1969620 1935818
36678 1935818 1183847 123456 -231707 409449 1100256 788011 -478070 -1737569 -2156039
36669 -2156039 -1629236 -648518 173367 558373 667963 743698 780220 690052 559306 478686
36659 478686 352006 161603 129842 271657 183239 -218591 -180848 915442 2358263 2767653
36649 2767653 1899582 912069 707290 823039 303014 -913162 -1855012 -1536189 -3372
36640 -3372 1474739 1508585 206898 -750505 -245592 655987 228397 -1246366 -1799546 -729875
36630 -729875 413089 310138 -207296 284991 1517292 2090454 1637684 1144051 1388310
36621 1388310 2127194 2725090 2719525 1831661 252412 -1036330 -1001087 183911 1223977
36612 1223977 1274191 872697 975697 1538294 1629104 837724 -9140 195995 1472503 2743485
36602 2743485 3134530 2835963 2531905 2440906 2327270 2127759 1978043 1714638 967796 -109950
36592 -109950 -706544 -235498 913819 1780597 1869548 1580184 1590823 1937514 1910312 1025599
36582 1025599 -113892 -394285 404458 1383445 1827668 1983405 2186076 2060815 1284441
36573 1284441 435223 201567 268572 -80791 -684941 -797816 -329753 171443 481716 694072
36563 694072 607037 150614 22329 713827 1296510 565097 -890699 -1297018 -246003
36554 -246003 967715 1471081 1475842 803177 -1108094 -3249405 -3325017 -973093 1270736
36545 1270736 1418330 566407 574893 1053366 567656 -590832 -1039106 -827584 -1159531 -1999106
36535 -1999106 -1973046 -649302 767925 1193773 770727 62737 -663856 -1103609 -840053
36526 -840053 27354 759403 677484 -261944 -1415288 -1781881 -881042 446609 834536
36517 834536 274693 170022 1042169 1562399 754116 -326331 -436886 -229254 -727872
36508 -727872 -1029207 256994 2151588 2363355 807396 -399249 -371789 -353852 -880021
36499 -880021 -608581 1118483 2740266 2709737 1557762 557856 -161038 -915782 -1168813
36490 -1168813 -327070 954483 1443959 835450 -141249 -563088 186956 1980260 3558015
36481 3558015 3474036 1872008 391103 -37207 -102165 -410050 -383979 307849 739528 343464
36471 343464 218188 1384028 2811845 2794748 1523200 689399 1042002 1870889 2564364
36462 2564364 3160902 3489391 3135948 2289541 1530655 891971 149579 -252913 225801
36453 225801 1005480 1081212 759065 1208127 2288922 2442822 1043818 -686040 -1594782
36444 -1594782 -1936554 -2130498 -1696114 -460286 430133 -21592 -1037146 -1139014 -210211
36435 -210211 690287 1018495 1019651 702942 -154704 -1100594 -1319782 -911136 -741532 -900463
36425 -900463 -438899 1002376 2356019 2489687 1585332 559518 -162662 -588155 -495002
36416 -495002 265410 1093842 1135027 442126 -5015 467530 1463706 2069303 1777076 802626
36406 802626 -166385 -463241 9667 641148 735381 281705 -107608 36510 595139 1096572
36396 1096572 1090323 388057 -675928 -1265825 -755401 530152 1622727 1918227 1464972
36387 1464972 381488 -1291226 -2986607 -3607883 -2658424 -997932 -18911 -281962 -1225048
36378 -1225048 -1897883 -1671208 -539276 892382 1875827 2188002 2130975 1854417 1215079
36369 1215079 492091 502276 1451642 2281278 1912691 751798 165217 712233 1685578
36360 1685578 2244613 2180136 1595004 674802 -67033 -44919 634572 1202316 1206498 960723
36350 960723 879851 927699 940965 993760 1184804 1470776 1871886 2383696 2557920 1774506
36340 1774506 219830 -988337 -1061726 -429751 70799 376609 955686 1773255 2253762
36331 2253762 2158982 1829994 1546328 1266222 1098824 1392033 2048067 2287491 1582934 516344
36321 516344 175596 829681 1729659 2202221 2332495 2364029 2066559 1258910 540848 727792
36311 727792 1641915 2244971 2115309 2012758 2580201 3202963 2867810 1724010 956156
36302 956156 1196886 1811205 1882607 1312264 689028 506622 831556 1486473 2211414 2658159
36292 2658159 2446141 1409118 -112120 -1314898 -1559568 -1053981 -646901 -790555 -1036301
36283 -1036301 -805953 -277810 -66416 -305791 -588630 -665578 -656248 -625229 -492113 -375263
36273 -375263 -488965 -620293 -242584 683165 1524759 1846586 1986937 2390851 2759234 2426592
36263 2426592 1465419 818202 1118732 1801896 1816397 1055223 517673 898149 1577103 1513676
36253 1513676 755281 312081 630806 1034930 879599 468107 376209 498935 351990 -73703
36243 -73703 -282476 138289 1206328 2485168 3131163 2544579 1289285 737139 1372546
36234 1372546 2120037 1874146 958797 378367 342988 401101 432490 580406 686388 670925
36224 670925 950186 1581203 1636375 508549 -792484 -898584 -73061 440655 519425 975613
36214 975613 1634587 1457552 583403 400168 1299437 2071477 1920398 1419299 1012626 297955
36204 297955 -566136 -491364 594021 1061014 -35364 -1321850 -1106711 229969 1179314
36195 1179314 1374912 1497242 1709782 1608975 1233358 916151 535905 -77417 -455783
36186 -455783 -188129 173376 -113519 -720829 -722319 29806 899759 1512275 1936113 2093427
36176 2093427 1799727 1242422 827272 748832 1069053 1740517 2185328 1581491 127060
36167 127060 -761493 -206471 944284 1439153 1305374 1307053 1519447 1514739 1339006 1224249
36157 1224249 847978 -86781 -1013610 -1229376 -969219 -807243 -557863 175459 906923
36148 906923 874922 337229 184961 621318 1176828 1584738 1716134 1233125 302611 -21504
36138 -21504 789580 1700791 1653542 1245793 1490212 1898246 1551333 1163370 1961249 3158203
36128 3158203 2881409 1285680 302601 370142 20298 -972622 -749345 1424742 3508806
36119 3508806 3517391 2083937 954505 648705 892528 1753626 2882248 2939880 1276666
36110 1276666 -788706 -1626168 -1338154 -1024761 -950189 -676879 -294032 -316800 -806730 -1434606
36100 -1434606 -1930042 -1901750 -956386 436398 1080383 644696 150168 306222 553303
36091 553303 465828 732290 1710521 2326339 1683603 632259 382254 585526 216258 -572266
36081 -572266 -945005 -903602 -827417 -314621 950227 1946350 1638794 891468 1253907 2381024
36071 2381024 2606899 1731181 1154278 1315935 1135054 260715 -187887 287374 616200
36062 616200 124837 -215587 477279 1413198 1433300 810919 550056 662436 330555 -639003
36052 -639003 -1543952 -1808727 -1553959 -1226218 -1154881 -1404321 -1737311 -1785000 -1396308 -718729
36042 -718729 20904 580579 701394 435274 302101 617311 867025 414708 -331738 -291565
36032 -291565 723565 1653238 1590874 828665 265687 357181 849978 1118883 749273 180039
36022 180039 452447 1681863 2327678 1123500 -695888 -679282 1373651 3019205 2618181
36013 2618181 1313022 750444 696182 296333 130114 1115989 2333687 1940440 -93529
36004 -93529 -1926171 -2431326 -2244518 -2134458 -1902772 -1355566 -1046795 -1337508 -1623986 -1201687
35994 -1201687 -274430 471300 778965 776516 473001 -97546 -488855 -203394 554804 931787
35984 931787 402842 -522722 -810944 -94286 894994 1250528 1008871 923055 1233936 1325017
35974 1325017 793113 153621 -23224 -71057 -586060 -1258492 -1256204 -602708 -196309 -342082
35964 -342082 -194187 939987 2465614 3225619 2896606 2110007 1475054 1031958 578807
35955 578807 78789 -314926 -369485 102549 984199 1704714 1628295 750179 -154211 -271892
35945 -271892 407803 1172649 1470705 1443016 1479457 1572289 1451076 1176847 1137100 1409052
35935 1409052 1521434 1000861 -81214 -1155181 -1521735 -785117 654165 1616804 1247791
35926 1247791 143899 -288840 305598 869043 685091 442784 892918 1482702 1402668
35917 1402668 1189928 1900824 3095249 3146398 1593885 -156956 -755389 -358956 188923
35908 188923 526654 598505 287598 -126282 71517 954292 1518926 997789 4771 -338945
35898 -338945 85806 515026 538230 426169 431401 482245 502693 453047 108632 -661969 -1395549
35887 -1395549 -1295943 -117863 1476315 2485890 2375408 1459707 668412 714859 1278977
35878 1278977 1284675 275827 -811473 -715191 521225 1546187 1337048 321483 -354133
35869 -354133 -309164 -251305 -806249 -1452482 -1125842 129325 827911 -84742 -1556845 -1559000
35859 -1559000 279637 2218873 2710985 2056934 1385487 1107237 1092328 1401450 1891283
35850 1891283 1828945 891178 -37555 -30582 501570 639329 543996 934552 1473455 1224570
35840 1224570 512889 614713 1437504 1298405 -352832 -1650158 -843562 1170367 2204381
35831 2204381 1802466 1427877 2045273 2983872 3281073 2926817 2371101 1700352 882842
35822 882842 272128 239360 534947 546350 166162 -23410 441936 1230745 1585058 1198133
35812 1198133 471206 -387 61072 500139 789001 328216 -846223 -1748213 -1464904
35803 -1464904 -484276 -174547 -789290 -1041690 -151537 825727 629651 -240187 -421801
35794 -421801 183120 578362 471005 407611 381660 -171386 -1043298 -1370631 -1097005 -898709
35784 -898709 -705474 74549 826963 157545 -1590621 -2288244 -1204399 -181567 -580977
35775 -580977 -1139033 -385772 731780 635378 -27622 392711 1559806 1805679 1114057
35766 1114057 989114 1588176 1412230 49620 -1012351 -837983 -330502 -370787 -439752
35757 -439752 36958 530425 593106 861082 1779849 2460073 1992390 1028040 832829 1394945
35747 1394945 1680593 1385446 1250287 1703750 2177285 1931845 908807 -385469 -1364791
35738 -1364791 -1622783 -1085175 -65591 957317 1617537 1712663 1256556 653852 494888
35729 494888 858784 1096986 704497 148775 262630 893845 868867 -394835 -1798240
35720 -1798240 -1696611 46589 1774955 1943045 791102 -182538 -4584 958064 1669821
35711 1669821 1377978 54595 -1540140 -2273723 -1658971 -463762 176894 154733 274440
35702 274440 868695 1373957 1346788 992891 497721 -216772 -788972 -504230 487404 1077449
35692 1077449 828877 604616 990103 1347172 1237557 1407532 2225177 2525306 1514706
35683 1514706 565914 1251146 2595050 2428973 823821 -136115 282896 708795 372368
35674 372368 212130 761844 1107599 763814 673981 1369731 1831894 1280986 621922 923980
35664 923980 1696501 1858324 1406184 1011113 827272 718603 881730 1304317 1343228 722737
35654 722737 246425 669981 1518196 1805651 1320194 507248 -275238 -761394 -722144 -464638
35644 -464638 -634168 -1036665 -603006 908876 2247368 2394958 1830506 1274726 452370
35635 452370 -820567 -1577689 -1110651 -378229 -499004 -770732 101477 1524213 1684551
35626 1684551 415693 -459017 271480 1876914 3206713 4071359 4626910 4588628 3756110
35617 3756110 2632778 1982776 2077287 2528587 2621880 1946941 989843 754666 1453497 2134066
35607 2134066 2083960 1832332 2025937 2199788 1756993 1367286 1980701 2989805 2924138 1712704
35597 1712704 707904 537305 493867 186077 233146 902522 1420480 1225010 828783 893606
35587 893606 1348363 1838239 2145138 1798804 281915 -1836877 -2903644 -2030906 -312537
35578 -312537 449406 -240661 -1343750 -1649672 -875789 321603 1040874 938672 463103
35569 463103 196023 148263 29869 -57895 223396 741948 940638 555257 -161439 -775794
35559 -775794 -844232 -150839 702494 524012 -896156 -2098349 -1818159 -811490 -527083
35550 -527083 -719070 -179051 643007 10598 -1980541 -2991433 -1876025 -400578 -392524
35541 -392524 -1048513 -594932 846345 1781560 1747603 1490223 1326419 893195 286853 161015
35531 161015 725336 1536269 2125870 2147942 1298268 -113998 -934739 -382717 836938
35522 836938 1469914 1370041 1267737 1236904 588417 -676633 -1429968 -846837 445551 1109115
35512 1109115 597369 -425371 -959758 -702477 -207438 -130133 -482715 -788980 -779123 -549968
35502 -549968 -174150 307295 559443 274483 -164839 -79631 401145 515474 259613 495707
35492 495707 1315845 1536040 535097 -534025 -317986 893168 1893495 2238152 2085202
35483 2085202 1243276 -252152 -1256742 -697019 723888 1383163 1006965 683735 869286
35474 869286 947252 757277 936576 1479625 1510296 950768 928667 1836982 2373542 1456647
35464 1456647 -48272 -602019 -94244 486196 806760 1349212 2128318 2451222 1998462
35455 1998462 1255693 747379 494463 295599 -13460 -576667 -1227560 -1224690 34084 1924676
35445 1924676 2924922 2328279 1059170 441267 718049 1259787 1671021 1948234 1887481
35436 1887481 1268846 623958 885933 1983080 2618524 1961118 823604 448115 746022
35427 746022 717690 241020 253681 1111080 1901406 1795775 1181805 925636 1222891 1750994
35417 1750994 2337247 2827993 2808625 2177926 1645075 1928196 2685370 2943185 2442143 1833105
35407 1833105 1544185 1180095 285334 -822595 -1337891 -853940 267287 1300543 1786355
35398 1786355 1778346 1541044 1149240 586750 151530 325381 1075337 1697684 1662191 1271583
35388 1271583 1125713 1243638 1160017 677723 72391 -317225 -297015 246028 1183548 2007418
35378 2007418 2274271 2153806 2154799 2352339 2306630 1775923 1098213 730131 707808 717136 495550
35367 495550 45492 -397045 -516544 -181334 331343 460784 -122583 -1063574 -1492603 -856696
35357 -856696 381584 1126378 882273 312329 277767 661601 668996 69406 -537851 -656834
35347 -656834 -412635 -82420 205875 198692 -327702 -934532 -784829 169959 987459 1041518
35337 1041518 782043 803439 955478 911411 865011 1029106 1105668 901374 828992 1120576
35327 1120576 1186535 518647 -347615 -563567 -146936 319599 616587 731756 401642 -245444
35317 -245444 -168569 1331835 3199011 3599170 2162351 260310 -796389 -873436 -451820
35308 -451820 45820 283382 129096 -152963 -264357 -215216 55906 813123 1711415 1688948
35298 1688948 566332 -130674 852860 2538101 3173322 2852905 2871856 3087087 2141143
35289 2141143 220641 -697863 224530 1562288 2042725 2163135 2574076 2676059 1942340
35280 1942340 1122138 928704 778810 -7804 -876122 -1066879 -987724 -1366355 -1854884 -1653400
35270 -1653400 -911750 -459936 -608970 -1056572 -1506341 -1685342 -1283548 -486552 13243
35261 13243 19647 112572 501620 570637 110857 -101931 335608 704956 610275 865545 1843847
35250 1843847 2301974 1324787 225821 691804 1937042 1754569 -71333 -1483445 -1215848
35241 -1215848 -175790 511936 1056889 1983055 2963718 3427920 3355029 2866220 1846669
35232 1846669 529134 -227861 160413 1169287 1600589 735383 -943407 -2019117 -1406085
35223 -1406085 358620 1517749 1173979 320091 197238 490627 212731 -387159 -254485
35214 -254485 535872 838947 345337 -85783 -97821 -357784 -1115058 -1628193 -1464479 -1125403
35204 -1125403 -921884 -427395 451410 1040322 1087710 1222468 1615642 1409790 280622
35195 280622 -627042 -366521 221484 -190726 -1266886 -1457242 -207852 1456970 2392833
35186 2392833 2380218 1772137 965932 326004 45122 -2847 21806 178367 445488 539599
35176 539599 392303 361614 559014 521310 70052 -162467 210492 431519 -245588 -1065281
35166 -1065281 -694073 656005 1423812 1044969 666605 1157272 1802219 1727731 1407216
35157 1407216 1638457 1891342 1043512 -603405 -1419783 -671331 517769 826628 405926
35148 405926 234770 514135 587912 187281 -133247 83224 519122 647932 524905 593626
35138 593626 926362 1084940 744443 152036 -168200 -40070 176725 40563 -429855 -820387
35128 -820387 -929813 -1034248 -1334934 -1442311 -878944 47922 484889 192141 -172480 -105427
35118 -105427 93873 52094 -34015 -13069 -322195 -1164202 -1757809 -1333855 -393377 71906
35108 71906 192231 777298 1509457 1142906 -301928 -1154365 -544497 222537 -270338 -1364075
35098 -1364075 -1499268 -662829 -156453 -430345 -690951 -535602 -493970 -741611 -630454 683
35088 683 201705 -655488 -1684500 -1620347 -594945 181316 267000 513812 1548009 2551094
35078 2551094 2183224 416148 -1228510 -1420581 -526313 29444 -369886 -949580 -903359
35069 -903359 -583987 -757421 -1180909 -870418 234780 862095 125941 -1091551 -1258790
35060 -1258790 -281036 484408 283978 30312 813323 2107579 2345494 1017825 -679325
35051 -679325 -1365090 -860275 180704 1219028 1867203 1641166 508147 -635903 -850204
35042 -850204 -362500 -139088 -400829 -496943 -247075 -296334 -811576 -929771 -141127 749690
35032 749690 891661 771931 1264617 1962032 1766894 819875 428811 1037047 1616126 1429581
35022 1429581 1166054 1677933 2585726 2947974 2616362 2102644 1607887 1007978 475781
35013 475781 324246 374552 151968 -343023 -602644 -313245 340218 968119 1177948 679662
35003 679662 -324623 -1044030 -945030 -531081 -645578 -1125270 -938101 260653 1526118
34994 1526118 1882684 1483507 1067227 829490 418379 -264781 -811384 -780666 -139561 676361
34984 676361 1035789 707246 265834 496525 1265977 1561073 930971 204080 227832 566527
34974 566527 300121 -358580 -329660 559137 1154152 592823 -526501 -1016938 -523109 372512
34964 372512 1002683 1133350 926928 775857 1029873 1647125 2194368 2264847 1791487 1029710
34954 1029710 453681 519114 1179311 1775540 1785154 1440240 1116022 510369 -712974 -1781491
34944 -1781491 -1538843 -335594 182295 -460579 -782189 194353 1136416 391899 -1294123
34935 -1294123 -1753816 -588056 358536 -248181 -1562718 -2112791 -1797507 -1553060 -1735486
34926 -1735486 -1690740 -829340 404102 904491 246395 -637484 -556271 296863 584814 -170750
34916 -170750 -870438 -603416 33381 248864 489475 1251671 1554816 363388 -1229204
34907 -1229204 -1291581 -141955 75934 -1116040 -1823694 -997242 15910 39925 -48336
34898 -48336 644236 1077530 84568 -1388766 -1667410 -840402 -154369 91008 317345 236959
34888 236959 -526801 -1099163 -475439 604562 765276 405765 919756 1921407 1636688
34879 1636688 82700 -634301 297872 1127208 579002 -109153 415310 1179243 670392
34870 670392 -426732 -354215 758398 1124348 137195 -881641 -822267 -138384 210043
34861 210043 -25003 -540990 -957219 -871321 -177796 525915 517906 -22841 -247036 142692
34851 142692 661913 1000899 1337872 1644131 1613692 1451223 1763984 2401652 2415507 1579882
34841 1579882 911055 1089057 1411494 1112626 707355 958183 1372099 1029036 289748
34832 289748 244726 822965 934078 346415 -93043 -140346 -468002 -1047184 -869329 156262
34822 156262 634090 -139280 -905031 -411892 683239 1109546 944073 886116 715463 98610
34812 98610 -44713 1175995 2696084 2786590 1725574 1147986 1186647 602543 -385390 -49681
34802 -49681 1628804 2325182 947578 -538009 -231970 871179 861145 -83542 -584436
34793 -584436 -538149 -690242 -784434 -131098 708361 668528 50496 -84927 139376 -160569
34783 -160569 -699072 -343098 837115 1581647 1449110 1199195 1189419 953915 422305 75408
34773 75408 -136199 -573192 -686210 356267 1820184 1980760 747727 -134888 105528
34764 105528 219158 -594988 -1083301 35274 1936393 2840967 2212640 796387 -491920
34755 -491920 -830005 216197 1727221 1926258 613816 -186768 804269 1919433 976771
34746 976771 -1223329 -1909619 -287823 1645522 2212821 1987952 2132997 2469274 2155500
34737 2155500 1271606 708840 849285 1067491 563566 -596189 -1424464 -1129722 -195239
34728 -195239 129281 -489042 -1006154 -611378 35730 -53410 -544526 -351446 570569 1182118
34718 1182118 971931 494327 259363 138263 58242 318652 890328 1216941 1064379 834849
34708 834849 680989 72796 -1212465 -2308893 -2187939 -1024744 34884 306639 107281
34699 107281 -150602 -699564 -1836585 -3039031 -3356149 -2706926 -2116529 -2293565 -2553317
34690 -2553317 -1842168 -431171 394108 259926 183734 808509 1291402 698558 -377891
34681 -377891 -593868 269820 1167736 1248066 630730 -46573 -127110 765499 2188610 2915524
34671 2915524 2299124 1321288 1381672 2268600 2397974 1048593 -751967 -1790430 -2071888
34662 -2071888 -2216857 -2330629 -2119389 -1610473 -1172344 -1059881 -1264445 -1583055 -1657956 -1239166
34652 -1239166 -555999 -143168 -204063 -436854 -522645 -443385 -283259 -62411 203009 577106
34642 577106 1263999 2230203 2909068 2755404 1984598 1254484 755955 232271 -223333 -156659
34632 -156659 413302 899796 1038353 1161024 1375798 1189431 303538 -784701 -1358843
34623 -1358843 -1250031 -759026 -209220 181489 324769 345674 396191 399780 301152 386866
34613 386866 831933 1129859 680617 -202559 -706582 -826973 -1248799 -1889454 -1729845 -413922
34603 -413922 1081072 1820725 1945415 1869522 1546622 1154740 1406418 2329120 2700373 1644156
34593 1644156 -36496 -1068885 -1435991 -1842238 -2224918 -2031890 -1443939 -1095010 -960970
34584 -960970 -658857 -434980 -650104 -683295 273300 1551982 1605044 268806 -993699
34575 -993699 -1262932 -1134316 -1171925 -840810 310092 1545377 1835650 1047351 -341278
34566 -341278 -1833663 -2635616 -1806048 402658 2156569 2016122 747362 206437 939510
34557 939510 1960066 2510688 2785866 2947388 2650457 1869645 1235132 1104415 1046721 704862
34547 704862 494940 880623 1486969 1602824 1228923 956816 998217 1010775 828832 668778
34537 668778 497370 -105327 -1113375 -1673300 -1095705 124560 856016 720640 386159
34528 386159 545138 1147400 1680839 1710977 1056339 -72546 -959593 -902441 -63743 659049
34518 659049 833059 988752 1532408 1781394 833086 -903670 -1879369 -1180929 460580
34509 460580 1584179 1456397 465749 -492855 -735325 -148164 844786 1657212 1957718
34500 1957718 1746498 1168014 427086 -208548 -580457 -810901 -1092235 -1327178 -1225698
34491 -1225698 -782190 -386637 -330724 -390221 -85937 697612 1523127 1889219 1797348 1657073
34481 1657073 1637368 1419963 823889 371212 733357 1705970 2307303 1987352 1204950 668920
34471 668920 600226 963526 1720730 2395473 2045170 354297 -1660330 -2675769 -2452084
34462 -2452084 -1643845 -721819 144940 566336 282740 -130981 126904 816490 926168
34453 926168 232328 -387783 -361181 -143857 -189975 -118001 541352 1466179 2006024 2024614
34443 2024614 1768354 1319633 678005 78108 -194950 -112353 198569 595381 846788 808072
34433 808072 773306 1163286 1745650 1771070 1086683 437212 354152 471358 376477 377136 775899
34422 775899 1055886 616146 -131248 -243569 440353 1232972 1635362 1696728 1484038 969143
34412 969143 465201 487319 1019112 1406218 1132361 387861 -177082 -42530 730816 1416120
34402 1416120 1221326 256612 -440222 -219744 282167 124113 -523738 -747491 -373986
34393 -373986 -146927 -490542 -1005244 -1239551 -1086282 -344220 1102040 2398092 2108310
34384 2108310 142647 -1550584 -1070860 1148741 2921795 2839636 1475266 263218 -47657
34375 -47657 259746 503807 327875 -36931 -175161 -142775 -429602 -1111846 -1483189 -961823
34365 -961823 -20669 365294 4721 -404363 -380628 -201656 -253683 -479839 -695731 -882882
34355 -882882 -888509 -409421 334865 511562 -141558 -573104 282599 1798086 2339335 1654944
34345 1654944 1326821 2365648 3577975 3332267 2022402 1348858 1609481 1399041 170542
34336 170542 -599102 364353 2054876 2559308 1675836 813338 730779 807634 536570 363289
34326 363289 636583 826450 432310 -110103 -129183 219447 302332 70109 43199 355498
34316 355498 482193 48965 -564618 -698489 -268775 104797 -188295 -1064708 -1854632 -2008211
34306 -2008211 -1539108 -807409 -158020 117290 -171369 -787974 -1104737 -874168 -682181
34297 -682181 -1105718 -1693006 -1498213 -486289 438853 816046 1085935 1457603 1340487
34288 1340487 428502 -545557 -835617 -714136 -715106 -559892 206064 1057227 1064469 323791
34278 323791 -258990 -423477 -688530 -1077685 -882811 70959 957484 1099028 696826 78815
34268 78815 -850030 -1916988 -2318926 -1618904 -458168 318186 619188 638925 202636 -620414
34258 -620414 -944130 -118490 1115866 1570085 1322200 1331599 1622766 1267372 253954 -129943
34248 -129943 681291 1465358 1019457 -76052 -571655 -512129 -752967 -1119524 -613362 656566
34238 656566 1289657 660623 -160561 -99596 508970 940984 1383666 2151497 2518036 1700716
34228 1700716 472309 295634 1047864 1170250 220176 -368455 333948 1164530 734491
34219 734491 -357641 -588389 56665 314017 -99695 -130192 664259 1372269 1370636 1351243
34209 1351243 1995944 2709267 2568788 1779162 1257702 1279258 1410162 1441640 1516262 1488396
34199 1488396 1004158 296059 207534 1151827 2441948 2931210 2174916 804047 -225291
34190 -225291 -647849 -968776 -1457228 -1499906 -527311 728217 888961 -76802 -666350 -110638
34180 -110638 375568 -444563 -1654873 -1365328 497669 2071287 2075061 1069115 139479
34171 139479 -335513 -310286 322980 1256869 1842546 2069623 2582572 3361013 3424603 2406206
34161 2406206 1367883 1246289 1407015 766367 -340539 -596652 316255 1312358 1495033
34152 1495033 1222090 1318779 1838090 1962883 956816 -921720 -2471156 -2670066 -1743357
34143 -1743357 -780975 -323410 86932 849592 1621470 2085320 2566409 3225585 3394409
34134 3394409 2588883 1591770 1517726 2198506 2538124 2200807 1821188 1609310 937365 -389610
34124 -389610 -1415920 -1117391 319513 1673518 1855164 801616 -477377 -775797 51684
34115 51684 856755 596427 -335157 -706992 -31065 1156570 2243341 2886698 2684513
34106 2684513 1556078 390778 264551 956283 1251723 751784 247120 185808 58469
34097 58469 -351889 -427015 10637 148493 -314698 -309211 943496 2380810 2379186 915753
34087 915753 -659948 -1492899 -1761499 -1722159 -1332052 -749548 -343638 -186982 -105050 -82620
34077 -82620 -137056 -69976 167320 224744 -49940 -241749 -117107 -139098 -597208 -928985
34067 -928985 -742919 -766010 -1651206 -2468172 -1754987 250544 1810361 1976088 1341610
34058 1341610 601689 -161116 -620011 -187372 678578 562097 -838072 -1977608 -1633885
34049 -1633885 -680119 -658585 -1465513 -1677023 -713594 490551 901657 565754 224787
34040 224787 296102 426222 -75120 -1297976 -2284129 -1943922 -485209 697750 807819
34031 807819 594323 1049131 1877986 2025088 1222202 179131 -476704 -646536 -344739
34022 -344739 328233 838868 652489 119716 206394 1145927 2054170 2199444 1975563 2064955
34012 2064955 2181814 1489887 119007 -671137 -185050 607090 406079 -404609 -148487
34003 -148487 1630264 3168384 2713852 917318 -93888 430515 1236547 1226008 811663
33994 811663 661583 402215 -492138 -1428938 -1440309 -697691 -222077 -355092 -528035 -443680
33984 -443680 -488736 -843601 -1032684 -634811 173692 979451 1470261 1294696 272053 -992014
33974 -992014 -1395610 -709670 -84259 -592423 -1700419 -1934378 -896279 197475 173280
33965 173280 -586485 -800194 -106541 456342 -90125 -1277775 -1749723 -1010358 -29704
33956 -29704 47024 -720426 -1373096 -1371339 -1011427 -643276 -163032 497432 940427 805395
33946 805395 376292 199695 256143 16348 -685389 -1332141 -1415733 -986946 -262497 834302
33936 834302 2220747 3074396 2495317 840740 -316090 61570 1276355 1911570 1597680
33927 1597680 1124830 1062087 1076904 746303 370871 582481 1429447 2160510 1901462 581476
33917 581476 -713755 -583617 1119860 2835972 2980626 1852889 1057784 1166427 1086407
33908 1086407 28497 -1129222 -1206124 -463203 49485 190571 600333 1295706 1633243
33899 1633243 1559644 1711791 2148577 2072327 1132399 72417 -357211 -359845 -494558 -794971
33889 -794971 -1026223 -1263980 -1603349 -1664553 -1002097 155193 1044792 1186941 765390 296591
33879 296591 148727 281252 318319 35181 -173771 371777 1682696 2814617 2784412 1533999
33869 1533999 -176606 -1510460 -1991781 -1599299 -770137 -62089 445348 1132475 2024849
33860 2024849 2458159 1953714 1000947 422423 279395 35459 -401502 -521597 -111891
33851 -111891 338856 341973 78257 144611 872867 1987881 2761357 2572017 1568894 660312
33841 660312 538145 901405 1053303 991214 1222106 1627898 1418550 443914 -282665 126317
33831 126317 1223185 1879261 1715762 1277531 1053532 940961 637121 109935 -380285
33822 -380285 -517910 -240031 97096 65035 -240747 -312528 -87226 -182983 -942084 -1761319
33812 -1761319 -1892877 -1468961 -1115013 -916312 -478761 226975 784333 925244 608576
33803 608576 -174791 -972592 -733666 829563 2122564 1338517 -818724 -1721727 -455287
33794 -455287 894516 398729 -996320 -1283365 -487206 -92235 -304507 -9853 814955
33785 814955 756389 -625668 -1803394 -1391914 76990 1227608 1571684 1370643 719917
33776 719917 -287979 -1104632 -1290524 -1152868 -1172042 -1205306 -897651 -482748 -448440 -630980
33766 -630980 -339298 642442 1687782 2011007 1427328 457348 -164710 -203659 -194308 -728659
33756 -728659 -1499726 -1611700 -956601 -515594 -884377 -1304083 -883933 -105657 -110697 -892236
33746 -892236 -1319662 -886999 -354699 -456641 -913557 -1115481 -1024683 -917817 -804769 -607080
33736 -607080 -485139 -510112 -382392 -1174 -9087 -1096856 -2806611 -3696232 -2960417 -1426175
33726 -1426175 -537750 -651850 -877479 -517164 14321 -2277 -447357 -619343 -303947 108969
33716 108969 414842 716347 778225 185938 -627014 -510178 704095 1569808 930685 -323016
33706 -323016 -476681 574324 1378247 1197173 876441 1246564 1848365 1772706 928230 -83948
33696 -83948 -770796 -955164 -649386 -106288 364943 837317 1578323 2318009 2351144 1607289
33686 1607289 910003 789693 746120 204818 -484159 -695978 -613386 -836511 -1271545 -1244524
33676 -1244524 -547096 380878 1192174 1823531 2012277 1399074 234036 -675098 -912921
33667 -912921 -838747 -886122 -1009410 -1004240 -870636 -629251 -230452 117908 -25832 -706451
33657 -706451 -1353947 -1477641 -1230723 -1059415 -1211809 -1824438 -2905817 -3800592 -3337474
33648 -3337474 -1303279 690303 815119 -661750 -1715484 -1244745 -270238 -120591 -625539
33639 -625539 -919737 -1063890 -1682267 -2520759 -2640747 -1924655 -1228439 -949062 -543657 239302
33629 239302 709243 363092 -203501 -218220 97467 62977 -237302 -135356 414881 626766
33619 626766 -39835 -1123230 -1610256 -874616 773862 2229543 2448789 1471503 428688
33610 428688 289495 879911 1432837 1682826 1883367 2062823 1916926 1318559 408190 -659453
33600 -659453 -1549637 -1601577 -529816 912350 1715149 1940564 2469143 3492560 4192855
33591 4192855 4033007 3400316 2681369 1675174 438994 -191916 276246 974624 643655
33582 643655 -693488 -1819680 -1928283 -1391528 -902243 -544676 -33646 543659 703694
33573 703694 293817 -84826 324512 1451996 2358481 2321103 1609661 908868 391767 -118687
33563 -118687 -439236 -244106 143794 -3154 -714268 -1194214 -917950 -152878 730754 1711731
33553 1711731 2663660 3176396 3104702 2676418 1938194 854577 17911 217013 1040178
33544 1040178 1074756 -29289 -927036 -691525 -252273 -705167 -1425553 -1246237 -532135
33535 -532135 -466789 -924904 -754391 168159 848017 1020695 1424081 2109343 2115018 1229228
33525 1229228 612251 1063470 1894442 2158719 1902343 1526998 957704 243934 94184
33516 94184 909535 1936693 2227975 1924821 1802391 2012179 2116856 2044395 2129995 2294043
33506 2294043 1960822 955581 -54133 -303847 102145 262099 -368625 -1053928 -482832
33497 -482832 1383651 2815778 2377525 933296 448263 1109652 1229321 179612 -434050
33488 -434050 577258 1882396 1689560 597037 449924 1156482 892181 -634499 -1395995
33479 -1395995 -163577 1484745 1415276 -136436 -1210177 -863499 53401 491184 390367
33470 390367 264399 434162 838305 1132022 934091 285018 -270506 -367629 -340523 -653661
33460 -653661 -1087738 -1027553 -382244 359427 898443 1350593 1708800 1700788 1323699 989851
33450 989851 934157 904225 628125 200315 -165255 -376196 -304005 178041 804349 1022859
33440 1022859 739980 494679 606512 676646 337028 -51748 -18087 181794 44873 -212620
33430 -212620 38905 772103 1341707 1495224 1532399 1490618 1065112 460557 392184 913271
33420 913271 1110529 466358 -235667 -13809 889556 1414835 1128872 535791 143589 -100152
33410 -100152 -418128 -721219 -641942 87034 1200333 1820009 1177639 -398775 -1642501
33401 -1642501 -1767002 -1268819 -974903 -867252 -469040 61224 64015 -502651 -821111 -214630
33391 -214630 1072422 2169987 2346463 1536118 420934 -104056 183471 665799 856923
33382 856923 1158979 2155531 3486799 4126042 3688463 2824239 2260802 1984683 1497595
33373 1497595 519582 -652789 -1291121 -837081 429072 1528593 1809864 1502722 1024100
33364 1024100 314966 -645278 -1310643 -1327735 -1290912 -1816292 -2314282 -1793126 -595059 -70675
33354 -70675 -551745 -919479 -396087 428352 729309 531156 191298 -229906 -553276 -305503
33344 -305503 451928 846590 301722 -709624 -1448235 -1740291 -1591351 -789946 483900
33335 483900 1394849 1521981 1583539 2358255 3430265 3811456 3394018 2943562 2883719 2881196
33325 2881196 2595396 2200424 2061861 2261925 2509301 2379218 1728820 907519 343601
33316 343601 -2771 -389913 -667438 -566853 -508679 -1177183 -2205953 -2414800 -1686835 -1348688
33306 -1348688 -2017050 -2352605 -1043165 1035473 2001435 1568306 996743 910507 737995
33297 737995 259661 174194 744411 1098032 515898 -369226 -331335 856179 2087037 2128217
33287 2128217 958846 -180887 -176797 654902 1067189 609582 88347 131048 305964 234538
33277 234538 530296 1667461 2776263 2751659 1938476 1483799 1541179 1446451 1235010 1483158
33267 1483158 1884703 1595413 985713 1375753 2743528 3347490 2230901 616617 -12986
33258 -12986 82107 -146079 -624907 -448248 495240 1306454 1290051 578268 -340493 -1099535
33248 -1099535 -1515054 -1610880 -1581626 -1529050 -1328832 -847146 -139742 547153 805857 334700
33238 334700 -464756 -538029 506867 1463830 837772 -1053589 -2330258 -1928417 -641568
33229 -641568 349569 794444 864037 516468 -10168 -35858 607425 1288669 1716980 2375114
33219 2375114 3245219 3232067 1744270 -100666 -833925 -395146 420745 1405374 2617058
33210 2617058 3315567 2648977 1148037 259403 412712 609863 -10289 -1105453 -1749636
33201 -1749636 -1426921 -329787 812919 1247528 953907 692224 917528 1085229 578583
33192 578583 -195077 -387362 28716 381074 355274 171876 37082 113983 603178 1143397
33182 1143397 766082 -653897 -1657173 -1095594 -4131 -56512 -830715 -570017 661859
33173 661859 871330 -578814 -1862909 -1621038 -867361 -828416 -804483 248258 1528712
33164 1528712 1585736 670098 142863 259042 201070 -231041 -604175 -1115152 -2178444 -2948738
33154 -2948738 -2001714 360958 2095253 2085870 1395290 1317336 1559719 1219396 491796 321363
33144 321363 909364 1526079 1609866 1383896 1415056 1913248 2436347 2254058 1252106 365296
33134 365296 562185 1438296 1595692 563372 -569953 -800841 -498448 -385841 -195614
33125 -195614 615370 1488223 1361059 364424 -304206 -170169 18270 -252090 -422470 93469
33115 93469 968062 1617615 2037160 2364974 2265918 1469639 479278 46018 242511 673694
33105 673694 1275722 2162517 2863970 2545232 1105277 -556110 -1535508 -1717494 -1450583
33096 -1450583 -926613 -127141 941700 2150697 3133901 3236597 2017851 17910 -1387964
33087 -1387964 -1288416 -197110 596349 482197 -1505 -90354 219209 316422 -73456 -422891
33077 -422891 -53794 910544 1589449 1419069 818960 496003 402867 -70928 -952224 -1365041
33067 -1365041 -611058 876349 2034859 2380738 2324631 2380296 2462795 2130592 1322378 578070
33057 578070 428412 716771 782230 326425 -213956 -302419 39800 507919 1091691 1872423
33047 1872423 2450742 2199748 1116852 -74520 -705886 -591421 257965 1692480 3078684
33038 3078684 3563645 2983023 2007509 1161829 260241 -892752 -1837361 -1944780 -1149928
33029 -1149928 147507 1457160 2158866 1691462 297429 -910760 -1160716 -846758 -660808
33020 -660808 -509294 -25089 402043 95078 -691071 -1025838 -706806 -453524 -632762 -719222
33010 -719222 -287084 258348 330561 -55431 -540763 -981460 -1332278 -1303680 -565073 779572
33000 779572 2125060 2782245 2523328 1847515 1588382 2062005 2765817 3120119 3178068 3220835
32990 3220835 3032221 2204389 942360 -114943 -750064 -1173396 -1320341 -940707 -351241
32981 -351241 -230756 -565275 -657947 -355848 -340500 -869472 -1158003 -558529 409712 823587
32971 823587 532763 -12169 -538288 -939684 -978120 -618439 -280187 -242697 -241769 -145367 -435799
32960 -435799 -1332767 -2003384 -1542922 -375444 263976 20061 -380577 -517537 -795672
32951 -795672 -1372290 -1552672 -780718 423193 1101815 1066956 930969 1097700 1211594 741895
32941 741895 -117857 -426191 457188 1928307 2632139 2002189 887582 412138 697099
32932 697099 1133904 1403764 1533140 1300456 455349 -574875 -1027557 -873320 -770082
32923 -770082 -932823 -918890 -643581 -603056 -770597 -354663 732574 1230560 330088 -743247
32913 -743247 -243704 1473106 2284249 1206759 -431499 -1025310 -574904 100203 835389
32904 835389 1754232 2249477 1651210 619522 587099 1704012 2478262 1866198 737770
32895 737770 568480 1390875 1953926 1579565 919280 822464 1232591 1505647 1308992 832993
32885 832993 398517 190273 244247 434592 504815 284482 -95105 -269485 15763 579498
32875 579498 876278 585985 144836 343515 1226806 1856593 1596888 1143543 1497183 2245790
32865 2245790 2011682 707093 66569 1279136 3165940 3764165 2982853 2370227 2560077
32856 2560077 2427742 1091768 -488711 -713646 524266 1722902 1572316 264182 -998531
32847 -998531 -1378897 -1111837 -948072 -1095764 -985393 -199829 740740 1009946 695127 698536
32837 698536 1334701 1743244 1082913 -237763 -1059216 -889151 -311060 -137048 -593163
32828 -593163 -1275804 -1569393 -1143506 -272696 416697 645479 661029 549810 -101433 -1319371
32818 -1319371 -2007108 -1042491 970362 2072156 1357292 82430 -177659 361510 320148
32809 320148 -653481 -1436621 -1118428 -114847 665392 952822 976425 816224 463222 150592
32799 150592 86601 83607 -72900 -82315 507308 1451252 1876618 1363525 572808 530953 1449430
32788 1449430 2462874 2549111 1657429 845638 1139634 2260508 2808501 1899783 261577
32779 261577 -674937 -445225 248870 790745 1324139 2078345 2764498 3015352 2900081 2603667
32769 2603667 2031888 1165853 425170 183606 221635 178510 270788 909097 1741876 1856999
32759 1856999 1072293 296652 236674 372522 -166138 -1139737 -1468105 -902708 -509830 -1092167
32749 -1092167 -1883978 -1574862 -205362 894298 966788 628605 582771 543211 40870 -553371
32739 -553371 -682261 -663721 -1108585 -1721316 -1785619 -1549953 -1858983 -2465888 -2123161 -645443
32729 -645443 518355 402133 -60637 351401 1205143 1275540 611072 406721 1097700 1763790
32719 1763790 1475832 378167 -663910 -895977 -161655 944294 1481476 1112907 457869
32710 457869 187219 202548 164032 254359 711554 1120085 1034628 901017 1385320 2066237
32700 2066237 1847730 603197 -570602 -796304 -276457 333931 646728 596969 474269
32691 474269 868790 1930631 2827003 2644861 1614864 666966 92022 -428290 -824211
32682 -824211 -796529 -670995 -857787 -761657 335349 1575099 1438423 291490 53337
32673 53337 1103536 1681950 980223 556333 1528727 2498290 1876541 485430 -36257
32664 -36257 61535 -403614 -1029149 -502246 878343 1520521 1089723 789777 1185963 1524594
32654 1524594 1282391 811868 326538 -343358 -895772 -790939 -396873 -606998 -1297589
32645 -1297589 -1486408 -1024929 -711699 -662325 -120872 843391 1045635 141589 -557747 32675
32635 32675 1249456 1809138 1502261 1029366 903864 1124315 1336508 970392 -139976
32626 -139976 -1146492 -1057560 -288376 -240454 -1181811 -1851476 -1516494 -991152 -1009235 -1021727
32616 -1021727 -473090 54803 -8666 -144120 77459 -86555 -1141156 -1909334 -1024540
$$ [...]
##END NTUPLES=NMR SPECTRUM
##END=
