##TITLE=31Pdec_X1412
 CDCl3, 24 sc
 15.12.2021
##JCAMPDX= 6.0         $$ Bruker NMR JCAMP-DX V2.0
##DATA TYPE= NMR SPECTRUM
##DATA CLASS= NTUPLES
##ORIGIN= UXNMR, Bruker Analytische Messtechnik GmbH
##OWNER= root
$$ XWIN-NMR		Version 3.5
$$ Wed Dec 15 10:46:07 2021 Russian Standard Time (UT+4h)  she@DPX200
##.OBSERVE FREQUENCY= 81.013821
##.OBSERVE NUCLEUS= ^31P
##.ACQUISITION MODE= SIMULTANEOUS
##.ACQUISITION SCHEME= undefined
##.AVERAGES= 24
##.DIGITISER RES= 16
##SPECTROMETER/DATA SYSTEM= spect
##.PULSE SEQUENCE= zgpg30
##.SOLVENT NAME= DMSO
##.SHIFT REFERENCE= (INTERNAL, DMSO, 0, 248.564)
##AUDIT TRAIL= $$ (NUMBER, WHEN, WHO, WHERE, WHAT)
$$ ##TITLE= Audit trail, XWIN-NMR		Version 3.5
$$ ##JCAMPDX= 5.01
$$ ##ORIGIN= Bruker BioSpin GmbH
$$ ##OWNER= she
$$ F:/spectra/data/she/nmr/P31/1/pdata/1/auditp.txt
$$ ##AUDIT TRAIL=  $$ (NUMBER, WHEN, WHO, WHERE, WHAT)
(   1,<2021-12-15 10:44:53.12 +0400>,<she>,<DPX200>,
      <created by zg, POWCHK disabled, PULCHK disabled
       configuration hash MD5:
       00 E9 B6 7A A2 85 ED C7 34 08 36 98 17 FE 4E 26
       data hash MD5: 32K
       77 16 14 91 3E 5A 43 A1 53 2F 8E 8D CF 97 CA 18>)
(   2,<2021-12-15 10:44:55.75 +0400>,<she>,<DPX200>,
      <Start of raw data processing
       efp BC_mod = 2 LB = 1 FT_mod = 6 PKNL = 1 PHC0 = -9019.001 PHC1 = -264.13 SI = 64K 
       data hash MD5: 64K
       39 D4 18 5D 01 4E 19 5A 7E 62 1D F3 ED AE D8 65>)
(   3,<2021-12-15 10:45:13.29 +0400>,<she>,<DPX200>,
      <pk PHC0 = -9.994428 PHC1 = 0 
       data hash MD5: 64K
       49 5C 57 ED 6A 23 56 8C 1D 0D 16 45 41 71 EA 32>)
$$ ##END=
$$ 
$$ hash MD5
$$ 7F 09 54 7D B5 05 CC F5 BE 7E C3 8A EE 38 90 F1
##$RELAX= 
##$RELAX= 
##$RELAX= 
##$RELAX= 
##$RELAX= 
##$RELAX= 
##$RELAX= 
##$RELAX= 
$$ Bruker specific parameters
$$ --------------------------
##$DU= <F:/spectra>
##$EXPNO= 1
##$NAME= <P31>
##$PROCNO= 1
##$TYPE= <nmr>
##$USER= <she>
##$AMP= (0..31)
100 100 100 100 100 100 100 100 100 100 100 100 100 100 100 100 100 100 
100 100 100 100 100 100 100 100 100 100 100 100 100 100 
##$AQSEQ= 0
##$AQ_mod= 1
##$AUNM= <au_zg>
##$AUTOPOS= <>
##$BF1= 81.014009
##$BF2= 200.13
##$BF3= 200.13
##$BF4= 200.13
##$BF5= 200.13
##$BF6= 200.13
##$BF7= 200.13
##$BF8= 200.13
##$BYTORDA= 1
##$CFDGTYP= 0
##$CFRGTYP= 5
##$CHEMSTR= <none>
##$CNST= (0..31)
1 1 145 1 1 1 1 1 1 1 1 1 1 1 1 1 1 1 1 1 1 1 1 1 1 1 1 1 1 1 1 1 
##$CPDPRG= <waltz16>
##$CPDPRG1= <>
##$CPDPRG2= <waltz16>
##$CPDPRG3= <>
##$CPDPRG4= <mlev>
##$CPDPRG5= <mlev>
##$CPDPRG6= <mlev>
##$CPDPRG7= <mlev>
##$CPDPRG8= <mlev>
##$CPDPRGB= <>
##$CPDPRGT= <>
##$D= (0..31)
0 1 0 0 0 0 0 0 0 0 0 0.03 2e-05 3e-06 0 0 0 0 0 0 0 0 0 0 0 0 0 0 0 0 
0 0 
##$DATE= 1639550692
##$DBL= (0..7)
120 120 120 11 120 120 24 19 
##$DBP= (0..7)
150 150 150 150 150 150 150 150 
##$DBP07= 0
##$DBPNAM0= <>
##$DBPNAM1= <>
##$DBPNAM2= <>
##$DBPNAM3= <>
##$DBPNAM4= <>
##$DBPNAM5= <>
##$DBPNAM6= <>
##$DBPNAM7= <>
##$DBPOAL= (0..7)
0.5 0.5 0.5 0.5 0.5 0.5 0.5 0.5 
##$DBPOFFS= (0..7)
0 0 0 0 0 0 0 0 
$$ [...]
##$SUBNAM2= <"">
##$SUBNAM3= <"">
##$SUBNAM4= <"">
##$SUBNAM5= <"">
##$SUBNAM6= <"">
##$SUBNAM7= <"">
##$SUBNAM8= <"">
##$SUBNAM9= <"">
##$SW= 501.771253377433
##$SWIBOX= (0..15)
0 1 3 0 0 0 0 0 0 0 0 0 0 0 0 0 
##$SW_h= 40650.406504065
##$TD= 32768
##$TD0= 1
##$TE= 0
##$TE2= 300
##$TE3= 300
##$TEG= 300
##$TL= (0..7)
0 120 53 12 22 120 120 120 
##$TP= (0..7)
150 150 150 150 150 150 150 150 
##$TP07= 0
##$TPNAME0= <>
##$TPNAME1= <>
##$TPNAME2= <>
##$TPNAME3= <>
##$TPNAME4= <>
##$TPNAME5= <>
##$TPNAME6= <>
##$TPNAME7= <>
##$TPOAL= (0..7)
0.5 0.5 0.5 0.5 0.5 0.5 0.5 0.5 
##$TPOFFS= (0..7)
0 0 0 0 0 0 0 0 
##$TUNHIN= 0
##$TUNHOUT= 0
##$TUNXOUT= 0
##$USERA1= <user>
##$USERA2= <user>
##$USERA3= <user>
##$USERA4= <user>
##$USERA5= <user>
##$V9= 5
##$VALIST= <valist>
##$VCLIST= <CCCCCCCCCCCCCCC>
##$VD= 0
##$VDLIST= <DDDDDDDDDDDDDDD>
##$VPLIST= <PPPPPPPPPPPPPPP>
##$VTLIST= <TTTTTTTTTTTTTTT>
##$WBST= 1024
##$WBSW= 4
##$XGAIN= (0..3)
0 0 0 0 
##$XL= 0
##$YL= 0
##$YMAX_a= 12131
##$YMIN_a= -12693
##$ZGOPTNS= <>
##$ZL1= 120
##$ZL2= 120
##$ZL3= 120
##$ZL4= 120
##$ABSF1= 0
##$ABSF2= 0
##$ABSG= 0
##$ABSL= 0
##$ALPHA= 0
##$AQORDER= 0
##$ASSFAC= 0
##$ASSFACI= 0
##$ASSFACX= 0
##$ASSWID= 0
##$AUNMP= <proc_1d>
##$AZFE= 0.1
##$AZFW= 0.5
##$BCFW= 0
##$BC_mod= 2
##$BYTORDP= 0
##$COROFFS= 0
##$CY= -3
##$DATMOD= 1
##$DC= 0
##$DFILT= <>
##$DTYPP= 0
##$F1P= 0
##$F2P= 0
##$FCOR= 1
##$FTSIZE= 65536
##$FT_mod= 6
##$GAMMA= 0
##$GB= 0
##$INTBC= 1
##$INTSCL= 5.30512e-09
##$ISEN= 30
##$LB= 1
##$LEV0= 0
##$LPBIN= 0
##$MAXI= 10000
##$MC2= 0
##$MEAN= 0
##$ME_mod= 0
##$MI= 50
##$NCOEF= 0
##$NC_proc= -3
##$NLEV= 6
##$NOISF1= 182.463
##$NOISF2= 159.3651
##$NSP= 0
##$NTH_PI= 0
##$NZP= 0
##$OFFSET= 248.5645
##$PC= 4
##$PHC0= -9028.995
##$PHC1= -264.13
##$PH_mod= 1
##$PKNL= yes
##$PPARMOD= 0
##$PSCAL= 0
##$PSIGN= 0
##$REVERSE= no
##$SF= 81.014009
##$SI= 65536
##$SIGF1= 159.3651
##$SIGF2= -187.1042
##$SINO= 113.3802
##$SIOLD= 16384
##$SREGLST= <1H.CDCl3>
##$SSB= 0
##$STSI= 65536
##$STSR= 0
##$SW_p= 40650.406504065
##$SYMM= 0
##$S_DEV= 0
##$TDeff= 32768
##$TDoff= 0
##$TI= <>
##$TILT= no
##$TM1= 0
##$TM2= 0
##$TOPLEV= 0
##$USERP1= <user>
##$USERP2= <user>
##$USERP3= <user>
##$USERP4= <user>
##$USERP5= <user>
##$WDW= 1
##$XDIM= 65536
##$YMAX_p= 353413533
##$YMIN_p= -3026043
$$ End of Bruker specific parameters
$$ ---------------------------------
##NTUPLES= NMR SPECTRUM
##VAR_NAME=  FREQUENCY,     SPECTRUM/REAL,   SPECTRUM/IMAG
##SYMBOL=    X,             R,               I
##VAR_TYPE=  INDEPENDENT,   DEPENDENT,       DEPENDENT
##VAR_FORM=  AFFN,          ASDF,            ASDF
##VAR_DIM=   65536,         65536,           65536
##UNITS=     HZ,            ARBITRARY UNITS, ARBITRARY UNITS
##FACTOR=    0.620285442955139, 1,           1
##FIRST=     20137.2065510759, 0,            0
##LAST=      -20513.1999529892, 0,           0
##MIN=       -20513.1999529892, -3026043,    0
##MAX=       20137.2065510759, 353413533,    0
$$ Real data points
##PAGE= N=1
##DATA TABLE= (X++(R..R)), XYDATA
$$ [...]
$$ plain form
40161 -471065 -489450 -412230 -300694 -233364 -227524 -246476 -243200 -201144 -160505 -176124 -221985 -201405
40149 -201405 -105952 -77726 -216449 -405310 -458071 -375118 -303790 -292848 -255533 -155975 -63746
40138 -63746 -23384 -21085 -71544 -184033 -264525 -225385 -167136 -250081 -402784 -393073 -201269
40127 -201269 -69414 -129857 -238758 -256991 -245657 -277040 -292864 -278032 -346103 -506404 -559739
40116 -559739 -384860 -137429 -10750 14289 30394 12292 -67372 -116516 -91265 -106821 -213885
40105 -213885 -258896 -151636 -67507 -167054 -310679 -296775 -204441 -232877 -356431 -419836 -440445
40094 -440445 -520454 -569917 -426904 -178943 -58774 -66278 4724 181547 249446 95223 -141212
40083 -141212 -291816 -322166 -254601 -134273 -76936 -156114 -252260 -205610 -82768 -71513 -152323
$$ packed form
40161d71065j8385P7220J11536O7330N840j8952L276M2056M0639j5619m5861K0580
40149b01405R5453K8226j38723j88861n2761Q2953P1328J0942L7315R9558R2229
40138f3746M0362K299n0459j12489q0492L9140N8249q2945j52703R711J91804
40127b01269J31855o0443j08901j8233J1334l1383j5824J4832o8071j60301n3335
40116e59739J74879K47431J26679K5039J6105j8102p9664m9144K5251j5556j07064
40105b13885m5011J07260Q4129r9547j43625J3904R2334k8436j23554o3405k0609
40094d40445q0009m9463J43013K47961J20169p504P1002J76823O7899j54223k36435
40083a41212j50604l0350O7565J20328N7337p9178r6146M6650J22842J1255q0810
$$ plain form
40072 -152323 -137158 -24652 -28414 -206827 -340323 -266817 -101000 -13719 235 21959 55160
40061 55160 85613 142326 195622 128875 -87515 -306417 -377299 -317974 -247507 -235821 -275148
40050 -275148 -322799 -331130 -297939 -292969 -361913 -427922 -389411 -283481 -225273 -215844 -162409 -72005
40038 -72005 -53961 -121947 -164334 -137844 -127692 -179272 -226709 -231538 -240155 -252932 -185549 -28617
40026 -28617 83129 36257 -121853 -259522 -290810 -204744 -65382 -4571 -107395 -279060
40016 -279060 -327830 -200395 -33955 36036 9173 -51977 -112794 -159118 -190645 -232865 -278496
40005 -278496 -244911 -91760 62160 72600 -16291 -43201 14617 26653 -61709 -162913 -217313
39994 -217313 -256126 -277187 -227424 -136223 -107766 -154142 -183781 -166536 -154198 -136347 -53282
$$ packed form
40072a52323J5165J12506l762j78413j33496P3506J65817Q7281J3954K1724L3201
40061E5160L0453N6713N3296o6747k16390k18902p0882N9325P0467J1686l9327
40050b75148m7651q331L3191M970o8944o6009L8511J05930N8208R429N3435R0404
40038g2005J8044o7986m2387K6490J0152n1580m7437m829q617j2777O7383J56932
40026b8617J11746m6872j58110j37669l1288Q6066J39362O0811j02824j71665
40016b79060m8770J27435J66440O9991k6863o1150o0817m6324l1527m2220m5631
40005b78496L3585J53151J53920J0440q8891k6910N7818J2036q8362j01204n4400
39994b17313l8813k1061M9763R1201K8457m6376k9639J7245J2338J7851Q3065
$$ plain form
39983 -53282 36892 -7259 -181006 -317586 -327855 -279870 -228011 -159575 -125786 -208455 -328810
39972 -328810 -319456 -220430 -247243 -407441 -434464 -212617 15230 22771 -76325 -74017 -9410
39961 -9410 -41816 -161786 -254588 -315165 -391758 -432404 -382360 -329900 -372471 -437636 -413192 -353570
39949 -353570 -372717 -424805 -386611 -287282 -260613 -313677 -326423 -255957 -175270 -123728 -71595
39938 -71595 -31452 -69034 -186534 -292520 -300241 -199767 -57072 11091 -79792 -261078 -342240
39927 -342240 -234296 -65682 -256 -32189 -57613 -54705 -69221 -94368 -94416 -97874 -150708 -217807
39915 -217807 -230663 -188204 -125065 -43397 35672 34520 -61009 -129197 -81355 -17456 -74095 -201061
39903 -201061 -254081 -239747 -275409 -345069 -309116 -167807 -107877 -228143 -394263 -449195 -419990
$$ packed form
39983e3282R0174m4151j73747j36580j0269M7985N1859O8436L3789q2669j20355
39972c28810R354R9026k6813j60198k7023K21847K27847P541r9096K308O4607
39961i410l2406j19970r2802o0577p6593m0646N0044N2460m2571o5165K4444N9622
39949c53570j9147n2088L8194R9329K6669n3064j2746P0466Q0687N1542N2133
39938g1595M0143l7582j17500j05986p721J00474J42695O8163r0883j81286q1162
39927c42240J07944J68614O5426l1933k5424K908j4516k5147m8l458n2834o7099
39915b17807j2856M2459O3139Q1668P9069j152r5529o8188M7842O3899n6639j26966
39903b01061n3020J4334l5662o9660L5953J41309N9930j20266j66120n4932K9205
$$ plain form
39892 -419990 -412872 -422149 -367099 -246452 -136978 -73837 -35276 -29891 -99144 -219180 -287345
39881 -287345 -251015 -187655 -192576 -226980 -166146 3751 137676 123547 31027 -9494 -901
39870 -901 -41986 -144459 -217559 -220627 -200794 -175913 -115911 -61233 -112607 -248065 -288734 -132179
39858 -132179 91117 184017 110125 -33942 -178313 -302025 -367556 -353241 -317852 -336718 -393639
39847 -393639 -407391 -341329 -230266 -131853 -99551 -158358 -257116 -294823 -241468 -172904 -141100
39836 -141100 -95522 -4471 39121 -56577 -217738 -289444 -243220 -175536 -126798 -41685 80454
39825 80454 131991 48981 -79915 -124801 -74229 -21981 -38426 -117255 -220933 -309970 -332138
39814 -332138 -252199 -115558 -26005 -22716 -32401 621 -3338 -142983 -334455 -373267 -224649
$$ packed form
39892d19990P118r277N5050J20647J09474O3141L8561N385o9253j20036o8165
39881b87345L6330O3360m921l4404O0834J69897J33925j4129r2520m0521Q593
39870i01m1085j02473p3100l068J9833K4881O0002N4678n1374j35458m0669J56555
39858a32179K23296R2900p3892j44067j44371j23712o5531J4315L5389j8866n6921
39847c93639j3752O6062J11063R8413L2302n8807r8758l7707N3355O8564L1804
39836a41100M5578R1051M3592r5698j61161p1706M6224O7684M8738Q5113J22139
39825H0454N1537q3010j28896m4886N0572N2248j6445p8829j03678q9037k2168
39814c32138P9939J36641Q9553L289r685L3022l959j39645j91472l8812J48618
$$ plain form
39803 -224649 -99307 -161321 -303379 -333839 -259595 -215688 -207144 -127275 -828 2664 -168001
39792 -168001 -339985 -336499 -183365 -43931 -39933 -170334 -326759 -368867 -253449 -88339
39782 -88339 443 12834 7567 -30975 -129678 -205127 -170763 -106876 -138612 -198581 -128239 19950
39770 19950 29525 -132677 -275452 -315172 -377423 -506773 -550254 -432273 -292400 -234009 -180173
39759 -180173 -101934 -132854 -299567 -386499 -257066 -85568 -71019 -136559 -131139 -119127 -214475
39748 -214475 -306618 -231042 -77107 -46281 -109717 -88019 6850 -1689 -121786 -164226 -55979
39737 -55979 59375 67427 23994 8532 7432 -12612 -48254 -103186 -179209 -223562 -189377 -130524
39725 -130524 -131130 -172322 -177955 -150347 -144357 -155873 -159865 -202481 -316224 -398507 -330315 -176488
$$ packed form
39803b24649J25342o2014j42058l0460P4244M3907Q544P9869J26447L492j70665
39792a68001j71984L486J53134J39434L998j30401j56425m2108J15418J65110
39782h8339Q8782J2391n267l8542r8703p5449L4364O3887l1736n9969P0342J48189
39770A9950R575j62202j42775l9720o2251j29350m3481J17981J39873N8391N3836
39759a80173P8239l0920j66713q6932J29433J71498J4549o5540N420J2012r5348
39748b14475r2143P5576J53935L0826o3436K1698R4869q539j20097m2440J08247
39737e5979J15354Q052m3433j5462j100k0044l5642n4932p6023m4353L4185N8853
39725a30524o06m1192n633K7608N990j1516l992m2616j13743q2283O8192J53827
$$ plain form
39713 -176488 -111204 -174401 -256648 -294752 -315065 -301257 -199024 -65053 -43719 -159707 -274089
39702 -274089 -283042 -234678 -210748 -208135 -187558 -152900 -136419 -157993 -214247 -267100 -261337 -202459
39690 -202459 -177538 -239390 -325919 -363240 -369672 -364493 -273058 -63458 110322 83104 -57080
39679 -57080 -78094 44672 99470 -18631 -152278 -142086 -49230 -4411 6797 59359 98960
39668 98960 7472 -184324 -311524 -317843 -342643 -493533 -635729 -539526 -213589 54478 44072
39657 44072 -135302 -229160 -179425 -123811 -127125 -121990 -107339 -177947 -302619 -292692 -94604 82323
39645 82323 62457 -46146 -50451 34462 63500 4843 -74223 -163279 -277843 -357128 -350007 -318617
39633 -318617 -314677 -263523 -128953 -61135 -178757 -323806 -269640 -80120 -2445 -67289 -80291
$$ packed form
39713a76488O5284o3197q2247l8104k0313J3808J02233J33971K1334j15988j14382
39702b74089q953M8364K3930K613K0577L4658J6481k1574n6254n2853N763N8878
39690b02459K4921o1852q6529l7321o432N179R1435K09600J73780k7218j40184
39679e7080k1014J22766N4798j18101j33647J0192R2856M4819J1208N2562L9601
39668I8960r1488j91796j27200o319k4800j50890j42196R6203L25937K68067j0406
39657D4072j79374r3858M9735N5614l314N135J4651p0608j24672R927J98088J76927
39645H2323j9866j08603m305Q4913K9038n8657p9066q9056j14564p9285P121L1390
39633c18617L940N1154J34570O7818j17622j45049N4166J89520P7675o4844j3002
$$ plain form
39622 -80291 6246 9422 -150997 -305606 -314782 -269278 -296049 -349825 -330808 -270250 -262100 -299275
39610 -299275 -299263 -244780 -202877 -216866 -240370 -194876 -81784 -10951 -71744 -186744 -188252 -63361
39598 -63361 3339 -102412 -252450 -280088 -222547 -217232 -273250 -308444 -313278 -309397 -242967 -98461
39586 -98461 -18057 -106848 -216158 -148784 3952 -12548 -209813 -351543 -336041 -300441 -322562
39575 -322562 -296483 -169302 -55818 -34009 -36901 -24421 -64245 -164481 -213688 -167009 -119973
39564 -119973 -126465 -111933 -35321 28493 34022 32955 39053 -12152 -115727 -176268 -181310 -217001
39552 -217001 -267227 -203161 -38620 26152 -82627 -170008 -72989 92008 129333 34786 -91958
39541 -91958 -240683 -414315 -492317 -368946 -151481 -49883 -117167 -233510 -297908 -311519
$$ packed form
39622h0291Q6537L176j60419j54609r176M5504k6771n3776J9017O0558Q150l7175
39610b99275J2N4483M1903j3989k3504M5494J13092P0833o0793j15000j508J24891
39598f3361O6700j05751j50038k7638N7541N315n6018l5194m834L881O6430J44506
39586i8461Q0404q8791j09310O7374J52736j6500j97265j41730J5502L5600k2121
39575c22562K6079J27181J13484K1809k892J2480l9824j00236m9207M6679M7036
39564a19973o492J4532P6612O3814N529j067O098n1205j03575o0541n042l5691
39552b17001n0226O4066J64541O4772j08779q7381R7019J64997L7325r4547j26744
39541i1958j48725j73632p8002J23371K17465J01598o7284j16343o4398j3611
$$ plain form
39531 -311519 -306923 -297362 -275890 -211916 -95664 -9024 -55170 -185280 -227737 -146211 -110196
39520 -110196 -212525 -285856 -154069 73053 147662 35227 -84365 -121829 -178332 -325646
39510 -325646 -466295 -482935 -409470 -366362 -381925 -360508 -234069 -93996 -111898 -311256 -484483
39499 -484483 -418510 -166554 14743 -12694 -142043 -232893 -291805 -369652 -418072 -363208 -233609
39488 -233609 -108625 -8187 71876 83947 -6872 -130448 -181897 -151332 -102210 -58225 1888
39477 1888 63444 75692 28560 -31661 -61515 -57619 -48438 -73675 -143750 -201634 -172076 -72979
39465 -72979 -18563 -75704 -177928 -223659 -195019 -132220 -65197 -35254 -104316 -246571 -294362
39454 -294362 -116386 172775 305954 179239 -35979 -131532 -107011 -103152 -172764 -232435 -221428
$$ packed form
39531c11519M596R561K1472O3974J16252Q6640m6146j30110m2457Q1526L6015
39520a10196j02329p3331J31787K27122P4609j12435j19592l7464n6503j47314
39510c25646j40649j6640P3465M3108j5563K1417J26439J40073j7902j99358j73227
39499d84483O5973K51956J81297k7437j29349r0850n8912p7847m8420N4864J29599
39488b33609J24984J00438Q0063J2071r0819j23576n1449L0565M9122M3985O0113
39477A888O1556J2248m7132o0221k9854L896R181k5237p0075n7884K9558R9097
39465g2979N4416n7141j02224m5731K8640O2799O7023K9943o9062j42255m7791
39454b94362J77976K89161J33179j26715k15218r5553K4521L859o9612n9671J1007
$$ plain form
39443 -221428 -192390 -208979 -242514 -235208 -204348 -203702 -222563 -213115 -190519 -202237 -213093 -145251
39431 -145251 -40185 -37365 -149101 -206239 -107960 17354 12674 -76984 -117558 -121247 -196421
39420 -196421 -328597 -389025 -339074 -271085 -248169 -233140 -180606 -96246 -8853 36931 -7823
39409 -7823 -115992 -176306 -150656 -149812 -242835 -306359 -219942 -95375 -106794 -188836 -150057 -24939
39397 -24939 -33176 -197377 -291232 -214070 -136989 -183395 -224489 -132249 -15209 -30477 -127270
39386 -127270 -156085 -116972 -128744 -221290 -306506 -324692 -309480 -315153 -345691 -355971 -306075 -228949
39374 -228949 -220470 -313367 -401556 -371058 -263103 -203659 -217626 -242000 -278298 -370736 -455349
39363 -455349 -407239 -245111 -123707 -109787 -125480 -122724 -142293 -179208 -162132 -97096 -67906
$$ packed form
39443b21428K9038j6589l3535P306L0860O46j8861R448K2596j1718j0856O7842
39431a45251J05066K820j11736n7138R8279J25314m680q9658m0574l689p5174
39420a96421j32176o0428M9951O7989K2916J5029N2534Q4360Q7393M5784m4754
39409g823j08169o0314K5650Q44r3023o3524Q6417J24567j1419q2042L8779J25118
39397b4939q237j64201r3855P7162P7081m6406m1094R2240J17040j5268r6793
39386a27270k8815L9113j1772r2546q5216j8186J5212n673l0538j0280M9896P7126
39374b28949Q479r2897q8189L0498J07955N9444j3967k4374l6298r2438q4613
39363d55349M8110J62128J21404J3920j5693K756j9569l6915J7076O5036K9190
$$ plain form
39352 -67906 -69181 -8935 97481 115548 10499 -96017 -126618 -135277 -161274 -172415 -187115
39341 -187115 -272211 -384016 -393659 -303626 -255541 -297810 -335965 -325980 -309735 -259523 -125104
39330 -125104 -29571 -139712 -337606 -343743 -191502 -202553 -416345 -468995 -201207 43008
39320 43008 -28851 -205474 -187657 -95238 -181536 -337580 -297704 -122820 -61823 -91619 -7603
39309 -7603 139563 105636 -103825 -228058 -171820 -97279 -104328 -129268 -157314 -239361 -297620
39298 -297620 -203111 -49143 -59080 -213152 -264139 -149131 -74474 -132325 -152347 -47900 -4871
39287 -4871 -150973 -294858 -217002 -32148 -16690 -185423 -286671 -193174 -78505 -145222 -328787
39276 -328787 -388221 -235325 -48727 -28153 -135070 -180281 -116879 -92923 -195862 -309735
$$ packed form
39352f7906j275O0246J06416J8067j05049j06516l0601q659k5997j1141j4700
39341a87115q5096j11805r643R0033M8085m2269l8155R985J6245N0212J34419
39330a25104R5533j10141j97894o137J52241j1051k13792n2650K67788K44215
39320D3008p1859j76623J7817R2419q6298j56044L9876J74884O0997k9796Q4016
39309g603J47166l3927k09461j24233N6238P4541p049k4940k8046q2047n8259
39298b97620R4509J53968r937j54072n0987J15008P4657n7851k0022J04447M3029
39287d871j46102j43885P7856J84854J5458j68733j01248R3497J14669o6717j83565
39276c28787n9434J52896J86598K0574j06917m5211O3402K3956j02939j13873
$$ plain form
39266 -309735 -310385 -261329 -290452 -376163 -396832 -326935 -253684 -242192 -292568 -388707 -495312 -550020
39254 -550020 -534000 -493110 -434351 -299996 -110569 1017 -3564 20832 149543 207404 28415
39243 28415 -241887 -324382 -185489 -13866 91427 162324 158348 -3760 -229133 -311644 -238176
39232 -238176 -189998 -223756 -199504 -69886 13667 -30193 -72193 -17785 16093 -85590 -218052
39221 -218052 -212384 -81064 43550 111041 144281 116078 -6564 -143932 -178427 -130552 -131078
39210 -131078 -218861 -288130 -262356 -212156 -241132 -329458 -369718 -322377 -252952 -218247 -199870
39199 -199870 -180322 -203264 -288077 -344715 -273087 -120206 -30460 -42181 -46405 31435 119946
39188 119946 115204 12424 -121011 -221997 -246590 -196407 -158700 -219458 -311239 -272600 -95969
$$ packed form
39266c09735o50M9056k9123q5711k0669O9897P3251J1492n0376r6139j06605n4708
39254e50020J6020M0890N8759J34355J89427J11586m581K4396J28711N7861j78989
39243B8415k70302q2495J38893J71623J05293P0897l976j62108k25373q2511P3468
39232b38176M8178l3758K4252J29618Q3553m3860m2000N4408L3878j01683j32462
39221b18052N668J31320J24614O7491L3240k8203j22642j37368l4495M7875n26
39210a31078q7783o9269K5774N0200k8976q8326m0260M7341O9425L4705J8377
39199a99870J9548k2942q4813n6638P1628J52881Q9746j1721m224P7840Q8511
39188A19946m742j02780j33435j00986k4593N0183L7707o0758r1781L8639J76631
$$ plain form
39177 -95969 33457 9780 -48189 -23913 -5087 -107588 -242263 -248118 -162982 -160265 -261731
39166 -261731 -303526 -187160 -8532 85482 56218 -32219 -98970 -114509 -125801 -198147 -311594
39155 -311594 -372094 -347685 -301271 -252806 -135050 44848 140424 71246 -34070 -28169 38024
39144 38024 31280 -36516 -57107 -21512 -6654 -23341 -21297 2368 21986 52281 89354 62631
39132 62631 -39940 -95426 -23668 63037 32810 -51155 -51367 13253 34731 15276 11427 -22925
39120 -22925 -132218 -190816 -69357 101263 76657 -133051 -283706 -258105 -163334 -81847 20404
39109 20404 119704 114086 22651 -12634 30812 23029 -62850 -80606 29027 111739 32531 -130942
39097 -130942 -224627 -210809 -146423 -95322 -124931 -264236 -411219 -410577 -270475 -164360 -171456
$$ packed form
39177i5969J29426k3677n7969K4276J8826j02501j34675n855Q5136K717j01466
39166b61731m1795J16366J78628R4014k9264q8437o6751j5539j1292p2346j13447
39155c11594o0500K4409M6414M8465J17756J79898R5576o9178j05316N901O6193
39144C8024o744o7796k0591L5595J4858j6687K044K3665J9618L0295L7073k6723
39132F2631j02571n5486P1758Q6705l0227q3965k12O4620K1478j9455l849l4352
39120b2925j09293n8598J21459J70620k4606k09708j50655K5601R4771Q1487J02251
39109B0404R9300n618r1435l5285M3446p783q5879j7756J09633Q2712p9208j63473
39097a30942r3685J3818O4386N1101k9609j39305j46983O42J40102J06115p096
$$ plain form
39086 -171456 -173088 -78051 9455 -44065 -195919 -310050 -351695 -378242 -399654 -366582 -274721
39075 -274721 -188419 -154046 -142767 -94419 -1341 64891 26833 -98627 -210049 -239548 -202755
39064 -202755 -117568 28471 178189 188398 16110 -172196 -196975 -95100 -33521 -74163
39054 -74163 -161440 -267672 -391968 -465988 -418803 -302973 -220950 -175865 -132589 -154924 -311624
39043 -311624 -504085 -569434 -509395 -436820 -352487 -184934 -9422 7197 -126560 -238706
39033 -238706 -272427 -322987 -387283 -328952 -145556 -30196 -82695 -170540 -166741 -128139 -139532
39022 -139532 -166917 -174968 -221969 -322907 -367943 -293670 -205732 -220197 -296255 -325603 -282785
39011 -282785 -199628 -97284 -28048 -76021 -224657 -321743 -268737 -160412 -149252 -246169 -339871
$$ packed form
39086a71456j632R5037Q7506n3520j51854j14131m1645k6547k1412L3072R1861
39075b74721Q6302L4373J1279M8348R3078O6232l8058j25460j11422k9499L6793
39064b02755Q5187J46039J49718J0209j72288j88306k4779J01875O1579m0642
39054g4163q7277j06232j24296p4020M7185J15830Q2023M5085M3276k2335j56700
39043c11624j92461o5349O0039P2575Q4333J67553J75512J6619j33757j12146
39033b38706l3721n0560o4296N8331J83396J15360n2499q7845L799L8602j1393
39022a39532k7385q051m7001j00938m5036P4273Q7938j4465p6058k9348M2818
39011b82785Q3157J02344O9236m7973j48636r7086N3006J08325J1160r6917r3702
$$ plain form
39000 -339871 -354413 -313651 -290529 -338921 -435312 -469561 -353557 -152213 -35980 -89085 -231582
38989 -231582 -330354 -310922 -173156 6125 92718 19179 -115358 -166157 -138135 -143205 -197881
38978 -197881 -214920 -178740 -160765 -161211 -115721 -72668 -164621 -357800 -433190 -299708 -138080
38967 -138080 -124988 -185496 -153791 -35463 44767 49728 24529 -44123 -201480 -381496 -434748
38956 -434748 -323841 -191617 -188812 -288837 -328655 -221292 -68979 -25653 -89613 -121382 -62634
38945 -62634 -16016 -61712 -123240 -108282 -68893 -100313 -174231 -204301 -196423 -201323 -198967 -165226
38933 -165226 -161431 -210666 -193577 -44218 64834 -50369 -272932 -346464 -265926 -230231 -264517
38922 -264517 -207634 -71591 -78950 -274625 -406236 -305467 -128649 -86863 -157937 -202853 -183474
$$ packed form
39000c39871j4542M0762K3122m8392r6391l4249J16004K01344J16233n3105j42497
38989b31582r8772J9432J37766J79281Q6593p3539j34537n0799K8022n070n4676
38978a97881j7039L6180J7975m46M5490M3053r1953j93179p5390J33482J61628
38967a38080J3092o0508L1705J18328Q0230M961k5199o8652j57357j80016n3252
38956d34748J10907J32224K805j00025l9818J07363J52313M3326o3960l1769N8748
38945f2634M6618m5696o1528J4958L9389l1420p3918l0070P878m900K356L3741
38933a65226L795m9235J7089J49359J09052j15203k22563p3532Q0538L5695l4286
38922b64517N6883J36043p359j95675j31611J00769J76818M1786p1074m4916J9379
$$ plain form
38911 -183474 -135584 -76980 -46907 -102551 -204038 -241282 -219705 -255790 -349176 -350614 -214204
38900 -214204 -83194 -52288 -44303 -9127 -42405 -192946 -333207 -347421 -300657 -309343 -374641
38889 -374641 -434458 -452112 -382734 -191437 30605 114573 37301 -53184 -76833 -108798 -179352
38878 -179352 -191683 -123147 -110025 -221593 -321507 -266435 -97587 57026 132356 109117 -5050
38867 -5050 -117082 -118559 -50709 -39717 -67502 -20934 32528 -100223 -361033 -430430 -201542
38856 -201542 38929 45316 -67574 -110426 -129029 -208995 -237858 -118869 -8984 -86308 -252560
38845 -252560 -305258 -249460 -212557 -200028 -160305 -153285 -233890 -294239 -231467 -151851 -206122 -337473
38833 -337473 -385931 -330862 -252231 -172869 -110160 -148737 -286655 -351168 -242188 -105153 -85172
$$ packed form
38911a83474M7890N8604L0073n5644j01487l7244K1577l6085r3386j438J36410
38900b14204J31010L0906P985L5176l3278j50541j40261j4214M6764q686o5298
38889c74641n9817j7654O9378J91297K22042Q3968p7272r0485k3649l1965p0554
38878a79352j2331O8536J3122j11568r9914N5072J68848J54613P5330k3239j14167
38867e050j12032j477O7850J0992k7785M6568N3462j32751k60810o9397K28888
38856b01542K40471O387j12890m2852j8603p9966k8863J18989J09885p7324j66252
38845b52560n2698N5798L6903J2529L9723P020q0605o0349O2772P9616n4271j31351
38833c37473m8458N5069P8631P9362O2709l8577j37918o4513J08980J37035J9981
$$ plain form
38822 -85172 -89389 2369 82977 17884 -77693 -30756 74752 54349 -47913 -79075 -93501
38811 -93501 -233171 -400559 -387166 -254547 -244302 -351849 -340434 -173588 -81109 -153409 -206425
38800 -206425 -134271 -89848 -195680 -338709 -388234 -396300 -442505 -467473 -403264 -320967 -314291
38789 -314291 -347423 -331734 -269115 -230254 -253457 -320770 -380973 -378382 -320530 -301002 -368353 -412170
38777 -412170 -308160 -138535 -97104 -187092 -214268 -109404 -39378 -111153 -174938 -71583 90598
38766 90598 100546 -17348 -45435 75148 143578 -906 -244312 -363043 -315009 -241395 -234425
38755 -234425 -242374 -208227 -172613 -185080 -209782 -192312 -150141 -124290 -105880 -85374 -103157 -162112
38743 -162112 -167949 -67670 31480 15552 -43310 -12134 58635 19044 -102270 -138105 -86293
$$ packed form
38822h5172m217R1758Q0608o5093r5577M6937J05508k0403j02262l1162j4426
38811i3501j39670j67388J3393J32619J0245j07547J1415J66846R2479p2300n3016
38800b06425P2154M4423j05832j43029m9525q066m6205k4968O4209Q2297O676
38789c14291l3132J5689O2619L8861k3203o7313o0203K591N7852J9528o7351m3817
38777d12170J04010J69625M1431q9988k7176J04864P0026p1775o3785J03355J62181
38766I0598R948j17894k8087J20583O8430j44484k43406j18731M8034P3614O970
38755b34425p949L4147L5614j2467k4702J7470M2171K5851J8410K0506j7783n8955
38743a62112n837J00279R9150j5928n8862L1176P0769l9591j21314l5835N1812
$$ plain form
38732 -86293 -121156 -276400 -372092 -318243 -242658 -234304 -207903 -130708 -134215 -258565 -320884 -206876
38720 -206876 -80184 -116702 -227098 -246596 -223558 -291945 -393467 -360348 -189893 -33602
38710 -33602 28467 38395 42391 53919 71938 42036 -102056 -277982 -282619 -85223 75696
38699 75696 21163 -117936 -134760 -49626 7031 41446 108587 123765 -5526 -169972 -198786
38688 -198786 -113813 -46539 -12256 28482 1680 -157820 -313772 -289833 -143035 -56716 -47847
38677 -47847 -10976 32375 -18910 -108970 -91437 757 -4951 -131588 -235644 -265392 -305508
38666 -305508 -363098 -335942 -219637 -144383 -170037 -215982 -218614 -199967 -166084 -92297 -22808
38655 -22808 -39227 -119540 -162016 -148668 -153273 -194664 -216814 -210382 -224115 -256719 -257342 -232750
$$ packed form
38732h6293l4863j55244r5692N3849P5585Q354K6401P7195l507j24350o2319J14008
38720b06876J26692l6518j10396j9498K3038o8387j01522L3119J70455J56291
38710c3602O2069R928L996J1528J8019k9902j44092j75926m637J97396J60919
38699G5696n4533j39099j6824Q5134N6657L4415O7141J5178j29291j64446k8814
38688a98786Q4973O7274L4283M0738k6802j59500j55952K3939J46798Q6319Q869
38677d7847L6871M3351n1285r0060J7533R2194n708j26637j04056k9748m0116
38666c05508n7590K7156J16305P5254k5654m5945k632J8647L3883P3787O9489
38655b2808j6419q0313m2476J3348m605m1391k2150O432j3733l2604o23K4592
$$ plain form
38643 -232750 -247012 -315926 -385777 -400018 -323608 -152483 32882 96426 5213 -125037 -211322
38632 -211322 -307194 -433927 -460412 -296404 -76592 7409 -49157 -135192 -218260 -308366 -344577
38621 -344577 -287261 -222169 -222891 -226977 -190354 -212671 -343221 -430005 -354745 -245835 -244686 -245792
38609 -245792 -119846 -11054 -114586 -311101 -343654 -237885 -217310 -297307 -300705 -208744 -162027
38598 -162027 -157967 -69799 69301 111438 80281 101518 106340 -54330 -251791 -215519 -10515
38587 -10515 20017 -186956 -321282 -232591 -143857 -205167 -227682 -55895 127955 97183 -77845
38576 -77845 -190798 -194445 -153172 -83138 -1265 24619 4246 47930 156955 163046 -12057
38565 -12057 -203728 -228229 -115177 -14872 -6390 -82026 -195345 -257619 -208135 -126525 -142484
$$ packed form
38643b32750j4262o8914o9851j4241P6410J71125J85365O3544r1213j30250q6285
38632b11322r5872j26733k6485J64008K19812Q4001n6566q6035q3068r0106l6211
38621c44577N7316O5092p22m086L6623k2317j30550q6784P5260J08910J149j106
38609b45792J25946J08792j03532j96515l2553J05769K0575p9997l398R1961M6717
38598a62027M060Q8168J39100M2137l1157K1237M822j60670j97461L6272K05004
38587a0515L0532k06973j34326Q8691Q8734o1310k2515J71787J83850l0772j75028
38576g7845j12953l647M1273P0034Q1873K5884k0373M3684J09025O091j75103
38565a2057j91671k4501J13052J00305Q482p5636j13319o2274M9484Q1610j5959
$$ plain form
38554 -142484 -222888 -215304 -112117 -71589 -145115 -194440 -135447 -60619 -51224 -58649 -41991 -45534
38542 -45534 -79573 -96271 -124521 -244629 -400182 -439873 -372561 -351831 -378097 -283318 -74061
38531 -74061 -233 -167936 -357738 -370540 -293650 -258871 -194069 -25299 96493 13163 -157286
38520 -157286 -185980 -61518 51408 71790 23292 -104751 -310778 -459537 -401802 -188447
38510 -188447 -9859 52087 72195 104729 97079 -4797 -160908 -271626 -263147 -143076 -1062
38499 -1062 62447 23125 -75289 -200395 -338949 -436394 -421754 -311446 -206523 -167035 -163884
38488 -163884 -163091 -171718 -187548 -187675 -177715 -171973 -129425 -7030 125483 137554 23430 -70283
38476 -70283 -34816 72792 128428 97282 53758 82817 179373 239097 174908 40992 -31927
$$ packed form
38554a42484q0404P584J03187M0528p3526m9325N8993P4828R395p425J6658l543
38542d5534l4039j6698k8250j20108j55553l9691O7312K0730k6266R4779K09257
38531g4061P3828j67703j89802j2802P6890L4779O4802J68770J21792q3330j70449
38520a57286k8694J24462J12926K0382m8498j28043k06027j48759N7735K13355
38510a88447J78588O1946K0108L2534p650j01876j56111j10718Q479J20071J42014
38499a062O3509l9322r8414j25106j38554r7445J4640J10308J04923L9488L151
38488a63884P93q627j5830j27R960N742M2548J22395J32513J2071j14124r3713
38476g0283L5467J07608N5636l1146m3524K9059R6556N9724o4189j33916p2919
$$ plain form
38465 -31927 -30064 -62292 -139568 -116353 59369 214122 199742 107268 73549 48222 -54510
38454 -54510 -140003 -96930 -32755 -104186 -238881 -270201 -226213 -233914 -262230 -222617 -191571 -252309
38442 -252309 -259310 -72698 120350 69800 -90665 -52468 133478 164553 38722 25707 126212
38431 126212 58159 -194026 -309564 -184306 -84264 -146901 -181357 -84272 -16515 -36953 10049
38420 10049 112893 38493 -202087 -288855 -148966 -100252 -254413 -285734 -46257 99330
38410 99330 -117669 -395202 -369424 -179048 -124225 -147018 -75395 -38362 -189665 -315177 -170942
38399 -170942 41085 -13778 -237676 -298316 -194430 -165100 -200540 -115302 6375 -90175 -341290
38388 -341290 -415567 -239944 -78048 -78022 -109668 -77341 -58827 -86508 -78595 -31654 -36613 -83475
$$ packed form
38465c1927J863l2228p7276K3215J75722J54753j4380r2474l3719k5327j02732
38454e4510q5493M3073O4175p1431j34695l1320M3988p701k8316L9613L1046o0738
38442b52309p001J86612J93048n0550j60465L8197J85946L1075j25831j3015J00505
38431A26212o8053k52185j15538J25258J00042o2637l4456R7085O7757k0438M7002
38420A0049J02844p4400k40580q6768J39889M8714j54161l1321K39477J45587
38410I9330k16999k77533K5778J90376N4823k2793P1623L7033j51303j25512J44235
38399a70942K12027n4863k23898o0640J03886K9330l5440Q5238J21677r6550k51115
38388c41290p4277J75623J61896K6l1646L2327J8514k7681P913M6941m959m6862
$$ plain form
38376 -83475 -73949 -24299 -37579 -93004 -77947 144 42871 51632 73249 24980 -182228 -410379
38364 -410379 -448198 -347837 -335358 -429133 -441883 -340814 -290678 -320346 -263734 -92687 -4333
38353 -4333 -80433 -142912 -75439 -28415 -143689 -301736 -332329 -296244 -349183 -453677 -444087
38342 -444087 -313771 -233577 -288392 -362397 -324963 -208703 -137923 -153757 -185384 -168589 -125478
38331 -125478 -115922 -156365 -213838 -253567 -266592 -270722 -301225 -368522 -412464 -358181 -242685 -195302
38319 -195302 -235849 -208926 -26250 146643 106954 -85229 -223664 -285488 -395989 -518993
38309 -518993 -481023 -317204 -281019 -430354 -502853 -333148 -116236 -81958 -153397 -137760 -53829
38298 -53829 -40522 -93275 -119315 -142700 -236283 -326313 -267735 -77254 72613 72802 -29715
$$ packed form
38376h3475R526M9650j3280n5425J5057P8091M2727Q761K1617m8269k07208k28151
38364d10379l7819J00361J2479r3775j2750J01069N0136k9668N6612J71047Q8354
38353d333p6100o2479O7473M7024j15274j58047l0593L6085n2939j04494R590
38342d44087J30316Q0194n4815p4005L7434J16260P0780j5834l1627J6795M3111
38331a25478R556m0443n7473l9729j3025m130l0503o7297m3942N4283J15496M7383
38319a95302m0547K6923J82676J72893l9689j92183j38435o1824j10501j23004
38309e18993L7970J63819L6185j49335p2499J69705K16912L4278p1439J5637Q3931
38298e3829J3307n2753k6040k3385r3583r0030N8578J90481J49867J89j02517
$$ plain form
38287 -29715 -134231 -186582 -198486 -222776 -277826 -289141 -186810 -55314 -55673 -188761 -293491
38276 -293491 -301017 -304295 -334185 -281242 -123461 -19081 -58069 -118335 -97700 -98572 -230123 -391014
38264 -391014 -408337 -266058 -66385 110079 197203 136839 -11780 -91641 -65925 -66382 -151377
38253 -151377 -201301 -142709 -73404 -61531 -35403 12121 -55533 -252407 -367805 -301751 -259501
38242 -259501 -405392 -555384 -461641 -208696 -59727 -57620 -43420 36145 87564 67125 12235
38231 12235 -67369 -167720 -225893 -205011 -158935 -116549 -28812 78705 72025 -60125 -133268
38220 -133268 -57335 7110 -62569 -126288 -36995 85387 54242 -83171 -157680 -136224 -78324
38209 -78324 3672 65954 -1325 -155639 -162049 36349 148708 -30454 -268260 -256399 -92105
$$ packed form
38287b9715j04516n2351j1904k4290n5050j1315J02331J31496l59j33088j04730
38276b93491p526l278k9890N2943J57781J04380l8988o0266K0635q72j31551j60891
38264c91014j7323J42279J99673J76464Q7124o0364j48619p9861K5716m57q4995
38253a51377m9924N8592O9305J1873K6128M7524o7654j96874j15398O6054M2250
38242b59501j45891j49992R3743K52945J48969K107J4200P9565N1419k0439n4890
38231A2235p9604j00351n8173K0882M6076M2386Q7737J07517o680j32150p3143
38220a33268P5933O4445o9679o3719Q9293J22382l1145j37413p4509K1456N7900
38209g8324Q1996O2282o7279j54314o410J98398J12359j79162k37806J1861J64294
$$ plain form
38198 -92105 -64785 -157331 -128853 32871 105987 15604 -100043 -160210 -198050 -193099 -107291
38187 -107291 -42465 -122014 -265389 -301884 -244631 -233728 -279206 -280200 -231982 -204745 -185082 -131257
38175 -131257 -104232 -160048 -209969 -167259 -116899 -159050 -220336 -209660 -207567 -297284 -372131 -326049
38163 -326049 -259777 -273865 -256460 -126354 -64773 -209585 -343557 -232624 -62220 -136806
38153 -136806 -324118 -254286 36591 140819 -68796 -281236 -283589 -231490 -283661 -334403 -258058
38142 -258058 -140186 -116704 -176473 -229361 -231183 -191246 -164420 -221910 -328384 -329348 -186592
38131 -186592 -93109 -182490 -284005 -191301 -16533 -9598 -159940 -260189 -244810 -180094 -43964
38120 -43964 177322 293741 139293 -110374 -176944 -123075 -201570 -371168 -366475 -189929 -118208
$$ packed form
38198i2105K7320r2546K8478J61724P3116r0383j15647o0167l7840M951Q5808
38187a07291O4826p9549j43375l6495N7253J0903m5478r94M8218K7237J9663N3825
38175a31257K7025n5816m9921M2710N0360m2151o1286J0676K093q9717p4847M6082
38163c26049O6272j4088J7405J30106O1581j44812j33972J10933J70404p4586
38153a36806j87312O9832K90877J04228k09615k12440k353N2099n2171n0742P6345
38142b58058J17872K3482n9769n2888j822L9937K6826n7490j06474r64J42756
38131a86592R3483q9381j01515R2704J74768O935j50342j00249J5379O4716J36130
38120d3964K21286J16419j54448k49667o6570N3869p8495j69598M693J76546P1721
$$ plain form
38109 -118208 -226504 -299211 -228371 -128820 -39077 121683 268515 194062 -48139 -154494
38099 -154494 -26867 117471 144046 160519 204658 127089 -98032 -264033 -262798 -240938 -301900
38088 -301900 -321657 -196140 -36269 16166 -25483 -87089 -135798 -126383 -26818 65550 20762
38077 20762 -99781 -124273 -71101 -126386 -312373 -438907 -417938 -368004 -362312 -332807 -282461
38066 -282461 -332065 -470536 -498395 -324994 -123121 -89705 -215958 -367353 -444523 -413049
38056 -413049 -304598 -217063 -207423 -208974 -164410 -155584 -246164 -307694 -207236 -57598 -45034
38045 -45034 -119316 -122514 -114566 -257719 -459846 -474036 -313144 -227348 -284751 -304241 -203953
38034 -203953 -94507 -21386 68697 103280 -48437 -273628 -309211 -155751 -71484 -136447 -167414
$$ packed form
38109a18208j08296p2707P0840R9551Q9743J60760J46832p4453k42201j06355
38099a54494J27627J44338K6575J6473M4139p7569k25121j66001J235K1860o0962
38088c01900j9757J25517J59871N2435m1649o1606m8709R415R9565R2368m4788
38077B0762j20543k4492N3172n5285j85987j26534K0969M9934N692K9505N0346
38066b82461m9604j38471k7859J73401K01873L3416j26253j51395p7170L1474
38056d13049J08451Q7535R640j551M4564Q826r0580o1530J00458J49638J2564
38045d5034p4282l198P948j43153k02127j4190J60892Q5796n7403j9490J00288
38034b03953J09446P3121R0083L4583j51717k25191l5583J53460Q4267o4963l0967
$$ plain form
38023 -167414 -102558 -111492 -245964 -320189 -239608 -145802 -140743 -151474 -150228 -227097 -362429 -397509
38011 -397509 -306278 -238560 -240606 -198604 -100502 -73196 -118621 -102127 -41990 -106507 -277598
38000 -277598 -334834 -236459 -194759 -291433 -335516 -206522 -43568 13661 1716 -37818 -140485
37989 -140485 -251496 -237365 -130355 -103500 -161286 -132726 -2394 55617 8969 10074 66139
37978 66139 7693 -154971 -198708 -90394 -63755 -193995 -256492 -133092 -6083 -5468 -6149
37967 -6149 65871 58887 -92549 -186641 -76691 89390 122684 43034 -68330 -220445 -381542
37956 -381542 -431925 -365069 -309833 -277271 -146052 35819 40072 -155722 -280853 -188576 -62435
37945 -62435 -80531 -163267 -187926 -182827 -182349 -141321 -90591 -124116 -170109 -59230 134082 142592
$$ packed form
38023a67414O4856q934j34472p4225Q0581R3806N059j0731J246p6869j35332l5080
38011c97509R1231O7718k046M2002R8102K7306m5425J6494O0137o4517j71091
38000b77598n7236R8375M1700r6674m4083J28994J62954N7229j1945l9534j02667
37989a40485j11011J4131J07010K6855n7786K8560J30332N8011m6648J105N6065
37978F6139n8446j62664m3737J08314K6639j30240o2497J23400J27009O15o81
37967f149P2020o984j51436r4092J09950J66081L3294p9650j11364j52115j61097
37956c81542n0383O6856N5236L2562J31219J81871M253j95794j25131R2277J26141
37945f2435j8096q2736k4659N099M78M1028N0730l3525m5993J10879J93312Q510
$$ plain form
37933 142592 -49742 -167933 -112345 -80397 -137497 -82211 127645 228882 102393 -26223
37923 -26223 -14672 -37657 -194267 -277610 -170572 -102633 -261155 -480188 -554291 -539914 -522300
37912 -522300 -418535 -244407 -235912 -454369 -601508 -484237 -332750 -383890 -475986 -360599
37902 -360599 -120478 32263 107123 184756 170457 -254 -139118 -77973 44915 35712 -31768
37891 -31768 -4968 44714 -26136 -159303 -213511 -191149 -148693 -62880 40460 28281 -109974
37880 -109974 -196489 -161920 -141147 -147490 10881 315577 415500 165732 -77564 1561 189573
37869 189573 140243 -53150 -76699 55695 78417 -61545 -182164 -199021 -174626 -130581 -63882
37858 -63882 -50959 -127558 -183242 -144333 -105598 -129035 -111267 -8065 39730 -24914 -32255 101606
$$ packed form
37933A42592j92334j18191N5588L1948n7100N5286K09856J01237j26489j28616
37923b6223J1551k2985j56610q3343J07038O7939j58522k19033p4103J4377J7614
37912e22300J03765J74128Q495k18457j47139J17271J51487n1140r2096J15387
37902c60599K40121J52741P4860P7633j4299j70711j38864O1145J22888r203o7480
37891c1768K6800M9682p0850j33167n4208K2362M2456Q5813J03340j2179j38255
37880a09974q6515L4569K0773o343J58371L04696R9923k49768k43296P9125J88012
37869A89573m9330j93393k3549J32394K2722j39962j20619j6857K4395M4045O6699
37858f3882J2923p6599n5684L8909L8735k3437J7768J03202M7795o4644p341J33861
$$ plain form
37846 101606 184857 76138 -74149 -124852 -194663 -367199 -444163 -279683 -87042 -105686
37836 -105686 -209307 -156409 -3224 48441 10587 8159 5862 -68669 -104127 8413 131607
37825 131607 86184 -59213 -133832 -124042 -75690 51980 216069 205927 -35396 -241825 -212293
37814 -212293 -112997 -144983 -193053 -97388 2527 -74170 -194448 -154212 -53493 -87361 -168822
37803 -168822 -105567 32464 59188 13535 31432 50465 -35651 -98673 23439 206863 238214
37792 238214 171504 178928 209165 113331 -42324 -106180 -134569 -243172 -317125 -193224 3798
37781 3798 29619 -91848 -154827 -131653 -146179 -190633 -158161 -73062 -35710 -30698 -6979 -19988
37769 -19988 -85035 -57154 114654 198199 -5669 -334861 -501936 -472596 -365870 -194776
$$ packed form
37846A01606Q3251j08719j50287n0703o9811j72536p6964J64480J92641j8644
37836a05686j03621N2898J53185N1665l7854k428k297p4531l5458J12540J23194
37825A31607m5423j45397p4619R790M8352J27670J64089j0142k41323k06429K9532
37814b12293R9296l1986m8070R5665R9915p6697j20278M0236J00719l3868q1461
37803a68822O3255J38031K6724m5653J7897J9033q6116o3022J22112J83424L1351
37792B38214o6710P424L0237r5834j55655o3856k8389j08603p3953J23901J97022
37781C798K5821j21467o2979K3174j4526m4454L2472Q5099L7352N012K3719j3009
37769a9988o5047K7881J71808Q3545k03868l29192j67075K9340J06726J71094
$$ plain form
37759 -194776 15918 73420 -110381 -284885 -210247 -47999 -81619 -240674 -255195 -121442
37749 -121442 -50931 -78201 -67239 -13392 -17046 -38760 24940 101789 50475 -74181 -107714
37738 -107714 -40711 16928 29423 5663 -81843 -174794 -110226 96392 169652 -28930 -271923
37727 -271923 -344088 -359606 -448749 -443658 -200273 52946 45125 -106875 -149682 -126090 -189112
37716 -189112 -229448 -89723 61868 -17928 -203794 -209686 -75600 -49843 -135507 -150152 -107948
37705 -107948 -156187 -242045 -210424 -132962 -193057 -340941 -385924 -325446 -278985 -223110 -97269
37694 -97269 -33490 -167809 -356183 -380287 -297455 -292365 -331768 -265543 -125233 -34131 34367
37683 34367 143791 202479 131186 39065 7908 -71906 -230119 -262986 -94806 25209 -44893
$$ packed form
37759a94776K10694N7502j83801j74504P4638J62248l3620j59055j4521J33753
37749a21442P0511k7270J0962N3847l654k1714O3700P6849n1314j24656l3533
37738a07714O7003N7639J2495k3760q7506r2951O4568K06618P3260j98582k42993
37727b71923p2165j5518q9143N091K43385K53219p821j52000m2807K3592o3022
37716a89112m0336J39725J51591p9796j85866n892J34086K5757q5664j4645M2204
37705a07948m8239q5858L1621P7462o0095j47884m4983O0478M6461N5875J25841
37694i7269O3779j34319j88374k4104Q2832N090l9403O6225J40310R1102O8498
37683C4367J09424N8688p1293r2121l1157p9814j58213l2867J68180J20015p0102
$$ plain form
37672 -44893 -70661 88143 137396 -140272 -428170 -365008 -122566 -35970 -26551 108532 194922
37661 194922 19100 -162697 -30005 190007 110129 -107931 -63384 128192 62822 -180273
37651 -180273 -194125 -20419 -62991 -308920 -331184 -53111 142139 90671 34483 88151 80954
37640 80954 -13134 -3782 103744 94314 -31632 -64771 -18833 -109927 -311474 -368419 -246462
37629 -246462 -150322 -126055 -55774 8112 -75227 -184771 -93579 97203 101935 -57788 -127142
37618 -127142 -79015 -69862 -58653 78715 187143 56060 -132098 -67482 118455 71250 -140687
37607 -140687 -157276 10834 35022 -91356 -55096 167954 276041 204024 178422 214507 89039
37596 89039 -177689 -317310 -293347 -307246 -349061 -225187 -4285 46728 -59134 -79370 -14331
$$ packed form
37672d4893k5768J58804M9253k77668k87898O3162K42442Q6596R419J35083Q6390
37661A94922j75822j81797J32692K20012p9878k18060M4547J91576o5370k43095
37651a80273j3852J73706m2572k45929k2264K78073J95250n1468n6188N3668p197
37640H0954r4088R352J07526r430j25946l3139M5938r1094k01547n6945J21957
37629b46462R6140K4267P0281O3886q3339j09544R1192J90782M732j59723o9354
37618a27142M8127R153J1209J37368J08428j31083j88158O4616J85937m7205k11937
37607a40687j6589J68110K4188j26378L6260K23050J08087p2017k5602L6085j25468
37596H9039k66728j39621K3963j3899m1815J23874K20902N1013j05862k0236O5039
$$ plain form
37585 -14331 -63866 -190035 -196383 -147188 -227644 -312930 -183703 -19758 -127006 -328721 -231361
37574 -231361 40741 22085 -281008 -417044 -273315 -176700 -239774 -250492 -201473 -298802 -449900
37563 -449900 -357569 -108019 -56767 -169178 -103070 105536 104023 -73050 -51367 156837 178533
37552 178533 19112 47850 236284 165201 -160974 -273597 -102566 -111278 -429795 -603346
37542 -603346 -397049 -154661 -150528 -228300 -268492 -393562 -542895 -453239 -205793 -187584 -393820
37531 -393820 -396023 -111423 49351 -77867 -183213 -121672 -116753 -196329 -97138 128462 87054
37520 87054 -228519 -363796 -198915 -128874 -296719 -357784 -187977 -116614 -252971 -280156
37510 -280156 -123326 -122576 -332077 -355303 -97948 28395 -118161 -157211 44166 89217 -172894
$$ packed form
37585a4331m9535j26169o348M9195q0456q5286J29227J63945j07248k01715R7360
37574b31361K72102j8656l03093j36036J43729R6615o3074j0718M9019r7329j51098
37563d49900R2331K49550N1252j12411O6108K08606j513j77073K1683K08204K1696
37552A78533j59421K8738J88434p1083l26175j12623J71031q712l18517j73551
37542f03346K06297K42388M133p7772m0192j25070j49333Q9656K47446J8209k06236
37531c93820k203K84600J60774j27218j05346O1541M919p9576R9191K25600m1408
37520H7054l15573j35277J64881P0041j67845o1065J69807P1363j36357k7185
37510b80156J56830P50k09501k3226K57355J26343j46556l9050K01377M5051k62111
$$ plain form
37499 -172894 -317167 -113630 63640 -66357 -244546 -248350 -270553 -400730 -364336 -102752
37489 -102752 4083 -195852 -345977 -250131 -194755 -321933 -329622 -99271 23891 -110369
37479 -110369 -158434 43848 149811 -33731 -184253 -91437 -23868 -147785 -200766 -62442
37469 -62442 -30835 -218403 -293410 -122159 -34614 -158285 -146546 125696 268758 96573
37459 96573 -39898 43391 24133 -222588 -292861 -3443 218299 80937 -106644 -90027
37449 -90027 -103292 -270212 -270911 -8396 83614 -191006 -399543 -261224 -119372 -219732 -237525
37438 -237525 24174 176340 -33788 -221936 -68329 137318 110740 68774 163474 107110
37428 107110 -181426 -257388 51863 242242 11155 -190165 568 197937 13677 -250922
$$ packed form
37499a72894j44273K03537J77270j29997j78189l804k2203j30177L6394K61584
37489a02752J06835j99935j50125R5846N5376j27178p689K30351J23162j34260
37479a10369m8065K02282J05963j83542j50522R2816O7569j23917n2981J38324
37469f2442L1607j87568p5007J71251Q7545j23671J1739K72242J43062j72185
37459I6573j36471Q3289j9258k46721p0273K89418K21742j37362j87581J6617
37449i0027j3265j66920o99K62515R2010k74620k08537J38319J41852j00360j7793
37438b37525K61699J52166k10128j88148J53607K05647k6578m1966R4700n6364
37428A07110k88536p5962L09251J90379k31087k01320J90733J97369j84260k64599
$$ plain form
37418 -250922 -238164 -174051 -292283 -293628 25348 259007 96689 -105690 -28240 10939 -254299
37407 -254299 -433950 -199549 58327 -61940 -252406 -136257 9622 -154374 -335621 -192021
37397 -192021 -20139 -175413 -371951 -242095 -45739 -144814 -299533 -156420 68771 41002
37387 41002 -54617 62818 196250 99856 -16299 53343 77884 -77408 -79339 204641 311571
37376 311571 -11408 -286394 -141330 53650 -29641 -26421 331359 551051 236216 -131785
37366 -131785 -30313 201937 80797 -109461 61502 299666 175591 -34606 84080 274200
37356 274200 154647 -14385 113402 259130 115722 13711 236039 352009 19809 -256381
37346 -256381 5858 362012 254246 -2634 65893 144423 -167428 -436446 -169156 199968
$$ packed form
37418b50922J2758O4113j18232j345L18976K33659j62318k02379P7450L9179k65238
37407b54299j79651K34401K57876j20267j90466J16149J45879j63996j81247J43600
37397a92021J71882j55274j96538J29856J96356r9075j54719J43113K25191k7769
37387D1002r5619J17435J33432r6394j16155O9642K4541j55292j931K83980J06930
37376C11571l22979k74986J45064J94980q3291L220L57780K19692l14835l68001
37366a31785J01472K32250j21140j90258J70963K38164j24075k10197J18686J90120
37356B74200j19553j69032J27787J45728j43408j02011K22328J15970l32200k76190
37346b56381K62239L56154j07766k56880O8527P8530l11851k69018K67290L69124
$$ plain form
37336 199968 91696 -143518 52123 348946 203074 -68648 46079 208785 -59447 -324749
37326 -324749 -29248 368347 209800 -107493 97632 471518 346549 78482 333177 719267
37316 719267 520717 134953 339511 768385 620656 254877 501080 1004432 920028 650411
37306 650411 1111398 1858369 1879618 1704956 2579006 3983595 4370433 4086518 4925256 6845453
37296 6845453 8259951 10072768 15759564 25488614 33200646 32581437 24425592 15344063
37288 15344063 10130788 8128679 6693327 5159223 4342103 4223387 3874073 2985999 2188337
37279 2188337 1931028 1886611 1590176 1106443 776211 647547 534028 458365 598091 826010
37269 826010 778997 462673 302405 446977 541311 398949 326420 483906 531419 298886
$$ packed form
37336A99968j08272k35214J95641K96823j45872k71722J14727J62706k68232k65302
37326c24749K95501L97595j58547l17293K05125L73886j24969k68067K54695L86090
37316G19267j98550l85764K04558M28874j47729l65779K46203N03352q4404k69617
37306F50411M60987P46971K1249j74662Q74050J404589L86838k83915Q38738J920197
37296F845453J414498J812817N686796R729050P712032o19209q155845r081529
37288A5344063n213275k002109j435352j534104q17120j18716l49314q88074p97662
37279B188337k57309m4417k96435m83733l30232j28664j13519p5663J39726K27919
37269H26010m7013l16324j60268J44572R4334j42362p2529J57486M7513k32533
$$ plain form
37259 298886 190555 452918 652245 416356 96047 104370 195366 32833 -118583 46094
37249 46094 203644 17039 -149958 112190 445524 351370 86581 124445 260001 98294
37239 98294 -87997 130566 456050 372106 85972 109483 356774 488581 656600 1056055
37229 1056055 1260344 880287 366906 290531 382135 172719 -40897 176492 446804 269011
37219 269011 29649 274069 608922 433047 122512 324885 692917 535459 141800 207788
37209 207788 499481 364925 49474 200765 554253 420324 23590 59985 364240 302261
37199 302261 39543 136482 344286 94892 -283074 -131831 248293 175448 -88351 84625
37189 84625 366150 117648 -240272 42603 542833 399984 -35995 129430 593735 425837
$$ packed form
37259B98886j08331K62363J99327k35889l20309Q323R0996j62533j51416J64677
37249D6094J57550j86605j66997K62148L33334r4154k64789L7864J35556j61707
37239I8294j86291K18563L25484q3944k86134K3511K47291J31807J68019L99455
37229A056055K04289l80057n13381p6375R1604k09416k13616K17389K70312j77793
37219B69011k39362K44420L34853j75875l10535K02373L68032j57458l93659O5988
37209B07788K91693j34556l15451J51291L53488j33929l96734L6395L04255o1979
37199C02261k62718R6939K07804k49394l77966J51243L80124p2845k63799J72976
37189H4625K81525k48502l57920K82875N00230j42849m35979J65425M64305j67898
$$ plain form
37179 425837 -141384 -163668 234588 208758 -122126 -19364 287313 51372 -384045 -142679
37169 -142679 451584 422287 -19435 66376 502079 399570 -32782 79777 481593 279303
37159 279303 -210633 -4369 597439 531355 6329 52465 485835 342537 -106202 144097
37149 144097 747640 558525 -144992 -148336 395256 353397 -103899 119513 774742 684478
37139 684478 65075 101230 586491 375717 -210605 91290 948954 952033 295181 355234
37129 355234 976398 852741 236175 491444 1313004 1239965 586182 899269 1866341 1880569
37119 1880569 1372888 2259225 4204736 4832766 3702757 2746537 2676429 2329721 1683211
37110 1683211 2055233 3078854 2893688 1602961 1171109 1736593 1506102 424707 312982
$$ packed form
37179D25837n67221k2284L98256k5830l30884J02762L06677k35941m35417K41366
37169a42679N94263k9297m41722Q5811M35703j02509m32352J12559M01816k02290
37159B79303m89936K06264O01808o6084n25026M6136M33370j43298m48739K50299
37149A44097O03543j89115p03517l344N43592m1859m57296K23412O55229r0264
37139F84478o19403L6155M85261k10774n86322L01895Q57664L079o56852O0053
37129C55234O21164j23657o16566K55269Q21560p3039o53783L13087R67072J4228
37119A880569n07681Q86337J945511O28030j130009r56220p0108l46708o46510
37110A683211L72022J023621j85166j290727m31852N65484k30491j081395j11725
$$ plain form
37101 312982 1184398 1147581 173785 174553 1143542 1114776 133481 242407 1351565 1301317
37091 1301317 198613 332275 1595803 1547208 235072 216730 1526615 1578157 346099
37082 346099 461067 1843547 1698387 201865 443665 2288937 2368544 677257 753270
37073 753270 2687536 2779115 895159 935914 3064836 3154092 1040869 1163520 3724153
37064 3724153 3963717 1694831 2133855 5522308 6130152 3638695 4380219 8791688 9898858
37055 9898858 7313175 9147449 16259542 19855700 19490663 25888600 39366541 45720818
37047 45720818 42881655 48433309 67638476 82247962 92886502 140364739 244957445
37040 244957445 345956253 353413533 258617103 146229806 89486690 78405557 67229282
$$ packed form
37101C12982Q71416l6817r73796P68R68989k8766r81295J08926J109158n0248
37091A301317j102704J33662J263528m8595j312136j8342J309885N1542j232058
37082C46099J14968J382480j45160j496522K41800J845272P9607j691287P6013
37073G53270J934266R1579j883956M0755K128922Q9256k113223J22651K560633
37064C724153K39564k268886M39024L388453O07844k491457P41524M411469J107170
37055I898858k585683J834274P112093L596158l65037O397937J3477941O354277
37047D5720818k839163N551654J9205167J4609486J0638540M7478237J04592706
37040B44957445J00998808P457280r4796430j12387297n6743116j1081133j1176275
$$ plain form
37033 67229282 46904554 37452630 39982733 36447641 24074682 16867974 17911864 16411527
37025 16411527 9864618 7053290 9629501 9558166 5181333 3575879 6213354 6621745
37017 6621745 3286559 2011693 4273956 4853286 2331006 1354946 3124938 3354896 1058641
37008 1058641 357857 2185455 2578788 581319 -36667 1714089 2255369 530316 -139657
36999 -139657 1311467 1821045 375909 -177568 1091934 1517595 290869 -21972 1255239
36990 1255239 1523405 96515 -417132 775612 1177259 -50097 -515980 650214 1159908
36981 1159908 96252 -392349 615860 1110441 209258 -165786 840578 1373566 579026
36972 579026 235501 1214837 1871978 1394525 1313393 2252345 2528929 1487815 1040783 2328336
$$ packed form
37033F7229282k0324728r451924K530103l535092j2372959p206708J043890j500337
37025A6411527o546909k811328K576211p1335m376833j605454K637475M08391
37017F621745l335186j274866K262263N79330k522280r76060J769992K29958k296255
37008A058641p00784J827598L93333j997469o17986J750756N41280j725053o69973
36999a39657J451124N09578j445136n53477J269502M25661j226726l12841J277211
36990A255239K68166j426890n13647J192744M01647j227356m65883J166194N09694
36981A159908j063656m88601J008209M94581r01183l75044J006364N32988p94540
36972E79026l43525R79336O57141m77453q1132R38952K76584j041114m47032J287553
$$ plain form
36962 2328336 3757048 3828708 3223547 2768025 1966239 792196 417650 997780 1113327
36953 1113327 362135 89766 722929 911851 179816 -138593 489404 775480 142095
36944 142095 -201919 326875 611322 123450 -68132 474802 637203 -8506 -303333 238748
36934 238748 502963 -1498 -213801 290803 413844 -246227 -498553 159224 540305 29478
36924 29478 -302614 140232 326022 -320834 -731795 -221145 241650 -83084 -398308 -59369
36914 -59369 204747 -151803 -408515 -89545 81718 -290964 -423663 50193 263858 -196515
36904 -196515 -430279 49651 364319 -45970 -405787 -182924 -70144 -474955 -630323 -141745
36894 -141745 155953 -189670 -354128 124936 401815 -27948 -314664 108250 430290 48234
$$ packed form
36962B328336J428712P1660o05161m55522q01786j174043l74546N80130J15547
36953A113327p51192k72369O33163J88922p32035l18409O27997K86076o33385
36944A42095l44014N28794K84447m87872j91582N42934J62401o45709k94827N42081
36934B38748K64215n04461k12303N04604J23041o60071k52326O57777L81081n10827
36924B9478l32092M42846J85790o46856m10961N10650M62795l24734l15224L38939
36914e9369K64116l56550k56712L18970J71263l72682j32699M73856K13665m60373
36904a96515k33764M79930L14668m10289l59817K22863J12780m04811j55368M88578
36894a41745K97698l45623j64458M79064K76879m29763k86716M22914L22040l82056
$$ plain form
36884 48234 -276098 76583 388769 33878 -309879 -6637 315275 23346 -310381 -82201
36874 -82201 177690 -87489 -358554 -120391 90767 -226404 -511681 -238591 45351 -203739
36864 -203739 -465309 -186681 146389 -27842 -299039 -167757 -10500 -221790 -351166 -23172
36854 -23172 230060 -32499 -273757 8029 321766 145840 -85801 119598 335984 66010
36844 66010 -290825 -223407 -42296 -165452 -286119 -86643 38503 -211386 -347832 -12610
36834 -12610 254165 -16308 -337504 -193470 747 -258656 -576283 -415369 -92734 -125686
36824 -125686 -281760 -137074 78628 9019 -100834 31620 86145 -203797 -421114 -208887
36814 -208887 32805 -103261 -279472 -116106 59408 -114257 -303645 -147061 26367 -147303
$$ packed form
36884D8234l24332L52681L12186l54891l43757L03242L21912k91929l33727K28180
36874h2201K59891k65179k71065K38163K11158l17171k85277K73090K83942k49090
36864b03739k61570K78628L33070j74231k71197J31282J57257k11290j29376L27994
36854b3172K53232k62559k41258K81786L13737j75926k31641K05399K16386k69974
36844F6010l56835O7418J81111j23156j20667J99476J25146k49889j36446L35222
36834a2610K66775k70473l21196J44034J94217k59403l17627J60914L22635l2952
36824a25686j56074J44686K15702o9609j09853J32454N4525k89942k17317K12227
36814b08887K41692j36066j76211J63366J75514j73665j89388J56584J73428j73670
$$ plain form
36804 -147303 -359915 -269905 -174223 -362508 -481687 -223436 35677 -53029 -152009 50930
36794 50930 193349 -26898 -201065 12614 195162 -39764 -295065 -160927 -1410 -218414
36784 -218414 -451668 -284045 -40709 -108647 -164192 122521 314394 -23176 -445318 -374907
36774 -374907 -98060 -154722 -341543 -204514 33058 -75197 -315039 -243866 -48073 -141018
36764 -141018 -340607 -249858 -45502 -116464 -309066 -261720 -101609 -119389 -155221 28011
36754 28011 182866 35731 -129929 22049 246499 197902 61751 100624 90557 -168375
36744 -168375 -326466 -114450 65351 -153093 -384381 -194309 72067 -70545 -345184 -254551
36734 -254551 -2306 -45946 -208236 -69877 184693 138618 -41174 36820 197392 57049
$$ packed form
36804a47303k12612R0010R5682j88285j19179K58251K59113q8706r8980K02939
36794E0930J42419k20247j74167K13679J82548k34926k55301J34138J59517k17004
36784b18414k33254J67623K43336o7938n5545K86713J91873l37570m22142P0411
36774c74907K76847n6662j86821J37029K37572j08255k39842P1173J95793r2945
36764a41018j99589R0749K04356p0962j92602M7346J60111j7780l5832J83232
36754B8011J54855j47135j65660J51978K24450m8597j36151L8873j0067k58932
36744a68375j58091K12016J79801k18444k31288J90072K66376j42612k74639R0633
36734b54551K52245m3640j62290J38359K54570m6075j79792P7994J60572j40343
$$ plain form
36724 57049 -196766 -161778 7142 -52981 -161558 31874 280617 139383 -193425 -213362
36714 -213362 6246 24792 -159081 -246575 -289141 -468330 -527630 -173339 238618 169282
36704 169282 -204788 -296976 -69083 51344 -14056 3588 90677 24528 -87300 8580 161424
36693 161424 63619 -152036 -157409 -42692 -90786 -189651 -77207 84668 -3535 -179894 -128034
36682 -128034 -12089 -164765 -405760 -335082 -73061 -45998 -237432 -292083 -174997 -115970
36672 -115970 -93403 35696 100631 -110744 -369798 -358595 -245612 -343697 -488637 -365123
36662 -365123 -152831 -205325 -367198 -268305 -29682 -13207 -133699 -93236 -30176 -234455
36652 -234455 -478241 -362479 -94228 -164710 -460687 -473914 -229765 -212943 -471557 -573022
$$ packed form
36724E7049k53815L4988J68920o0123j08577J93432K48743j41234l32808j9937
36714b13362K19608J8546j83873q7494m2566j79189n9300L54291M11957o9336
36704A69282l74070r2188K27893J20427o5400J7644Q7089o6149j11828R5880J52844
36693A61424r7805k15655n373J14717m8094r8865J12444J61875q8203j76359N1860
36682a28034J15945j52676k40995P0678K62021K7063j91434n4651J17086N9027
36672a15970K2567J29099O4935k11375k59054J1203J12983r8085j44940J23514
36662c65123K12292n2494j61873R8893K38623J6475j20492M0463O3060k04279
36652b34455k43786J15762K68251p0482k95977j3227K44149J6822k58614j01465
$$ plain form
36642 -573022 -402786 -272490 -263424 -165707 -47422 -192694 -473316 -450861 -128098 32665
36632 32665 -129965 -295844 -269779 -197039 -145924 -18246 99202 2761 -202871 -227600 -112538
36621 -112538 -142673 -300394 -306784 -155200 -98154 -147258 -89180 36748 -22901 -235135 -292260
36610 -292260 -124036 25278 15237 -74051 -185581 -292401 -267193 -87165 -6278 -172685
36600 -172685 -302102 -128625 90011 -15033 -276056 -280943 -74937 -12427 -109678 -113693 -45687
36589 -45687 -110658 -212995 -113068 70842 45853 -121342 -169666 -160003 -288799 -384796 -168455
36578 -168455 166499 218067 48995 2013 31207 -142512 -373944 -275392 46122 109766
36568 109766 -137697 -291822 -222861 -197286 -277069 -219157 -2179 113085 74051 71599 98304
$$ packed form
36642e73022J70236J30296R066R7717J18285j45272k80622K2455L22763J60763
36632C2665j62630j65879K6065P2740N1115J27678J17448r6441k05632k4729J15062
36621a12538l0135j57721o390J51584N7046m9104N8078J25928n9649k12234n7125
36610b92260J68224J49314j0041q9288j11530j06820K5208J80028Q0887j66407
36600a72685j29417J73477K18636j05044k61023m887K06006O2510r7251m015O8006
36589d5687o4971j02337R9927J83910k4989j67195m8324R663j28796r5997K16341
36578a68455L34954N1568j69072m6982K9194j73719k31432R8552L21514O3644
36568A09766k47463j54125O8961K5575p9783N7912K16978J15264l9034k452K6705
$$ plain form
36557 98304 -25532 -220719 -237010 -114266 -81528 -103121 -15237 38252 -155984 -374410 -270745
36546 -270745 -32170 -101046 -395297 -466851 -306472 -293776 -437773 -386429 -148794 -92784
36536 -92784 -233933 -227254 -69402 -106147 -322320 -333635 -127089 -97140 -279604 -268467 5482
36525 5482 130792 -15932 -65676 105602 129450 -140001 -315370 -147426 74195 59245
36515 59245 -67226 -133952 -219681 -346026 -324303 -124218 7902 -40579 -112656 -157312 -313739
36504 -313739 -528036 -531968 -307781 -145428 -153620 -140823 -40687 -13142 -71589 -53596 6903
36493 6903 -71357 -201360 -145550 -22522 -160261 -463587 -512106 -294457 -223057 -376155 -379120
36482 -379120 -135473 -13044 -149601 -218864 -82337 -53515 -285556 -480879 -453994 -433173
$$ packed form
36557I8304j23836j95187j6291J22744L2738k1593Q7884N3489j94236k18426J03665
36546b70745K38575o8876k94251p1554J60379J2696j43997N1344K37635N6010
36536i2784j41149O679J57852l6745k16173j1315K06546K9949j82464J1137K73949
36525E482J25310j46724m9744J71278K3848k69451j75369J67944K21621j4950
36515E9245j26471o6726q5729j26345K1723K00085J32120m8481p2077m4656j56427
36504c13739k14297l932K24187J62353q192J2797J00136K7545n8447J7993O0499
36493F903p8260j30003N5810J23028j37739l03326m8519K17649P1400j53098k965
36482c79120K43647J22429j36557o9263J36527K8822k32041j95323K6885K0821
$$ plain form
36472 -433173 -556915 -596785 -429178 -283490 -283531 -227086 -48947 -19679 -246926 -439174 -395975
36461 -395975 -298069 -307840 -315985 -268354 -305044 -407641 -354297 -168717 -142105 -281570 -256021
36450 -256021 -32971 -4153 -286706 -478605 -351039 -212642 -301230 -369861 -207477 -53438
36440 -53438 -135694 -259240 -204193 -104221 -97337 -22820 199661 299291 107073 -99671 -43122
36429 -43122 117982 119264 20501 -9184 -19155 -92355 -125215 -56313 -29303 -103802 -108919 13955
36417 13955 57573 -63126 -128400 -26599 27748 -83703 -126881 61664 259792 235330 98765
36406 98765 25869 -41127 -166400 -219048 -143675 -123998 -252573 -343433 -273142 -189037 -196947
36395 -196947 -185562 -136099 -231468 -466992 -541349 -339592 -133464 -99904 -57288 101360 155703
$$ packed form
36472d33173j23742l9870J67607J45688m1N6445J78139K9268k27247j92248M3199
36461c95975R7906r771q145M7631l6690j02597N3344J85580K6612j39465K5549
36450b56021K23050K8818k82553j91899J27566J38397q8588o8631J62384J54039
36440e3438q2256j23546N5047R9972O884P4517K22481R9630j92218k06744N6549
36429d3122J61104J282r8763k9685r971p3200l2860O8902K7010p4499n117J22874
36417A3955M3618j20699o5274J01801N4347j11451m3178J88545J98128k4462j36565
36406I8765p2896o6996j25273n2648P5373J9677j28575r0860P0291Q4105p910
36395a96947J1385M9463r5369k35524p4357K01757K06128L3560M2616J58648N4343
$$ plain form
36384 155703 -2266 -111034 -7148 69979 -63461 -188673 -108621 -11379 -78765 -126124
36374 -126124 22523 174416 128533 33178 45407 6504 -190367 -289410 -112615 56523
36364 56523 -63285 -254297 -197440 -36323 -80643 -234735 -206657 -56235 -51719 -155312 -116819
36353 -116819 42025 65882 -90817 -231020 -263025 -264134 -260778 -216281 -167164 -153135 -115309
36342 -115309 -45572 -78302 -249771 -364336 -301769 -239092 -345272 -484880 -470291 -383289 -383124
36331 -383124 -404055 -310124 -159180 -60125 41462 191669 242327 87468 -103056 -127404
36321 -127404 -44237 1257 39732 135265 186432 106652 8433 -13398 -74404 -255921 -389709
36310 -389709 -325249 -202201 -218785 -327859 -387302 -408907 -441073 -412967 -304933 -259808 -330158
$$ packed form
36384A55703j57969j08768J03886P7127j33440j25212Q0052R7242o7386m7359
36374a26124J48647J51893m5883r5355J2229l8903j96871r9043J76795J69138
36364E6523j19808j91012N6857J61117m4320j54092K8078J50422M516j03593L8493
36353a16819J58844K3857j56699j40203l2005j109L356M4497M9117J4029L7826
36342a15309O9737l2730j71469j14565O2567O2677j06180j39608J4589Q7002J65
36331c83124k0931R3931J50944R9055J01587J50207N0658j54859j90524k4348
36321a27404Q3167M5494L8475R5533N1167p9780r8219k1831o1006j81517j33788
36310c89709O4460J23048j6584j09074n9443k1605l2166K8106J08034M5125p0350
$$ plain form
36299 -330158 -348950 -237563 -173533 -250778 -269915 -100891 49270 -5224 -101455 -46195 25544
36288 25544 -79112 -243733 -261929 -190807 -188559 -226667 -239940 -319917 -489080 -548357 -423789
36277 -423789 -369019 -523618 -594681 -332399 -1737 31147 -103101 -41193 187574 267693
36267 267693 154380 72994 89089 89178 75334 102894 51486 -178064 -381092 -330326 -182928
36256 -182928 -220269 -343549 -255853 -12876 66210 -43168 -61551 73103 114866 -33819
36246 -33819 -168747 -142373 -44103 25605 72513 71455 -24851 -130178 -121035 -70413 -141454 -283546
36234 -283546 -293291 -151136 -39956 -44181 -72483 -67377 -69917 -93075 -127193 -229181 -417528
36223 -417528 -547766 -491430 -357669 -329882 -374734 -336907 -230913 -197060 -235824 -218315 -110651
$$ packed form
36299c30158j8792J11387O4030p7245j9137J69024J50161n4494r6231N5260P1739
36288B5544j04656j64621j8196P1122K248l8108j3273p9977j69163n9277J24568
36277d23789N4770j54599p1063K62282L30662L2884j34248O1908K28767Q0119
36267B67693j13313q1386J6095Q9j3844K7560n1408k29550k03028N0766J47398
36256a82928l7341j23280Q7696K42977P9086j09378j8383J34654M1763j48685
36246c3819j34928K6374R8270O9708M6908j058r6306j05327R143N0622p1041j42092
36234b83546r745J42155J11180m225k8302N106k540k3158l4118j01988j88347
36223d17528j30238N6336J33761K7787m4852L7827J05994L3853l8764J7509J07664
$$ plain form
36212 -110651 9952 97731 126705 41030 -112427 -143526 964 89013 -46828 -209967
36202 -209967 -159314 -26700 -84362 -263635 -279982 -125645 -50528 -111966 -124747 -44791 -36227
36191 -36227 -126273 -126588 37262 199271 223185 161581 91725 6831 -81750 -121454 -131608 -177967
36179 -177967 -228056 -189960 -87943 -44288 -96304 -167937 -197120 -171795 -93310 -17833 -50940
36168 -50940 -185215 -256512 -186289 -120884 -180627 -243291 -164988 -37769 -5257 546 81692
36157 81692 101679 -113114 -426919 -550748 -446634 -289576 -133458 72281 221036 143770
36147 143770 -68903 -154245 -71779 -18271 -68235 -97845 -64516 -63400 -84637 -2767 152954
36136 152954 193799 91503 38462 115239 151084 19221 -153761 -203480 -172221 -195517 -273081
$$ packed form
36212a10651J20603Q7779K8974q5675j53457l1099J44490Q8049j35841j63139
36202b09967N0653J32614n7662j79273j6347J54337P5117o1438j2781P9956Q564
36191c6227r0046l15J63850J62009K3914o1604o9856q4894q8581l9704j0154m6359
36179a77967n0089L8096J02017M3655n2016p1633k9183K5325P8485P5477l3107
36168e0940j34275p1297P0223O5405n9743o2664P8303J27219L2512N803Q1146
36157H1692J9987k14793l13805j23829J04114J57058J56118K05739J48755p7266
36147A43770k12673q5342Q2466N3508m9964k9610L3329J116k1237Q1870J55721
36136A52954M0845j02296n3041P6777L5845j31863j72982m9719L1259k3296p7564
$$ plain form
36125 -273081 -294262 -220381 -122046 -57834 -2804 82842 157163 124337 -18850 -125094 -64780
36114 -64780 92200 174430 146587 98988 39805 -95899 -236223 -214793 -61916 -3383 -103997
36103 -103997 -169128 -83437 22688 46723 72639 135440 118528 25004 48461 214394 264954
36092 264954 81042 -103449 -104134 -62662 -105251 -90499 46747 79966 -82312 -144169 56843
36081 56843 174711 -84206 -404448 -347357 -60148 26837 -73938 -47188 87272 62928
36071 62928 -67768 -36379 84506 -4324 -233196 -243577 -23962 82347 -6280 -25362 85584
36060 85584 81389 -82649 -151983 -66244 -69242 -220025 -254897 -70007 83883 35366 -63719
36049 -63719 -69634 -64498 -104600 -80371 41606 131596 148697 194231 253385 191495 59300 72141
$$ packed form
36125b73081k1181P3881R8335O4212N5030Q5646P4321l2826j43187j06244O0314
36114f4780J56980Q2230k7843m7599n9183j35704j40324K1430J52877N8533j00614
36103a03997o5131Q5691J06125K4035K5916O2801j6912r3524K3457J65933N0560
36092B64954j83912j84491o85M1472m2589J4752J37246L3219j62278o1857K01012
36081E6843J17868k58917l20242N7091K87209Q6985j00775K6750J34460k4344
36071F2928j30696L1389J20885q8830k28872j0381K19615J06309q8627j9082J10946
36060H5584m195j64038o9334Q5739k998j50783l4872J84890J53890m8517r9085
36049f3719n915N136m0102K4229J21977Q9990J7101M5534N9154o1890j32195J2841
$$ plain form
36037 72141 224718 264896 118108 -10441 -31414 -100966 -250336 -261194 -66047 70899
36027 70899 -40439 -223162 -231320 -85106 63490 168117 226879 186323 56350 -43162 -53839
36016 -53839 -41601 -37729 -1649 28296 -38875 -142977 -128100 -26012 -27488 -138361 -146675 4863
36004 4863 101681 9122 -125771 -137374 -65275 -1109 66467 140507 148902 92705 85629 167451
35992 167451 246452 277297 314171 347015 279362 116973 -1676 1630 84365 208719 345431
35981 345431 387029 273953 167674 255150 423911 407095 216166 119622 201130 270758 242473
35970 242473 265469 416706 576881 691342 863101 1107451 1289642 1378556 1501013 1695913
35960 1695913 1884885 2117326 2551621 3169998 3830007 4605157 5676331 6808882 7362358
$$ packed form
36037G2141J52577M0178j46788j28549k0973o9552j49370j0858J95147J36946
36027G0899j11338j82723q158J46214J48596J04627N8762m0556j29973r9512j0677
36016e3839J2238L872L6080K9945o7171j04102J4877J02088j476j10873q314J51538
36004D863R6818r2559j34893j1603P2099O4166O7576P4040Q395n6197p076Q1822
35992A67451P9001L0845L6874L2844o7653j62389j18649L306Q2735J24354J36712
35981C45431M1598j13076j06279Q7476J68761j6816j90929r6544Q1508O9628k8285
35970B42473K2996J51237J60175J14461J71759K44350J82191Q8914J22457J94900
35960A695913J88972K32441M34295O18377O60009P75150J071174J132551N53476
$$ plain form
35951 7362358 7002559 6069178 5079290 4204104 3407464 2742630 2250781 1822036 1390533
35942 1390533 1065596 899895 748450 516833 322552 255359 207195 93897 13661 28298
35932 28298 17626 -87066 -148425 -63087 58635 106265 146163 234103 270598 201026 147583
35921 147583 185338 195766 96051 2395 9751 22406 -35689 -56558 33578 97108 8025 -131472
35909 -131472 -169745 -128452 -90069 -42798 4318 -65829 -279528 -449357 -416437 -274018 -208374
35898 -208374 -256976 -343243 -402145 -371756 -227460 -109004 -213928 -475484 -575526 -386358
35888 -386358 -153223 -108334 -169547 -188638 -226330 -361265 -465171 -413958 -325858 -347231 -376946
35877 -376946 -249681 -43603 38924 -20856 -91448 -125837 -159535 -175946 -163588 -207838 -347556
$$ packed form
35951G362358l59799r33381r89888q75186p96640o64834m91849m28745m31503
35942A390533l24937j65701j51445k31617j94281o7193m8164j13298q0236J4637
35932B8298j0672j04692o1359Q5338J21722M7630L9898Q7940L6495o9572n3443
35921A47583L7755J0428r9715r3656P356J2655n8095k0869R0136O3530q9083j39497
35909a31472l8273M1293L8383M7271M7116p0147k13699j69829L2920J42419O5644
35898b08374m8602q6267n8902L0389J44296J18456j04924k61556j00042J89168
35888c86358K33135M4889o1213j9091l7692j34935j03906N1213Q8100k1373k9715
35877c76946J27265K06078Q2527n9780p0592l4389l3698j6411J2358m4250j39718
$$ plain form
35866 -347556 -443575 -363759 -194458 -97505 -68078 -16086 17939 -70560 -237237 -328831 -296344
35855 -296344 -221683 -175427 -170677 -203817 -231279 -170206 -24670 61244 -23022 -197744 -297360
35844 -297360 -258097 -129866 7889 69521 21 -138503 -209499 -181364 -151511 -155080 -105515
35833 -105515 8709 38205 -112518 -327808 -442333 -431023 -349216 -224917 -109595 -96736
35823 -96736 -180499 -218363 -131711 -20122 13832 17799 63535 96461 30873 -100730 -198864
35812 -198864 -226806 -216793 -210625 -233501 -264564 -238484 -156979 -146413 -276195 -397555 -348183
35801 -348183 -233954 -263216 -374752 -336944 -176346 -147193 -260856 -240742 -24905 93519
35791 93519 -26777 -125443 -2102 145217 98171 -4058 36811 94645 -33202 -222954
$$ packed form
35866c47556r6019P9816J69301R6953K9427N1992L4025q8499j66677r1594L2487
35855b96344P4661M6256M750l3140k7462O1073J45536Q5914q4266j74722r9616
35844b97360L9263J28231J37755O1632o9500j38524p0996K8135K9853l569M9565
35833a05515J14224K9496j50723k15290j14525J1310Q1807J24299J15322J2859
35823i6736q3763l7864Q6652J11589L3954L967M5736L2926o5588j31603r8134
35812a98864k7942J0013O168k2876l1063K6080Q1505J0566j29782j21360M9372
35801c48183J14229k9262j11536L7808J60598K9153j13663K0114K15837J18424
35791I3519j20296r8666J23341J47319m7046j02229M0869N7834j27847j89752
$$ plain form
35781 -222954 -211415 -27629 76337 11672 -105692 -201365 -276811 -275806 -145439 22215 88322
35770 88322 48996 -16075 -87411 -174558 -243736 -283819 -330581 -351652 -267660 -154641 -208589
35759 -208589 -412498 -489719 -324612 -162478 -213383 -327547 -287108 -165616 -136997 -149694
35749 -149694 -71089 28643 14850 -47313 -30555 -42 -75731 -182961 -190787 -159282 -201061
35738 -201061 -237278 -144955 -12333 6752 -37809 -18654 12737 -45740 -108872 -73133 -77430
35727 -77430 -283671 -520711 -484622 -210456 -4206 38922 96412 215116 208035 15047 -147920
35716 -147920 -110852 17523 48205 -40078 -147294 -206165 -210406 -184302 -167755 -169256 -144752
35705 -144752 -85590 -69576 -137808 -200330 -174752 -130215 -162795 -218318 -190568 -114893 -100098
$$ packed form
35781b22954J1539J83786J03966o4665j17364r5673p5446J005J30367J67654O6107
35770H8322l9326o5071p1336q7147o9178m0083m6762k1071Q3992J13019n3948
35759b08589k03909p7221J65107J62134n0905j14164M0439J21492K8619j2697
35749a49694P8605R9732j3793o2163J6758L0513p5689j07230p826L1505m1779
35738b01061l6217R2323J32622J9085m4561J9155L1391n8477o3132L5739m297
35727g7430k06241k37040L6089K74166K06250M3128N7490J18704p081j92988j62967
35716a47920L7068J28375L0682q8283j07216n8871m241K6104J6547j501K4504
35705a44752N9162J6014o8232o2522K5578M4537l2580n5523K7750P5675J4795
$$ plain form
35694 -100098 -133085 -118326 -62559 -56172 -101374 -110041 -60793 -34490 -94379 -211429 -296371 -272128
35682 -272128 -167480 -142708 -309962 -526184 -536841 -349734 -241742 -327457 -383316 -230016
35672 -230016 -22649 28090 -19470 -13976 2703 -77043 -197748 -268951 -340820 -428608 -366149
35661 -366149 -90098 133716 59675 -145153 -168946 -45537 -34894 -152362 -185439 -95736
35651 -95736 -45325 -70070 -64504 -58037 -173532 -327008 -299779 -121857 -64852 -213929 -345388
35640 -345388 -293491 -168062 -124028 -148216 -166991 -175320 -174962 -134036 -68561 -45115 -75905 -114604
35628 -114604 -146383 -178734 -182345 -150807 -156262 -228324 -263361 -184224 -84799 -69415 -72844 -11511
35616 -11511 20857 -88803 -245379 -293362 -272867 -305128 -349267 -316003 -295160 -400249 -502496
$$ packed form
35694a00098l2987J4759N5767O387m5202q667M9248K6303n9889j17050q4942K4243
35682b72128J04648K4772j67254k16222j0657J87107J07992q5715n5859J53300
35672b30016K07367N0739m7560N494J6679p9746j20705p1203p1869q7788O2459
35661c66149K76051K23814p4041k04828k3793J23409J0643j17468l3077Q9703
35651i5736N0411k4745N566O467j15495j53476K7229J77922N7005j49077j31459
35640c45388N1897J25429M4034k4188j8775q329L58M0926O5475K3446l0790l8699
35628a14604l1779l2351l611L1538n455p2062l5037P9137R9425J5384l429O1333
35616a1511L2368j09660j56576m7983K0495l2261m4139L3264K0843j05089j02247
$$ plain form
35605 -502496 -407447 -195338 -88398 -76245 5975 107507 19142 -236162 -410387 -419972 -409051
35594 -409051 -431423 -391416 -306525 -306791 -354054 -279957 -129154 -139667 -334922 -456625 -371462
35583 -371462 -236627 -182824 -135925 -51906 -41391 -142890 -224555 -217963 -214111 -239504 -181256
35572 -181256 -26642 66594 35847 11986 58338 54464 -56257 -147513 -154151 -191175 -295780
35561 -295780 -294656 -99241 79911 9010 -239254 -414815 -421015 -346462 -267977 -185920 -103143
35550 -103143 -43602 -10088 17673 63876 136343 179662 96370 -95583 -206354 -123179 -29112
35539 -29112 -162430 -423457 -486500 -286842 -105586 -132406 -234649 -243732 -194221 -160528 -108999
35528 -108999 -49766 -102973 -262669 -312002 -142352 39864 10559 -137435 -156091 -7105
$$ packed form
35605e02496R5049K12109J06940J2153Q2220J01532q8365k55304j74225r585J0921
35594d09051k2372M0007Q4891k66m7263P4097J50803j0513j95255j21703Q5163
35583c71462J34835N3803M6899Q4019J0515j01499q1665O592L852k5393N8248
35572a81256J54614R3236l0747k3861M6352l874j10721r1256o638l7024j04605
35561b95780J124J95415J79152p0901k48264j75561o200P4553P8485Q2057Q2777
35550a03143N9541L3514K7761M6203P2467M3319q3292j91953j10771Q3175R4067
35539b9112j33318k61027o3043J99658J81256k6820j02243r083M9511L3693N1529
35528a08999N9233n3207j59696m9333J69650J82216k9305j47994j8656J48986
$$ plain form
35518 -7105 134060 148401 66421 -47651 -147421 -181562 -148521 -139494 -221851 -318020 -297712 -159339
35506 -159339 -31275 -9704 -64532 -99795 -61802 13737 48011 14414 -32616 -44623 -48654
35495 -48654 -80258 -103978 -79868 -58461 -113913 -222164 -299049 -316175 -288082 -206461 -92927
35484 -92927 -42931 -90805 -108817 14323 172718 184504 60026 -47579 -86888 -110596 -104232
35473 -104232 -25672 41887 -2861 -75425 -41446 8875 -106131 -301685 -313754 -137662 -49807
35462 -49807 -151911 -229796 -158493 -120695 -267265 -438758 -414763 -233503 -89202 -72165 -150498
35451 -150498 -266275 -338683 -307079 -247793 -301787 -440521 -486315 -405778 -358134 -387659 -322783
35440 -322783 -92476 108906 124740 77001 130778 219616 196145 90972 32117 36659 46761
$$ packed form
35518g105J41165J4341q1980j14072r9770l4141L3041R027q2357r6169K0308J38373
35506a59339J28064K1571n4828l5263L7993P5539L4274l3597m7030j2007m031
35495d8654l1604k3720K4110K1407n5452j08251p6885j7126K8093Q1621J13534
35484i2927M9996m7874j8012J23140J58395J1786j24478j07605l9309k3708O364
35473a04232P8560O7559m4748p2564L3979N0321j15006j95554j2069J76092Q7855
35462d9807j02104p7885P1303L7798j46570j71493K3995J81260J44301J7037p8333
35451a50498j15777p2408L1604N9286n3994j38734m5794Q0537M7644k9525O4876
35440c22783K30307K01382J5834m7739N3777Q8838k3471j05173n8855M542J0102
$$ plain form
35429 46761 53306 43615 -44633 -186110 -227359 -117320 -21985 -61944 -106746 -14073 91974
35418 91974 13701 -169509 -199519 -32104 112163 84688 -17742 -50124 -13730 11097 4300
35407 4300 5118 35584 75501 85726 36073 -74047 -216575 -354104 -445518 -451710 -378706 -298422
35395 -298422 -267176 -241737 -154504 -54387 -65875 -198883 -310615 -292509 -201272 -159084 -197882
35384 -197882 -248773 -239105 -171064 -124488 -167062 -242166 -212180 -65126 22493 -67966 -195016
35373 -195016 -154259 11476 88962 20936 -55821 -71015 -98276 -161634 -173520 -106292 -51058
35362 -51058 -66168 -111561 -145331 -146825 -68015 75327 109464 -97112 -378324 -447959 -305705
35351 -305705 -208358 -251451 -277351 -223844 -238612 -358420 -386737 -228774 -71591 -72615 -120649
$$ packed form
35429D6761O545r691q8248j41477m1249J10039R5335l9959m4802R2673J06047
35418I1974p8273j83210l0010J67415J44267k7475j02430l2382L6394K4827o797
35407D300Q18L0466L9917J0225m9653j10120j42528j37529r1414o192P3004Q0284
35395b98422L1246K5439Q7233J00117j1488j33008j11732J8106R1237M2188l8798
35384a97882n0891R668O8041M6576m2574p5104K9986J47054Q7619r0459j27050
35373a95016M0757J65735P7486o8026p6757j5194k7261o3358j1886O7228N5234
35362e1058j5110m5393l3770j494P8810J43342L4137k06576k81212o9635J42254
35351c05705R7347m3093k5900N3507j4768j19808k8317J57963J57183j024m8034
$$ plain form
35340 -120649 -81700 -52143 -166615 -339394 -399219 -341940 -272665 -217369 -150700 -106265 -117355
35329 -117355 -132949 -102156 -60720 -58239 -94141 -175680 -319349 -453110 -458620 -352564 -273264
35318 -273264 -254753 -194525 -85588 -73273 -211305 -363415 -426764 -453539 -471965 -401166 -244272
35307 -244272 -156959 -208877 -268006 -229027 -165695 -153998 -141303 -97517 -98984 -156827 -160372 -89297
35295 -89297 -71219 -132245 -121536 6650 77972 -12341 -139895 -204528 -277250 -358137 -286908
35284 -286908 -76889 -27307 -261165 -443087 -251586 117805 249587 110063 4310 65332
35274 65332 131867 78462 -30621 -107486 -136631 -116220 -68584 -72193 -154105 -221077 -207676 -186530
35262 -186530 -224060 -262069 -253718 -257103 -277415 -203854 -35715 38245 -63122 -164815 -153746
$$ packed form
35340a20649L8949K9557j14472j72779n9825N7279O9275N5296O6669M4435j1090
35329a17355j5594L0793M1436K481l5902q1539j43669j33761n510J06056P9300
35318b73264J8511O0228J08937J2315j38032j52110o3349k6775j8426P0799J56894
35307b44272Q7313n1918n9129L8979O3332J1697J2695M3786j467n7843l545P1075
35295h9297J8078o1026J0709J28186P1322r0313j27554o4633p2722q0887P1229
35284b86908K10019M9582k33858j81922J91501L69391J31782j39524j05753O1022
35274F5332O6535n3405j09083p6865k9145K0411M7636l609q1912o6972J3401K1146
35262a86530l7530l8009Q351l385k0312P3561J68139P3960j01367j01693J1069
$$ plain form
35251 -153746 -188860 -377853 -507682 -371232 -131002 -58715 -117716 -114399 -71200 -114638 -163094
35240 -163094 -78858 12588 -81255 -225834 -141069 109531 198853 60006 -51634 -11880 29209
35229 29209 -9596 -4934 87924 117911 -1405 -158837 -250464 -304312 -342727 -320337 -251783
35218 -251783 -224902 -249158 -245331 -195991 -159197 -148850 -147145 -189240 -276753 -280761 -120960 35833
35206 35833 -28454 -255413 -399738 -379076 -303821 -231146 -141506 -94162 -140390 -144064 31597
35195 31597 223568 163866 -80292 -200438 -143599 -138448 -227403 -190640 -5774 42707 -140794
35184 -140794 -257335 -107984 68887 8748 -150172 -149703 -62939 -124191 -289642 -320428 -211584
35173 -211584 -202830 -371026 -501184 -420581 -242245 -184424 -292272 -434192 -490143 -454759 -383614
$$ packed form
35251a53746l5114j88993j29829J36450K40230P2287n9001L317M3199m3438m8456
35240a63094Q4236R1446r3843j44579Q4765K50600Q9322j38847j11640L9754M1089
35229B9209l8805M662R2858K9987j19316j57432r1627n3848l8415K2390O8554
35218b51783K6881k4256L827M9340L6794J0347J705m2095q7513m008J59801J56793
35206C5833o4287k26959j44325K0662P5255P2675Q9640M7344m6228l674J75661
35195C1597J91971n9702k44158j20146N6839N151q8955L6763J84866M8481j83501
35184a40794j16541J49351J76871o0139j58920M69Q6764o1252j65451l0786J08844
35173b11584Q754j68196j30158Q0603J78336N7821j07848j41920n5951L5384P1145
$$ plain form
35162 -383614 -309503 -237282 -192823 -221161 -309423 -359468 -294744 -164284 -77210 -62922 -69379
35151 -69379 -70939 -89460 -126623 -167541 -239581 -370996 -493138 -481289 -311049 -104571 -10945
35140 -10945 -84307 -254541 -365970 -293873 -94814 13629 -95614 -294129 -378411 -330930
35130 -330930 -273578 -244913 -193410 -141333 -169070 -246887 -253338 -168353 -95682 -87512 -95113 -100438
35118 -100438 -146918 -224121 -263391 -262266 -275219 -276511 -188602 -63439 -63523 -211874 -321155 -249828
35106 -249828 -95461 -40390 -106834 -164684 -122507 -24948 19987 -37385 -137350 -175103 -118262
35095 -118262 -30246 33384 84268 122681 93521 -8819 -87571 -85536 -77791 -117418 -112854 -7349
35083 -7349 46445 -103670 -316991 -315994 -93512 76456 30985 -110818 -190470 -197737 -165846
$$ packed form
35162c83614P4111P2221M4459k8338q8262n0045O4724J30460Q7074J4288o457
35151f9379j560j8521l7163m0918p2040j31415j22142J1849J70240K06478R3626
35140a0945p3362j70234j11429P2097J99059J08443j09243j98515q4282M7481
35130c30930N7352K8665N1503N2077k7737p7817o451Q4985P2671Q170p601n325
35118a00438m6480p7203l9270J125j2953j292Q7909J25163q4j48351j09281P1327
35106b49828J54367N5071o6444n7850M2177R7559M4935n7372r9965l7753N6841
35095a18262Q8016O3630N0884L8413k9160j02340p8752K035P745l9627M564J05505
35083g349N3794j50115k13321R97K22482J69968m5471j41803p9652p267L1891
$$ plain form
35072 -165846 -89694 -22355 -67739 -194511 -224469 -95278 19027 -49042 -228558 -329408
35062 -329408 -289663 -196221 -133056 -111055 -112908 -132768 -174590 -230128 -249119 -161377 21945
35051 21945 167766 158047 34598 -74702 -128467 -165222 -172800 -105796 -16435 -19313 -111807 -165757
35039 -165757 -127773 -101518 -178891 -289930 -289521 -143036 24693 56925 -64594 -185165 -155111
35028 -155111 -30468 3580 -80667 -102260 20684 94006 -71322 -352323 -482698 -421546
35018 -421546 -347576 -356039 -366226 -296665 -158746 -4771 79427 -6568 -226572 -366566 -300114
35007 -300114 -184120 -213806 -317643 -316545 -247553 -255241 -274669 -136169 83645 140931 21650
34996 21650 -60728 -48436 -91476 -206947 -220474 -95806 -12828 -58929 -132132 -193377 -310615
$$ packed form
35072a65846P6152O7339m5384j26772k9958J29191J14305o8069j79516j00850
35062c29408L9745R3442O3165K2001j853j9860m1822n5538j8991Q7742J83322
35051B1945J45821r719j23449j09300n3765l6755p578O7004Q9361k878r2494n3950
35039a65757L7984K6255p7373j11039M09J46485J67729L2232j21519j20571L0054
35028a55111J24643L4048q4247k1593J22944P3322j65328k81001j30375O1152
35018d21546P3970q463j0187O9561J37919J53975Q4198q5995k20004j39994O6452
35007c00114J15994k9686j03837J098O8992p688j9428J38500K19814N7286j19281
34996B1650q2378J2292m3040j15471j3527J24668Q2978m6101p3203o1245j17238
$$ plain form
34985 -310615 -409648 -313120 -94359 -45973 -203005 -259891 -93854 5054 -178011 -417712
34975 -417712 -422711 -273912 -210215 -224982 -168925 -66351 -45008 -83773 -75698 -35767 -41257 -69059
34963 -69059 -67355 -77753 -130393 -141341 -59888 18487 23916 38287 104117 86652 -97091 -285129
34951 -285129 -304227 -239000 -258735 -320975 -273721 -135829 -47783 -29523 2138 45615 34253
34940 34253 -22397 -84693 -189529 -345440 -414336 -280571 -60433 35314 -20677 -96878 -126861
34929 -126861 -137054 -123460 -73187 -46879 -82632 -90261 4893 102323 79168 7338 28312 98800
34917 98800 69725 -50359 -127428 -145505 -196765 -261332 -221541 -90640 -16717 -47822 -85126
34906 -85126 -81320 -97204 -139703 -125779 -45298 -2009 -56365 -160298 -258099 -317165 -273913 -113163
$$ packed form
34985c10615r9033R6528K18761M8386j57032n6886J66037R8908j83065k39701
34975d17712m999J48799O3697j4767N6057J02574K1343l8765Q075L9931n490k7802
34963f9059J704j0398n2640j0948Q1453P8375N429J4371O5830j7465j83743j88038
34951b85129j9098O5227j9735o2240M7254J37892Q8046J8260L1661M3477j1362
34940C4253n6650o2296j04836j55911o8896J33765K20138R5747n5991p6201k9983
34929a26861j0193J3594N0273K6308l5753p629R5154R7430k3155p1830K0974P0488
34917I8800k9075j20084p7069j8077n1260o4567L9791J30901P3923l1105l7304
34906h5126L806j5884m2499J3924Q0481M3289n4356j03933r7801n9066M3252J60750
$$ plain form
34894 -113163 14398 -50384 -197368 -149490 117548 297200 187315 -26607 -71374 29230
34884 29230 64153 -16175 -82479 -78602 -72657 -80245 -35484 44934 46813 -42389 -75901 28023
34872 28023 133946 76394 -93908 -190816 -170339 -169077 -257322 -311142 -204098 -8231 104021
34861 104021 85465 27227 -8711 -46167 -93680 -104928 -63276 -15339 6551 20668 33454
34850 33454 14949 -37406 -78017 -83382 -82470 -93162 -87740 -48233 -6716 -8724 -72517 -185169
34838 -185169 -301364 -366508 -387446 -433927 -500309 -441614 -176583 108443 140953 -70304 -251172
34827 -251172 -261961 -253650 -350862 -415408 -283712 -57487 40817 -14013 -75074 -91498 -146306
34816 -146306 -242420 -239254 -55099 182181 250764 61412 -251185 -446157 -401271 -235127
$$ packed form
34894a13163J27561o4782j46984M7878K67038J79652j09885k13922m4767J00604
34884B9230L4923q0328o6304L877N945p588M4761Q0418J879q9202l3512J03924
34872B8023J05923n7552j70302r6908K0477J262q8245n3820J07044J95867J12252
34861A04021j8556n8238l5938l7456m7513j1248M1652M7937K1890J4117J2786
34850C3454j8505n2355m0611n365R12j0692N422L9507M1517k008o3793j12652
34838a85169j16195o5144k0938m6481o6382N8695K65031K85026L2510k11257j80868
34827b51172j0789Q311r7212o4546J31696K26225R8304n4830o1061j6424n4808
34816a46306r6114L166J84155K37280O8583j89352l12597j94972M4886J66144
$$ plain form
34806 -235127 -168522 -257401 -338011 -264070 -97069 9830 24618 28070 53918 55752 11671
34795 11671 -45259 -107143 -213268 -362934 -465820 -424698 -253826 -86392 -54052 -168339
34785 -168339 -336149 -475050 -562667 -575315 -471780 -287771 -152604 -128548 -121162 -49252 -637
34774 -637 -76610 -184560 -178720 -127352 -203982 -356908 -357200 -180591 -54796 -73201 -58116 80714
34762 80714 143513 -26433 -256181 -306351 -223887 -202271 -246018 -216193 -104701 -31527 -28939
34751 -28939 -27091 -13640 -40314 -106363 -173904 -252520 -346577 -384869 -328768 -274745 -313778 -366532
34739 -366532 -308172 -189294 -170544 -278274 -376586 -360351 -248351 -106442 8555 47289
34729 47289 2723 -73203 -142263 -213450 -264942 -239824 -180144 -226554 -392943 -496182 -430978
$$ packed form
34806b35127O6605q8879q0610P3941J67001J06899J4788L452K5848J834m4081
34795A1671n6930o1884j06125j49666j02886M1122J70872J67434L2340j14287
34785a68339j67810j38901q7617j2648J03535J84009J35167K4056P386P1910M8615
34774f37p5973j07950N840N1368p6630j52926k92J76609J25795j8405J5085J38830
34762H0714O2799j69946k29748n0170Q2464K1616m3747K9825J11492P3174K588
34751b8939J848J3451k6674o6049o7541p8616r4057l8292N6101N4023l9033n2754
34739c66532N8360J18878J8750j07730r8312J6235J12000J41909J14997L8734
34729D7289m4566p5926o9060p1187n1492K5118N9680m6410j66389j03239O5204
$$ plain form
34718 -430978 -345918 -387685 -445015 -355042 -206301 -184326 -238553 -183482 -49942 -39157 -162846
34707 -162846 -224764 -163175 -123981 -160267 -142753 -38513 -7260 -112543 -184089 -107089 -30909
34696 -30909 -118464 -261642 -240586 -54604 91724 73144 -44132 -147995 -204772 -231849 -240937
34685 -240937 -237582 -237015 -260812 -315329 -365173 -351666 -275253 -229309 -288669 -391483 -414235 -342921
34673 -342921 -269844 -233051 -180134 -102501 -74156 -114715 -137063 -95133 -71087 -131852 -198574
34662 -198574 -166216 -79122 -62479 -118436 -126266 -53060 -34378 -180305 -388915 -452114 -318816
34651 -318816 -153475 -115250 -168855 -175315 -102283 -43308 -52450 -77838 -85586 -139427 -285854 -436873
34639 -436873 -459466 -347366 -221772 -175041 -186620 -195674 -188518 -182675 -163295 -85218 48764
$$ packed form
34718d30978Q5060m1767n7330Q9973J48741K1975n4227N5071J33540J0785j23689
34707a62846o1918O1589L9194l6286J7514J04240L1253j05283p1546P7000P6180
34696c0909q7555j43178K1056J85982J46328j8580j17276j03863n6777k7077r088
34685b40937L355N67k3797n4517m9844J3507P6413M5944n9360j02814k2752P1314
34673c42921P3077L6793N2917P7633K8345m0559k2348M1930K4046o0765o6722
34662a98574L2358Q7094J6643n5957p830P3206J8682j45927k08610o3199J33298
34651c18816J65341L8225n3605o460P3032N8975r142k5388p748n3841j46427j51019
34639d36873k2593J12100J25594M6731j1579r054P156N843J9380P8077J33982
$$ plain form
34628 48764 142128 89366 -79058 -194926 -145939 -20470 15174 -62128 -135935 -142518 -130192
34617 -130192 -130020 -108221 -74230 -97807 -171107 -187164 -118105 -84013 -164490 -264581 -263424 -186959
34605 -186959 -130375 -108382 -93407 -116435 -212145 -325714 -376096 -357703 -300225 -202506 -90137
34594 -90137 -49654 -103600 -138231 -68249 13210 -21240 -119758 -135183 -66283 -48205 -123668 -189650
34582 -189650 -186361 -186450 -245044 -284633 -212601 -80491 -33056 -114539 -205413 -187069 -116767 -153114
34570 -153114 -308683 -396544 -293584 -137297 -124134 -210446 -205559 -98952 -58785 -119201 -130654
34559 -130654 -58305 -58368 -174013 -229276 -154242 -144382 -317677 -466894 -379308 -186687 -143014
34548 -143014 -230857 -257345 -201930 -194218 -246421 -269141 -274127 -315509 -306253 -144722 38387 16388
$$ packed form
34628D8764R3364n2762j68424j15868M8987J25469L5644p7302p3807o583J2326
34617a30192J72K1799L3991k3577p3300j6057O9059L4092q0477j00091J157P6465
34605a86959N6584K1993J4975k3028r5710j13569n0382J8393N7478R7719J12369
34594i0137M0483n3946l4631O9982Q1459l4450r8518j5425O8900J8078p5463o5982
34582a89650L289q9n8594l9589P2032J32110M7435q1483r0874J8344P0302l6347
34570a53114j55569q7861J02960J56287J3163q6312M887J06607M0167o0416j1453
34559a30654P2349o3j15645n5263P5034R860j73295j49217Q7586J92621M3673
34548a43014q7843k6488N5415P712n2203k2720m986m1382R256J61531J83109k1999
$$ plain form
34536 16388 -186085 -323734 -283409 -177001 -106589 -69096 -83529 -182964 -273704 -218867 -75432
34525 -75432 -43144 -161828 -259217 -223521 -137410 -107770 -134195 -179846 -221318 -206844 -103477
34514 -103477 12252 46306 46913 119519 214407 179231 10662 -127823 -140926 -86167 -28616
34503 -28616 19305 16817 -76940 -191754 -216678 -167472 -136941 -123724 -81445 -76611 -188621 -304592
34491 -304592 -248880 -80715 -10942 -49558 -16551 101805 121671 28429 45895 234702 336883
34480 336883 184886 -11676 3673 140632 134748 -41316 -176709 -148436 -40264 34909
34470 34909 68166 98013 120629 86194 -36384 -189870 -251768 -176750 -75885 -72959 -131201
34459 -131201 -132883 -76467 -51485 -63932 -54227 -53698 -134966 -226116 -180333 -36917 -5695 -163523
$$ packed form
34536A6388k02473j37649M0325J06408P0412L7493j4433r9435r0740N4837J43435
34525g5432L2288j18684r7389L5696Q6111K9640k6425m5651m1472J4474J03367
34514a03477J15729L4054O07P2606R4888l5176j68569j38485j3103N4759N7551
34503b8616M7921k488r3757j14814k4924M9206L0531J3217M2279M834j12010j15971
34491c04592N5712J68165O9773l8616L3007J18356J9866r3242J7466J88807J02181
34480C36883j51997j96562J5349J36959n884j76064j35393K8273J08172P5173
34470C4909L3257K9847K2616l4435j22578j53486o1898P5018J00865K926n8242
34459a31201j682N6416K4982j2447R705N29q1268r1150M5783J43416L1222j57828
$$ plain form
34447 -163523 -359161 -447183 -425260 -317587 -128973 47473 80613 3882 -22074 28727 33711
34436 33711 -17620 -767 67296 4632 -204105 -329402 -260329 -175366 -213937 -244958 -136440
34425 -136440 -10741 -27879 -120184 -148567 -142825 -181285 -193775 -94081 28564 52013 33942
34414 33942 88516 161733 125361 6964 -58070 -36395 1622 25302 44254 27983 -45158
34403 -45158 -117582 -136535 -135283 -139856 -95425 11767 70308 1963 -98249 -105859 -57517 -69750
34391 -69750 -145042 -181404 -121229 -1042 94795 82140 -39985 -132224 -63447 70504 50541
34380 50541 -116490 -177592 -31303 110130 78728 6768 47420 92686 -563 -122462 -107418
34369 -107418 -36699 -71397 -137349 -62330 93230 130904 50795 16680 57357 72496 72645 138862
$$ packed form
34447a63523j95638q8022K1923J07673J88614J76446L3140p6731k5956N0801M984
34436C3711n1331J6853O8063o2664k08737j25297O9073Q4963l8571l1021J08518
34425a36440J25699j7138r2305k8383N742l8460j2490R9694J22645K3449j8071
34414C3942N4574P3217l6372j18397o5034K1675L8017K3680J8952j6271p3141
34403d5158p2424j8953J252m573M4431J07192N8541o8345j00212p610M8342j2233
34391f9750p5292l6362O0175J20187R5837j2655j22125r2239O8777J33951j9963
34380E0541j67031o1102J46289J41433l1402p1960M0652M5266r3249j21899J5044
34369a07418P0719l4698o5952P5019J55560L7674q0109l4115M0677J5139J49O6217
$$ plain form
34357 138862 190682 74416 -139033 -217917 -129551 -74693 -150960 -238177 -248524 -244695 -262613
34346 -262613 -246606 -216084 -279609 -421904 -483654 -418388 -366937 -403036 -408659 -299978 -187372
34335 -187372 -186869 -228570 -184627 -67512 22120 49348 37309 -12222 -88603 -129612 -103413 -83153
34323 -83153 -156579 -295337 -381985 -346015 -225307 -109175 -54533 -51357 -55693 -50388 -49645 -40639
34311 -40639 16632 93634 76733 -75416 -230138 -242989 -163176 -149380 -223333 -257187 -195816
34300 -195816 -136201 -158018 -209677 -208896 -150057 -68587 9564 45302 -3891 -117806 -224809
34289 -224809 -289940 -316114 -267072 -101641 103393 191710 130980 59730 72965 78628 -42202
34278 -42202 -227437 -304412 -222035 -100806 -59178 -84328 -99533 -91597 -116005 -191821 -247035
$$ packed form
34357A38862N1820j16266k13449p8884Q8366N4858p6267q7217j0347L829j7918
34346b62613J6007L0522o3525j42295o1750O5266N1451l6099n623J08681J12606
34335a87372N03m1701M3943J17115Q9632K7228j2039m9531p6381m1009K6199K0260
34323h3153p3426j38758q6648L5970J20708J16132N4642L176m336N305P43R006
34311d0639N7271P7002j6901j52149j54722j2851P9813J3796p3953l3854O1371
34300a95816N9615k1817n1659P81N8839Q1470P8151L5738m9193j13915j07003
34289b24809o5131k6174M9042J65431K05034Q8317o0730p1250J3235N663j20830
34278d2202j85235p6975Q2377J21229M1628k5150j5205P936k4408p5816n5214
$$ plain form
34267 -247035 -204292 -97818 -45684 -95143 -162107 -163756 -142832 -186040 -269562 -285038 -204332
34256 -204332 -122678 -126932 -197461 -258051 -262331 -216197 -163768 -155030 -183171 -169001 -65868 44560
34244 44560 44590 -47523 -102297 -78111 -70719 -125754 -135365 -15863 116917 88365 -65906 -120427
34232 -120427 38128 258768 330605 237405 122475 71516 46376 10836 -4593 6225 -23264
34221 -23264 -126032 -228056 -256258 -248988 -267348 -261889 -152843 -7742 8280 -128992 -251770
34210 -251770 -229889 -130881 -89047 -119340 -144463 -135320 -138236 -191940 -269314 -288848 -187088 -24294
34198 -24294 18279 -148293 -338117 -284558 -29600 86413 -96975 -314655 -272300 -90056
34188 -90056 -100020 -322676 -447125 -321003 -166988 -221164 -387733 -407043 -219003 9970
$$ packed form
34267b47035M2743J06474N2134m9459o6964j649K0924m3208q3522j5476Q0706
34256b04332Q1654m254p0529o0590m280M6134N2429Q738k8141J4170J03133J10428
34244D4560L0r2113n4774K4186P392n5035r611J19502J32780k8552j54271n4521
34232a20427J58555K20640P1837r3200j14930n0959k5140l5540j5429J0818k9489
34221b3264j02768j02024k8202P270j8360N459J09046J45101J6022j37272j22778
34210b51770K1881R9008M1834l0293k5123R143k916n3704p7374j9534J01760J62794
34198b4294M2573j66572j89824N3559K54958J16013j83388k17680M2355J82244
34188i0056r964k22656j24449J26122J54015n4176j66569j9310J88040K28973
$$ plain form
34178 9970 144506 199271 214926 163687 33367 -85818 -86855 4115 40082 -67494 -239122
34167 -239122 -331498 -301009 -212575 -135093 -106262 -163607 -303755 -419040 -389817 -256107 -182923
34156 -182923 -226289 -259191 -183329 -82316 -71675 -111088 -91645 -33209 -55211 -178646 -280929
34145 -280929 -260737 -165887 -131354 -224200 -360882 -382389 -236965 -68469 -54846 -172845 -231729
34134 -231729 -153615 -85064 -172151 -353589 -467163 -455298 -366750 -247154 -132813 -76402 -78029
34123 -78029 -56718 23091 71809 7116 -117852 -210842 -274341 -339266 -358260 -288311 -201091
34112 -201091 -183445 -193499 -136710 -21215 76967 131815 138307 57261 -80786 -119799 14105
34101 14105 149671 103810 -16050 25682 190078 195084 -43200 -269731 -263152 -116135 -33781
$$ packed form
34178I970J34536N4765J5655n1239j30320j19185j037R0970L5967j07576j71628
34167b39122r2376L0489Q8434P7482K8831n7345j40148j15285K9223J33710P3184
34156a82923m3366l2902P5862J01013J0641l9413J9443N8436k2002j23435j02283
34145b80929K0192R4850L4533r2846j36682k1507J45424J68496J3623j17999n8884
34134b31729P8114O8551q7087j81438j13574J1865Q8548J19596J14341N6411j627
34123g8029K1311P9809M8718o4693j24968r2990o3499o4925j8994O9949Q7220
34112b01091J7646j0054N6789J15495R8182N4848O492q1046j38047l9013J33904
34101A4105J35566m5861j19860M1732J64396N006k38284k26531O579J47017Q2354
$$ plain form
34090 -33781 -47569 -69526 -83715 -129937 -185728 -198765 -182720 -174102 -139210 -27902 102731
34079 102731 117829 -24869 -199189 -242824 -139638 -27754 -20197 -67576 -51180 26616 46600
34068 46600 -32116 -108727 -119089 -143063 -243837 -328510 -298860 -231930 -251387 -306613 -264887
34057 -264887 -163870 -163804 -266441 -297617 -196998 -119746 -183763 -298395 -337910 -328005 -344014
34046 -344014 -350633 -276595 -164097 -112680 -123432 -115192 -67151 -38903 -57904 -84956 -103706 -156087
34034 -156087 -248211 -287688 -184491 6058 109266 17911 -191653 -354604 -387099 -325255
34024 -325255 -240017 -175756 -150797 -154492 -151885 -136492 -145649 -169147 -107877 75150 225802 166996
34012 166996 -39645 -164710 -124044 -38942 3523 30808 10899 -147694 -358094 -380970 -194158
$$ packed form
34090c3781j3788k1957j4189m6222n5791j3037J6045Q618L4892J11308J30633
34079A02731J5098j42698j74320m3635J03186J11884P557m7379J6396P7796J9984
34068D6600p8716p6611j0362k3974j00774q4673K9650O6930j9457n5226M1726
34057b64887J01017O6j02637l1176J00619P7252o4017j14632l9515R905j6009
34046c44014o619P4038J12498N1417j0752Q240M8041K8248j9001k7052j8750n2381
34034a56087r2124l9477J03197J90549J03208r1355k09564j62951l2495O1844
34024c25255Q5238O4261K4959l695K607J5393r157k3498O1270J83027J50652n8806
34012A66996k06641j25065M0666Q5102M2465K7285j9909j58593k10400k2876J86812
$$ plain form
34001 -194158 -72635 -165051 -269460 -209251 -136686 -212043 -262299 -85343 135596 94171 -131336
33990 -131336 -223641 -157083 -169729 -276831 -247146 -66524 -754 -132593 -230997 -181813 -171597
33979 -171597 -301475 -374830 -259255 -144565 -215813 -333986 -284155 -126544 -54785 -77761
33969 -77761 -88715 -116512 -258179 -441568 -484560 -358429 -208971 -136004 -107992 -84103 -79742
33958 -79742 -98037 -102986 -84453 -82465 -129316 -204917 -256383 -248555 -201692 -173347 -183338 -182548 -134981
33945 -134981 -88987 -102368 -142662 -146792 -130847 -136023 -118125 -22275 77599 68421 -5268 -7588
33933 -7588 42199 -15870 -206334 -354584 -345938 -264965 -215757 -179207 -127330 -118646 -186163 -259121
33921 -259121 -275715 -260935 -239729 -198706 -177848 -255137 -387063 -417495 -307561 -198870 -177777
$$ packed form
34001a94158J21523r2416j04409O0209P2565p5357n0256J76956K20939m1425k25507
33990a31336r2305O6558j2646j07102K9685J80622O5770j31839r8404M9184J0216
33979a71597j29878p3355J15575J14690p1248j18173M9831J57611P1759k2976
33969g7761j0954k7797j41667j83389m2992J26131J49458P2967K8012K3889M361
33958g9742j8295m949J8533J988m6851p5601n1466P828M6863K8345r991P90M7567
33945a34981M5994j3381m0294m130J5945n176J7898R5850R9874r178p3689k320
33933g588M9787n8069j90464j48250Q646Q0973M9208L6550N1877Q684o7517p2958
33921b59121j6594J4780K1206M1023K0858p7289j31926l0432J09934J08691K1093
$$ [...]
##END NTUPLES=NMR SPECTRUM
##END=
