##TITLE=31Pdec_X1312
 CDCl3, 24 sc
 14.12.2021
##JCAMPDX= 6.0         $$ Bruker NMR JCAMP-DX V2.0
##DATA TYPE= NMR SPECTRUM
##DATA CLASS= NTUPLES
##ORIGIN= UXNMR, Bruker Analytische Messtechnik GmbH
##OWNER= root
$$ XWIN-NMR		Version 3.5
$$ Tue Dec 14 12:18:08 2021 Russian Standard Time (UT+4h)  she@DPX200
##.OBSERVE FREQUENCY= 81.013821
##.OBSERVE NUCLEUS= ^31P
##.ACQUISITION MODE= SIMULTANEOUS
##.ACQUISITION SCHEME= undefined
##.AVERAGES= 24
##.DIGITISER RES= 16
##SPECTROMETER/DATA SYSTEM= spect
##.PULSE SEQUENCE= zgpg30
##.SOLVENT NAME= CDCl3
##.SHIFT REFERENCE= (INTERNAL, CDCl3, 0, 248.564)
##AUDIT TRAIL= $$ (NUMBER, WHEN, WHO, WHERE, WHAT)
$$ ##TITLE= Audit trail, XWIN-NMR		Version 3.5
$$ ##JCAMPDX= 5.01
$$ ##ORIGIN= Bruker BioSpin GmbH
$$ ##OWNER= she
$$ F:/spectra/data/she/nmr/P31/1/pdata/1/auditp.txt
$$ ##AUDIT TRAIL=  $$ (NUMBER, WHEN, WHO, WHERE, WHAT)
(   1,<2021-12-14 12:16:54.54 +0400>,<she>,<DPX200>,
      <created by zg, POWCHK disabled, PULCHK disabled
       configuration hash MD5:
       00 E9 B6 7A A2 85 ED C7 34 08 36 98 17 FE 4E 26
       data hash MD5: 32K
       D4 2D 8B 41 FB 38 A4 AF 66 E3 A1 42 0A 83 BF 3B>)
(   2,<2021-12-14 12:16:59.17 +0400>,<she>,<DPX200>,
      <Start of raw data processing
       efp BC_mod = 2 LB = 1 FT_mod = 6 PKNL = 1 PHC0 = -9018.446 PHC1 = -264.13 SI = 64K 
       data hash MD5: 64K
       67 51 CA BD 74 EE 9B 79 2D 52 69 AE 0B 44 7C 87>)
(   3,<2021-12-14 12:17:15.53 +0400>,<she>,<DPX200>,
      <pk PHC0 = -2.946923 PHC1 = 0 
       data hash MD5: 64K
       38 F3 EA 5B 64 8E 6F 55 09 58 79 E5 E8 CA E6 F0>)
$$ ##END=
$$ 
$$ hash MD5
$$ 21 80 C3 77 D1 54 6D 03 5E EF AE F9 A9 4C 11 4A
##$RELAX= 
##$RELAX= 
##$RELAX= 
##$RELAX= 
##$RELAX= 
##$RELAX= 
##$RELAX= 
##$RELAX= 
$$ Bruker specific parameters
$$ --------------------------
##$DU= <F:/spectra>
##$EXPNO= 1
##$NAME= <P31>
##$PROCNO= 1
##$TYPE= <nmr>
##$USER= <she>
##$AMP= (0..31)
100 100 100 100 100 100 100 100 100 100 100 100 100 100 100 100 100 100 
100 100 100 100 100 100 100 100 100 100 100 100 100 100 
##$AQSEQ= 0
##$AQ_mod= 1
##$AUNM= <au_zg>
##$AUTOPOS= <>
##$BF1= 81.014009
##$BF2= 200.13
##$BF3= 200.13
##$BF4= 200.13
##$BF5= 200.13
##$BF6= 200.13
##$BF7= 200.13
##$BF8= 200.13
##$BYTORDA= 1
##$CFDGTYP= 0
##$CFRGTYP= 5
##$CHEMSTR= <none>
##$CNST= (0..31)
1 1 145 1 1 1 1 1 1 1 1 1 1 1 1 1 1 1 1 1 1 1 1 1 1 1 1 1 1 1 1 1 
##$CPDPRG= <waltz16>
##$CPDPRG1= <>
##$CPDPRG2= <waltz16>
##$CPDPRG3= <>
##$CPDPRG4= <mlev>
##$CPDPRG5= <mlev>
##$CPDPRG6= <mlev>
##$CPDPRG7= <mlev>
##$CPDPRG8= <mlev>
##$CPDPRGB= <>
##$CPDPRGT= <>
##$D= (0..31)
0 1 0 0 0 0 0 0 0 0 0 0.03 2e-05 3e-06 0 0 0 0 0 0 0 0 0 0 0 0 0 0 0 0 
0 0 
##$DATE= 1639469813
##$DBL= (0..7)
120 120 120 11 120 120 24 19 
##$DBP= (0..7)
150 150 150 150 150 150 150 150 
##$DBP07= 0
##$DBPNAM0= <>
##$DBPNAM1= <>
##$DBPNAM2= <>
##$DBPNAM3= <>
##$DBPNAM4= <>
##$DBPNAM5= <>
##$DBPNAM6= <>
##$DBPNAM7= <>
##$DBPOAL= (0..7)
0.5 0.5 0.5 0.5 0.5 0.5 0.5 0.5 
##$DBPOFFS= (0..7)
0 0 0 0 0 0 0 0 
$$ [...]
##$SUBNAM2= <"">
##$SUBNAM3= <"">
##$SUBNAM4= <"">
##$SUBNAM5= <"">
##$SUBNAM6= <"">
##$SUBNAM7= <"">
##$SUBNAM8= <"">
##$SUBNAM9= <"">
##$SW= 501.771253377433
##$SWIBOX= (0..15)
0 1 3 0 0 0 0 0 0 0 0 0 0 0 0 0 
##$SW_h= 40650.406504065
##$TD= 32768
##$TD0= 1
##$TE= 0
##$TE2= 300
##$TE3= 300
##$TEG= 300
##$TL= (0..7)
0 120 53 12 22 120 120 120 
##$TP= (0..7)
150 150 150 150 150 150 150 150 
##$TP07= 0
##$TPNAME0= <>
##$TPNAME1= <>
##$TPNAME2= <>
##$TPNAME3= <>
##$TPNAME4= <>
##$TPNAME5= <>
##$TPNAME6= <>
##$TPNAME7= <>
##$TPOAL= (0..7)
0.5 0.5 0.5 0.5 0.5 0.5 0.5 0.5 
##$TPOFFS= (0..7)
0 0 0 0 0 0 0 0 
##$TUNHIN= 0
##$TUNHOUT= 0
##$TUNXOUT= 0
##$USERA1= <user>
##$USERA2= <user>
##$USERA3= <user>
##$USERA4= <user>
##$USERA5= <user>
##$V9= 5
##$VALIST= <valist>
##$VCLIST= <CCCCCCCCCCCCCCC>
##$VD= 0
##$VDLIST= <DDDDDDDDDDDDDDD>
##$VPLIST= <PPPPPPPPPPPPPPP>
##$VTLIST= <TTTTTTTTTTTTTTT>
##$WBST= 1024
##$WBSW= 4
##$XGAIN= (0..3)
0 0 0 0 
##$XL= 0
##$YL= 0
##$YMAX_a= 3186
##$YMIN_a= -3301
##$ZGOPTNS= <>
##$ZL1= 120
##$ZL2= 120
##$ZL3= 120
##$ZL4= 120
##$ABSF1= 0
##$ABSF2= 0
##$ABSG= 0
##$ABSL= 0
##$ALPHA= 0
##$AQORDER= 0
##$ASSFAC= 0
##$ASSFACI= 0
##$ASSFACX= 0
##$ASSWID= 0
##$AUNMP= <proc_1d>
##$AZFE= 0.1
##$AZFW= 0.5
##$BCFW= 0
##$BC_mod= 2
##$BYTORDP= 0
##$COROFFS= 0
##$CY= -3
##$DATMOD= 1
##$DC= 0
##$DFILT= <>
##$DTYPP= 0
##$F1P= 0
##$F2P= 0
##$FCOR= 1
##$FTSIZE= 65536
##$FT_mod= 6
##$GAMMA= 0
##$GB= 0
##$INTBC= 1
##$INTSCL= 5.30512e-09
##$ISEN= 30
##$LB= 1
##$LEV0= 0
##$LPBIN= 0
##$MAXI= 10000
##$MC2= 0
##$MEAN= 0
##$ME_mod= 0
##$MI= 50
##$NCOEF= 0
##$NC_proc= -5
##$NLEV= 6
##$NOISF1= 182.463
##$NOISF2= 159.3651
##$NSP= 0
##$NTH_PI= 0
##$NZP= 0
##$OFFSET= 248.5645
##$PC= 4
##$PHC0= -9021.394
##$PHC1= -264.13
##$PH_mod= 1
##$PKNL= yes
##$PPARMOD= 0
##$PSCAL= 0
##$PSIGN= 0
##$REVERSE= no
##$SF= 81.014009
##$SI= 65536
##$SIGF1= 159.3651
##$SIGF2= -187.1042
##$SINO= 113.3802
##$SIOLD= 16384
##$SREGLST= <1H.CDCl3>
##$SSB= 0
##$STSI= 65536
##$STSR= 0
##$SW_p= 40650.406504065
##$SYMM= 0
##$S_DEV= 0
##$TDeff= 32768
##$TDoff= 0
##$TI= <>
##$TILT= no
##$TM1= 0
##$TM2= 0
##$TOPLEV= 0
##$USERP1= <user>
##$USERP2= <user>
##$USERP3= <user>
##$USERP4= <user>
##$USERP5= <user>
##$WDW= 1
##$XDIM= 65536
##$YMAX_p= 303890462
##$YMIN_p= -14172128
$$ End of Bruker specific parameters
$$ ---------------------------------
##NTUPLES= NMR SPECTRUM
##VAR_NAME=  FREQUENCY,     SPECTRUM/REAL,   SPECTRUM/IMAG
##SYMBOL=    X,             R,               I
##VAR_TYPE=  INDEPENDENT,   DEPENDENT,       DEPENDENT
##VAR_FORM=  AFFN,          ASDF,            ASDF
##VAR_DIM=   65536,         65536,           65536
##UNITS=     HZ,            ARBITRARY UNITS, ARBITRARY UNITS
##FACTOR=    0.620285442955139, 1,           1
##FIRST=     20137.2065510759, 0,            0
##LAST=      -20513.1999529892, 0,           0
##MIN=       -20513.1999529892, -14172128,   0
##MAX=       20137.2065510759, 303890462,    0
$$ Real data points
##PAGE= N=1
##DATA TABLE= (X++(R..R)), XYDATA
$$ [...]
42304 383481 152873 -166911 60492 704547 869129 119039 -879956 -1248776 -938345 -503946
42294 -503946 -244709 -62469 60808 -28922 -302611 -499687 -482975 -377716 -336924 -383483
42284 -383483 -476464 -523821 -352028 95031 519758 511229 122976 -41448 473163 1335071
42274 1335071 1730453 1283758 459375 -4410 131662 527573 790857 838966 764469 601331
42264 601331 338081 -1377 -408999 -885951 -1268338 -1233328 -686167 -27078 212932 -36579
42254 -36579 -382536 -531667 -598074 -794063 -1054914 -1121896 -881733 -506286 -302450 -454368
42244 -454368 -832971 -1044588 -780511 -166239 324789 354069 55169 -135122 72639 547907
42234 547907 868931 728141 240344 -192192 -343519 -390187 -610789 -999562 -1309851 -1357460
42224 -1357460 -1123192 -680677 -213904 19796 -26101 -61643 117450 228571 -98118 -604409
42214 -604409 -585466 119911 806175 816128 366902 93292 84275 -107367 -586889 -813100
42204 -813100 -389696 231023 250690 -391535 -895692 -682734 -163871 -54366 -245516 7806
42194 7806 838097 1454938 1325187 941073 928424 1048265 806462 524777 851825 1491793
42184 1491793 1485129 740251 222252 421900 680814 438392 147343 314054 490843 49400
42174 49400 -677644 -915720 -666833 -523243 -570649 -384328 27698 166244 -69457 -253069
42164 -253069 -288667 -603894 -1260889 -1619150 -1280154 -768266 -770071 -1125184 -1135225 -638532
42154 -638532 -200042 -240721 -465518 -341633 164424 607776 697492 593044 506934 313872
42144 313872 -167697 -676873 -710020 -245785 157950 164538 137234 492122 928843 794816
42134 794816 53338 -609427 -639674 -166089 346497 611254 576234 299448 -38626 -198807
42124 -198807 -134722 -69579 -206373 -451831 -534420 -352947 -115779 -98761 -285652 -333730
42114 -333730 15389 555116 803745 554681 57751 -326057 -428583 -265814 -18194 3659
42104 3659 -261716 -314774 325259 1196630 1240939 302025 -494023 -320050 172461 -23102
42094 -23102 -662185 -757152 -230759 76209 -119804 -203680 126501 365151 181463 -27231
42084 -27231 66637 153948 -70419 -362538 -424863 -370361 -339369 -209908 -17923 -100200 -485661
42073 -485661 -714091 -588942 -500851 -647900 -608196 -142198 259182 178853 -22067 83524
42063 83524 218648 53183 -13170 425678 838680 531860 -70888 -31253 491737 437853
42053 437853 -391369 -987083 -753644 -334305 -410763 -688115 -649431 -491201 -630521 -898029
42043 -898029 -899695 -731037 -698971 -682343 -375068 84119 291554 230180 236083 398241 425937
42032 425937 101819 -441857 -877908 -919426 -509368 53279 343765 320852 359888 616283
42022 616283 729881 462657 224775 487757 978608 1033601 593850 267201 440603 861482
42012 861482 1120508 1071182 730902 217220 -162619 -178775 -69398 -244428 -611933 -703777
42002 -703777 -477595 -380678 -513138 -417815 39118 276223 -92758 -582503 -604010 -367637
41992 -367637 -407110 -668971 -764938 -741509 -828881 -727809 -24870 824888 865118 48584
41982 48584 -606823 -472667 -78040 -89274 -317352 -259671 6372 92637 24897 83214 203707
41971 203707 108451 -142560 -233273 -125590 -82507 -212390 -341642 -301810 -66907 329541
41961 329541 769625 1017067 913877 535873 39579 -466656 -806240 -803195 -640542 -770074
41951 -770074 -1211667 -1386703 -1018485 -700227 -1003636 -1475179 -1283981 -576721 -299855 -748012
41941 -748012 -1194060 -1087402 -764465 -676816 -670273 -444320 -115655 107119 284103 368431
41931 368431 11697 -766745 -1239005 -906343 -338532 -365471 -773998 -666977 21401 332736
41921 332736 -213845 -821681 -597159 158451 511207 309608 240116 602320 840650 490867
41911 490867 -73665 -251575 -104312 -123773 -393975 -554317 -488550 -471931 -582104 -498499
41901 -498499 -59143 434003 671296 684157 527719 69048 -608260 -1029948 -938932 -671770
41891 -671770 -526738 -218661 489146 1049132 756067 -157669 -805154 -843855 -618069 -260278
41881 -260278 420739 1117043 1070679 243874 -408816 -247335 209254 207826 -136408 -222208
41871 -222208 73469 389276 476418 328145 23247 -196886 -49185 291928 264523 -214660
41861 -214660 -536842 -444106 -569873 -1308638 -1852250 -1260423 9835 674068 426060 108039
41851 108039 206168 306728 173750 271735 823427 1256904 1120936 840005 984040 1345022
41841 1345022 1338925 912094 456253 117195 -233392 -517436 -492875 -221240 -30871 -14102
41831 -14102 37868 171124 136962 -153177 -376832 -219356 174763 404953 336056 164500
41821 164500 19813 -208365 -564242 -805422 -695989 -368052 -149927 -125473 -139788 -195081
41811 -195081 -485615 -950755 -1136850 -732042 -28848 370301 185617 -354448 -821292 -931906
41801 -931906 -707363 -410133 -246384 -141486 9302 -26293 -514471 -1088716 -984274 -162158
41791 -162158 428363 138535 -417959 -309729 298366 477349 -10788 -472313 -436250 -201898
41781 -201898 -108942 -15956 228605 396339 268812 -25363 -304182 -570705 -770420 -707683
41771 -707683 -398000 -140521 -76526 -38035 32930 -70504 -376936 -546070 -345123 30737
41761 30737 310869 490470 648986 762211 849430 980317 1041233 878489 723942 970043
41751 970043 1426796 1418892 825251 352802 454371 663788 454259 76858 -30048 -24338
41741 -24338 -167280 -152497 244994 377742 -414095 -1494753 -1588939 -638655 97457 -107800
41731 -107800 -575839 -493168 -65073 116604 67027 136178 285763 245413 36736 -149382
41721 -149382 -301685 -411055 -268373 138285 331152 -79367 -737242 -918457 -433697 241629
41711 241629 620073 605140 335290 2068 -200070 -239126 -322173 -555580 -632266 -180021
41701 -180021 624490 1117232 861687 84331 -590516 -652422 -45707 740319 997873 505431
41691 505431 -151238 -253296 146202 363752 66048 -371804 -545267 -535895 -537203 -449307
41681 -449307 -197653 -76312 -338202 -691769 -656856 -278196 -49886 -209143 -536701 -829908
41671 -829908 -1106840 -1267835 -1041166 -504664 -258822 -707210 -1403213 -1519833 -875414 -101734
41661 -101734 215780 166073 121938 76381 -265246 -865666 -1254794 -1164601 -936343 -1021281
41651 -1021281 -1265321 -1065989 -241949 628648 913565 687824 517444 667453 874132
41642 874132 859042 703880 603375 531865 362453 149209 59326 84216 26566 -201004
41632 -201004 -424052 -434254 -271859 -162931 -202521 -238293 -125486 33026 47205 -43704
41622 -43704 -33201 85487 80020 -121654 -288240 -307432 -435671 -830552 -1120234 -879456
41612 -879456 -358057 -201994 -483198 -582776 -166265 282865 187209 -327822 -728007 -796121
41602 -796121 -654151 -360860 29685 189637 -187673 -841071 -1129810 -810054 -260194 99262
41592 99262 221882 183827 -60258 -422726 -514179 -96607 444861 457800 -142313 -713887
41582 -713887 -686950 -257910 -52605 -264924 -485131 -389592 -194239 -193944 -196784 146109 606901
41571 606901 510797 -322651 -1230015 -1498580 -1137349 -606113 -130577 334532 683346 644448
41561 644448 187213 -353840 -610882 -483131 -126471 208265 337298 252022 79317 -52072
41551 -52072 -35426 225295 620716 712306 186974 -548968 -712294 -222161 99016 -308930
41541 -308930 -928182 -966910 -487182 -131873 -96323 -53464 117973 212569 198369 217352 166206
41530 166206 -132109 -439587 -423560 -368759 -828819 -1571007 -1692025 -958775 -233648 -233489
41520 -233489 -573015 -480561 121659 745220 1087244 1158237 982220 606793 189001 -230724
41510 -230724 -778898 -1335203 -1426146 -849108 -83511 245939 36253 -433251 -955381 -1370784
41500 -1370784 -1427343 -1072561 -648211 -441042 -282666 64734 401315 370900 31107 -260684
41490 -260684 -362651 -380539 -346346 -226859 -116096 -92564 -30106 150196 231936 36159
41480 36159 -208480 -211451 -149115 -410841 -925855 -1185311 -931887 -475951 -294649 -551355
41470 -551355 -996481 -1193760 -949670 -610277 -677523 -1025682 -945696 -231174 335933 81006
41460 81006 -511861 -546928 -84190 122067 -14707 157939 743207 982979 507278 -27171
41450 -27171 4875 266821 138783 -277769 -440992 -228425 63641 280384 444933 462815
41440 462815 268095 90219 144063 212259 -41790 -484231 -682285 -587840 -582454 -814121
41430 -814121 -941305 -699483 -359678 -342666 -571939 -532677 16968 644440 714485 154358
41420 154358 -477196 -708380 -688428 -837640 -1186751 -1363922 -1125778 -572993 99844 698401
41410 698401 893947 454233 -270145 -539619 -143186 273804 106843 -354909 -407663 -1364
41400 -1364 212037 -153569 -712700 -904438 -709129 -518105 -504456 -435131 -127844 131649
41390 131649 -155467 -1016507 -1793503 -1816115 -1182220 -600955 -504496 -664083 -736267 -762248
41380 -762248 -890296 -975620 -827276 -607745 -579512 -601114 -297319 311882 741147 638190
41370 638190 151727 -332399 -562605 -520110 -404619 -514822 -877001 -1040837 -598122 117611
41360 117611 314285 -168357 -555768 -200939 516897 801460 597564 544722 900836 1151685
41350 1151685 839886 270406 62610 296546 471357 209974 -305308 -624363 -538573 -209335
41340 -209335 86305 208784 169651 12274 -213449 -374411 -299490 -4049 225913 127775
41330 127775 -200653 -424066 -409291 -337278 -351600 -343100 -205311 -75511 -120308 -251033 -284062
41319 -284062 -247668 -258216 -195335 158153 659606 848466 545279 95064 -137539 -214698
41309 -214698 -346462 -447908 -309233 -34462 69649 -18030 -34704 56612 -40864 -408965
41299 -408965 -636907 -397141 -30640 -136331 -677767 -975075 -685164 -329568 -526002 -1028908
41289 -1028908 -1039559 -378832 200067 30447 -593859 -889430 -610567 -191092 -30630 -87038
41279 -87038 -162778 -196138 -181091 -98183 -10163 20801 136125 496530 862790 755556 176465
41268 176465 -237040 -39225 396058 421729 11708 -304022 -223840 45935 246509 395694
41258 395694 594334 796197 870788 731542 377780 -56496 -335130 -352581 -271025 -272152
41248 -272152 -284747 -163510 -11143 -44471 -219937 -299279 -263040 -351847 -664260 -978170
41238 -978170 -1028443 -770178 -369728 -117417 -264556 -688390 -826275 -299800 466927 687766
41228 687766 259987 -151924 -172626 -246562 -788112 -1355010 -1234259 -539369 -91235 -269522
41218 -269522 -552764 -325838 299702 722778 638793 294999 53111 -43346 -202935 -536696
41208 -536696 -908941 -1110161 -1048793 -731560 -196316 399069 722757 528514 6097 -286307
41198 -286307 71153 952437 1765439 1903559 1231607 241519 -391320 -539724 -722990 -1262719
41188 -1262719 -1635757 -1142160 -49399 571839 221126 -457820 -695093 -555152 -479430
41179 -479430 -435381 -129712 276219 329463 43998 -84638 177285 525609 634479 540687
41169 540687 433873 402151 474116 640302 763610 689002 460521 228085 513 -245152
41159 -245152 -303589 32424 505023 576647 169619 -179897 -59139 298882 434042 267203
41149 267203 35026 -103352 -103365 101428 450735 606491 267722 -402818 -914343 -997668
41139 -997668 -821500 -668265 -579417 -374409 64810 563397 732588 380977 -161456 -339357
41129 -339357 -59989 189145 80320 -29109 321534 848503 816261 145058 -373553 -170616
41119 -170616 313450 319292 -138486 -386569 -121478 232594 230449 -22339 -209396 -345030
41109 -345030 -650545 -1068056 -1223057 -869693 -175895 458003 742595 656467 368177 40466
41099 40466 -303901 -685791 -947691 -793527 -184163 438135 540625 76354 -535057 -959287
41089 -959287 -1194841 -1240073 -900225 -193711 333595 141124 -511950 -748675 -183061 539384
41079 539384 593164 61381 -276104 -112622 3127 -387147 -868962 -768546 -205209 78774
41069 78774 -162214 -395072 -280142 -257152 -753463 -1350781 -1371242 -978706 -953357 -1425368
41059 -1425368 -1590890 -912673 21273 252865 -327219 -952583 -950179 -349556 350594 686371
41049 686371 539175 184224 14051 99001 139128 -58741 -304918 -406286 -507713 -737573
41039 -737573 -816791 -480091 -54602 -38245 -217796 107414 959405 1467496 1098374 421708
41029 421708 181735 194351 -171866 -827987 -1071521 -702861 -256747 -96766 -14591 118991
41019 118991 30433 -314469 -409225 -12363 313654 53422 -350172 -166669 370939 353347
41009 353347 -367075 -942707 -879773 -721940 -989811 -1244094 -855284 -121136 169447 -51063
40999 -51063 -164790 24006 43914 -289022 -427980 72785 833856 1163636 948629 656576
40989 656576 673340 960942 1233816 1213795 817963 302624 109191 369594 672744 527658
40979 527658 -27065 -490179 -525563 -298534 -155427 -160322 -80580 232223 594940 705813
40969 705813 529189 292927 82256 -302746 -894708 -1225652 -838628 -26468 398878 114067
40959 114067 -383764 -565961 -519000 -559129 -642842 -539109 -275609 -22523 226184 482797
40949 482797 525407 249101 25895 216066 504563 316619 -196282 -280001 224447 535440
40939 535440 103545 -523757 -543219 -114888 -51805 -540451 -919748 -748570 -390217 -298365
40929 -298365 -316309 -103810 173972 123279 -159622 -233777 -95552 -199147 -610928 -775082
40919 -775082 -410573 -60252 -262403 -646122 -507009 19540 143158 -303730 -597271 -286875
40909 -286875 147883 157493 -39665 4896 128153 -116017 -621637 -867033 -718317 -504991
40899 -504991 -358006 -28238 571824 1091031 1142477 715295 123028 -260681 -241955 13793
40889 13793 100876 -151317 -452657 -485422 -341671 -276890 -306179 -386582 -681329 -1171224 -1313022
40878 -1313022 -706232 116247 277062 -177399 -375907 8273 330793 100459 -288431
40869 -288431 -296735 -14261 215835 345434 387226 199905 -78028 50973 636702 970458
40859 970458 593267 35423 -43779 136898 71246 15949 521305 1274312 1433715 983673
40849 983673 751274 1048242 1261959 971330 553054 360255 131464 -332026 -609263 -333426
40839 -333426 107479 107963 -290013 -570521 -481028 -146152 273463 582555 466599 -96293
40829 -96293 -507119 -147610 725161 1142269 544289 -604555 -1399163 -1405866 -893839 -395128
40819 -395128 -213836 -300079 -468593 -641694 -820764 -909122 -769953 -480413 -302875 -330809
40809 -330809 -395329 -411116 -529322 -792531 -948933 -849583 -735630 -822521 -871693 -565404
40799 -565404 -98928 46069 -196509 -444022 -476524 -441209 -448570 -403006 -306149 -335370 -511950
40788 -511950 -626425 -588716 -536511 -524042 -441726 -319465 -333216 -399365 -171243 378396 769393
40777 769393 652870 280112 60051 -13821 -178335 -443324 -668843 -851846 -987067 -867811
40767 -867811 -391951 126419 321895 283463 325163 430281 351069 135493 95883 295538
40757 295538 484798 526853 493149 364206 49027 -304558 -439045 -430039 -559435 -734800
40747 -734800 -544925 7769 361336 189142 -139740 -165310 30064 116203 69632 63065
40737 63065 82717 25074 -26764 40324 82352 -144573 -634579 -1122339 -1293520 -913901 -16906
40726 -16906 891151 1146095 682021 166140 143863 405200 483427 359445 250383 93348
40716 93348 -221422 -407743 -164164 225596 275626 91602 129181 308584 122934 -388027
40706 -388027 -568932 -199599 138946 13678 -244133 -238024 -184984 -414032 -700089 -645419
40696 -645419 -366473 -270498 -394882 -452304 -360098 -292677 -322169 -360931 -359580 -294416 -120965
40685 -120965 17535 -212685 -823751 -1269373 -1101631 -603127 -336091 -334652 -276912 -217274
40675 -217274 -467599 -843458 -780228 -298472 -123894 -576337 -993132 -674894 115144 592080
40665 592080 506343 232251 60821 -43397 -88838 25449 215959 246030 116388 90481
40655 90481 246732 302681 23269 -403669 -546731 -186434 477556 1005375 1103356 904024
40645 904024 798062 897721 829806 279173 -436107 -706509 -479528 -307986 -481261 -604023
40635 -604023 -286445 189290 292957 34203 -131622 -14554 159423 248106 388912 641540
40625 641540 822787 820360 767784 766937 678876 342299 -161389 -569312 -658294 -398648 -30414
40614 -30414 70895 -171776 -313842 72908 681362 730270 28314 -699024 -765778 -359521
40604 -359521 -84158 -60668 57865 415781 777998 924278 818336 445469 -144333 -652758
40594 -652758 -746491 -497077 -328231 -471222 -693069 -614663 -134839 486354 855998 787392
40584 787392 491813 348628 439123 495648 372875 259709 274156 235477 99590 175781
40574 175781 502252 475093 -292760 -1135392 -1135412 -513061 -311652 -757009 -920271 -224739
40564 -224739 647077 802063 347090 3778 73140 344253 622897 818819 787536 522814
40554 522814 288318 249133 240391 150619 177006 419473 613191 572214 483835 444698 190087
40543 190087 -324674 -610320 -419666 -299385 -726112 -1187355 -909133 -119111 300568 186371
40533 186371 179565 507463 630513 247121 -192753 -246673 -66504 54912 134335 214871
40523 214871 141495 -119979 -371461 -561428 -819584 -991543 -679297 75129 689014 814062
40513 814062 659411 387190 -108286 -540247 -172700 1018142 1846180 1331126 91439
40504 91439 -480575 -53066 485243 456486 88396 -185191 -278418 -175140 195698 602292
40494 602292 619214 307145 247199 666806 1042340 854750 276210 -224332 -537669 -778043
40484 -778043 -831073 -508547 14440 328773 293730 118811 34999 152326 528821 1066601
40474 1066601 1397402 1183652 541694 -77363 -402621 -484414 -376080 -38189 371744 479170
40464 479170 165993 -189000 -162892 207877 581078 764940 756534 506227 21948 -340227
40454 -340227 -104711 677174 1330042 1304684 792820 374258 261607 202585 13436 -172560
40444 -172560 -240826 -335289 -567417 -722938 -537125 -155163 -11432 -226977 -420885 -272243
40434 -272243 -26925 -159981 -645496 -920918 -642436 -144601 53396 -64600 -127046 -13773
40424 -13773 16034 -164188 -289666 -102404 268178 505017 485635 294247 30836 -199958
40414 -199958 -250233 -81075 133283 210725 176222 140303 106380 70220 148691 371642 480305
40403 480305 223871 -222157 -450866 -417922 -507520 -937231 -1400656 -1456471 -1067045 -589588
40393 -589588 -354060 -370207 -382786 -160210 223892 438677 333553 218174 460482 872075
40383 872075 858008 254931 -355510 -385095 14089 239323 59266 -203752 -210443 34168
40373 34168 368656 707484 975406 1041673 879535 657983 528162 410853 154153 -152452
40363 -152452 -225319 3876 218583 111234 -187917 -306424 -184871 -120053 -206159 -109992
40353 -109992 366443 834855 824920 529647 565627 1051921 1434837 1309148 932589 728095
40343 728095 696749 605554 413285 183533 -146189 -548419 -680526 -281135 328926 540861
40333 540861 219357 -184284 -281268 -159335 -82977 -102817 -115708 -90080 -68022 -79741 -172185
40322 -172185 -396011 -646969 -631974 -149770 611769 1166141 1154363 667007 145976 -20138
40312 -20138 197650 541633 771615 820708 705567 458370 205773 153349 357830 607573
40302 607573 652035 475170 233865 26591 -124991 -146094 41804 341312 506648 393472
40292 393472 101402 -137900 -157066 33440 267161 392987 454118 601925 793278 743783
40282 743783 309520 -243661 -531033 -478999 -273024 -22262 261301 452823 400293 205010
40272 205010 125362 186400 171073 33380 3845 174951 280887 78792 -280088 -484679
40262 -484679 -513786 -607332 -845845 -983061 -761703 -292794 -17796 -242618 -736175 -926547
40252 -926547 -580100 -136993 -184033 -703969 -1107586 -969778 -452024 18555 201457 114267
40242 114267 -71168 -109689 97595 291738 127846 -277500 -403076 -54512 324676 285440
40232 285440 -40042 -273561 -374180 -495696 -525280 -240391 190977 323537 42723 -313325
40222 -313325 -452036 -404763 -275804 -52118 233486 413046 381565 217024 39721 -101962
40212 -101962 -185640 -199066 -160338 -22685 356917 959108 1422570 1411905 1104815 971798
40202 971798 1059771 866416 59631 -976346 -1511808 -1232100 -505862 -8340 -123361 -598089
40192 -598089 -793579 -397737 200976 427602 234183 -10149 -149337 -277890 -259384 162363
40182 162363 706313 684749 36086 -413269 -95826 482506 570833 277494 206072 401230
40172 401230 409996 170938 65356 119605 -108342 -716501 -1154782 -964618 -351459 208590
40162 208590 528490 627126 436292 -82313 -695566 -1031708 -915026 -475945 -2252 275926
40152 275926 327843 257643 80214 -294225 -755705 -923625 -637668 -300906 -383276 -750447
40142 -750447 -882042 -617079 -234593 96539 432740 667380 585443 344497 345032 532194
40132 532194 396723 -179175 -657065 -645197 -405337 -283068 -187632 12023 100868 -46160
40122 -46160 -102657 165799 384187 79595 -597779 -1117893 -1262624 -1166219 -959929 -796102
40112 -796102 -929978 -1343152 -1574978 -1353055 -1055095 -1074344 -1113407 -703563 -76530 181411
40102 181411 79169 59924 72031 -354220 -1119177 -1479884 -1107709 -495340 -124000 95654
40092 95654 316118 341292 72803 -138822 51491 528266 947523 1083732 798643 66896
40082 66896 -796232 -1303560 -1319080 -1066282 -641415 -46220 320847 -45807 -813085 -959931
40072 -959931 -223441 396795 82150 -615632 -702270 -199400 146187 107404 8708 -170480
40062 -170480 -745132 -1448750 -1517203 -779620 57682 377120 271273 42371 -282018 -650065
40052 -650065 -734992 -362198 143218 347932 225584 72774 132407 471512 1007030 1476939
40042 1476939 1582232 1319947 1010978 883783 828484 684950 536583 511882 486068 256253
40032 256253 -66455 -119198 218936 613882 675609 422406 167961 26942 -195197 -555405
40022 -555405 -724153 -436188 44017 278638 315009 503611 743462 551717 -7577 -189272
40012 -189272 288887 660983 231036 -529430 -739976 -483864 -516252 -893049 -912736 -391945
40002 -391945 10556 -81685 -247140 -176802 -212345 -528562 -600613 -91217 421093 303011
39992 303011 -99536 -56846 340116 401528 4016 -310161 -303696 -307549 -473387 -508916 -314904
39981 -314904 -224400 -376714 -438843 -234997 -123906 -389563 -695971 -562609 -63076 351832
39971 351832 482752 454481 372148 296058 395678 718754 906162 553500 -166479 -634943
39961 -634943 -568904 -305702 -241355 -343972 -352039 -142669 242900 659624 822580 538743
39951 538743 129754 227706 885661 1317991 945520 294799 241612 645536 547635 -305628
39941 -305628 -1023695 -921044 -477826 -422615 -538336 -155733 568351 751511 101811 -650006
39931 -650006 -786510 -440866 -135383 5551 192781 425104 419413 43248 -425528 -531992
39921 -531992 -116336 438997 538305 72445 -365708 -216781 249882 276773 -308022 -856469
39911 -856469 -826668 -428541 -118793 59129 259068 346444 97298 -349204 -682299 -906756
39901 -906756 -1218523 -1529681 -1578313 -1446873 -1480732 -1656017 -1522111 -929474 -363921 -276619
39891 -276619 -426630 -249457 328833 826842 882903 636459 382364 143350 -233517 -711930
39881 -711930 -1023346 -1003056 -821165 -777622 -915802 -962440 -691599 -243404 36513 32570
39871 32570 -21314 99465 278071 217911 -128889 -462682 -497039 -279290 -58979 56668
39861 56668 152561 235606 115114 -336389 -918341 -1247909 -1145433 -773510 -425859 -288194
39851 -288194 -375865 -562929 -658402 -581845 -479524 -528352 -615687 -422948 79264 447734
39841 447734 295838 -147681 -311080 -77607 27668 -415846 -1063143 -1168066 -515195 292947
39831 292947 523342 72410 -563983 -901452 -865077 -669888 -527444 -500471 -489575 -307724
39821 -307724 110781 525903 550594 83453 -522574 -820465 -712188 -450310 -311455 -393479
39811 -393479 -640821 -906898 -1022589 -930820 -740942 -582574 -477152 -425297 -486195 -631084
39801 -631084 -652783 -411095 -61361 158246 243412 291024 197493 -165807 -552874 -529415
39791 -529415 -98413 250911 224128 78163 132519 277471 215635 -75929 -387074 -583416
39781 -583416 -645758 -568089 -414775 -319539 -265700 -69494 249299 345290 54111 -232479
39771 -232479 -55616 406640 517454 23202 -627545 -842386 -506187 -3207 190670 -83858
39761 -83858 -529765 -681430 -428541 -142479 -155198 -305306 -233499 61605 287652 340072
39751 340072 338507 254754 -73185 -533980 -764296 -679819 -617292 -812419 -1085138 -1210954
39741 -1210954 -1247861 -1245761 -965843 -265226 439504 526774 -15658 -478917 -248385 491923
39731 491923 1022004 933419 533990 388317 607909 779917 599506 311196 293104 383581
39721 383581 45411 -747926 -1247898 -862648 -37727 255003 -204662 -627252 -330024 371206
39711 371206 706067 539449 419456 630285 737347 271792 -519585 -949411 -732452 -232578
39701 -232578 53789 -24043 -281303 -429180 -293985 -17619 423 -400164 -787773 -631557
39691 -631557 -95900 122912 -186929 -445976 -216964 118966 44826 -210617 -64292 452594
39681 452594 771921 699913 599175 654791 586940 249439 -25548 56529 291450 314407
39671 314407 119496 -14694 76506 322292 538490 515994 133153 -465427 -886316 -796614
39661 -796614 -218748 444276 648484 153896 -603764 -800132 -166967 558482 521533 -105747
39651 -105747 -401100 -8574 471923 467967 121168 -229295 -581499 -905573 -827586 -202035
39641 -202035 411803 384863 -150689 -590182 -722715 -801205 -937122 -967040 -867133 -825152
39631 -825152 -875028 -837311 -658967 -501401 -460165 -460885 -453154 -475523 -510714 -474132 -367309
39620 -367309 -304649 -389475 -628452 -887109 -897732 -502708 39757 254790 75970 -42919
39610 -42919 186501 466986 448361 270780 183748 11100 -484697 -1005048 -1075500 -813816
39600 -813816 -738946 -937737 -1035607 -930772 -910146 -998602 -825353 -277120 264616 497747
39590 497747 520355 444781 200373 -110837 -169499 31996 83122 -198855 -479198 -504062
39580 -504062 -509938 -720671 -874896 -635737 -135759 236708 307956 89162 -390751 -909354
39570 -909354 -1053162 -764468 -581054 -941318 -1518488 -1646599 -1177483 -519544 -39801 170357
39560 170357 130652 -9738 55641 413336 685480 533077 189493 54518 -9472 -402618
39550 -402618 -944500 -971281 -334518 306620 380676 91070 -32481 141996 354994 391268
39540 391268 247617 56407 14119 208525 409839 250115 -281362 -749457 -798705 -549740
39530 -549740 -355615 -382104 -553033 -699646 -640310 -323867 -18035 -129426 -683687 -1197552
39520 -1197552 -1238727 -917440 -636909 -539808 -433112 -157728 182394 348409 224132 -38409
39510 -38409 -142796 -11173 57574 -192898 -497171 -380370 69699 238611 -81591 -347904
39500 -347904 -142237 164172 79029 -183819 -165875 -54537 -351807 -882461 -966223 -536371
39490 -536371 -253050 -397978 -483591 -215999 -43365 -318904 -624392 -479288 -145450 -114594
39480 -114594 -275145 -244252 -118171 -174449 -169653 252286 681173 383683 -419577 -671227
39470 -671227 -35413 582398 433582 -10239 44773 469693 609471 434743 467571 787474
39460 787474 911846 653839 405062 438475 502763 319488 30471 -101904 -98068 -107096 -104622
39449 -104622 1830 142606 191148 177366 189445 149182 -100655 -489022 -672778 -386166
39439 -386166 222262 683744 676997 370614 219000 412327 661452 607815 295918 63433
39429 63433 64865 138871 123474 59500 32220 15447 -50092 -184725 -426323 -770367 -990394
39418 -990394 -761701 -131554 341957 174749 -430390 -821561 -698689 -386817 -285769 -379085
39408 -379085 -467771 -601176 -925850 -1229886 -1058590 -366972 300015 474023 320809 269613
39398 269613 344434 242336 -74733 -303662 -286110 -156412 7667 243738 358523 24541
39388 24541 -603513 -867518 -473830 82340 281225 275912 397465 466213 205974 -52859
39378 -52859 179928 647488 666296 239925 40711 261025 320960 -85656 -447536 -290842
39368 -290842 98671 246960 217583 270221 261132 -49217 -392407 -255035 374336 941704
39358 941704 951995 380103 -433553 -1058348 -1250313 -1131395 -987854 -856027 -581079 -313028
39348 -313028 -463840 -962652 -1081592 -406656 458482 653475 176396 -290612 -362082 -153389
39338 -153389 250754 814903 1106333 574102 -560955 -1305248 -1061328 -345537 -41349
39329 -41349 -305801 -577663 -437777 -68076 102554 -100216 -533222 -975601 -1252642 -1177639
39319 -1177639 -614972 243459 833378 743972 260191 70395 401300 790417 807603 586828
39309 586828 416696 214505 -210803 -658612 -735810 -425330 -96957 -23665 -157352 -302904
39299 -302904 -303100 -158572 -106479 -379199 -754826 -670634 336 653837 729445 401570 146949
39288 146949 35658 -96514 -166894 -80186 -104222 -431744 -675802 -420763 13851 29361
39278 29361 -303574 -484795 -525646 -817064 -1213853 -1151452 -650755 -317964 -296457 -114422
39268 -114422 301885 374194 -130966 -692905 -900776 -936215 -932270 -686132 -336031 -462493
39258 -462493 -1077772 -1327386 -704802 180146 552759 453231 237279 -126562 -628076 -816102
39248 -816102 -521086 -293689 -429172 -310055 448735 986446 406552 -639472 -832826
39239 -832826 -232719 -89351 -780188 -1321678 -1077737 -668359 -784132 -1172768 -1321553 -1276373
39229 -1276373 -1226970 -987737 -455336 -15492 40770 36947 348737 736009 740152 416883
39219 416883 177227 140857 110124 16359 -31350 -34847 -80298 -101588 10290 129764 41934
39208 41934 -160801 -128286 257065 685169 809638 666525 580711 730521 913743 765846
39198 765846 191497 -446442 -626838 -215927 312464 300226 -399171 -1219359 -1474159 -1100325
39188 -1100325 -641894 -508252 -533397 -416348 -271129 -369662 -549165 -383211 88089 326007
39178 326007 100604 -164209 -56479 260919 413010 333695 142366 -104339 -226840 96790
39168 96790 773648 1104019 608804 -261973 -708975 -570867 -244258 66193 416575 662317
39158 662317 573999 325622 289421 412363 347046 115354 45285 103778 -59811 -388017
39148 -388017 -404075 -36872 197726 37978 -116216 88131 396938 445581 355324 441104
39138 441104 652566 678867 415190 62589 -95206 113197 594181 985404 1036252 956647
39128 956647 1052777 1110603 674745 -63504 -345604 -11613 126460 -518625 -1379652 -1568020
39118 -1568020 -1124103 -756643 -691100 -545796 -220503 -136048 -459937 -707959 -409740 211283
39108 211283 533729 317764 -79076 -213456 -85865 -78342 -420971 -858927 -964769 -703951
39098 -703951 -478819 -586461 -850300 -886662 -567377 -118293 106065 -106818 -615096 -946607
39088 -946607 -751332 -278208 -142603 -539619 -986321 -986760 -648237 -426252 -525046 -800118
39078 -800118 -1033736 -1040823 -671652 26706 747013 1189708 1279559 1045223 552578 94919
39068 94919 83137 463141 594216 100832 -471817 -369707 228805 416262 -147362 -802085
39058 -802085 -892954 -588701 -377124 -270427 -23701 174945 -144094 -905818 -1354956 -955229
39048 -955229 -77746 481307 447660 211001 135551 128784 -13124 -184767 -162604 -14134
39038 -14134 4293 -108014 -65874 246215 549079 514583 168600 -160927 -189025 105931
39028 105931 507865 749002 748067 690233 791368 992337 1007285 686594 214925 -76411
39018 -76411 -15803 270210 443568 241803 -213983 -483277 -303719 96054 337723 377544
39008 377544 413744 486872 494001 467785 487610 435533 229719 150607 433829 659797 196004
38997 196004 -736464 -1158208 -678868 -39743 13907 -281090 -317379 -98216 15157 77413
38987 77413 388283 826156 1004559 915693 814244 611592 31206 -681999 -870914 -401925
38977 -401925 60682 -98003 -769534 -1480152 -1978048 -2172302 -1859600 -960050 90900
38968 90900 593208 319160 -238408 -486401 -417282 -448582 -682190 -703250 -252896 265304
38958 265304 292663 -116379 -454030 -511532 -480495 -431452 -283437 -243304 -587971 -963933
38948 -963933 -696217 21386 137688 -661703 -1297990 -877303 -52896 68610 -365026 -433956
38938 -433956 -89500 -44066 -274622 27873 941170 1486378 1133916 559732 458129 549068
38928 549068 326796 -8555 -26715 132841 98104 -38200 35878 244601 312528 294792
38918 294792 415744 576439 475620 95451 -281077 -416301 -245474 127200 335971 -39150
38908 -39150 -871703 -1398886 -1084156 -295694 230967 299965 197397 37994 -267752 -577618
38898 -577618 -649995 -656219 -981247 -1477293 -1477638 -709129 271400 739691 523246 -93493 -768418
38887 -768418 -1174765 -1057398 -541803 -135428 -141765 -311535 -346637 -449931 -944891 -1542643
38877 -1542643 -1530651 -730076 193421 526869 259428 -150058 -420181 -566532 -594812 -435378
38867 -435378 -155141 26346 -22222 -219737 -384801 -375502 -173342 59682 79539 -165359
38857 -165359 -455459 -626955 -819711 -1177831 -1466156 -1329533 -864958 -542199 -525863 -477781
38847 -477781 -149941 215690 281754 73580 -196574 -457039 -651244 -579107 -225385 -29218
38837 -29218 -410284 -1121850 -1460652 -1099223 -381630 192824 447010 465457 399177 436735
38827 436735 684660 933794 785472 184960 -377239 -428629 -144080 -128117 -591526 -1055063
38817 -1055063 -1005885 -581243 -311904 -347484 -357534 -210862 -247376 -633684 -927871 -732012
38807 -732012 -390568 -436436 -628992 -318181 348160 497070 -43374 -335481 226309 921920
38797 921920 802985 87079 -344136 -327938 -402855 -700602 -775097 -485427 -245039 -315740
38787 -315740 -519822 -742988 -1098406 -1448556 -1342695 -660911 116657 485131 409915 121123
38777 121123 -218214 -482077 -534827 -386512 -201490 -97456 -114274 -317277 -668416 -880628
38767 -880628 -715066 -340591 -77050 80868 295575 416661 189948 -173041 -203071 90537
38757 90537 273068 251522 348857 584641 591497 375685 415346 761326 799763 283690 -132269
38746 -132269 103746 566270 608180 412579 529777 792608 571396 -74095 -380690 -85201
38736 -85201 139402 -274558 -912877 -959072 -296412 395638 505778 94162 -371898 -602877
38726 -602877 -663070 -701279 -719448 -648003 -496966 -318493 -113633 99316 209717 157975
38716 157975 76275 109370 164358 54101 -143899 -109801 298566 822372 1044596 764435
38706 764435 166381 -293078 -271305 66057 176640 -195759 -680582 -763145 -357057 292029
38696 292029 917598 1161933 645145 -423236 -1124799 -918452 -444123 -541295 -907922 -685678
38686 -685678 -31784 112639 -259523 -102967 820445 1329068 669947 -235362 -243619 309645
38676 309645 369584 -129036 -393545 -136058 221215 430684 612113 727691 626545 470097
38666 470097 459452 339965 -171229 -695458 -636573 -127759 190256 189482 293391 574767
38656 574767 611898 301027 65433 104350 107260 -80026 -134759 105366 221089 -201477
38646 -201477 -940681 -1450853 -1538845 -1401529 -1162352 -708927 -12174 595573 620653 -48539
38636 -48539 -869478 -1115753 -670259 -128134 -17129 -207396 -287121 -201839 -186692 -296743
38626 -296743 -389570 -448574 -574735 -726714 -754325 -631722 -444149 -243340 -87049 -57768
38616 -57768 -81181 44100 269274 255999 -78155 -347192 -294822 -174935 -197209 -97081
38606 -97081 262035 385351 -87062 -560104 -256929 476226 544595 -317268 -1231980 -1478199
38596 -1478199 -1248970 -968191 -679076 -413239 -453915 -825631 -1058239 -846628 -517525 -490638
38586 -490638 -647023 -584810 -228246 128500 205063 -43682 -431756 -648693 -528804 -266587
38576 -266587 -182604 -299490 -394249 -407252 -469235 -559632 -508101 -331401 -197015 -58988 273823
38565 273823 706790 918678 868813 812599 798111 627223 359285 319869 490267 432396
38555 432396 25496 -233458 56106 609831 875313 689131 261682 -168228 -411396 -341409
38545 -341409 -57069 184333 309498 439452 514136 291743 -178098 -501028 -503113 -426153
38535 -426153 -406541 -241676 86079 140088 -357662 -1008100 -1175366 -674768 212142 1070343
38525 1070343 1466085 1137211 395746 -18677 173701 395513 50718 -603808 -859320
38516 -859320 -533500 -72822 130949 73194 -109020 -324804 -509395 -670887 -869736 -991077
38506 -991077 -769975 -264550 -555 -304957 -756280 -703492 -152715 270071 130847 -404764
38496 -404764 -900153 -1064374 -892478 -632435 -536322 -500935 -177530 394428 642681 286424
38486 286424 -101019 127114 670522 691874 67439 -479341 -469831 -198949 -71211 -70496 -108857
38475 -108857 -306657 -614701 -660899 -327933 -57364 -202602 -461999 -380947 -91129 -57029
38465 -57029 -309680 -457960 -356582 -247572 -250630 -217117 -165955 -363620 -776357 -906143
38455 -906143 -495282 -21129 -65574 -451825 -515827 -128577 104053 -247273 -807180 -916207
38445 -916207 -440069 202173 564150 471793 19321 -455811 -559899 -266422 -3689 -80398
38435 -80398 -223266 -1289 479326 714493 539118 289347 233155 255136 179278 47803
38425 47803 -20756 30095 240500 538712 625675 319387 -4636 225853 923705 1348984
38415 1348984 1109642 636480 447181 483523 504487 588308 766730 634032 -68094 -796732
38405 -796732 -800373 -205997 121581 -240773 -832439 -1081799 -953867 -692286 -416999 -198180
38395 -198180 -145679 -203407 -153102 17550 70988 1391 173117 700536 1047971 662675
38385 662675 -213314 -814056 -826239 -628340 -555183 -435125 -66081 273818 174726 -262611
38375 -262611 -530239 -398146 -149517 -106813 -223681 -239714 -12756 394821 769609 831388
38365 831388 495546 122423 223899 787902 1197289 1031659 648475 661088 1089709 1410599
38355 1410599 1288941 871385 441091 160937 116287 260458 337629 176323 13608 200700
38345 200700 651798 947355 912715 685849 299520 -273540 -665572 -335572 570598 1164920
38335 1164920 929263 385893 285968 573359 639250 297303 -47625 -96266 -15625 -30327
38325 -30327 -28576 211557 563277 568617 6404 -696946 -885342 -523323 -269030 -506217
38315 -506217 -746238 -434933 65272 6525 -488542 -590013 -158623 -15612 -575772 -1133848
38305 -1133848 -974855 -408686 -123185 -160157 -165999 -126667 -204738 -268767 -190835 -233297 -574101
38294 -574101 -836788 -662450 -345046 -297705 -310709 -14954 322744 231907 -69103 -29367
38284 -29367 233913 127709 -385076 -759267 -750051 -530561 -77362 682956 1206978 785380
38274 785380 -279197 -884718 -657825 -352382 -542764 -879055 -940626 -877870 -788117 -371595
38264 -371595 260984 306241 -546753 -1391608 -1279269 -490092 77666 188969 159881 6491
38254 6491 -404571 -737111 -609441 -369647 -578278 -937155 -660444 188685 690653 447587
38244 447587 40207 -59195 -112800 -339858 -392643 -110944 -38780 -531757 -945585 -494168
38234 -494168 458652 793277 187077 -514915 -563108 -236828 -224768 -597547 -847450 -707703
38224 -707703 -487688 -576746 -905847 -1058707 -834888 -539187 -603525 -971375 -1067672 -507520
38214 -507520 338207 732889 456718 3238 -132142 -36035 -81131 -308971 -402380 -184658
38204 -184658 128464 220709 50580 -153000 -210283 -224666 -431930 -794794 -886930 -391109
38194 -391109 345627 589949 155191 -295798 -115432 489710 839572 717007 439291 182996
38184 182996 -148884 -393872 -134901 536112 855112 388003 -263822 -265649 271562 521232
38174 521232 207179 -34552 303531 788775 684884 66426 -232146 231165 870534 831481
38164 831481 98421 -534127 -509893 -106375 117097 54365 -41223 -55878 -20316 170204
38154 170204 578603 880238 697492 278267 323440 1011249 1654824 1540263 740957 -100606
38144 -100606 -467340 -249477 333973 856262 975301 786663 662179 671890 517404 129393
38134 129393 -118510 20123 328365 575914 819408 997419 796092 312873 266413 976293
38124 976293 1640732 1333148 350117 -197717 91233 577186 667657 461098 255647 117915
38114 117915 96995 285640 486257 306323 -241509 -667453 -678423 -503349 -395983 -243497
38104 -243497 101472 451234 515157 283374 -25546 -244070 -338722 -331737 -244386 -81728
38094 -81728 114483 192819 42317 -122493 70959 526676 619055 91606 -421158 -289460
38084 -289460 107902 -3953 -481626 -466291 176393 597919 333927 11618 296574 911434
38074 911434 1223807 1186892 1111200 981532 620542 210742 64836 74302 -86875 -341259
38064 -341259 -296890 75428 318274 141800 -138537 -5345 588154 1141626 1195685 850040
38054 850040 567383 541265 535092 407626 405521 649292 713595 215913 -444449 -544242 -85858
38043 -85858 268891 245186 206064 322054 284178 40217 43651 454072 806816 842793 947434
38032 947434 1321938 1455281 1001618 495436 495197 633492 326838 -112808 -27828 314022
38022 314022 67614 -715415 -1036456 -483016 153375 84947 -444699 -730099 -571503 -244826
38012 -244826 31098 190389 205105 188959 353743 649695 751938 603755 624757 1109403
38002 1109403 1724970 1915065 1566617 986674 437290 14134 -180003 -91693 106135 168043
37992 168043 87113 50994 138084 253014 303752 238652 -21541 -439486 -694899 -472767
37982 -472767 33098 215847 -203631 -808017 -1061705 -993606 -979508 -1036707 -800737 -220876
37972 -220876 181241 -39877 -661871 -1097700 -1058347 -679185 -219092 81189 45446 -205799
37962 -205799 -243006 104037 364693 69797 -404885 -270939 414498 670011 15941 -730183
37952 -730183 -576275 271844 798631 595869 190593 86991 168502 142819 25391 -30747
37942 -30747 -8972 58816 172034 219252 36319 -266103 -336477 -116852 -26867 -345121 -692040
37931 -692040 -534225 -53547 -14978 -688263 -1353862 -1173310 -266003 464817 461553 54956
37921 54956 -155748 -47308 123103 234281 364868 493849 505712 463933 543971 659885
37911 659885 484098 -42953 -504023 -492707 -118712 161238 79157 -256450 -599763 -793246
37901 -793246 -779484 -552283 -154210 314648 704908 866209 745605 428679 38842 -341727
37891 -341727 -582026 -489562 -106981 102480 -281997 -985036 -1225535 -677405 125274 532524
37881 532524 556336 600601 744702 740128 542924 375536 301060 180254 85512 307334 799877
37870 799877 1039767 715767 231021 145515 335408 169146 -517838 -1096298 -950866 -254425
37860 -254425 324993 442733 291794 148934 58685 -35691 -127943 -171676 -99745 147475
37850 147475 428755 355341 -237491 -841404 -723709 126314 926417 1077502 766129 455842
37840 455842 292185 262297 416991 571484 282538 -448441 -940168 -789300 -544092 -809390
37830 -809390 -1208198 -1038808 -531628 -480295 -879724 -985933 -656571 -549333 -881581 -1050405
37820 -1050405 -747852 -465478 -526254 -535876 -224322 46663 91803 333581 855465 910715
37810 910715 114990 -661770 -464007 333326 700577 509709 413230 552810 454501 55993
37800 55993 -162555 -85850 -129084 -411485 -534125 -306889 -14224 166207 356005 451799
37790 451799 80847 -672498 -1090882 -702933 116195 717356 933486 950825 812812 463893
37780 463893 63124 -142683 -181183 -283271 -465368 -448157 -78271 350624 384287 -13451
37770 -13451 -375159 -330690 -92511 -92252 -297657 -303890 -66389 -23263 -347970 -610935 -483519
37759 -483519 -297260 -486118 -872140 -995310 -845323 -745357 -738276 -617448 -408402 -309635
37749 -309635 -277113 -163450 -150952 -502426 -930949 -789813 20882 810949 907746 366185
37739 366185 -222507 -340810 93858 718637 1035134 912759 723147 800245 955203 806349
37729 806349 379590 16607 -129603 -114954 87548 456635 675155 491989 170514 79104
37719 79104 33499 -349559 -814681 -720051 -97602 304338 143866 -86209 39049 238851
37709 238851 103593 -276375 -602393 -805302 -881937 -731667 -435680 -288228 -316821 -204349
37699 -204349 109828 260723 131782 125061 413292 510952 76787 -376694 -176055 494452
37689 494452 897441 802037 611045 589845 589435 501547 426236 325756 -8293 -516310 -786379
37678 -786379 -579692 -165375 38823 -29234 -97181 19493 183823 162932 365 4602
37668 4602 286309 494780 277561 -122671 -145620 198379 224379 -423255 -1136922 -1117615
37658 -1117615 -449618 71628 4485 -322038 -405552 -158352 158069 270965 86389 -241805
37648 -241805 -379896 -115024 389730 759477 787931 539203 181394 -93916 -96420 160366
37638 160366 330177 88148 -364434 -424888 170059 934511 1128892 565265 -227756 -608945
37628 -608945 -459616 -174731 -126437 -290019 -420439 -407442 -289263 -58126 277940 502128
37618 502128 382723 73686 -37315 47904 -105354 -599142 -871115 -504060 47612 76082
37608 76082 -319828 -432000 -73581 192071 27512 -160853 43455 389206 417138 167797
37598 167797 -24131 -126748 -313966 -479493 -355982 -32112 129780 80506 121712 299366
37588 299366 234161 -260585 -802630 -951964 -780543 -631512 -575706 -466585 -352428 -423541
37578 -423541 -602514 -575106 -281015 -48029 -122138 -321982 -317200 -72429 151135 142923 -35690
37567 -35690 -141961 -10654 243051 287354 -86539 -714325 -1243049 -1509484 -1584222 -1497641
37557 -1497641 -1161639 -608360 -94280 138307 79242 -118348 -292622 -330280 -221465 -103533
37547 -103533 -132019 -303281 -512773 -706255 -792917 -549538 66642 601139 515592 -82427
37537 -82427 -562468 -655232 -697821 -887326 -897102 -527612 -164943 -163379 -264467 -129218 -2859
37526 -2859 -252760 -599155 -484460 825 231628 -20720 -401333 -651340 -845318 -953377
37516 -953377 -788077 -454640 -278742 -211198 113684 637728 836336 589701 429941 628443
37506 628443 703604 280121 -170491 -51699 357826 327015 -185567 -540827 -451681 -272355
37496 -272355 -202984 82425 753419 1351512 1391422 1017714 652130 340375 -56957 -302583
37486 -302583 -52280 390242 279533 -461360 -983143 -679380 -20735 243308 159666 182034
37476 182034 162030 -366352 -1094926 -1150980 -489826 -80929 -389946 -638985 -123266 620070
37466 620070 743671 485633 664073 1218040 1304093 709390 181611 249745 545427 532964
37456 532964 256270 61017 50283 93053 55391 -137408 -404206 -437517 -39027 493580
37446 493580 683890 544386 488808 596185 491399 51895 -306232 -266202 -77572 -114216
37436 -114216 -336781 -484629 -506337 -500766 -440720 -238455 24604 144240 25979 -225361
37426 -225361 -402111 -372444 -238423 -248855 -430832 -450211 -73380 377571 381845 -27262
37416 -27262 -253318 86027 729458 1200856 1345557 1317735 1298170 1366222 1479059 1489120
37406 1489120 1304685 1040486 881285 846979 839537 826775 808517 729563 607230 559789 506667
37395 506667 127373 -565605 -940942 -504900 316466 695154 494691 240266 161960 -15292
37385 -15292 -349004 -485357 -313044 -140548 -36506 357791 1080639 1509429 1154526 356475
37375 356475 -185080 -250675 -136160 -108428 -144652 -93537 87622 206700 -15791 -512053
37365 -512053 -737238 -313922 331223 426050 -138795 -772039 -1085330 -1212092 -1195393 -780271
37355 -780271 -64859 287990 -99164 -702180 -732443 -98175 582155 701060 174951 -563456
37345 -563456 -939236 -770627 -451917 -405275 -485321 -292131 95994 251329 167336 245303
37335 245303 494307 462005 107322 9095 420851 792650 614902 154684 -70197 -45667
37325 -45667 -41587 -53399 82822 313268 478226 561973 562588 379501 62617 -102952 34974
37314 34974 305773 523493 673319 703482 516674 276579 308505 575849 683389 505939
37304 505939 342389 333569 247377 -11598 -223637 -354575 -657014 -1052566 -1007470 -319826
37294 -319826 507903 976018 1146200 1221966 1141808 934075 933180 1243734 1456285 1276985
37284 1276985 1015484 1098752 1506758 2007872 2556889 3180346 3862689 4758511 6066920
37275 6066920 7539785 8718397 9920121 12318229 16547402 21631551 25632858 27022497
37267 27022497 25359745 21358775 16654425 12859736 10365079 8437131 6631805 5404698
37259 5404698 5071660 5040648 4630681 3953161 3399483 2889865 2247139 1751652 1687373 1794004
37249 1794004 1728460 1621260 1665674 1638904 1353825 1104715 1136398 1143535 823028 451081
37239 451081 374929 390775 173492 -102865 -108589 66670 165196 207705 271616 237152 126653
37228 126653 229239 539621 606585 286211 41414 124425 137118 -172734 -398084 -241746
37218 -241746 -69435 -168119 -194593 76689 225291 6208 -99404 192590 338116 1252
37208 1252 -146505 450971 1123716 985219 350723 105324 266280 249574 61510 143657
37198 143657 416475 485227 463517 659248 784978 397563 -198177 -364237 -128887 59654
37188 59654 211255 562499 827964 585935 133358 105117 480568 733003 695772 564533
37178 564533 358415 79512 59729 472232 872089 839794 615541 503868 267239 -205326
37168 -205326 -328587 269864 959978 1088196 1034584 1372319 1730580 1551622 1262843 1530860
37158 1530860 1977548 1845450 1383054 1334422 1537530 1271153 589582 121699 -75816 -328821
37148 -328821 -427000 -25744 456019 432280 160402 91502 -135273 -834923 -1154677 -286685
37138 -286685 819415 597147 -705240 -1400364 -893643 -169710 112896 341877 705950
37129 705950 773582 518323 454193 583368 373843 -135321 -307383 -11052 266418 340197
37119 340197 400524 356680 68967 -61062 296791 612061 320647 -109736 -36131 114999
37109 114999 -282139 -669278 -231018 492185 478009 50384 187111 646220 542855 190479
37099 190479 499426 1081600 904238 345011 558848 1220624 1029128 137927 -98928 427032
37089 427032 598761 356617 670106 1297935 931867 -303126 -783381 -53777 617990
37080 617990 599380 675061 1194862 1489155 1405650 1510719 1651719 1243696 883429 1562286
37070 1562286 2483341 2062660 941744 1316679 3210133 4249165 3482185 2568578 2623711
37061 2623711 2692291 2127179 1825423 2195096 2302189 1857576 1777082 2123576 1803292 847201
37051 847201 610357 1226839 1320296 638525 401762 710234 364319 -425658 -110698 1065166
37041 1065166 1135263 27423 -180383 907704 1403901 919748 1216352 2332845 2019203
37032 2019203 86232 -682454 739094 1938382 1502454 1119855 1739018 1724957 557650
37023 557650 325761 1751360 2686375 2206412 2108477 2856839 2480254 977758 1019951 2764161
37013 2764161 3175362 1991589 2533056 4938864 5194428 2938341 2932630 6199149 7727703
37004 7727703 6192729 7121075 12443307 16602051 17859786 22556964 32044816 37815141
36996 37815141 37662008 42589640 57098334 69857658 80823056 118364852 199773540
36989 199773540 284642838 303890462 240182884 149286912 91998194 73147992 62491247
36982 62491247 47419975 38180313 37396578 34096310 24728822 17765820 16697949 15265699
36974 15265699 10807268 8270915 9180812 8584473 5042071 3352463 5228098 6306048
36966 6306048 4501111 3186038 3994580 3905854 1672511 422861 1623722 2467616 1400632
36957 1400632 755472 1849518 2547502 1673603 1141786 1830765 1791219 371424 -145200
36948 -145200 1120478 1728723 293548 -1019336 -392757 734137 728480 535839 1266234
36939 1266234 1859567 1284099 606964 897845 1252207 711868 147906 519188 1061928
36930 1061928 809890 306267 351874 504594 139310 -293100 -208526 62104 86449 120069
36920 120069 404999 745925 1219490 2136776 3032398 3021244 2373935 2289680 2931877 3272251
36910 3272251 3041672 3049682 3282949 2623218 1004145 -35874 307765 948244 882266 661427
36900 661427 986546 1371351 1229326 986285 1113449 1177505 769029 369696 460763 677663
36890 677663 582194 408432 386175 173936 -400198 -814829 -658374 -267124 -86567 -52467
36880 -52467 3732 -33952 -223800 -380268 -388817 -193708 432442 1433954 2017745 1540841
36870 1540841 630242 399667 768892 726335 90497 -306679 -151278 15948 76442 549107
36860 549107 1315589 1491464 889754 350779 297464 208689 -136510 -157893 356706 760018
36850 760018 662808 455606 356096 54503 -347188 -215218 401879 610532 150101 -142426
36840 -142426 187786 456931 115026 -363606 -460738 -415559 -449139 -230693 271226 423969
36830 423969 43861 -124133 321178 687434 402370 -14480 26031 117656 -310001 -886699
36820 -886699 -931760 -557784 -294344 -138455 210338 580702 537558 94233 -334550 -458515
36810 -458515 -237852 198208 502348 360183 -38075 -213202 -120076 -56279 108295 742040
36800 742040 1423980 1176686 47626 -624533 -49945 905674 1095163 639884 337220
36791 337220 320177 178378 -151559 -410818 -518175 -438138 -10356 555446 567365 -174772
36781 -174772 -848981 -699023 -123815 22977 -254512 -266610 205644 704069 874263 779826
36771 779826 525834 140959 -203627 -325871 -362520 -590040 -934294 -974513 -467454 314297
36761 314297 789615 583783 -89613 -599022 -578641 -313937 -231519 -251284 -57501 225680
36751 225680 223971 43122 124205 389676 257264 -393753 -956131 -955521 -557152 -75797 385795
36740 385795 657887 504128 85452 -158460 -201318 -386074 -656202 -601472 -364818 -608460
36730 -608460 -1314168 -1513617 -643223 598101 1196605 960225 313107 -353046 -683631
36721 -683631 -380797 287830 542667 69535 -555711 -703216 -354673 301037 1173630 1817497
36711 1817497 1500933 272327 -753753 -749321 -173879 121948 113030 259938 547784 604983
36701 604983 378092 53985 -339191 -714406 -696670 -156710 378902 373372 28977 -63750
36691 -63750 276793 765632 1061340 903268 238107 -459836 -447079 346418 1090651 1127384
36681 1127384 759190 569854 515629 227090 -241676 -544344 -615089 -624498 -608166 -519351
36671 -519351 -432142 -437382 -562653 -862065 -1215509 -1111927 -273070 548029 277183 -853908
36661 -853908 -1409006 -762827 83104 147008 -252048 -526317 -918681 -1608917 -1805983 -916830
36651 -916830 229443 554060 397359 728746 1334207 1236229 502768 138894 352168 386537
36641 386537 83190 152161 655136 608002 -380183 -1232905 -884385 212039 807647 530123
36631 530123 106977 205409 672414 917168 666023 196672 -92071 -188550 -347949 -507683
36621 -507683 -256868 399588 730225 184756 -753069 -1162058 -866184 -456281 -343083 -393886
36611 -393886 -395107 -290945 -6730 444069 719341 509340 93379 43727 396601 600416
36601 600416 305203 -235746 -583083 -548232 -204237 187356 262181 -119125 -647813 -923045
36591 -923045 -917897 -821373 -617588 -211118 174530 157097 -280477 -758452 -948862 -811194
36581 -811194 -512300 -352835 -576300 -991268 -1033516 -489958 148041 387492 414239 625372
36571 625372 863688 709162 264221 12610 49054 51397 -80512 -133849 -68955 -54632 -54077
36560 -54077 119859 367742 402641 253169 201000 250807 133963 -163699 -327088 -194227
36550 -194227 62541 235728 228206 -42428 -535825 -948077 -1009677 -846450 -756290 -779560
36540 -779560 -793236 -814384 -862898 -775816 -538553 -491256 -759265 -848577 -387718 96396 -115160
36529 -115160 -720881 -750674 -28461 600314 562723 231339 107581 109452 -3305 -130604
36519 -130604 -126955 -105742 -127275 -9542 255902 298356 -103437 -605085 -714850 -393931
36509 -393931 17245 278961 416715 519671 575495 509688 334938 227297 343478 533019
36499 533019 450040 68043 -204300 -134870 -60220 -324487 -651543 -553652 -136635 46637
36489 46637 -156039 -319116 -105789 334246 670970 747866 605222 407132 307006 210627
36479 210627 -147350 -705357 -973290 -707566 -296356 -103990 103520 571394 884274 561688
36469 561688 -75526 -384507 -391093 -486728 -494256 -27313 452499 76567 -925647 -1295914
36459 -1295914 -538045 399955 578900 254492 146583 340478 476252 428877 286770 94112
36449 94112 -22108 117958 358074 326825 117635 257271 786147 1037377 644103 100504
36439 100504 -79182 -120153 -416495 -771194 -779151 -544691 -455346 -541304 -552711 -442598 -351194
36428 -351194 -287739 -150165 105256 515956 1086605 1549298 1486025 890582 267076 -21243
36418 -21243 -129511 -274939 -336302 -160306 136150 422724 723630 915719 713040 196215
36408 196215 -134380 -107786 -137895 -395256 -355126 299571 899076 623898 -254658 -729290
36398 -729290 -468856 -147348 -364668 -873681 -1052841 -723334 -270608 -135821 -326663 -435134
36388 -435134 -179314 160916 113437 -219677 -219940 296278 707189 470062 -111004 -417096
36378 -417096 -371239 -249341 -23445 463246 900878 782170 212938 -171561 -141260 -140781
36368 -140781 -490260 -858610 -812749 -489924 -365218 -572517 -801774 -787420 -591085 -364071
36358 -364071 -90768 262375 500292 375328 13664 -120029 180469 552734 562014 270177
36348 270177 28390 -63280 -113606 -63862 173850 345544 167057 -70383 178798 778296
36338 778296 971289 511195 40006 81654 330923 318804 160409 152654 151334 -100746 -424384
36327 -424384 -514112 -466081 -498793 -472063 -211451 -21357 -294634 -802241 -950018 -660874
36317 -660874 -481785 -806361 -1393255 -1681071 -1313015 -417434 395095 465095 -213370 -888288
36307 -888288 -911490 -489478 -281881 -521387 -920874 -1208939 -1287513 -1024435 -396664 213766
36297 213766 330060 13446 -179533 98048 614746 902483 723515 222652 -186502 -165593
36287 -165593 145816 225932 -150003 -569181 -575726 -320634 -253970 -418799 -496671 -393829
36277 -393829 -321278 -358181 -338746 -157993 103372 297443 246409 -135088 -519200 -301180
36267 -301180 573938 1287229 1143610 536097 299776 447619 348482 -50621 -135027 207011
36257 207011 277650 -283740 -865918 -815346 -336844 1182 111259 224248 306654 179845
36247 179845 -33550 -48049 147101 334944 419110 446460 421356 337195 260169 191673 5955
36236 5955 -304391 -506435 -432292 -228867 -132621 -178205 -292334 -473394 -693402 -812404
36226 -812404 -774828 -707644 -656811 -448648 -23408 318242 274801 -14198 -165549 -73360
36216 -73360 43603 37750 1134 49325 157850 236042 220853 104711 -27429 -47638 20935
36205 20935 -38700 -331721 -605126 -518672 -115373 205034 196634 35725 6810 116070 180030
36194 180030 195570 401997 911745 1423288 1466536 931206 214053 -206621 -213167 6287
36184 6287 271667 463727 380277 -151159 -956407 -1535360 -1515617 -969330 -244231 352933
36174 352933 644397 553100 153673 -321009 -637811 -711887 -591564 -381167 -191625 -71031
36164 -71031 21678 86226 -15506 -359216 -720800 -780469 -547261 -298084 -83853 342660
36154 342660 998362 1460352 1424787 1147529 1025850 1021165 859945 589064 506343 641006
36144 641006 706781 550091 305336 122675 60571 218381 627589 1012865 1028388 776766
36134 776766 734710 1094759 1540629 1754477 1747037 1563061 1123529 611469 562514 1173138
36124 1173138 1853545 1921098 1508786 1319668 1637096 2077033 2275162 2329071 2476104 2725869
36114 2725869 2951765 3080235 3095974 3060763 3130540 3334559 3409430 3156285 2870558 2999044
36104 2999044 3415462 3562692 3376402 3458983 4095434 4694771 4629560 4129177 3797496 3629145
36094 3629145 3156117 2370517 1824190 1800063 1945955 1832911 1431669 931839 496673 327457
36084 327457 589435 1087976 1332681 1131875 875058 1015307 1477102 1812902 1813861 1709515
36074 1709515 1767323 1892674 1741640 1180571 494564 50104 -138704 -303626 -457726 -397119
36064 -397119 -230218 -438080 -1112321 -1554131 -1103039 -73937 658290 786316 691764 603437
36054 603437 344237 -62539 -236394 -60183 143856 243588 501498 918497 1006496 575992
36044 575992 170851 261416 500940 304060 -240925 -590161 -556933 -349609 -50544 360421
36034 360421 618833 395664 -123469 -372880 -150966 159726 137816 -231317 -642809 -730705
36024 -730705 -312569 343128 613232 200414 -419683 -580462 -283383 -45638 -56626 -41441
36014 -41441 91117 76394 -144466 -268437 -207955 -280953 -584795 -705593 -388140 -29288
36004 -29288 -90019 -409687 -578065 -655224 -949525 -1285051 -1129665 -442555 193981 405325
35994 405325 464158 693516 908102 780780 403828 99995 -64253 -172702 -79745 380758
35984 380758 900422 925508 429866 -10758 -31200 98512 44258 -80990 -98195 -215253
35974 -215253 -631307 -982050 -699311 200798 1116652 1542375 1378050 738756 -70774 -513991
35964 -513991 -289639 175313 181460 -323521 -782142 -925380 -1008802 -1113415 -913916 -352962
35954 -352962 104559 183933 167960 231456 39332 -542847 -927669 -587727 82323 313677
35944 313677 53959 -129649 -37990 -86902 -576815 -1213345 -1449068 -1045932 -309278 96782
35934 96782 -270927 -1096874 -1593331 -1441809 -1064596 -806711 -423619 248881 718448 518317
35924 518317 -5043 -230141 -179005 -209625 -187227 212797 650357 477721 -146786 -383675
35914 -383675 24775 446526 423660 261109 351768 602473 777484 839832 744216 408867
35904 408867 42595 -16527 112646 -9710 -342074 -342425 97464 382106 132868 -263690
35894 -263690 -343764 -213657 -163942 -173721 -152801 -186650 -212488 52701 540092 714694 391903
35883 391903 116169 294258 505357 221954 -261093 -264211 226660 582485 435976 26618
35873 26618 -260225 -268087 -65268 106542 -7903 -334510 -491802 -352187 -246416 -360458
35863 -360458 -376268 -100756 27964 -369963 -813712 -547025 292638 800386 533830 -28440
35853 -28440 -277588 -142656 118344 301558 311505 209370 268354 655658 1089768 1176076
35843 1176076 996944 914490 868393 454214 -247982 -549306 -92235 601733 839122 609126
35833 609126 408908 542174 924318 1332339 1521716 1281430 676569 106967 -123755 -163055
35823 -163055 -299357 -459896 -332201 86621 389422 252405 -210857 -656539 -879884 -891940
35813 -891940 -784434 -637437 -476526 -228667 212047 789162 1222543 1258231 946748 551886
35803 551886 206790 -170278 -583464 -789336 -578959 -108462 236947 254830 52348 -163337
35793 -163337 -244488 -130931 57063 7924 -437446 -950737 -1013907 -566247 -48594 217330
35783 217330 311402 298284 7142 -513707 -769124 -463232 -54941 -187131 -765024 -1110187
35773 -1110187 -929930 -611686 -543257 -647080 -715528 -757182 -784696 -619082 -198015 164004
35763 164004 132906 -157063 -254518 18624 379224 509501 451640 455580 565001 548581 264230
35752 264230 -68469 -95662 225280 554695 558992 253702 -66730 -142392 22361 150919
35742 150919 -49811 -493228 -658539 -178387 585105 915931 702297 540692 739418 791802
35732 791802 232297 -503138 -679743 -368370 -219355 -322456 -121231 488019 812270 430367
35722 430367 -97914 -73359 322064 416898 97891 -164721 -168500 -229249 -551317 -875874
35712 -875874 -919867 -771758 -640174 -514194 -332412 -268432 -520904 -891506 -896875 -384093
35702 -384093 200909 319686 -31498 -394185 -458441 -356195 -337908 -416753 -461160 -453568 -484855
35691 -484855 -590341 -716264 -763284 -603351 -218131 119659 81674 -152846 58053 890725
35681 890725 1554372 1243161 308416 -197349 1262 197403 20087 21885 584020 1110407
35671 1110407 964455 527733 526798 810056 699902 236476 80285 293223 235860 -230859
35661 -230859 -445033 -126039 98346 -187984 -424825 -79123 354533 175130 -303862 -294826
35651 -294826 118181 196129 -114472 -133866 269124 433105 139992 31678 381924 464059
35641 464059 -209466 -900727 -752692 -188939 -202151 -717163 -787226 -223517 132905 -137695
35631 -137695 -400911 -134673 215652 83079 -280447 -354516 -260165 -406652 -630668 -430287
35621 -430287 152540 569988 591694 462004 282303 -109969 -568979 -591123 -80103 368292
35611 368292 267538 -105129 -224681 -114916 -154071 -327832 -243381 125293 234715 -281686
35601 -281686 -1018627 -1245961 -789602 -196418 -54646 -364449 -643519 -530485 -167659 24271
35591 24271 -112419 -258919 -19172 537902 905360 736024 223639 -224501 -491486 -692557
35581 -692557 -769783 -521518 -55848 171858 -47807 -354953 -340500 -139276 -180359 -513427
35571 -513427 -757511 -664940 -381941 -141317 -33796 -132689 -495555 -907625 -932434 -419744
35561 -419744 257323 654768 745896 774224 829769 818589 704641 517717 212719 -219244
35551 -219244 -552535 -508933 -155153 113519 44007 -209203 -357052 -334474 -272505 -251912
35541 -251912 -244934 -247173 -313155 -442698 -545936 -574774 -600830 -669363 -636753 -313940 193186
35530 193186 453706 169887 -414751 -739129 -548496 -136087 67495 -18003 -153787 -194515
35520 -194515 -288747 -610168 -991563 -998699 -455655 221738 415361 6898 -540929 -833122
35510 -833122 -961409 -1126935 -1191943 -936190 -513994 -251931 -142468 33465 180259 -29952
35500 -29952 -540882 -852341 -670331 -207604 244969 611483 785410 570126 78221 -234283
35490 -234283 -175056 -72436 -203097 -389231 -438479 -528179 -780129 -879469 -571987 -177472
35480 -177472 -102292 -146224 145107 657183 827943 485397 9616 -297945 -483550 -580003
35470 -580003 -490093 -314388 -353574 -656028 -903738 -845976 -565647 -280560 -161797 -336055
35460 -336055 -742727 -994255 -724719 -91323 401962 554753 559155 479869 164581 -225408
35450 -225408 -141827 600788 1408619 1591712 1193187 807804 771646 873193 794140 538435
35440 538435 350043 326059 212703 -323724 -1181759 -1750018 -1559531 -894871 -466909 -549357
35430 -549357 -788618 -841738 -769414 -699605 -540498 -263419 -127984 -331518 -660657 -762962
35420 -762962 -608455 -451107 -454800 -556856 -610528 -504840 -220289 118514 317822 312337
35410 312337 211953 141944 153201 258716 382094 320838 5464 -255293 -107228 294536
35400 294536 451448 263632 143699 283274 325336 5272 -388222 -533669 -576075 -661573
35390 -661573 -424582 455339 1480353 1790280 1282514 659045 386727 231554 -87398
35381 -87398 -389072 -426247 -319312 -284243 -272904 -196848 -232664 -555136 -938098 -976523 -654130
35370 -654130 -381658 -438063 -631718 -636873 -493226 -574182 -1072931 -1676421 -1848611 -1397710
35360 -1397710 -679498 -241804 -336776 -777882 -1171194 -1233708 -964463 -598919 -405391 -497032
35350 -497032 -798624 -1097677 -1080939 -492479 519882 1303303 1261552 558803 -43171 -138145
35340 -138145 -111297 -423982 -839384 -760079 -119080 532590 781772 763662 746819 694655
35330 694655 443331 72161 -146819 -91819 72298 89099 -122743 -393258 -495858 -440528
35320 -440528 -500895 -847955 -1224491 -1167091 -581864 60813 207060 -180421 -609512 -653061
35310 -653061 -472274 -622968 -1290657 -1885612 -1656756 -672152 173818 270697 28321 172844
35300 172844 629804 664213 56330 -477958 -257104 433325 733159 276239 -490003 -929141
35290 -929141 -828563 -403446 24455 247352 224074 47420 -130117 -159656 54947 448871
35280 448871 713786 507676 -95141 -499513 -190393 581960 995661 632566 992 -136229
35270 -136229 236715 413991 -23908 -626115 -696405 -200647 295237 438318 416655 460858
35260 460858 457078 261240 41925 -28456 -187208 -753441 -1459302 -1567869 -779302 338465
35250 338465 1015833 1075358 804404 334440 -389597 -1101634 -1213292 -546278 295508 622429
35240 622429 514787 603470 1109021 1553654 1488208 1058267 636486 288158 -57296 -223379
35230 -223379 -42700 178538 -34178 -588651 -896372 -724749 -462996 -392731 -239711 229125
35220 229125 642729 535650 99227 -107769 -20597 -86344 -448610 -657796 -359209 133672
35210 133672 219972 -241851 -801359 -957159 -673436 -340215 -277793 -365636 -268055 24933
35200 24933 144157 -81201 -308797 -200270 21245 -92193 -497652 -714939 -514827 -121082
35190 -121082 240847 539112 657862 419772 10972 -91164 184360 322110 -828 -385569
35180 -385569 -317749 63659 245433 130322 68249 234040 448044 595042 785107 1007553
35170 1007553 973420 477449 -271051 -812513 -848393 -463463 -39758 53435 -206227 -471533
35160 -471533 -414243 -83805 213283 298592 239380 155000 78512 -11359 -144772 -309179 -364456
35149 -364456 -136599 276748 475869 256014 -37940 36920 345967 348862 -85454 -473922
35139 -473922 -427667 -158940 -78792 -222654 -346449 -356603 -351336 -370010 -361570 -333456 -331245
35128 -331245 -319788 -235344 -97324 48341 203803 318948 247472 -25721 -228502 -94013
35118 -94013 240043 345068 30819 -418584 -591747 -402638 -114601 26841 88143 310755
35108 310755 689960 843678 478021 -106436 -278525 104223 473170 320972 -112498 -209812
35098 -209812 204526 754615 1067001 1074594 850919 494781 173774 6888 -75869 -146835
35088 -146835 -96155 71917 -37603 -722625 -1525246 -1609925 -829866 94730 510485 408620
35078 408620 25507 -477109 -764000 -467163 117377 178850 -366380 -551370 157045 869990
35068 869990 621701 -34711 75307 768268 809316 31285 -354328 196912 659593 193912
35058 193912 -477206 -363010 140707 15579 -655716 -926407 -552421 -151970 34599 409524
35048 409524 985871 1140537 658282 140160 26697 -14513 -324461 -593708 -488436 -334511
35038 -334511 -559728 -901167 -829165 -458667 -359216 -613899 -734236 -496973 -248347 -272367
35028 -272367 -397320 -412953 -410552 -466062 -386276 -67533 209063 151755 -126198 -361071 -546761
35017 -546761 -737588 -703278 -255710 240994 247026 -88955 -43945 568402 1016320 712611
35007 712611 122735 97688 663766 1076953 908061 474199 208391 146665 138751 114777
34997 114777 2716 -249681 -459582 -378210 -165063 -274938 -732185 -980548 -693687 -271545
34987 -271545 -182975 -239760 15394 526183 849299 846004 719772 510905 105741 -314421
34977 -314421 -403983 -264669 -357945 -676024 -576656 254428 1154652 1237767 512619 -203973
34967 -203973 -365498 -245826 -359441 -683904 -700315 -116284 679624 1018916 735274 322252
34957 322252 235585 315611 175075 -76267 21066 443164 558520 42123 -564340 -562997
34947 -562997 -25979 405955 413346 225923 85128 -32633 -127560 -45029 223181 426626
34937 426626 412960 345584 388543 395261 144390 -246350 -393912 -124959 306114 515421
34927 515421 394231 156690 32836 -16203 -227248 -674272 -1072856 -1073749 -720394 -420461
34917 -420461 -402443 -422829 -193541 100303 41849 -320135 -423565 22754 573638 655912
34907 655912 373644 305487 636751 961517 965474 824233 748711 578173 151341 -253986
34897 -253986 -272775 -48515 -44138 -348208 -589322 -525942 -318035 -168467 -80961 -68700 -230648
34886 -230648 -471015 -486454 -222620 -29696 -146626 -336144 -303710 -199018 -352475 -702377
34876 -702377 -854384 -627053 -225853 74280 153973 12852 -243850 -435036 -530482 -733889
34866 -733889 -1093168 -1197351 -639959 306319 913398 905923 715164 750873 861205 702060
34856 702060 270654 -162899 -367804 -203129 333595 888822 917207 366324 -94100 117578
34846 117578 708837 957060 743049 621908 892764 1121539 766839 -76803 -792388 -905525
34836 -905525 -468797 90037 371672 315598 168059 132316 129154 -8675 -241666 -415046
34826 -415046 -528784 -664782 -734641 -604552 -419882 -452123 -617018 -537215 -175739 -12092
34816 -12092 -395329 -1043715 -1405598 -1256783 -750178 -143469 318737 518260 660338 1072232
34806 1072232 1616326 1689831 1102675 518274 558380 867515 697992 136540 -47202 286734
34796 286734 342780 -376293 -1264640 -1465860 -995148 -520893 -395027 -418108 -375335 -322226
34786 -322226 -358762 -461278 -576582 -683180 -748214 -736138 -622872 -351205 105753 579089
34776 579089 775110 599330 239998 -118864 -424527 -551265 -339038 1450 -64781 -647238
34766 -647238 -1111271 -908885 -381147 -225805 -452343 -502506 -260465 -214729 -552128 -797613
34756 -797613 -616033 -380990 -564501 -1009575 -1241505 -1180229 -1101067 -1110776 -1107110 -1122891 -1259336
34745 -1259336 -1310682 -900964 -103903 433808 209033 -499610 -931204 -691174 -109377 231938
34735 231938 142000 -104374 -222545 -243559 -324183 -409158 -292963 13144 194366 -324
34725 -324 -433851 -717645 -602446 -189453 163932 125434 -305478 -730300 -718810 -291270
34715 -291270 109343 171148 42381 15958 127466 261953 443567 729555 950420 884076
34705 884076 641035 551157 655502 634329 312365 -79051 -281550 -366593 -517273 -689328
34695 -689328 -729574 -662173 -605117 -515651 -265367 95700 360576 393096 162834 -321617
34685 -321617 -876139 -1078775 -692248 -90795 120360 -86437 -166038 111677 289190 -13709
34675 -13709 -449304 -482530 -214662 -138128 -301182 -310186 -91120 -49897 -390775 -811614 -1056391
34664 -1056391 -1281570 -1587102 -1598353 -936273 97953 701065 415234 -417942 -1033248
34655 -1033248 -949613 -351301 151386 164816 -122483 -310353 -358248 -474631 -556611 -247800
34645 -247800 379623 751234 608403 353566 274426 21666 -647405 -1175168 -966020 -433879
34635 -433879 -454425 -995260 -1178276 -655663 -18807 277272 489076 785659 741944 150077
34625 150077 -367644 -209145 247880 221866 -278641 -531214 -194449 323585 559447 499209
34615 499209 330658 142579 -14727 -86816 -115194 -151844 -88255 170858 405344 275102
34605 275102 -159049 -426012 -236678 182528 443952 441969 316201 181908 71920 32926
34595 32926 115939 284909 415548 408512 310841 307793 515246 772474 786862 540703 347217
34584 347217 363987 303684 -91436 -503101 -389800 182788 535827 298244 -96560 -60940
34574 -60940 346670 606007 516675 410996 594126 888373 886372 507848 103584 -19594
34564 -19594 -8350 -211013 -572002 -585402 -5319 682622 819258 424203 97294 158152
34554 158152 337467 333032 170494 -116102 -633892 -1183906 -1160417 -331810 647845 999380
34544 999380 813681 759843 1020577 1140452 862319 474647 246552 99119 22 143807
34534 143807 505463 707740 611662 566199 738334 682337 49569 -675925 -735421 -141669
34524 -141669 418090 570647 556861 617312 686644 742314 895137 1027348 855638 469129
34514 469129 279108 300019 72953 -469390 -712504 -327777 98081 -29584 -322004 -65050
34504 -65050 522362 577699 1745 -348312 1784 452971 319799 -183316 -425914 -328170
34494 -328170 -281939 -392907 -355308 -15353 359271 423062 138920 -193810 -181182 321775
34484 321775 1006614 1371595 1279098 1068738 997585 843417 331696 -270573 -379540 143247
34474 143247 805073 1095437 997264 803648 670946 513770 224923 -144135 -420163 -491283
34464 -491283 -444718 -472203 -610891 -670005 -484071 -125918 247079 635020 1097529 1492280
34454 1492280 1547715 1223568 816066 636039 693930 753521 619647 340522 165739 287534
34444 287534 594646 769859 702078 657524 873485 1118531 938024 303584 -292328 -453905
34434 -453905 -297898 -119323 50387 270786 297565 -215737 -1104751 -1671916 -1486530 -955148
34424 -955148 -793795 -1063238 -1120410 -582195 83866 226123 -42466 -48724 376352 605531
34414 605531 169754 -485341 -585283 -63043 442111 465775 132774 -276535 -698913 -1087533
34404 -1087533 -1209395 -893594 -304323 213728 453997 414510 182651 -129981 -424905 -665437
34394 -665437 -830780 -841604 -676172 -540042 -687077 -1007724 -1039126 -537294 143909 424834
34384 424834 132799 -392802 -725012 -720265 -539587 -456722 -620729 -902917 -1000738 -759530
34374 -759530 -353359 -105984 -190223 -519333 -834905 -883564 -641004 -391692 -426981 -634449
34364 -634449 -610625 -262707 -18080 -233684 -642814 -696231 -321292 -12825 -177745 -655099
34354 -655099 -953047 -808832 -453279 -363673 -729616 -1175081 -1160975 -671498 -227705 -134936
34344 -134936 -105161 129051 265647 -34406 -416381 -266189 307325 610912 428385 210977
34334 210977 149162 -137786 -721252 -966741 -505240 58428 22721 -347491 -335171 38393
34324 38393 119159 -278285 -654259 -695802 -661731 -783719 -884954 -791531 -643707 -581521 -495724
34313 -495724 -283195 -47040 98565 151013 69134 -197083 -459463 -401371 -20238 348266
34303 348266 498718 510113 420403 192954 76209 462786 1186121 1487619 1009567 349750
34293 349750 225482 497235 507978 91520 -275482 -166421 389510 1072366 1465847 1227585
34283 1227585 454479 -224138 -277226 96041 284556 74583 -223702 -328144 -252248 -87242
34273 -87242 92410 137862 -13137 -139727 -43495 47693 -213903 -661732 -748118 -312786
34263 -312786 224632 470749 425677 212185 -92111 -262468 -48202 345163 336660 -247063
34253 -247063 -853518 -906578 -488538 -77149 89441 105887 78895 -23863 -292013 -721779
34243 -721779 -1030691 -737889 210362 983886 615324 -693033 -1643901 -1492263 -955686
34234 -955686 -1017030 -1460881 -1353193 -583089 -32233 -245070 -716188 -704060 -181577 312062
34224 312062 395070 146427 -91951 -20577 360089 677174 506619 -145404 -800745 -1007448
34214 -1007448 -769126 -443122 -340376 -489928 -696255 -733215 -506672 -99052 300712 521149
34204 521149 540574 540404 721317 973312 893598 342106 -198462 -173842 246931 407784 177444
34193 177444 121279 500429 758085 407143 -140349 -204355 121464 213524 -71520 -327422
34183 -327422 -408238 -598948 -944887 -1062291 -785351 -469388 -426875 -492040 -389799 -187015
34173 -187015 -106106 -127142 -26425 299040 680598 778485 334292 -521801 -1233228 -1284664
34163 -1284664 -711501 21993 576079 921455 1051471 861371 382417 -124381 -396494
34154 -396494 -350514 -78659 155717 37330 -420995 -735181 -497498 60762 412307 476891
34144 476891 550016 627574 412460 -12771 -180251 -23982 -21722 -349750 -563096 -422554
34134 -422554 -360677 -676553 -910390 -620731 -231406 -361336 -717724 -518372 167745 392203
34124 392203 -293017 -1208675 -1529435 -1243111 -804740 -373576 152614 671655 908573 801694
34114 801694 540088 281971 68098 -58716 -75623 -86600 -204230 -330026 -239576 84875
34104 84875 380209 432565 330628 267220 207664 -47842 -491787 -807882 -727997 -350401
34094 -350401 1125 120444 12189 -224086 -426832 -384377 -38692 335885 361092 -4505
34084 -4505 -406450 -499445 -277730 -1926 54906 -209791 -634449 -866907 -682913 -242683
34074 -242683 101726 214421 214481 168268 2820 -264993 -474824 -556182 -598451 -653959 -691037
34063 -691037 -746716 -856698 -822174 -374798 353727 857137 859386 585140 339889 191190
34053 191190 194834 495016 938518 992683 404028 -362527 -690106 -553190 -360345 -326507
34043 -326507 -378961 -440181 -389201 38272 847466 1452699 1262112 520534 58155 196335
34033 196335 411177 182219 -307408 -542375 -389231 -162201 -169420 -414460 -658013 -651123
34023 -651123 -369153 -62385 -11181 -238478 -534015 -694642 -635018 -368976 -44464 101603
34013 101603 284 -141766 -160337 -185177 -330427 -346048 34153 519889 501341 -121972
34003 -121972 -759379 -851093 -421462 145851 511251 467487 14815 -490190 -601002 -366012
33993 -366012 -323242 -742568 -1234466 -1351912 -1216048 -1193074 -1243505 -1038615 -578997 -246169
33983 -246169 -235484 -314668 -239220 -117042 -200671 -489726 -710050 -635305 -315481 23380
33973 23380 247473 427864 666620 867133 778930 300483 -326091 -670597 -474302 101926
33963 101926 561457 495409 11731 -348382 -231997 113572 213703 -15886 -305059 -536129
33953 -536129 -794269 -943912 -668661 -89968 145032 -288607 -846053 -813318 -266617 122639
33943 122639 49723 -159327 -182938 -92537 -17357 129799 371768 430945 56883 -563837
33933 -563837 -959516 -877384 -485152 -119121 30768 -11654 -143156 -304171 -455899 -497965
33923 -497965 -344385 -133241 -190067 -599627 -944294 -764584 -252161 -115127 -624981 -1163185
33913 -1163185 -1013123 -326817 124241 23508 -187292 -136279 -99154 -429418 -836672 -744422
33903 -744422 -172592 286363 354766 376521 577097 547325 -144194 -1157249 -1666155 -1320605
33893 -1320605 -539914 84181 307825 162248 -258723 -788303 -1180143 -1254142 -985738 -480220
33883 -480220 25300 243483 133603 10994 96701 99111 -359940 -996442 -1082504 -485292
33873 -485292 87910 114479 -38000 172001 537468 472955 -6923 -322121 -223893 -47521
33863 -47521 -45347 -24180 199975 441419 469949 364908 299122 207992 -70667 -457528 -659244
33852 -659244 -517583 -208311 -67848 -237659 -497267 -526101 -342750 -299782 -530140 -653216
33842 -653216 -310877 219656 368023 122582 42264 375974 684105 535505 133296 -58890
33832 -58890 28090 131197 119562 43497 -106229 -348477 -533765 -519191 -428742 -455674 -505139
33821 -505139 -354154 -106136 -122657 -464158 -741923 -663010 -448657 -500344 -815188 -979263
33811 -979263 -722370 -277462 -78945 -193282 -240758 41874 356883 230094 -234456 -375136
33801 -375136 124761 737943 792439 365413 63569 109091 153566 -35846 -237168 -249959
33791 -249959 -234836 -317572 -241768 211800 705561 678309 143417 -228615 79960 805475
33781 805475 1246958 1091107 695327 564971 738073 824082 574246 203013 70118 215351
33771 215351 367199 307310 46618 -284819 -514205 -431435 42818 655357 979333 837605
33761 837605 442138 112739 4018 76131 140953 -26447 -390627 -523215 -82818 590254
33751 590254 758952 245643 -325422 -402535 -169077 -63870 -101451 -93467 -165333 -501960
33741 -501960 -807481 -603923 10929 441187 414290 215411 82756 -84395 -288800 -244095
33731 -244095 126066 444255 443988 405529 678622 1077024 1137143 757698 201722 -338028
33721 -338028 -747166 -726587 -64802 807150 1059521 441497 -406155 -828779 -921415 -1083698
33711 -1083698 -1224924 -970116 -455094 -261786 -509111 -617985 -214435 272665 298321 35819
33701 35819 -4028 120707 -94063 -662022 -953687 -600892 944 317145 336980 328269
33691 328269 314426 145862 -157922 -452134 -681779 -821945 -788274 -608252 -470724 -407883
33681 -407883 -173444 337398 809831 920143 778740 680816 667545 653262 739144 1021799
33671 1021799 1274346 1192250 829745 491940 355543 451508 763684 1053219 928982 462885
33661 462885 322861 807853 1223508 897716 360496 586704 1353250 1455157 546691 -352918
33651 -352918 -416252 -15103 227739 411709 788690 1028334 763356 298565 113026 89396
33641 89396 -179423 -698974 -1212179 -1659200 -2007205 -1997393 -1557595 -1100731 -918887 -666506
33631 -666506 8947 696287 710663 94194 -481482 -621864 -459971 -185029 109832 231674
33621 231674 64933 -146729 -150866 -183332 -651755 -1456583 -2086135 -2255600 -2019175 -1443399
33611 -1443399 -679458 -191690 -349646 -871656 -1173804 -1156642 -1126216 -1092385 -796119 -387840
33601 -387840 -377255 -778130 -919026 -355162 485597 834242 469127 -122194 -302430 74565
33591 74565 506520 421144 -45029 -190038 167487 306423 -252186 -836127 -605002 71178
33581 71178 194622 -235364 -317284 153815 422132 241714 343233 999122 1298997 569752
33571 569752 -416268 -497616 276234 931699 980066 745286 592031 543984 529716 478417
33561 478417 279208 -12841 -140589 -74886 -133567 -386569 -397035 55815 479137 395920
33551 395920 126953 242628 591354 541528 -24721 -594192 -777220 -625227 -298403 62139
33541 62139 204017 -19643 -362136 -515014 -597757 -878670 -1157786 -951307 -249722 387526
33531 387526 515314 209598 -175616 -319568 -96345 230154 128908 -486427 -879579 -344163
33521 -344163 732414 1273678 918604 367802 287949 545362 709547 694627 598440 408311
33511 408311 206119 265526 610134 802950 501296 -44215 -350266 -341552 -336567 -547180
33501 -547180 -852281 -989865 -813853 -435810 -164902 -150405 -75944 508270 1474261 2084256
33491 2084256 1858995 1164502 686143 608270 630270 547062 404338 194088 -183858 -622554
33481 -622554 -790367 -509692 39722 539140 781662 700564 369431 47247 28748 321981
33471 321981 596651 568783 333304 179575 157949 25228 -352415 -723922 -722802 -338073
33461 -338073 52207 140548 34924 47902 246422 378340 247529 2729 -49835 150940
33451 150940 341102 282259 86181 80032 380726 753485 947330 1006763 1084979 1071140 686890
33440 686890 -29387 -629600 -787258 -674187 -588119 -419602 154409 999831 1447724 1062561
33430 1062561 242189 -202416 28116 462368 523529 196563 -112607 -182575 -153786 -151044
33420 -151044 -72442 121843 214653 64948 -106619 -71904 -20150 -220566 -418576 -108153
33410 -108153 598114 962223 650125 206125 205638 458502 481816 320112 348906 565107
33400 565107 653104 574011 519626 398304 -36401 -567312 -630386 -147597 312258 373621
33390 373621 326227 500806 669677 470691 78978 -7885 309841 636175 642625 389466
33380 389466 83658 -183462 -370786 -377669 -153078 156063 273148 25408 -497124 -994027
33370 -994027 -1157413 -866908 -263031 326966 593229 473784 174771 -117093 -470954 -980632
33360 -980632 -1373685 -1214535 -604049 -277769 -707872 -1416492 -1575616 -1066871 -498116 -324276
33350 -324276 -462780 -717069 -1019676 -1184891 -963028 -520224 -386349 -705609 -995637 -917048
33340 -917048 -807814 -1061380 -1393566 -1256839 -719383 -354155 -350717 -296346 103394 570043
33330 570043 694034 477444 210227 30012 -165596 -462377 -747965 -781316 -417964 182910
33320 182910 611270 602959 382825 439219 906320 1353039 1303818 815889 360409 226978
33310 226978 281828 323448 420230 729865 1137497 1314120 1120566 751329 447624 264890
33300 264890 183779 220386 293206 223615 86878 309095 1054693 1706237 1464553 457273
33290 457273 -296679 -179875 304538 401862 156339 67849 104014 -208017 -812259 -1006614
33280 -1006614 -470515 217581 416752 276113 320511 574190 649509 502017 485297 637895
33270 637895 485702 -229354 -1057109 -1393239 -1231946 -1008057 -882469 -611916 -112595 251961
33260 251961 114034 -403432 -822564 -825953 -506142 -195917 -173547 -469241 -847021 -1009646
33250 -1009646 -896280 -727403 -690018 -675028 -465517 -123580 15474 -212318 -536847 -584283
33240 -584283 -380946 -326699 -637158 -1012284 -1023287 -708409 -524542 -696374 -908078 -807791
33230 -807791 -567667 -632859 -1029894 -1289482 -1098450 -709146 -555746 -695820 -825622 -720284
33220 -720284 -475398 -339003 -401640 -470741 -286458 97887 281562 33566 -299248 -215065
33210 -215065 186621 294647 -113153 -519351 -412003 45028 381128 489911 560501 620297
33200 620297 548421 364056 158177 -79835 -255356 -48696 586389 1054587 782178 104369
33190 104369 -100303 353189 691649 302965 -415154 -622125 -97401 587174 794156 476393
33180 476393 133136 207906 577922 756326 601550 509985 725544 874347 600475 272431
33170 272431 422923 751620 479033 -374054 -904689 -640434 -108883 154527 346265 717723
33160 717723 910743 577148 108685 104767 493107 758628 720899 525729 157101 -454011
33150 -454011 -1022176 -1144048 -831406 -407507 -56140 161243 133686 -8603 231073 993986
33140 993986 1540186 1120402 128773 -380178 -183817 -65063 -499122 -1034633 -1150384 -912148
33130 -912148 -501384 136647 800806 924596 446699 135626 482897 893169 671881 252638
33120 252638 518556 1245135 1310667 487942 -42220 615936 1697650 1763618 577785 -718260
33110 -718260 -1117332 -759383 -383053 -345032 -471978 -535023 -486128 -322596 -44284 198664
33100 198664 146094 -242179 -617588 -573191 -121884 297399 317093 14685 -280499 -422225
33090 -422225 -523004 -648946 -671677 -519745 -385301 -468040 -608230 -458471 -56241 81890
33080 81890 -363205 -973728 -1045100 -471445 166446 389356 309014 213650 70935 -245115
33070 -245115 -523281 -448077 -154454 -103113 -370220 -493910 -201284 94323 -152138 -804532
33060 -804532 -1184513 -950683 -454391 -172705 -154220 -195246 -234638 -261819 -53923 574379
33050 574379 1302208 1510390 1072186 575383 555310 817491 803810 387483 -40566 -127034
33040 -127034 142276 583915 913403 803342 242558 -227186 -84632 375737 346802 -312603
33030 -312603 -795756 -490251 178567 450042 255274 -8656 -315068 -908479 -1554551 -1620900
33020 -1620900 -971268 -210505 86424 -63251 -352804 -592858 -664789 -485704 -225188 -229798
33010 -229798 -557063 -876700 -954638 -898676 -809157 -601313 -362908 -423652 -751482 -723628
33000 -723628 47158 1001180 1274748 831225 405971 464684 787502 1032424 1098534 852702
32990 852702 111654 -858526 -1344137 -1033156 -478997 -361339 -607258 -634167 -202672 401369
32980 401369 853444 1018147 807451 278998 -140759 12078 596983 939276 653729 55107
32970 55107 -364459 -497175 -483429 -384044 -254370 -237705 -286468 -73419 471317 809057
32960 809057 438421 -293675 -576547 -279340 -101452 -449434 -778469 -430345 340112 719145
32950 719145 472669 137372 93346 33119 -400709 -884371 -759755 37441 826103 1021616
32940 1021616 795486 697816 854936 864385 443247 -153251 -504698 -591132 -738741 -1067670
32930 -1067670 -1243829 -878934 -61355 647894 772053 401419 37177 -23380 28067 -55837
32920 -55837 -82967 304902 936225 1140553 630240 -46786 -216284 88399 356283 372740
32910 372740 292738 126095 -281533 -748616 -785906 -298513 165717 108853 -288564 -480418
32900 -480418 -262896 91765 275009 273765 273965 364604 393885 161740 -238708 -427767 -207938
32889 -207938 163098 373217 496548 703228 771416 397811 -133049 -195136 252067 608372
32879 608372 610987 696963 1132249 1437199 1112543 415326 -72905 -237485 -313044 -344482
32869 -344482 -267673 -230279 -346229 -390439 -193427 -54186 -266852 -524726 -358081 81083
32859 81083 289979 275662 457149 799000 778600 294650 -67994 119547 577579 834623
32849 834623 824376 722186 583910 406159 256433 153807 61508 79784 334781 605676
32839 605676 447440 -170900 -718889 -774587 -499395 -253892 -94532 82735 195489 96755
32829 96755 -115040 -170210 54826 411492 566236 203313 -622683 -1305106 -1191499 -400618
32819 -400618 205100 46284 -523679 -841273 -829214 -868441 -1041891 -1017404 -640013 -201622
32809 -201622 -24424 -71321 -92372 31986 205787 263603 118388 -185131 -519433 -777726
32799 -777726 -912791 -891157 -700506 -430831 -248751 -236962 -328164 -404811 -357719 -73817
32789 -73817 426129 804546 632081 -49294 -615062 -529764 34478 483311 551230 459245
32779 459245 387840 155052 -459030 -1299900 -1919253 -1974277 -1471300 -738965 -260078 -393678
32769 -393678 -1066999 -1754632 -1920802 -1526450 -1004687 -732159 -674305 -595311 -409301 -160146
32759 -160146 163561 524962 660069 334734 -239076 -588381 -596782 -540604 -460992 -46750
32749 -46750 611739 751603 -51980 -1053253 -1196178 -543069 -102813 -352501 -736137 -707881
32739 -707881 -460413 -322403 -144460 257542 587855 509058 207358 40048 -52368 -283787
32729 -283787 -446515 -161379 419873 696205 410916 -61378 -262011 -116623 211113 600432
32719 600432 959024 1136150 1006662 595567 107868 -133641 100661 662447 1057710 928253
32709 928253 408535 -140454 -580956 -939173 -1065238 -732866 -69462 465995 622702 603189
32699 603189 677013 813770 845540 770097 692939 606604 429755 202679 66418 46981 -12235
32688 -12235 -264631 -666393 -993987 -1033866 -760650 -363779 -108809 -136108 -344953 -463963
32678 -463963 -285770 118857 451187 508131 420023 473200 724659 931158 871305 574561
32668 574561 173345 -292326 -794226 -1189874 -1355535 -1354231 -1296438 -1116836 -705055 -212053
32658 -212053 41605 13282 34926 325106 629413 573036 216319 -39568 -46695 -66452 -264048
32647 -264048 -410944 -318296 -244377 -478173 -724455 -428220 315575 759699 573633 317722
32637 317722 475653 577724 -62832 -1101997 -1485769 -967087 -464274 -686690 -1160816
32628 -1160816 -1076822 -500991 -113118 -117519 -141666 -89438 -353281 -1018760 -1468851 -1157301
32618 -1157301 -409236 -24270 -257260 -611038 -603487 -316571 -52811 170015 454480 580203
32608 580203 168843 -696044 -1395539 -1457921 -1037140 -586068 -357615 -413974 -793669 -1339236
32598 -1339236 -1593867 -1245944 -557446 -48984 94101 8092 -228598 -548727 -666589 -403499
32588 -403499 -129343 -337408 -843297 -997779 -683341 -430797 -461917 -367135 -807 59031
32578 59031 -557575 -1220767 -1067407 -188514 538031 563346 99825 -374285 -547249 -315425
32568 -315425 173818 548312 570645 395553 270266 185359 67600 46438 190573 232231
32558 232231 -49890 -375423 -306440 97731 359764 193532 -320727 -1005611 -1629212 -1821545
32548 -1821545 -1394604 -697782 -281026 -252817 -287441 -151715 124924 471530 784295 834515
32538 834515 549939 258656 271028 393764 289647 105456 207931 486377 549598 488398
32528 488398 726481 1141825 1111032 540391 99399 220338 584289 855903 1173044 1524074
32518 1524074 1393866 605207 -100496 10531 616222 896345 769607 826382 1229970 1449261
32508 1449261 1114138 528770 204632 296702 580713 672848 287976 -398934 -726257 -264530
32498 -264530 513238 727266 216123 -352643 -529397 -624370 -969648 -1232613 -941025 -315453
32488 -315453 -28735 -291688 -668704 -763524 -646470 -545669 -501098 -465851 -458726 -458541 -373043
32477 -373043 -245999 -263970 -413448 -396264 -98137 135477 8455 -185713 26669 492819
32467 492819 569622 77332 -434939 -524388 -410103 -415315 -378032 -59255 279655 253469 17308
32456 17308 -27288 19754 -247402 -697908 -734897 -277067 45875 -92995 -187383 228794
32446 228794 770490 806907 440558 255380 357956 330846 38924 -169050 -121639 -96777
32436 -96777 -249943 -281165 39082 414781 440559 170552 -91522 -311979 -597915 -721237
32426 -721237 -307613 477746 936477 694832 141814 -200395 -334557 -497464 -585653 -348913
32416 -348913 49527 172595 -52115 -277476 -295635 -228649 -181956 -158441 -306867 -732505
32406 -732505 -1020016 -565452 436972 982911 551929 -194664 -418126 -191094 -34147
32397 -34147 52382 353632 657399 529104 128634 -39765 -19141 -231666 -547410 -414317
32387 -414317 85090 245322 -58668 -144613 209676 265249 -382468 -928869 -567881 139298
32377 139298 70184 -700995 -974417 -169523 915254 1253101 786630 182847 -95690 -114568
32367 -114568 -147704 -343062 -602930 -653588 -335785 118166 260987 -37735 -412940 -476831
32357 -476831 -290465 -152043 -40636 383013 1140038 1650661 1408740 735760 406386 555177
32347 555177 499590 -174843 -918302 -1010937 -588881 -322264 -409775 -536846 -599243 -742264
32337 -742264 -787603 -393936 185765 277514 -165171 -454870 -294042 -179286 -366038 -291705
32327 -291705 430515 1195216 1257054 796842 421346 125680 -428237 -973002 -857759 -81910
32317 -81910 631479 756018 376934 -199802 -668711 -675051 -152033 366467 340341 22049
32307 22049 51132 375925 317085 -293263 -814605 -794854 -536634 -408339 -263127 80124
32297 80124 343659 241813 29625 155840 625560 1066317 1219693 1074443 715092 318115
32287 318115 130697 206083 300374 226136 139280 266227 503492 521778 181615 -331917
32277 -331917 -705969 -686583 -183108 607328 1203204 1158584 484442 -291727 -588749 -362052
32267 -362052 -167187 -496258 -1116131 -1351098 -1047533 -830138 -1169054 -1643977 -1584427 -1075567
32257 -1075567 -718276 -623222 -370395 84313 238598 -62698 -269344 35665 527689 734492
32247 734492 735511 849084 1023661 988813 738738 469012 234190 -9923 -212402 -343444
32237 -343444 -507386 -722234 -828977 -821644 -953534 -1262490 -1339782 -910467 -330818 -128792
32227 -128792 -326592 -614768 -914589 -1280520 -1448500 -1038223 -188523 447043 385530 -277335
32217 -277335 -1075695 -1509970 -1299136 -640324 -144191 -208038 -541840 -587579 -238525 190036
32207 190036 493727 638397 454513 -187009 -921570 -1123974 -663076 -30555 293322 214997
32197 214997 -174592 -682914 -880567 -411583 436282 913786 669257 27352 -587506 -973332
32187 -973332 -882144 -137230 771346 931448 226659 -362998 -155713 227253 -57659 -607143
32177 -607143 -363102 629178 1152711 599864 -177039 -201111 240815 201969 -413550 -731877
32167 -731877 -232312 496655 580846 5817 -474516 -401059 -111875 -91907 -242954 -131349
32157 -131349 287645 627925 673208 578401 457405 230096 -18783 -15095 162124 10385
32147 10385 -581729 -911950 -348805 696004 1241389 982110 489455 270880 228966 117665
32137 117665 4739 71864 290807 476661 454966 110412 -516931 -1150102 -1484970 -1476215
32127 -1476215 -1254969 -885862 -454016 -232613 -407954 -743768 -883665 -861761 -896647 -843367
32117 -843367 -421203 90566 66779 -465668 -726566 -299433 293693 449216 302575 266419
32107 266419 289262 113938 -116420 -81529 114683 65238 -340696 -806604 -986750 -698511
32097 -698511 -13267 598835 531055 -219222 -904404 -984128 -816212 -903394 -925478 -296624
32087 -296624 604292 723725 -100542 -782344 -509694 154469 209063 -334194 -622076 -302548
32077 -302548 21437 -244412 -811997 -920312 -374818 192263 129355 -449359 -881949 -796746
32067 -796746 -437479 -194037 -161007 -260135 -457955 -643114 -557456 -122852 339077 454777
32057 454777 229869 -42244 -125224 62328 458082 786297 744522 449376 380778 678872
32047 678872 897182 722612 453155 368103 161371 -433152 -953593 -858309 -449508 -357318
32037 -357318 -461114 -226977 168243 98328 -257523 -61890 698873 1022035 448729 -264941
32027 -264941 -442189 -423647 -671728 -883851 -672226 -333518 -240243 -159778 132557 251774
32017 251774 -29186 -78907 635262 1435915 1258797 207848 -689825 -1005269 -1161974 -1306626
32007 -1306626 -1011157 -247065 296393 211550 -27969 154097 606425 782585 506562 44101
31997 44101 -337306 -574970 -694858 -681804 -458156 -3119 454645 515578 64738 -497429
31987 -497429 -711241 -599165 -497482 -517973 -495840 -336566 -74131 308539 774204 1036964
31977 1036964 822797 281331 -148733 -216748 30016 440860 775593 739523 369033 169626
31967 169626 454749 768442 464423 -327541 -888333 -946760 -910003 -1079677 -1270777 -1304763
31957 -1304763 -1310888 -1379905 -1389095 -1296730 -1184074 -954704 -472945 -31030 -103793 -546226 -667892
31946 -667892 -288576 -46408 -336485 -606093 -203157 602882 1038205 905982 661532 624699
31936 624699 677786 667570 632039 606554 538104 414935 262357 56843 -163909 -208917 21780
31925 21780 287839 238163 -151010 -553458 -669636 -483001 -202932 -81347 -211427 -395149
31915 -395149 -304406 123941 580195 782835 823827 935378 1055339 874336 284760 -424853
31905 -424853 -855340 -848234 -534130 -152461 105070 128591 -111648 -508617 -796841 -749836
31895 -749836 -470138 -332426 -526783 -822631 -929266 -871677 -777653 -550963 -138644 89741
31885 89741 -245043 -824675 -929745 -490036 -218263 -517947 -897528 -824045 -565842 -643333
31875 -643333 -887183 -721788 -169232 128668 -98976 -360740 -190972 167902 209373 -27937
31865 -27937 -40581 308191 477712 1824 -719561 -809610 -92621 591766 501982 -7233
31855 -7233 -76411 372434 607529 267432 -166543 -240696 -181659 -326327 -475169 -292321
31845 -292321 67151 235015 242541 373955 616480 699045 528219 213020 -173445 -507409
31835 -507409 -515481 -174284 9839 -395585 -1026267 -1126106 -583761 -17528 153198 140429
31825 140429 198566 180828 -58133 -273306 -192149 21993 6538 -263995 -471025 -413377
31815 -413377 -245084 -240321 -463102 -733728 -887614 -981975 -1144166 -1252230 -997658 -374025
31805 -374025 146793 163049 -125817 -228374 -41928 125634 102116 10843 -89961 -306416
31795 -306416 -580773 -643298 -413680 -144619 -65466 -163074 -363131 -590673 -603995 -193292
31785 -193292 338939 379129 -94891 -329176 123240 645402 447721 -177966 -247046 415902
31775 415902 865511 373482 -612243 -1188263 -1150565 -966624 -925891 -839434 -497284 1419
31765 1419 432706 695318 804379 802634 724076 557281 274118 -18005 -53698 293507 765560
31754 765560 964108 789690 443858 75265 -299766 -568228 -571884 -447301 -537112 -813553
31744 -813553 -783369 -231414 316895 274703 -161695 -352823 -208704 -230432 -576723 -751337
31734 -751337 -446735 -127030 -354567 -916937 -1104220 -658213 6372 446686 636314 732979
31724 732979 754733 619774 301302 -157463 -640498 -930094 -848441 -492570 -176694 -64330
31714 -64330 4559 236639 579936 822127 875654 797177 597281 239541 -165403 -376154
31704 -376154 -322828 -234660 -345238 -596842 -764400 -732144 -483354 2634 560741 712388
31694 712388 175045 -523529 -484900 330959 865930 327762 -683501 -958978 -250008 605531
31684 605531 945889 938154 940406 937111 852126 826480 837101 515706 -243615 -860356 -710182
31673 -710182 16457 524668 393583 -17289 -133101 156444 465847 406753 -1222 -423859
$$ [...]
##END NTUPLES=NMR SPECTRUM
##END=
