##TITLE=31Pdec_X0708
 CDCl3, 24 sc
 6.8.2024
##JCAMPDX= 6.0         $$ Bruker NMR JCAMP-DX V2.0
##DATA TYPE= NMR SPECTRUM
##DATA CLASS= NTUPLES
##ORIGIN= UXNMR, Bruker Analytische Messtechnik GmbH
##OWNER= root
$$ XWIN-NMR		Version 3.5
$$ Wed Aug  7 14:55:06 2024 Russian Standard Time (UT+4h)  she@DPX200
##.OBSERVE FREQUENCY= 81.013821
##.OBSERVE NUCLEUS= ^31P
##.ACQUISITION MODE= SIMULTANEOUS
##.ACQUISITION SCHEME= undefined
##.AVERAGES= 24
##.DIGITISER RES= 17
##SPECTROMETER/DATA SYSTEM= spect
##.PULSE SEQUENCE= zgpg30
##.SOLVENT NAME= D2O
##.SHIFT REFERENCE= (INTERNAL, D2O, 0, 198.062)
##AUDIT TRAIL= $$ (NUMBER, WHEN, WHO, WHERE, WHAT)
$$ ##TITLE= Audit trail, XWIN-NMR		Version 3.5
$$ ##JCAMPDX= 5.01
$$ ##ORIGIN= Bruker BioSpin GmbH
$$ ##OWNER= she
$$ F:/spectra/data/she/nmr/P31/2/pdata/1/auditp.txt
$$ ##AUDIT TRAIL=  $$ (NUMBER, WHEN, WHO, WHERE, WHAT)
(   1,<2024-08-07 14:53:55.84 +0400>,<she>,<DPX200>,
      <created by zg, POWCHK disabled, PULCHK disabled
       configuration hash MD5:
       00 E9 B6 7A A2 85 ED C7 34 08 36 98 17 FE 4E 26
       data hash MD5: 32K
       F9 A6 44 59 01 3D B2 69 AB 68 C6 30 21 FA D3 B1>)
(   2,<2024-08-07 14:54:01.98 +0400>,<she>,<DPX200>,
      <Start of raw data processing
       efp BC_mod = 2 LB = 1.5 FT_mod = 6 PKNL = 1 PHC0 = 2284.341 PHC1 = 1016.888 SI = 64K 
       data hash MD5: 64K
       38 27 EB DC 84 A4 3A B2 4B 26 8E 52 09 C2 99 D1>)
(   3,<2024-08-07 14:54:33.50 +0400>,<she>,<DPX200>,
      <pk PHC0 = 399.9346 PHC1 = -922.4 
       data hash MD5: 64K
       77 6D 14 14 AA 33 3B 0C 1C CB 4E 1C 06 D3 6D 48>)
(   4,<2024-08-07 14:54:37.03 +0400>,<she>,<DPX200>,
      <abs ABSG = 5 
       data hash MD5: 64K
       17 2B FF 65 B6 E5 6F 01 2F DE 40 4F 92 7F 1F D6>)
$$ ##END=
$$ 
$$ hash MD5
$$ DD 37 9B 64 36 DB EB D7 2C 89 0F 64 01 5F 11 EC
##$RELAX= 
##$RELAX= 
##$RELAX= 
##$RELAX= 
##$RELAX= 
##$RELAX= 
##$RELAX= 
##$RELAX= 
$$ Bruker specific parameters
$$ --------------------------
##$DU= <F:/spectra>
##$EXPNO= 2
##$NAME= <P31>
##$PROCNO= 1
##$TYPE= <nmr>
##$USER= <she>
##$AMP= (0..31)
100 100 100 100 100 100 100 100 100 100 100 100 100 100 100 100 100 100 
100 100 100 100 100 100 100 100 100 100 100 100 100 100 
##$AQSEQ= 0
##$AQ_mod= 1
##$AUNM= <au_zg>
##$AUTOPOS= <>
##$BF1= 81.014009
##$BF2= 200.13
##$BF3= 200.13
##$BF4= 200.13
##$BF5= 200.13
##$BF6= 200.13
##$BF7= 200.13
##$BF8= 200.13
##$BYTORDA= 1
##$CFDGTYP= 0
##$CFRGTYP= 5
##$CHEMSTR= <none>
##$CNST= (0..31)
1 1 145 1 1 1 1 1 1 1 1 1 1 1 1 1 1 1 1 1 1 1 1 1 1 1 1 1 1 1 1 1 
##$CPDPRG= <waltz16>
##$CPDPRG1= <>
##$CPDPRG2= <waltz16>
##$CPDPRG3= <>
##$CPDPRG4= <mlev>
##$CPDPRG5= <mlev>
##$CPDPRG6= <mlev>
##$CPDPRG7= <mlev>
##$CPDPRG8= <mlev>
##$CPDPRGB= <>
##$CPDPRGT= <>
##$D= (0..31)
0 1 0 0 0 0 0 0 0 0.06 0 0.03 2e-05 3e-06 0 0 0.0002 0 0 0 0 0 0 0 0 0 
0 0 0 0 0 0 
##$DATE= 1723028035
##$DBL= (0..7)
120 120 120 11 120 120 24 19 
##$DBP= (0..7)
150 150 150 150 150 150 150 150 
##$DBP07= 0
##$DBPNAM0= <>
##$DBPNAM1= <>
##$DBPNAM2= <>
$$ [...]
##$SUBNAM3= <"">
##$SUBNAM4= <"">
##$SUBNAM5= <"">
##$SUBNAM6= <"">
##$SUBNAM7= <"">
##$SUBNAM8= <"">
##$SUBNAM9= <"">
##$SW= 400.765351723535
##$SWIBOX= (0..15)
0 1 3 0 0 0 0 0 0 0 0 0 0 0 0 0 
##$SW_h= 32467.5324675325
##$TD= 32768
##$TD0= 1
##$TE= 0
##$TE2= 300
##$TE3= 300
##$TEG= 300
##$TL= (0..7)
0 120 53 12 22 120 120 120 
##$TP= (0..7)
150 150 150 150 150 150 150 150 
##$TP07= 0
##$TPNAME0= <>
##$TPNAME1= <>
##$TPNAME2= <>
##$TPNAME3= <>
##$TPNAME4= <>
##$TPNAME5= <>
##$TPNAME6= <>
##$TPNAME7= <>
##$TPOAL= (0..7)
0.5 0.5 0.5 0.5 0.5 0.5 0.5 0.5 
##$TPOFFS= (0..7)
0 0 0 0 0 0 0 0 
##$TUNHIN= 0
##$TUNHOUT= 0
##$TUNXOUT= 0
##$USERA1= <user>
##$USERA2= <user>
##$USERA3= <user>
##$USERA4= <user>
##$USERA5= <user>
##$V9= 5
##$VALIST= <valist>
##$VCLIST= <CCCCCCCCCCCCCCC>
##$VD= 0
##$VDLIST= <DDDDDDDDDDDDDDD>
##$VPLIST= <PPPPPPPPPPPPPPP>
##$VTLIST= <TTTTTTTTTTTTTTT>
##$WBST= 1024
##$WBSW= 4
##$XGAIN= (0..3)
0 0 0 0 
##$XL= 0
##$YL= 0
##$YMAX_a= 42022
##$YMIN_a= -37165
##$ZGOPTNS= <>
##$ZL1= 120
##$ZL2= 120
##$ZL3= 120
##$ZL4= 120
##$ABSF1= 198.0616
##$ABSF2= -202.7028
##$ABSG= 5
##$ABSL= 3
##$ALPHA= 0
##$AQORDER= 0
##$ASSFAC= 0
##$ASSFACI= 0
##$ASSFACX= 0
##$ASSWID= 0
##$AUNMP= <proc_1d>
##$AZFE= 0.1
##$AZFW= 0.5
##$BCFW= 0
##$BC_mod= 2
##$BYTORDP= 0
##$COROFFS= 0
##$CY= -3
##$DATMOD= 1
##$DC= 0
##$DFILT= <>
##$DTYPP= 0
##$F1P= 0
##$F2P= 0
##$FCOR= 1
##$FTSIZE= 65536
##$FT_mod= 6
##$GAMMA= 0
##$GB= 0
##$INTBC= 1
##$INTSCL= 9.790993e-09
##$ISEN= 30
##$LB= 1.5
##$LEV0= 0
##$LPBIN= 0
##$MAXI= 10000
##$MC2= 0
##$MEAN= 0
##$ME_mod= 0
##$MI= 50
##$NCOEF= 0
##$NC_proc= -4
##$NLEV= 6
##$NOISF1= 182.463
##$NOISF2= 159.3651
##$NSP= 0
##$NTH_PI= 0
##$NZP= 0
##$OFFSET= 198.0616
##$PC= 4
##$PHC0= 2684.276
##$PHC1= 94.48798
##$PH_mod= 1
##$PKNL= yes
##$PPARMOD= 0
##$PSCAL= 0
##$PSIGN= 0
##$REVERSE= no
##$SF= 81.0140089999434
##$SI= 65536
##$SIGF1= 159.3651
##$SIGF2= -187.1042
##$SINO= 113.3802
##$SIOLD= 16384
##$SREGLST= <1H.CDCl3>
##$SSB= 0
##$STSI= 65536
##$STSR= 0
##$SW_p= 32467.5324675325
##$SYMM= 0
##$S_DEV= 0
##$TDeff= 32768
##$TDoff= 0
##$TI= <>
##$TILT= no
##$TM1= 0
##$TM2= 0
##$TOPLEV= 0
##$USERP1= <user>
##$USERP2= <user>
##$USERP3= <user>
##$USERP4= <user>
##$USERP5= <user>
##$WDW= 1
##$XDIM= 65536
##$YMAX_p= 486554496
##$YMIN_p= -797088
$$ End of Bruker specific parameters
$$ ---------------------------------
##NTUPLES= NMR SPECTRUM
##VAR_NAME=  FREQUENCY,     SPECTRUM/REAL,   SPECTRUM/IMAG
##SYMBOL=    X,             R,               I
##VAR_TYPE=  INDEPENDENT,   DEPENDENT,       DEPENDENT
##VAR_FORM=  AFFN,          ASDF,            ASDF
##VAR_DIM=   65536,         65536,           65536
##UNITS=     HZ,            ARBITRARY UNITS, ARBITRARY UNITS
##FACTOR=    0.49542278885378, 1,            1
##FIRST=     16045.7642231865, 0,            0
##LAST=      -16421.768244346, 0,            0
##MIN=       -16421.768244346, -797088,      0
##MAX=       16045.7642231865, 486554496,    0
$$ Real data points
##PAGE= N=1
##DATA TABLE= (X++(R..R)), XYDATA
$$ [...]
$$ plain form
35987 65298 153249 82561 -62691 -164938 -174778 -126396 -70931 -20638 34555 78742 71598 8980
35975 8980 -45095 -26362 31033 14889 -115113 -241687 -209838 -7136 238202 417358 515844
35964 515844 537434 466385 344036 278746 308817 336839 278892 202258 215685 285812 283659
35953 283659 180052 70823 18288 -9588 -33687 -18749 34029 56679 22444 -7880 2098
35942 2098 -7921 -92170 -195193 -223983 -176380 -131624 -145332 -206846 -270323 -279765 -192038 -24383
35930 -24383 137202 211066 184659 91387 -34400 -149097 -194743 -153752 -83175 -53676 -76147
35919 -76147 -116716 -148791 -156017 -125596 -84433 -102886 -208019 -324147 -356501 -308400 -258071
35908 -258071 -244801 -245043 -245436 -265300 -302823 -322632 -307718 -271046 -209978 -107960 4250 50178
$$ packed form
35987F5298Q7951p0688j45252j02247r840M8382N5465N0293N5193M4187p144o2618
35975H980n4075J8733N7395j6144j30002j26574L1849K02702K45338J79156R8486
35964E15844K1590p1049j22349o5290L0071K8022n7947p6634J3427P0127k153
35953B83659j03607j09229n2535k7876k4099J4938N2778K2650l4235l0324R978
35942B098j0019q4249j03023k8790M7603M4756j3708o1514o3477r442Q7727J67655
35930b4383J61585P3864k6407r3272j25787j14697m5646M0991P0577K9499k2471
35919g6147m0569l2075p226L0421M1163j8453j05133j16128l2354M8101N0329
35908b58071J3270k42l93j9864l7523j9809J4914L6672O1068J02018J12210M5928
$$ plain form
35896 50178 2833 -68180 -83723 -57441 -70048 -157726 -265096 -312401 -287074 -258313 -303294
35885 -303294 -421498 -529052 -544997 -473755 -386893 -332361 -287907 -206430 -81359 45927 126622
35874 126622 137962 87880 4295 -79869 -143722 -189218 -232068 -272603 -275483 -196412 -44846
35863 -44846 95487 139813 95246 49028 59045 93218 94689 67766 60499 81535 78013 3740
35851 3740 -111752 -174692 -113599 37453 153924 146610 64165 26278 56007 46406 -76282
35840 -76282 -226186 -259243 -157583 -38143 2770 -19515 -41471 -41591 -50772 -109561 -218702
35829 -218702 -305646 -262694 -70833 129606 161193 12067 -142514 -137937 12589 167012
35819 167012 216180 162994 80909 36675 41737 55645 41175 16297 32937 106253 191331 230618
$$ packed form
35896E0178m7345p1013j5543K6282j2607q7678j07370m7305K5327K8761m4981
35885c03294j18204j07554j5945P1242Q6862N4532M4454Q1477J25071J27286Q0695
35874A26622J1340n0082q3585q4164o3853m5496m2850m0535k880P9071J51566
35863d4846J40333M4326m4567m6218J0017L4173J471k6923p267K1036l522p4273
35851C740j15492o2940O1093J51052J16471p314q2445l7887K9729r601j22688
35840g6282j49904l3057J01660J19440M0913k2285k1956j20r181n8789j09141
35829b18702q6944M2952J91861K00439L1587j49126j54581M577J50526J54423
35819A67012M9168n3186q2085m4234N062J3908j4470k4878J6640P3316Q5078L9287
$$ plain form
35807 230618 199606 112505 16747 -24981 9466 62496 53078 -29765 -130319 -208692 -258572
35796 -258572 -253106 -160204 -29707 24138 -30744 -94682 -85113 -54376 -83986 -133075 -97420 15380
35784 15380 78133 11273 -131561 -256688 -329462 -357886 -350083 -329571 -343116 -408078 -478654
35773 -478654 -498353 -465458 -418074 -375042 -328503 -289086 -299509 -384167 -502683 -577425 -566546
35762 -566546 -490774 -386849 -266461 -143445 -68792 -87478 -166936 -219737 -204874 -161464 -136179
35751 -136179 -130881 -134599 -144981 -133954 -59696 51306 107203 85486 83076 156486 195163 67869
35739 67869 -164223 -317892 -339665 -333471 -338161 -253915 -51649 103466 54829 -121588 -219521
35728 -219521 -163839 -51151 25431 64102 75257 33725 -60501 -157790 -231233 -312345 -418378
$$ packed form
35807B30618l1012q7101r5758m1728L4447N3030r418q2843j00554p8373m9880
35796b58572N466R2902J30497N3845n4882o3938R569L0737k9610m9089L5655J12800
35784A5380O2753o6860j42834j25127p2774k8424P803K0512j3545o4962p0576
35773d78654j9699L2895M7384M3032M6539L9417j0423q4658j18516p4742J0879
35762e66546P5772J03925J20388J23016P4653j8686p9458n2801J4863M3410K5285
35751a36179N298l718j0382J1027P4258J11002N5897k1717k410P3410L8677j27294
35739F7869k32092j53669k1773O194m690Q4246K02266J55115m8637j76417r7933
35728b19521N5682J12688P6582L8671J1155m1532r4226r7289p3443q1112j06033
$$ plain form
35717 -418378 -492294 -460905 -332447 -198830 -138959 -139501 -126630 -76445 -64919 -167064 -318983
35706 -318983 -356304 -224353 -76687 -91445 -240082 -332732 -268855 -136113 -54337 -31477 -16754
35695 -16754 -1045 8915 50976 152373 238349 178467 -61110 -355280 -524420 -484611 -300283
35684 -300283 -109757 2096 65222 151062 248732 262099 147835 -1544 -63721 -33987 -956
35673 -956 -4102 -980 23310 6031 -92912 -207704 -243687 -201990 -169611 -201398 -263257 -289161
35661 -289161 -249410 -156458 -43669 42949 60071 1034 -90452 -150432 -133517 -27513 140265
35650 140265 296403 355232 302214 231414 248584 329520 331936 182437 -620 -36433 91688
35639 91688 218524 209961 112507 57308 89637 156047 208666 243197 256183 242080 230724 259542
$$ packed form
35717d18378p3916L1389J28458J33617N9871n42J2871N0185J1526j02145j51919
35706c18983l7321J31951J47666j4758j48637r2650O3877J32742Q1776K2860J4723
35695a6754J5709R960M2061J01397Q5976n9882k39577k94170j69140L9809J84328
35684c00283J90526J11853O3126Q5840R7670J3367j14264j49379o2177K9734L3031
35673i56l146L122K4290j7279r8943j14792l5983M1697L2379l1787o1859k5904
35661b89161L9751R2952J12789Q6618J7122n9037r1486n9980J6915J06004J67778
35650A40265J56138N8829n3018p0800J7170Q0936K416j49499j83057l5813J28121
35639I1688J26836q563r7454n5199L2329O6410N2619L4531J2986j4103j1356K8818
$$ plain form
35627 259542 300556 276006 159899 9927 -111835 -190102 -215613 -167579 -72277 -8326 188
35616 188 33842 153613 281069 292028 199048 139647 182357 241057 208825 93376 -25864
35605 -25864 -106435 -146016 -125813 -30685 82977 110185 14387 -113279 -139838 -26004 139236
35594 139236 234774 223959 169750 144828 149399 129514 57601 -32716 -87997 -84639 -35828 24552
35582 24552 59576 58189 55017 90934 139944 113184 -30618 -206902 -285134 -237572 -158647 -131022
35570 -131022 -126705 -72228 32247 114929 136582 127997 110630 43133 -106117 -273607 -351539
35559 -351539 -311572 -217509 -119508 -8879 105740 160220 126823 82405 116127 211739 291137
35548 291137 332793 359917 344816 238301 92415 34329 88439 136728 105754 80904 153243
$$ packed form
35627B59542M1014k4550j16107j49972j21762p8267k5511M8034R5302O3951Q514
35616A88L3654J19771J27456J0959r2980n9401M2710N8700l2232j15449j19240
35605b5864q0571l9581K0203R5128J13662K7208r5798j27666k6559J13834J65240
35594A39236R5538j0815n4209k4922M571j9885p1913r0317n5281L358M8811O0380
35582B4552L5024j387l172L5917M9010k6760j43802j76284p8232M7562P8925K7625
35570a31022M317N4477J04475Q2682K1653q585j7367o7497j49250j67490p7932
35559c51539L9967R4063R8001J10629J14619N4480l3397m4418L3722R5612P9398
35548B91137M1656K7124j5101j06515j45886n8086N4110M8289l0974k4850P2339
$$ plain form
35537 153243 250602 235604 111903 11808 7139 47603 78212 105163 131455 128741 103376
35526 103376 106126 143975 160266 137450 139699 203612 259438 225605 123840 29034 -49530 -156500
35514 -156500 -287784 -383259 -416539 -416437 -392147 -309809 -170712 -55582 -48965 -145712 -258309
35503 -258309 -296291 -227478 -97907 -15887 -77835 -264260 -426674 -424072 -272421 -123944 -99219
35492 -99219 -177186 -252971 -255196 -183378 -75860 13329 32520 -19128 -68692 -44149 28578 54633
35480 54633 3562 -45008 -14261 68525 127521 145940 156770 160191 126118 70236 51859 82666
35468 82666 102060 66953 8618 -32508 -75853 -155590 -241533 -262073 -197017 -102012 -37598 -9224
35456 -9224 10897 28005 15475 -38219 -92739 -92851 -47705 -38033 -111197 -199216 -199766 -124600 -87976
$$ packed form
35537A53243R7359j4998j23701j00095m669M0464L0609K6951K6292k714k5365
35526A03376K750L7849J6291k2816K249O3913N5826l3833j01765r4806p8564j06970
35514a56500j31284r5475l3280J02K4290Q2338J39097J15130O617r6747j12597
35503b58309l7982O8813J29571Q2020o1948j86425j62414K602J51651J48477K4725
35492i9219p7967p5785k225P1818J07518Q9189J9191n1648m9564K4543P2727K6055
35480E4633n1071m8570L0747Q2786N8996J8419J0830L421l4073n5882j8377L0807
35468H2666J9394l5107n8335m1126m3345p9737q5943k0540O5056R5005O4414K8374
35456i224K0121J7108j2530n3694n4520j12M5146R672p3164q8019n50P5166L6624
$$ plain form
35443 -87976 -133758 -164032 -91821 14014 21741 -73934 -155127 -158469 -150717 -209508 -310611 -373037
35431 -373037 -362541 -310186 -259769 -226262 -187917 -110747 -5707 45009 -30458 -177103 -237559
35420 -237559 -123373 86097 248471 313294 329539 345687 364766 374293 359724 297572 187054
35409 187054 80110 27912 4527 -57322 -153360 -198177 -149404 -75646 -56942 -69620 -31654
35398 -31654 68127 159508 208435 271162 394117 509748 496495 339273 174705 145394 236563
35387 236563 299517 234017 100457 24381 25550 -1676 -136538 -316761 -409897 -364583 -240034
35376 -240034 -98704 63724 254262 403998 421813 321652 233125 255240 339016 357261
35366 357261 267745 154172 106535 117519 123374 101071 75941 55459 14775 -43600 -65321
$$ packed form
35443h7976m5782l0274P2211J05835P727r5675q1193l342P752n8791j01103o2426
35431c73037J0496N2355N0417L3507L8345P7170J05040N0716p5467j46645o0456
35420b37559J14186K09470J62374O4823J6245J6148J9079R527j4569o2152j10518
35409A87054j06944n2198k3385o1849r6038m4817M8773P3758J8704j2678L7966
35398c1654R9781R1381M8927O2727J22955J15631j3253j57222j64568k9311R1169
35387B36563O2954o5500j33560p6076J169k7226j34862j80223r3136M5314J24549
35376b40034J41330J62428J90538J49736J7815j00161q8527K2115Q3776J8245
35366C57261q9516j13573m7637J0984N855k2303k5130k0482m0684n8375k1721
$$ plain form
35355 -65321 -10360 81791 125276 77072 -31345 -143435 -228914 -282071 -297843 -269304 -197854
35344 -197854 -93428 23167 106220 96472 -18428 -162128 -232248 -216054 -199799 -239161 -271572
35333 -271572 -211218 -92527 -36858 -81062 -125905 -80655 19368 85121 95200 83030 59109
35322 59109 22354 9717 51168 97789 76756 2677 -49319 -67117 -101007 -144450 -129530 -59367
35310 -59367 -22482 -30794 32083 226750 439063 545255 590287 673623 745655 679378 497421
35299 497421 355504 306210 244045 105552 -36822 -127112 -215913 -317685 -316317 -128676 132850
35288 132850 281142 276212 218870 173807 113986 20175 -67534 -103206 -72997 13889 116295
35277 116295 162304 119420 45553 14995 20745 10145 -18563 -32341 -45004 -91937 -140074 -119389
$$ packed form
35355f5321N4961R2151M3485m8204j08417j12090q5479n3157j5772K8539P1450
35344a97854J04426J16595Q3053r748j14900j43700p0120J6194J6255l9362l2411
35333b71572O0354J18691N5669m4204m4843M5250J00023O5753J0079j2170k3921
35322E9109l6755j2637M1451M6621k1033p4079n1996j7798l3890m3443J4920P0163
35310e9367L6885q312O2877J94667K12313J06192M5032Q3336P2032o6277j81957
35299D97421j41917m9294o2165j38493j42374r0290q8801j01772J368J87641K61526
35288A32850J48292m930n7342m5063n9821r3811q7709l5672L0209Q6886J02406
35277A16295M6009m2884p3867l0558N750j0600k8708j3778j2663m6933m8137K0685
$$ plain form
35265 -119389 -42490 497 -28116 -81340 -132602 -207843 -285214 -271310 -135663 17330 79249
35254 79249 75349 104960 197410 293938 333903 299444 207391 110737 78496 124853 185416 203969
35242 203969 204899 232327 260231 228153 140335 64174 42010 59713 92927 132058 164598 175307
35230 175307 161155 117266 26383 -104303 -221239 -278787 -287158 -264433 -182443 -25585 130531
35219 130531 183502 137621 94990 115722 163118 188098 184693 149518 70418 -20489 -62606 -64339
35207 -64339 -102364 -187389 -221982 -150703 -62678 -59810 -99557 -79500 -26208 -66200 -218250 -349111
35195 -349111 -368465 -349060 -385891 -428995 -352653 -141261 92716 260144 370861 447381 452990
35184 452990 356006 208381 95854 34614 -22967 -89486 -113425 -65732 -4015 -14337 -114114
$$ packed form
35265a19389P6899M2987k8613n3224n1262p5241p7371J3904J35647J52993O1919
35254G9249l900K9611R2450R6528L9965l4459r2053r6654l2241M6357O0563J8553
35242B03969R30K7428K7904l2078q7818p6161k2164J7703L3214L9131L2540J0709
35230A75307j4152m3889r0883j30686j16936n7548q371K2725Q1990J56858J56116
35219A30531N2971m5881m2631K0732M7396K4980l405l5175p9100r0907m2117j733
35207f4339l8025q5025l4593P1279Q8025K868l9747K0057N3292l9992j52050j30861
35195c49111j9354J9405l6831m3104P6342K11392K33977J67428J10717P6520N609
35184D52990r6984j47625j12527o1240n7581o6519k3939M7693O1717j0322r9777
$$ plain form
35173 -114114 -241189 -319942 -313536 -232389 -124603 -48356 -24987 -24891 -19165 -26680 -77519 -144858
35161 -144858 -157066 -79314 51402 173891 252084 276608 255565 213565 170910 118839 42269
35150 42269 -39048 -91777 -125317 -173096 -216053 -194086 -116327 -85585 -161867 -260889 -255689 -140574
35138 -140574 -23872 18105 7568 -4110 -324 14381 31594 26044 -26390 -99591 -127318 -82465
35126 -82465 -12159 26402 36243 63589 126642 178522 139771 -22427 -231568 -340638 -276470
35115 -276470 -136059 -85596 -159692 -220842 -138802 50004 201788 234821 187073 136220 118670
35104 118670 118289 93383 20277 -62742 -75264 5981 91601 72686 -43117 -138658 -121669 494
35092 494 171221 339885 454256 468219 394375 301004 224265 129777 -5561 -127730 -172722
$$ packed form
35173a14114j27075p8753O406Q1147J07786P6247K3369R6N726p515n0839o7339
35161a44858j2208P7752J30716J22489P8193K4524k1043m2000m2655n2071p6570
35150D2269q1317n2729l3540m7779m2957K1967P7759L0742p6282r9022N200J15115
35138a40574J16702M1977j0537j1678L786J4705J7213n550n2434p3201k7727M4853
35126h2465P0306L8561R841K7346O3053N1880l8751j62198k09141j09070O4168
35115b76470J40411N0463p4096o1150Q2040J88806J51784L3033m7748n0853j7550
35104A18670l81k4906p3106q3019j2522Q1245Q5620j8915j15803r5541J6989J22163
35092D94J70727J68664J14371J3963p3844r3371p6739r4488j35338j22169m4992
$$ plain form
35081 -172722 -156153 -137529 -131244 -118698 -118447 -164417 -226761 -238073 -202189 -193672 -232253 -242678
35069 -242678 -174578 -82668 -36472 -20889 9335 37522 24871 -5119 -8102 -9963 -60024 -111827
35057 -111827 -58577 102863 247520 291443 285400 291237 266647 160416 45454 40366 131701
35046 131701 192347 176245 178368 268515 374080 397706 367082 370166 393685 343867 217902
35035 217902 132885 150610 182853 138369 71093 80879 132204 101870 -15201 -87423 -53548
35024 -53548 -13654 -55688 -111975 -81514 -2376 12037 -50592 -105437 -113265 -102017 -67090 26931
35012 26931 141646 180204 133557 110374 186318 309225 385933 381922 306731 188064 94117
35001 94117 90439 134069 105330 -8867 -71323 -640 94450 88356 42637 100299 246106 326618
$$ packed form
35081a72722J6569J8624O285J2546K51m5970o2344j1312L5884Q517l8581j0425
35069b42678O8100R1910M6196J5583L0224K8187j2651k9990k983j861n0061n1803
35057a11827N3250J61440J44657M3923o043N837k4590j06231j14962n088R1335
35046A31701O0646j6102K123R0147J05565K3626l0624L084K3519m9818j25965
35035B17902q5017J7725L2243m4484o7276R786N1325l0334j17071p2222L3875
35024e3548L9894m2034n6287L0461P9138J4413o2629n4845p828J1248L4927R4021
35012B6931J14715L8558m6647k3183P5944J22907P6708m011p5191j18667r3947
35001I4117l678M3630k8739j14197o2456P0683R5090o094m5719N7662J45807Q0512
$$ plain form
34989 326618 281490 204064 165796 120789 23928 -73100 -109485 -122194 -193762 -324326 -404043
34978 -404043 -311402 -34321 294406 496054 503297 399971 289725 182306 58178 -27034
34968 -27034 -6218 65068 51852 -82420 -237910 -323258 -345513 -345986 -339689 -337800 -345890 -322744
34956 -322744 -223324 -93194 -27745 -25430 12866 115835 189521 173158 127167 104714 52506
34945 52506 -76292 -211395 -264553 -258512 -261960 -268673 -237156 -180960 -118202 883 200225
34934 200225 368364 372448 249162 153074 132254 89271 -26709 -119988 -83262 64208 221114
34923 221114 315348 328665 270515 176596 102572 83165 104036 118544 85483 9900 -38389
34912 -38389 14365 136859 197597 129999 35219 46780 147291 215899 214907 212837 241748 254866
$$ packed form
34989C26618m5128p7426l8268m5007r6861r7028l6385j2709p1568j30564p9717
34978d04043R2641K77081L28727K01648P243j03326j10246j07419j24128q5212
34968b7034K0816P1286j3216j34272j55490q5348k2255m73O297J889q090K3146
34956c22744R9420J30130O5449K315L8296J02969P3686j6363m5991k2453n2208
34945E2506j28798j35103n3158O041l448o713L1517N6196O2758J19085J99342
34934B00225J68139M084j23286r6088k0820m2983j15980r3279L6726J47470J56906
34923B21114R4234J3317n8150r3919p4024j9407K0871J4508l3061p5583m8289
34912c8389N2754J22494O0738o7598r4780J1561J00511O8608r92k070K8911J3118
$$ plain form
34900 254866 231061 207014 190115 146706 93931 92549 124940 97548 2019 -46298 13716 87974
34888 87974 75561 10084 -33710 -73541 -150343 -204078 -144221 -1675 107148 147660 190892
34877 190892 272392 324609 271659 125692 -31649 -121328 -114291 -45291 15280 27495 13962
34866 13962 13983 38789 97803 220114 393588 517342 486586 319747 145455 62302 56417
34855 56417 57631 31114 -3732 -22753 -45882 -121261 -243363 -309161 -214524 2628 186807
34844 186807 253050 268354 306206 316689 220945 55347 -79052 -152633 -187570 -154131 -11926
34833 -11926 169869 260189 234508 186931 177671 183552 200773 263268 329676 285475 118344 -21870
34821 -21870 -15096 68543 84337 17272 -20272 47432 178114 275152 278827 211172 160926 194179
$$ packed form
34900B54866k3805k4047j6899m3409n2775j382L2391k7392r5529m8317O0014P4258
34888H7974j2413o5477m3794l9831p6802n3735N9857J42546J08823M0512M3232
34877A90892Q1500N2217n2950j45967j57341q9679P037O9000O0571J2215j3533
34866A3962K1K4806N9014J22311J73474J23754l0756j66839j74292q3153n885
34855E6417J214k6517l4846j9021k3129p5379j22102o5798R4637K17152J84179
34844A86807O6243J5304L7852J0483r5744j65598j34399p3581l4937L3439J42205
34833a1926J81795R0320k5681m7577r260N881J7221O2495O6408m4201j67131j40214
34821b1870O774Q3639J5794o7065l7544O7704J30682R7038L675o7655n0246L3253
$$ plain form
34809 194179 260219 235422 85556 -77275 -134950 -92869 -23186 45897 113301 141876 102995
34798 102995 49332 58297 121632 163643 152443 122785 99270 65819 14119 -30136 -33889 19766
34786 19766 115465 182753 131382 -36050 -184716 -188019 -79271 3895 -5845 -65516 -125090
34775 -125090 -171481 -181278 -134797 -84491 -106811 -167485 -139267 11528 158824 188626 140286
34764 140286 105890 75648 -19912 -166553 -262045 -233329 -87471 122849 308918 356553 231300
34753 231300 72189 76944 263013 430433 411065 276408 221189 295504 358391 291721 152593
34742 152593 68080 62704 71699 74670 109363 159616 143954 54747 7365 78316 177741 181874
34730 181874 128239 150716 249836 274117 147789 -20104 -102838 -108938 -98168 -59719 25361
$$ packed form
34809A94179O6040k4797j49866j62831n7675M2081O9683O9083O7404K8575l8881
34798A02995n3663Q965O3335M2011j1200k9658k3515l3451n1700m4255l753N3655
34786A9766R5699O7288n1371j67432j48666l303J08748Q3166r740n9671n9574
34775a25090m6391r797M6481N0306k2320o0674K8218J50795J47296K9802m8340
34764A40286l4396l0242r5560j46641r5492K8716J45858K10320J86069M7635j25253
34753B31300j59111M755J86069J67420j9368j34657n5219P4315O2887o6670j39128
34742A52593q4513n376Q995K971L4693N0253j5662q9207m7382P0951R9425M133
34730A81874n3635K2477R9120K4281j26328j67893q2734o100J0770L8449Q5080
$$ plain form
34719 25361 89367 63012 -3075 -16932 847 -34796 -101778 -85479 30338 118450 87279
34708 87279 -5863 -63429 -68844 -46569 3327 59435 47743 -56468 -148283 -102747 63232
34697 63232 212205 246210 176328 54573 -83872 -210875 -309610 -403584 -527260 -654718
34687 -654718 -708151 -655059 -552416 -473214 -428695 -388564 -343879 -316480 -323315 -357031 -391523
34676 -391523 -391442 -331976 -227956 -131865 -86428 -89110 -116436 -165814 -247150 -340792 -396663 -387770
34664 -387770 -344553 -316721 -308667 -273684 -176286 -42329 65958 111605 99983 45686 -42132
34653 -42132 -133743 -176463 -148797 -96660 -84104 -120663 -167283 -197842 -211533 -191664 -108896 16083
34641 16083 101942 96191 47659 50537 126811 196637 166074 25479 -137633 -210684 -146604 1968
$$ packed form
34719B5361O4006k6355o6087j3857J7779l5643o6982J6299J15817Q8112l1171
34708H7279r3142n7566n415K2275M9896N6108j1692j04211r1815M5536J65979
34697F3232J48973L4005o9882j21755j38445j27003r8735r3974j23676j27458
34687f54718n3433N3092J02643P9202M4519M0131M4685K7399o835l3716l4492
34676c91523Q1N9466J04020R6091M5437k682k7326m9378q1336r3642n5871Q893
34664c87770M3217K7832Q054L4983R7398J33957J08287M5647j1622n4297q7818
34653d2132r1611m2720K7666N2137J2556l6559m6620l0559j3691J9869Q2768J24979
34641A6083Q5859n751m8532K878P6274O9826l0563j40595j63112p3051O4080J48572
$$ plain form
34629 1968 135310 194505 195653 189938 212019 260387 294913 253302 111641 -62213 -162244
34618 -162244 -168267 -164562 -210377 -255894 -232234 -158279 -88586 -15030 88075 167807 154206 93592
34606 93592 95998 150737 127658 -10390 -129433 -114230 -14826 69782 139226 227584 293939
34595 293939 294113 282508 316765 324257 201804 8312 -84926 -21326 95803 175298 217452
34584 217452 218352 142978 28049 -20821 19043 56782 50590 70848 143399 169081 91364 19543
34572 19543 68951 181246 233689 243751 319995 465039 576317 612469 612943 566354 414216
34561 414216 205716 101267 164104 263606 256924 176188 154837 234030 332182 375907 376804 373707
34549 373707 362269 315916 249988 217412 220518 165060 -32068 -288799 -399494 -279907 -89521
$$ packed form
34629A968J33342N9195J148n715K2081M8368L4526m1611j41661j73854j00031
34618a62244o023L705m5815m5517K3660P3955O9693P3556J03105P9732j3601o0614
34606I3592K406N4739k3079j38048j19043J5203R9404Q4608O9444Q8358O6355
34595B93939J74j1605L4257P492j22453j93492r3238O3600J17129P9495M2154
34584B17452R00p5374j14929m8870L9864L7739o192K0258P2551K5682p7717p1821
34572A9543M9408J12295N2443J0062P6244J45044J11278L6152M74m6589j52138
34561D14216k08500j04449O2837R9502o682q0736k1351P9193R8152M3725Q97l097
34549C73707j1438m6353o5928l2576L106n5458j97128k56731j10695J19587J90386
$$ plain form
34538 -89521 -25065 -62455 -27809 116488 215300 165931 64694 43313 89171 126377 174738
34527 174738 300497 460133 523842 455059 363839 354370 391472 359771 216566 44572 -40212
34516 -40212 -8168 65698 93402 60838 11509 -27310 -62604 -93915 -104477 -95951 -83905 -53577
34504 -53577 28247 147963 246903 301215 339393 363500 326717 224706 133516 99277 56559
34493 56559 -68126 -218996 -263459 -164236 -25974 26113 -42871 -182331 -313745 -372825 -335528
34482 -335528 -223990 -83596 39173 103730 101605 87293 132202 223257 263067 204725 121126
34471 121126 89541 79180 32145 -7378 46495 163763 218864 171847 122405 154855 219572
34460 219572 219231 151318 102428 121033 146249 83495 -56478 -127655 -4920 236145 372113
$$ packed form
34538h9521O4456l7390L4646J44297R8812m9369j01237k1381M5858L7206M8361
34527A74738J25759J59636O3709o8783r1220r469L7102l1701j43205j71994q4784
34516d0212L2044P3866K7704l2564m9329l8819l5294l1311j0562Q526J2046L0328
34504e3577Q1824J19716R8940N4312L8178K4107l6783j02011r1190l4239m2718
34493E6559j24685j50870m4463R9223J38262N2087o8984j39460j31414n9080L7297
34482c35528J11538J40394J22769O4557k125j4312M4909R1055L9810n8342q3599
34471A21126l1585j0361m7035l9523N3873J17268N5101m7017m9442L2450O4717
34460B19572l41o7913m8890J8605K5216o2754j39973p1177J22735K41065J35968
$$ plain form
34449 372113 295371 141486 90420 126898 105103 -8617 -93677 -62825 34058 110919 150446
34438 150446 185116 248956 355303 453849 428600 231713 -889 -83618 -21013 18732 -32058
34427 -32058 -67144 -32659 -46836 -197982 -371907 -407578 -316638 -220543 -158014 -90560 -35192
34416 -35192 -52151 -130817 -203875 -249677 -276438 -236417 -73791 152819 308933 352812 368166
34405 368166 417727 459264 433685 353925 264285 168988 46084 -96084 -208058 -239598 -187976
34394 -187976 -109883 -66940 -51192 -1788 87193 133875 86930 15732 12505 53572 44774 -27649
34382 -27649 -88752 -104898 -122213 -164454 -184137 -147088 -94880 -83505 -106356 -110501 -59296 38488
34370 38488 135600 176323 146795 94688 73185 77853 71569 52333 52118 84629 141305 222721
$$ packed form
34449C72113p6742j53885n1066L6478k1795j13720q5060L0852R6883P6861L9527
34438A50446L4670O3840J06347R8546k5249j96887k32602q2729O2605L9745n0790
34427c2058l5086L4485j4177j51146j73925l5671R0940R6095O2529O7454N5368
34416c5192j6959p8666p3058m5802k6761M0021J62626K26610J56114M3879J5354
34405C68166M9561M1537k5579p9760q9640r5297j22904j42168j11974l1540N1622
34394a87976P8093M2943J5748M9404Q8981M6682m6945p1198l227M1067q798p2423
34382b7649o1103j6146j7315m2241j9683L7049N2208J1375k2851m145N1205R7784
34370C8488R7112M0723k9528n2107k1503M668o284j9236k15L2511N6676Q1416
$$ plain form
34358 222721 322643 396286 398842 343483 272214 192872 103306 46878 66544 126397 163352 195151
34346 195151 276496 361276 330463 172216 12013 -72056 -142286 -252806 -328200 -282648 -169266
34335 -169266 -104694 -106155 -108895 -101434 -129482 -178750 -164358 -59868 47227 70731 42225 62610
34323 62610 160702 249172 232094 125700 38424 34991 64020 44334 -19891 -61633 -60656 -62437
34311 -62437 -93020 -123552 -129235 -120763 -101753 -54670 11867 59326 82636 118852 170466 181545
34299 181545 119994 27386 -40838 -66892 -37616 68442 218798 318271 314724 260208 222288
34288 222288 195444 152247 117099 119093 122358 77030 2916 -43973 -54378 -53852 -46166 -34362
34276 -34362 -59597 -144070 -226238 -233178 -196446 -211470 -286355 -310871 -190583 42726 261671
$$ packed form
34358B22721R9922P3643K556n5359p1269p9342q9566n6428J9666N9853L6955L1799
34346A95151Q1345Q4780l0813j58247j60203q4069p0230j10520p5394M5552J13382
34335a69266O4572j461k740P461k8048m9268J4392J04490J07095K3504k8506K0385
34323F2610R8092Q8470j7078j06394q7276l433K9029j9686o4225m1742R77j781
34311f2437l0583l0532n683Q472J9010M7083O6537M7459K3310L6216N1614J1079
34299A81545o1551r2608o8224k6054K9276J06058J50356R9473l547n4516l7920
34288B22288k6844m3197l5148J994L265m5328p4114m6889j0405N26P686J1804
34276c4362k5235q4473q2168o940L6732j5024p4885k4516J20288K33309K18945
$$ plain form
34265 261671 341134 233823 4149 -206323 -288840 -250460 -168221 -85915 757 79434 103899
34254 103899 49920 -49033 -129429 -145521 -101535 -50337 -38522 -45114 -13216 53278 91332 94939
34242 94939 137061 226364 246126 126373 -14821 -23424 64126 83831 -9081 -102701 -121449
34231 -121449 -109597 -112428 -110146 -96015 -98205 -93479 -15807 112556 171261 107209 4403 -56915
34219 -56915 -101990 -162722 -182527 -103700 25275 110483 129792 129211 150867 211837 302264 364711
34207 364711 333688 230031 147952 117686 69449 -22462 -66516 -2846 71542 30475 -99727
34196 -99727 -196726 -227789 -263341 -334327 -388255 -383781 -338813 -283500 -240063 -244892 -316268 -397639
34184 -397639 -399471 -305354 -185565 -107532 -83788 -102793 -153291 -209028 -232668 -208032 -150132
$$ packed form
34265B61671P9463j07311k29674k10472q2517L8380Q2239Q2306Q6672P8677K4465
34254A03899n3979r8953q0396j6092M3986N1198J1815o592L1898O6494L8054L607
34242I4939M2122Q9303J9762j19753j41194q603Q7550J9705r2912r3620j8748
34231a21449J1852k831K282J4131k190M726P7672J28363N8705o4052j02806o1318
34219e6915m5075o0732j9805P8827J28975Q5208J9309n81K1656O0970R0427O2447
34207C64711l1023j03657q2079l0266m8237r1911m4054O3670P4388m1067j30202
34196i9727r6999l1063l5552p0986n3928M474M4968N5313M3437m829p1376q1371
34184c97639j832R4117J19789P8033K3744j9005n0498n5737k3640K4636N7900
$$ plain form
34173 -150132 -91500 -72156 -113588 -179113 -198099 -159466 -133831 -165101 -200234 -183947 -159445
34162 -159445 -191998 -243053 -220474 -125543 -48085 -27021 -13680 26415 67907 89870 101403
34151 101403 92432 37947 -37672 -75418 -68276 -57158 -37902 38451 158790 233105 211775 133064
34139 133064 32112 -101204 -239527 -296195 -244410 -170208 -142492 -111561 -7286 140441
34129 140441 262247 360356 463776 527075 478283 336025 182090 43419 -97189 -190392
34119 -190392 -138996 50278 232645 285770 232612 162684 98658 5628 -103090 -141239 -45707
34108 -45707 131384 250172 215623 84823 19821 112891 279777 358151 290444 162328 74844
34097 74844 42009 23492 -2979 -30389 -40176 -5704 82981 175765 188699 103156 -7092 -82895
$$ packed form
34173a50132N8632J9344m1432o5525j8986L8633K5635l1270l5133J6287K4502
34162a59445l2553n1055K2579R4931P7458K1064J3341M0095M1492K1963J1533
34151A01403q971n4485p5619l7746P142J1118J9256P6353J20339P4315k1330p8711
34139A33064j00952j33316j38323n6668N1785P4202K7716L0931J04275J47727
34129A40441J21806R8109J03420O3299m8792j42258j53935j38671j40608r3203
34119a90392N1396J89274J82367N3125n3158o9928o4026r3030j08718l8149R5532
34108d5707J77091J18788l4549j30800o5002R3070J66886P8374o7707j28116q7484
34097G4844l2835j8517k6471k7410r787L4472Q8685R2784J2934q5543j10248p5803
$$ plain form
34085 -82895 -157195 -265056 -329425 -237164 -20475 141956 138975 59432 57148 150175 231017
34074 231017 237319 219049 230703 237746 171725 34739 -95577 -149637 -124482 -68258 -30808
34063 -30808 -27207 -33919 -22017 -1505 -21154 -107943 -215290 -255274 -186044 -49085 85489
34052 85489 188686 271079 331496 343787 299748 231363 167420 91938 -21926 -153026 -249720
34041 -249720 -300659 -337746 -362532 -332006 -248802 -204472 -272690 -397116 -452445 -396590 -297538
34030 -297538 -224107 -181003 -149011 -117035 -64452 23263 109546 138038 113971 85342 41423
34019 41423 -78091 -252059 -357570 -326511 -230243 -156527 -99766 -38603 -14777 -39337 -20372
34008 -20372 94168 184615 109538 -78297 -217900 -286332 -379585 -474996 -420399 -192859 23009
$$ packed form
34085h2895p4300j07861o4369R2261K16689J62431k981p9543k284R3027Q0842
34074B31017O302j8270J1654P043o6021j36986j30316n4060K5155N6224L7450
34063c0808L601o712J1902K0512j9649q6789j07347l9984O9230J36959J34574
34052H5489J03197Q2393O0417J2291m4039o8385o3943p5482j13864j31100r6694
34041b49720n0939l7087k4786L0526Q3204M4330o8218j24426n5329N5855R9052
34030b97538P3431M3104L1992L1976N2583Q7715Q6283K8492k4067k8629m3919
34019D1423j19514j73968j05511L1059R6268P3716N6761O1163K3826k4560J8965
34008b0372J14540R0447p5077j87835j39603o8432r3253r5411N4597K27540K15868
$$ plain form
33997 23009 85101 58559 50118 37203 -27064 -77366 -42291 13482 -10384 -85453 -122578 -133632
33985 -133632 -182056 -226143 -168347 -36729 38806 33110 56870 154179 215069 151416 39238
33974 39238 1744 36966 48532 -13338 -126596 -268292 -420895 -525517 -513672 -398515 -276039
33963 -276039 -216745 -198334 -164577 -112527 -90206 -130849 -224155 -342151 -455468 -522241 -505299
33952 -505299 -426014 -366905 -381503 -423711 -411316 -340704 -277865 -240087 -161370 -1044 177239
33941 177239 276662 272334 209406 141184 106536 121027 144787 103879 -7144 -89591 -62329
33930 -62329 28350 84521 91961 99235 108342 89330 76612 135494 235937 274425 234045 205755
33918 205755 220887 185386 41045 -119982 -189203 -200781 -252366 -332326 -344036 -269567 -189404
$$ packed form
33997B3009O2092k6542q441j2915o4267n0302L5075N5773k3866p5069l7125j1054
33985a33632m8424m4087N7796J31618P5535n696K3760R7309O0890o3653j12178
33974C9238l7494L5222J1566o1870j13258j41696j52603j04622J1845J15157J22476
33963b76039N9294J8411L3757N2050K2321m0643r3306j17996j13317o6773J6942
33952e05299P9285N9109j4598m2208J2395P0612O2839L7778P8717J60326J78283
33941A77239R9423m328o2928o8222l4648J4491K3760m0908j11023q2447K7262
33930f2329R0679N6171P440P274R107j9012j2718N8882J00443L8488m0380k8290
33918B05755J5132l5501j44341j61027o9221j1578n1585p9960j1710P4469Q0163
$$ plain form
33907 -189404 -140801 -70822 39935 108670 71518 5872 42172 170306 220471 69166 -193207
33896 -193207 -361229 -358104 -303112 -317474 -346527 -251640 -32937 144768 153915 39062 -78984
33885 -78984 -148337 -184262 -196355 -192767 -214076 -288811 -376224 -411962 -389223 -339665 -262222 -140498
33873 -140498 -13277 50758 49964 47689 61979 30791 -83198 -214940 -267499 -222869 -148763
33862 -148763 -125167 -188400 -311261 -407946 -393326 -274064 -152516 -103597 -79673 11430 158184
33851 158184 244817 204133 104098 50437 56414 63011 55886 87031 169606 219638 152762 6049
33839 6049 -93952 -76355 14836 107565 182629 240870 254649 213322 178086 216720 294749 302539
33827 302539 195510 41832 -79865 -157820 -195085 -157177 -32181 107043 167803 137828
$$ packed form
33907a89404M8603O9979J10757O8735l7152o5646L6300J28134N0165j51305k62373
33896a93207j68022L125N4992j4362k9053R4887K18703J77705R147j14853j18046
33885g8984o9353l5925j2093L588k1309p4735q7413l5738K2739M9558P7443J21724
33873a40498J27221O4035p94k275J4290l1188j13989j31742n2559M4630P4106
33862a48763K3596o3233j22861r6685J4620J19262J21548M8919K3924R1103J46754
33851A58184Q6633m0684j00035n3661N977O597p125L1145Q2575N0032o6876j46713
33839F049j00001J7597R1191R2729P5064N8241J3779m1327l5236L8634P8029P790
33827C02539j07029j53678j21697p7955l7265L7908J24996J39224O0760k9975
$$ plain form
33817 137828 67843 -9580 -74768 -65784 76275 300583 471527 526353 532433 552083 529451
33806 529451 380723 145205 -37484 -87207 -50883 -10209 12684 34400 43751 953 -102147
33795 -102147 -208059 -238081 -176580 -97610 -82468 -115370 -102799 -7581 90757 105387 57271
33784 57271 19681 -6359 -73189 -164930 -199222 -162198 -139247 -173050 -187355 -116890 -31604 -42741
33772 -42741 -138467 -207454 -194032 -135019 -61989 26668 89585 47955 -88915 -190545 -160888
33761 -160888 -65801 -37075 -94482 -140637 -109405 -37553 13552 30141 13047 -60534 -187095
33750 -187095 -284539 -254198 -95705 83816 180599 176851 109350 8574 -99143 -171043 -181208
33739 -181208 -156557 -133340 -94516 -7766 84026 88498 2055 -53381 16277 143175 182619
$$ packed form
33817A37828o9985p7423o5188Q984J42059K24308J70944N4826O080J9650k2632
33806E29451j48728k35518j82689m9723L6324M0674K2893K1716R351m2798j03100
33795a02147j05912l0022O1501P8970J5142l2902J2571R5218R8338J4630m8116
33784E7271l7590k6040o6830r1741l4292L7024K2951l3803j4305P0465Q5286j1137
33772d2741r5726o8987J3422N9013P3030Q8657O2917m1630j36870j01630K9657
33761a60888R5087K8726n7407m6155L1232P1852N1105J6589j7094p3581j26561
33750a87095r7444L0341J58493J79521R6783l748o7501j00776j07717p1900j0165
33739a81208K4651K3217L8824Q6750R1792M472q6443n5436O9658J26898L9444
$$ plain form
33728 182619 96199 -22435 -85960 -97900 -90362 -51303 44196 166501 237550 203386 90388
33717 90388 -7125 -1504 108765 234788 283571 240609 157965 85820 43167 34251 55099 91179
33705 91179 134958 187738 217882 156554 -9062 -169508 -196935 -106121 -32499 -46508 -75786
33694 -75786 -36209 42132 66886 2371 -109400 -202520 -227903 -187681 -161029 -241985 -412744
33683 -412744 -533662 -506113 -392550 -320963 -321271 -322017 -267213 -161558 -26073 114500 207687
33672 207687 202682 109829 -8851 -99232 -132333 -93467 -7538 50074 28306 -30804 -53881
33661 -53881 -43288 -58339 -114839 -181567 -257783 -360934 -440052 -403594 -255366 -111106 -51509
33650 -51509 -48653 -69161 -141941 -258331 -307190 -212607 -70523 -37257 -119847 -188090 -176589
$$ packed form
33728A82619q6420j18634o3525j1940P538L9059R5499J22305P1049l4164j12998
33717I0388r7513N621J10269J26023M8783m2962q2644p2145m2653q916K0848L6080
33705I1179M3779N2780L0144o1328j65616j60446k7427R0814P3622j4009k9278
33694g5786L9577P8341K4754o4515j11771r3120k5383M0222K6652q0956j70759
33683d12744j20918K7549J13563P1587l08p46N4804J05655J35485J40573R3187
33672B07687n005r2853j18680r0381l3101L8866Q5929N7612k1768n9110k3077
33661e3881J0593j5051n6500o6728p6216j03151p9118L6458J48228J44260N9597
33650e1509K856k0508p2780j16390m8859R4583J42084L3266q2590o8243J1501
$$ plain form
33639 -176589 -156760 -193549 -241072 -230036 -177026 -141539 -125489 -83066 -6077 61717 93125
33628 93125 113440 155368 205072 210515 139066 19149 -84613 -146041 -211516 -327624 -442451
33617 -442451 -437483 -285424 -119679 -88091 -175163 -245053 -239388 -233588 -282919 -320212 -269771 -180911
33605 -180911 -157176 -199635 -216424 -165530 -92403 -30540 37387 102850 109774 47142 -15385 -29640
33593 -29640 -35663 -73616 -97654 -48857 37297 77162 63653 67959 130147 216285 278381 294536
33581 294536 250718 143391 10870 -84866 -119130 -114973 -95242 -61480 -16471 33294 97391
33570 97391 184906 267299 293657 246222 156979 79828 68130 146057 257239 278755 154658
33559 154658 -9285 -62019 2851 70180 104621 196571 366718 457226 321270 42833 -148496
$$ packed form
33639a76589J9829l6789m7523J1036N3010L5487J6050M2423P6989O7794L1408
33628I3125K0315M1928M9704N443p1449j19917j03762o1428o5475j16108j14827
33617d42451M968J52059J65745L1588q7072o9890N665N800m9331l7293N0441Q8860
33605a80911K3735m2459j6789N0894P3127O1863O7927O5463O924o2632o2527j4255
33593b9640o023l7953k4038M8797Q6154L9865j3509M306O2188Q6138O2096J6155
33581B94536m3818j07327j32521r5736l4264M157J9731L3762M5009M9765O4097
33570I7391Q7515Q2393K6358m7435q9243p7151j1698P7927J11182K1516j24097
33559A54658j63943n2734O4870O7329L4441R1950J70147R0508j35956k78437j91329
$$ plain form
33548 -148496 -149720 -66597 -31462 -43203 -24653 35454 66829 28540 -19737 14614 132952
33537 132952 223427 180265 23867 -123548 -164264 -94692 27486 126969 126091 -10351 -213466
33526 -213466 -342966 -318458 -189248 -55921 33778 85238 103625 89370 62623 50554 57515
33515 57515 64881 44098 -34071 -167624 -292623 -331966 -291883 -258604 -279390 -310474 -315578 -341642
33503 -341642 -436011 -549740 -597565 -569623 -509840 -425694 -305059 -192200 -151818 -167408 -165710
33492 -165710 -141759 -167316 -259957 -335128 -326069 -276026 -260292 -273323 -252944 -183224 -111686 -68984
33480 -68984 -21100 75609 190927 227535 134687 -2143 -36223 61578 156048 122186 12680
33469 12680 -19388 70556 173941 180905 85741 -64794 -230838 -351729 -345711 -201178 -18606
$$ packed form
33548a48496j224Q3123L5135j1741J8550O0107L1375l8289m8277L4351J18338
33537A32952R0475m3162j56398j47415m0716O9572J22178R9483q78j36442k03115
33526b13466j29500K4508J29210J33327Q9699N1460J8387j4255k6747j2069O961
33515E7515P366k0783p8169j33553j24999l9343M0083L3279k0786l1084n104k6064
33503c41642r4369j13729m7825K7942N9783Q4146J20635J12859M0382j5590J698
33492a65710K3951k5557r2641p5171R059N0043J5734j3031K0379O9720P1538M2702
33480f8984M7884R6709J15318L6608r2848j36830l4080R7801R4470l3862j09506
33469A2680l2068Q9944J03385O964r5164j50535j66044j20891O018J44533J82572
$$ plain form
33458 -18606 93299 128205 147822 180546 209170 228214 250536 265692 245654 196782 164681
33447 164681 175296 199030 187052 127236 53621 10577 17949 66693 132537 180920 169373 78963
33435 78963 -41598 -95565 -37618 62155 90695 20157 -69751 -86995 -9246 112576 185443
33424 185443 126732 -46770 -184997 -138889 52152 186083 148239 56273 92421 257052
33414 257052 378371 335778 180526 34143 -46921 -72184 -45734 43789 171061 260078 251564
33403 251564 175961 129403 165624 242860 304735 371014 481208 574302 528220 339836 163326
33392 163326 116517 142644 137635 116816 138139 136731 -509 -213117 -290233 -155382 18537
33381 18537 51105 -14639 -24508 43661 80874 37788 -21198 -43632 -46535 -33884 31009 130286
$$ packed form
33458a8606J11905L4906J9617L2724K8624J9044K2322J5156k0038m8872l2101
33447A64681J0615K3734j1978n9816p3615m3044P372M8744O5844M8383j1547r0410
33435G8963j20561n3967N7947R9773K8540p0538q9908j7244P7749J21822P2867
33424A85443n8711j73502j38227M6108J91041J33931l7844r1966L6148J64631
33414B57052J21319m2593j55252j46383q1064k5263K6450Q9523J27272Q9017q514
33403B51564p5603m6558L6221P7236O1875O6279J10194R3094m6082j88384j76510
33392A63326m6809K6127n009k0819K1323j408j37240k12608p7116J34851J73919
33381A8537L2568o5744r869O8169L7213m3086n8986k2434k903J2651O4893R9277
$$ plain form
33369 130286 165976 94825 16501 47159 150528 183948 98114 3829 22976 143253 257133
33358 257133 294603 269715 225728 188648 171491 178437 188981 165306 94619 9824 -48596 -81073
33346 -81073 -117524 -157219 -147823 -50840 81969 139052 77844 -9127 517 104772 186791 181985
33334 181985 161651 206629 262367 204502 27202 -124981 -131077 -25901 76618 128169 155650
33323 155650 166922 123603 12418 -109948 -164373 -115698 15958 177574 298758 316095
33313 316095 222074 88592 11728 22227 68101 92033 99916 131349 185673 217870 205472
33302 205472 178971 174315 190743 213718 245857 288980 324105 338508 345841 347762 307689 210986
33290 210986 128711 160227 310915 476441 555003 533863 463361 395084 358921 355074 345702
$$ packed form
33369A30286L5690p1151p8324L0658J03369L3420q5834r4285J9147J20277J13880
33358B57133L7470k4888m3987l7080j7157O946J0544k3675p0687q4795n8420l2477
33346h1073l6451l9695R396R6983J32809N7083o1208q6971R644J04255Q2019m806
33334A81985k0334M4978N5738n7865j77300j52183o096J05176J02519N1551K7481
33323A55650J1272m3319j11185j22366n4425M8675J31656J61616J21184J7337
33313C16095r4021j33482p6864J0499M5874K3932P883L1433N4324L2197j2398
33302B05472k6501m656J6428K2975L2139M3123L5125J4403P333J921m0073r6703
33290B10986q2275L1516J50688J65526P8562k1140p0502o8277l6163l847r372
$$ plain form
33279 345702 287744 193039 125829 123877 151773 149763 99671 21875 -65684 -156039 -231904 -260672
33267 -260672 -217310 -109406 26087 161977 309297 473472 583657 534137 336145 157434
33257 157434 133170 192392 171683 58253 -7457 43669 125839 160551 181508 226087 249566
33246 249566 219396 187963 198121 214604 216788 247893 291266 223970 9337 -180610 -179090
33235 -179090 -64647 -26015 -68022 -40920 84370 176789 181157 196067 277263 338798 313575
33224 313575 261698 242989 212690 132286 76369 132445 268422 381219 419357 395332 337817
33213 337817 293012 317631 409490 484914 466956 358113 209747 82359 49703 153137 317381
33202 317381 401014 369720 321590 298956 205401 -1984 -164663 -107217 109251 268384 292320
$$ packed form
33279C45702n7958r4705o7210j952K7896k010n0092p7796q7559r0355p5865k8768
33267b60672M3362J07904J35493J35890J47320J64175J10185m9520j97992j78711
33257A57434k4264N9222k0709j13430o5710N1126Q2170L4712K0957M4579K3479
33246B49566l0170l1433J0158J6483K184L1105M3373o7296k14633j89947J520
33235a79090J14443L8632m2007K7102J25290R2419M368J4910Q1196O1535k5223
33224C13575n1877j8709l0299q0404n5917N6076J35977J12797L8138k4025n7515
33213C37817m4805K4619R1859P5424j7958j08843j48366j27388l2656J03434J64244
33202C17381Q3633l1294m8130k2634r3555k07385j62679N7446K16468J59133K3936
$$ plain form
33191 292320 306698 419091 568591 625695 544506 382063 234060 173692 201042 240280 226012
33180 226012 182008 167478 170330 124585 23906 -55945 -52382 26736 140132 246086 300425
33169 300425 288602 267990 318118 437573 539773 551723 465228 301985 103119 -43223
33159 -43223 -50967 52384 128657 84339 -23609 -70937 -13268 84871 137858 125181 104842
33148 104842 150478 258930 331902 285378 162628 86257 108428 173027 221321 255951 289055
33137 289055 310553 334526 397588 480251 514434 508019 564968 718456 841955 819302 718820
33126 718820 681020 698461 649730 520490 432643 438962 439628 360438 288086 338915 479208 573627
33114 573627 563026 506877 479384 502758 567469 645624 683167 634486 511768 368158 245854
$$ packed form
33191B92320J4378J12393J49500N7104q1189j62443j48003o0368K7350L9238j4268
33180B26012m4004j4530K852m5745j00679p9851L563P9118J13396J05954N4339
33169C00425j1823k0612N0128J19455J02200J1950q6495j63243j98866j46342
33159d3223p744J03351P6273m4318j07948m7328N7669R8139N2987j2677k0339
33148A04842M5636J08452P2972m6524j22750p6371K2171O4599M8294L4630L3104
33137B89055K1498K3973O3062Q2663L4183o415N6949J53488J23499k2653j00482
33126G18820l7800J7441m8731j29240q7847O319O66p9190p2352N0829J40293R4419
33114E73627j0601n6149k7493K3374O4711P8155L7543m8681j22718j43610j22304
$$ plain form
33103 245854 175907 197436 314232 450213 518752 527150 534793 517230 383665 159541 29025
33092 29025 110558 284033 355577 328467 368536 524935 644704 600453 462802 369756 336009
33081 336009 298245 273088 339339 484720 589097 578411 507499 462487 454031 445201 425148
33070 425148 403759 370406 311399 253812 247822 305784 388631 454496 498067 539127 592339 656001
33058 656001 717124 758862 771728 767316 776816 824676 899404 956282 956578 905541 847053 815892
33046 815892 795425 729659 587138 413611 306544 323826 425713 520704 553975 524742 438113
33035 438113 299522 162061 107068 141158 179142 182732 243563 438647 661675 724013 606159
33024 606159 478688 464608 515407 555888 607632 690736 727192 651027 528480 462506 448228
$$ packed form
33103B45854o9947K1529J16796J35981O8539Q398P643j7563j33565k24124j30516
33092B9025Q1533J73475P1544k7110M0069J56399J19769m4251j37651r3046l3747
33081C36009l7764k5157O6251J45381J04377j0686p0912m5012q456q830k0053
33070D25148k1389l3353n9007n7587n990N7962Q2847O5865M3571M1060N3212O3662
33058F56001O1123M1738J2866m412R500M7860P4728N6878K96n1037n8488l1161
33046H15892k0467o5766j42521j73527j07067J7282J01887R4991L3271k9233q6629
33035D38113j38591j37461n4993L4090L7984L590O0831J95084K23028O2338j17854
33024F06159j27471j4080N0799M0481N1744Q3104L6456p6165j22547o5974j4278
$$ plain form
33013 448228 426313 410343 444407 489818 478571 441251 461022 533308 592837 645113 732991
33002 732991 798477 736711 588225 512140 541227 531162 410878 321927 413820 629127 798123
32991 798123 847189 810442 721979 607454 521928 495872 485110 447623 416619 429814 454323
32980 454323 460675 498906 604834 694979 666255 558667 513214 598475 772095 972901 1143885
32969 1143885 1200059 1099384 939346 870101 908560 939731 899734 845368 830055 824182 792678
32958 792678 756226 736471 720091 709687 733046 771548 759860 693842 659367 706803 768985
32947 768985 760431 700877 682756 757460 901596 1057810 1162945 1165706 1060017 890424 711853
32936 711853 566938 497258 525584 621998 743164 903196 1126812 1326947 1341455 1144897
$$ packed form
33013D48228k1915j5970L4064M5411j1247l7320J9771P2286N9529N2276Q7878
33002G32991O5486o1766j48486p6085K9087j0065j20284q8951R1893K15307J68996
32991G98123M9066l6747q8463j14525q5526k6056j0762l7487l1004J3195K4509
32980D54323O352L8231J05928R0145k8724j07588m5453Q5261J73620K00806J70984
32969A143885N6174j00675j60038o9245L8459L1171l9997n4366j5313n873l1504
32958G92678l6452j9755j6380j0404K3359L8502j1688o6018l4475M7436O2182
32947G68985q554n9554j8121P4704J44136J56214J05135K761j05689j69593j78571
32936G11853j44915o9680K8326R6414J21166J60032K23616K00135J4508j96558
$$ plain form
32926 1144897 925472 873483 970737 1073102 1127623 1199398 1328418 1473041 1583287 1640501
32916 1640501 1636016 1591835 1585835 1669733 1774829 1789296 1717191 1658538 1636274 1567335 1433591
32905 1433591 1354336 1420822 1560074 1646429 1666636 1681558 1694968 1675939 1669114 1752085 1882646
32894 1882646 1911247 1784238 1638767 1637371 1775634 1915694 1960175 1925458 1875066 1852281 1870053
32883 1870053 1905772 1903847 1837359 1772563 1815646 1977834 2147192 2222301 2221081 2215840 2215418 2184276
32871 2184276 2146671 2177371 2278085 2348985 2323025 2260456 2254419 2299288 2328045 2341124 2399286
32860 2399286 2492292 2523190 2465000 2437539 2546534 2712653 2772843 2727001 2753063 2944179 3152237
32849 3152237 3182334 3065104 3019344 3172262 3431821 3640253 3738326 3738462 3646800 3501669 3421077
$$ packed form
32926A144897k19425n1989R7254J02365N4521P1775J29020J44623J10246N7214
32916A640501m485m4181o000Q3898J05096J4467p2105n8653k2264o8939j33744
32905A433591p9255O6486J39252Q6355K0207J4922J3410j9029o825Q2971J30561
32894A882646K8601j27009j45471j396J38263J40060M4481l4717n0392k2785J7772
32883A870053L5719j925o6488o4796M3083J62188J69358P5109j220n241m22l1142
32871B184276l7605L0700J00714P0900k5960o2569o037M4869K8757J3079N8162
32860B399286R3006L0898n8190k7461J08995J66119O0190m5842K6062J91116K08058
32849C152237L0097j17230m5760J52918K59559K08432R8073J36r1662j45131q0592
$$ plain form
32838 3421077 3501489 3682440 3799817 3781722 3721717 3741007 3839471 3917947 3912468 3871141 3905397
32827 3905397 4075787 4320700 4505356 4555071 4526168 4529084 4611001 4747598 4913208 5097979
32817 5097979 5278862 5447084 5652912 5938487 6225087 6368424 6358318 6367124 6544111 6845316
32807 6845316 7133996 7367398 7592133 7823318 8049595 8326807 8736217 9235586 9663257
32798 9663257 9934641 10156312 10496601 11001869 11592747 12198789 12833378 13540446 14311430
32789 14311430 15077480 15784186 16466779 17233445 18166036 19260504 20477634 21810009 23263852
32780 23263852 24826899 26523978 28465442 30745920 33313583 36054489 39017066 42425489
32772 42425489 46423586 50942551 55936880 61665614 68604241 77110925 87304242 99273326
$$ packed form
32838C421077Q0412J80951J17377j8095o0005J9290R8464P8476n479m1327L4256
32827C905397J70390K44913J84656M9715k8903K916Q1917J36597J65610J84771
32817E097979J80883J68222K05828K85575K86600J43337j0106Q806J76987L01205
32807F845316K88680K33402K24735K31185K26277K77212M09410M99369M27671
32798I663257K71384K21671L40289N05268N90878O06042O34589P07068P70984
32789A4311430P66050P06706O82593P66666R32591J094468J217130J332375J453843
32780B3263852J563047J697079J941464K280478K567663K740906K962577L408423
32772D2425489L998097M518965M994329N728734O938627Q506684J0193317J1969084
$$ plain form
32764 99273326 113316808 129987445 150025659 174296285 203702084 239032993 280685082
32757 280685082 328032630 378406167 426370187 464463277 485712456 486554496 468131446
32750 468131446 435186617 393683788 348883007 304633128 263454949 226751931 194976094
32743 194976094 167905619 145034596 125848196 109851247 96494496 85210200 75550784
32736 75550784 67245461 60104816 53927374 48543526 43894849 39973050 36671626 33775686
32728 33775686 31128981 28740308 26669476 24865239 23198127 21625580 20224309 19039012
32720 19039012 17982817 16939625 15910312 14989725 14219290 13529323 12840023 12170893 11612386
32711 11612386 11199886 10848239 10429840 9910268 9383270 8961467 8654779 8378686 8056959
$$ packed form
32764I9273326J4043482J6670637K0038214K4270626K9405799L5330909M1652089
32757B80685082M7347548N0373537M7964020L8093090K1249179Q42040j8423050
32750D68131446l2944829m1502829m4800781m4249879m1178179l6703018l1775837
32743A94976094k7070475k2871023j9186400j5996949j3356751j1284296r659416
32736G5550784q305323p140645o177442n383848m648677l921799l301424k895940
32728C3775686k646705k388673k070832j804237j667112j572547j401271j185297
32720A9039012j056195j043192j029313r20587p70435o89967o89300o69130n58507
32711A1612386m12500l51647m18399n19572n26998m21803l06688k76093l21727
$$ plain form
32702 8056959 7672141 7232812 6765583 6358989 6135218 6109665 6120297 5976184 5669960 5376447
32692 5376447 5234766 5195669 5108932 4907513 4659368 4462086 4333334 4212295 4045766 3853807
32682 3853807 3703217 3622823 3568129 3481561 3360692 3237682 3116081 2977402 2842786 2770952
32672 2770952 2780347 2819670 2834557 2819128 2777508 2683911 2528033 2369975 2294796 2313844 2345917
32661 2345917 2297282 2139775 1921076 1727727 1634124 1656029 1740057 1805323 1797297 1707500 1568809
32650 1568809 1448824 1419030 1490586 1585167 1602523 1524598 1435115 1431586 1526211 1630068 1631064
32639 1631064 1502354 1341206 1277523 1331371 1393073 1365472 1281159 1233062 1231635 1206751 1133913
32628 1133913 1070124 1050756 1034817 991502 969942 1023351 1111327 1143917 1099275 1037011 1003461
$$ packed form
32702H056959l84818m39329m67229m06594k23771k5553J0632j44113l06224k93513
32692E376447j41681l9097q6737k01419k48145j97282j28752j21039j66529j91959
32682C853807j50590q0394n4694q6568j20869j23010j21601j38679j34616p1834
32672B770952R395L9323J4887j5429m1620r3597j55878j58058p5179J9048L2073
32661B345917m8635j57507k18699j93349r3603K1905Q4028O5266q026q9797j38691
32650A568809j19985k9794P1556R4581J7356p7925q9483l529R4625J03857R96
32639A631064j28710j61148o3683N3848O1702k7601q4313m8097j427k4884p2838
32628A133913o3789j9368j5939m3315k1560N3409Q7976L2590m4642o2264l3550
$$ plain form
32617 1003461 978039 921294 840070 792732 839088 971073 1080295 1032778 821013 613027
32607 613027 584595 709978 792756 719025 600811 617137 773553 901337 877199 759172
32597 759172 682014 686096 706462 697194 691523 723435 749736 700783 584785 486343 460187 476370
32585 476370 483615 473767 452301 398359 313655 277450 374073 563456 692777 660032 516867
32574 516867 387860 335809 335894 339903 326149 310597 339228 449308 618061 775108 878540
32563 878540 939077 956192 896299 775502 692602 705570 731700 664931 549920 521524 587751
32552 587751 609685 520236 424731 420823 444165 392948 305270 284515 314530 293364 221021 201038
32540 201038 244867 226058 85164 -50100 -41665 57971 95314 48297 44483 161246 324482
$$ packed form
32617A003461k5422n6745q1224m7338M6356J31985J09222m7517k11765k07986
32607F13027k8432J25383Q2778p3731j18214J6326J56416J27784k4138j18027
32597G59172p7158M082K0366r268n671L1912K6301m8953j15998r8442k6156J6183
32585D76370P245r848k1466n3942q4704l6205R6623J89383J29321l2745j43165
32574E16867j29007n2051Q5M009j3754j5552K8631J10080J68753J57047J03432
32563H78540O0537J7115n9893j20797q2900J2968K6130o6769j15011k8396O6227
32552E87751K1934q9449r5505l908K3342n1217q7678k0755L0015k1166p2343j9983
32540B01038M3829j8809j40894j35264Q435R9636L7343m7017l814J16763J63236
$$ plain form
32529 324482 429624 468194 485515 480621 412818 278992 133702 41155 32930 93469 160660
32518 160660 165090 104881 64168 119403 241859 334597 351732 326179 282948 195329 54704
32507 54704 -75859 -126529 -104412 -67051 -38553 2899 73698 164770 256826 316734 303616
32496 303616 228285 178002 211848 250928 165286 -23493 -129694 -35391 157304 272833 283072
32485 283072 289885 338812 361861 302232 202136 141414 148188 191670 221064 199294 134536 84035
32473 84035 95827 155430 227437 324439 466959 589875 583908 453100 341209 352627 421829
32462 421829 423938 352512 307540 344867 419035 458365 425557 318071 183071 126007 221741
32451 221741 401553 502197 452421 341885 274478 232735 150127 51834 29546 99745 176912
$$ packed form
32529C24482J05142L8570J7321m894o7803j33826j45290r2547q225O0539O7191
32518A60660M430o0209m0713N5235J22456R2738J7135k5553m3231q7619j40625
32507E4704j30563n0670K2117L7361K8498M1452P0799R1072R2056N9908j3118
32496C03616p5331n0283L3846L9080q5642j88779j06201R4303J92695J15529J0239
32485B83072O813M8927K3049n9629j00096o0722O774M3482K9394k1770o4758n0501
32473H4035J1792N9603P2007R7002J42520J22916n967j30808j11891J1418O9202
32462D21829K109p1426m4972L7327P4168L9330l2808j07486j35000n7064R5734
32451B21741J79812J00644m9776j10536o7407m1743q2608r8293k2288P0199P7167
$$ plain form
32440 176912 190902 153253 92811 4961 -95612 -137795 -71198 55430 150568 192443 229312
32429 229312 279455 289641 203593 34195 -140658 -231406 -197678 -91868 -30135 -76172 -163846
32418 -163846 -182871 -122519 -59615 -17221 61451 175458 214696 113365 -34105 -97496 -82911
32407 -82911 -83952 -115317 -107152 -37176 44129 112377 186305 241165 209413 88960 -39498 -123311
32395 -123311 -176923 -191703 -111723 55249 196033 220963 162853 100633 64816 70688 151381
32384 151381 277861 329029 241325 126520 137149 264737 379952 426905 445911 425041 283050
32373 283050 35252 -153776 -154802 -27166 78093 98349 71512 26637 -44350 -121597 -148844
32362 -148844 -111452 -69719 -81689 -120194 -101465 9620 152797 239427 241209 190818 115811
$$ packed form
32440A76912J3990l7649o0442q7850j00573m2183O6597J26628R5138M1875L6869
32429B29312N0143J0186q6048j69398j74853r0748L3728J05810O1733m6037q7674
32418a63846j9025O0352O2904M2394P8672J14007L9238j01331j47470o3391J4585
32407h2911j041l1365Q165O9976Q1305O8248P3928N4860l1752j20453j28458q3813
32395a23311n3612j4780P9980J66972J40784K4930n8110o2220l5817N872Q0693
32384A51381J26480N1168q7704j14805J0629J27588J15215M6953J9006k0870j41991
32373B83050k47798j89028j026J27636J05259K0256k6837m4875p0987p7247k7247
32362a48844L7392M1733j1970l8505J8729J11085J43177Q6630J782n0391p5007
$$ plain form
32351 115811 14231 -102744 -188041 -201503 -150947 -76049 -16437 -2969 -40302 -79359 -50725
32340 -50725 45553 125696 132627 116845 160311 256824 322506 299524 198664 63441 -54755
32329 -54755 -104439 -69538 10020 83024 127181 123285 49632 -47937 -50974 83504 228589 242589
32317 242589 170421 169763 267970 330585 268419 135917 4927 -119353 -214425 -206605 -89831
32306 -89831 29915 80686 120260 212939 299067 272156 123125 -62591 -195968 -221830 -139574
32295 -139574 -44140 -66083 -204042 -298321 -244018 -141448 -143180 -237158 -293198 -253625 -154953
32284 -154953 -17787 148580 264718 241658 119346 30266 26482 45622 39788 25808 4071
32273 4071 -59498 -148683 -189282 -149610 -70761 11711 94201 150302 141685 94495 75459 82037
$$ packed form
32351A15811j01580j16975q5297j3462N0556P4898N9612J3468l7333l9057K8634
32340e0725R6278Q0143O931j5782M3466R6513O5682k2982j00860j35223j18196
32329e4755m9684L4901P9558P3004M4157l896p3653r7569l037J34478J45085J4000
32317B42589p2168o58R8207O2615o2166j32502j30990j24280r5072P820J16774
32306h9831J19746N0771L9574R2679Q6128k6911j49031j85716j33377k5862Q2256
32295a39574R5434k1943j37959r4279N4303J02570j732r3978n6040L9573R8672
32284a54953J37166J66367J16138k3060j22312q9080l784J9140n834j3980k1737
32273D071o3569q9185m0599L9672P8849Q2472Q2490N6101q617m7190j9036O578
$$ plain form
32261 82037 48673 -29669 -83307 -92239 -113174 -154756 -143476 -61441 -5810 -46042 -118528 -132207
32249 -132207 -93847 -61219 -51763 -61502 -92513 -98685 3201 193279 316208 278967 184212
32238 184212 160810 164732 91132 -1916 36801 196019 302114 278976 232697 244685 249822
32227 249822 190448 143540 191332 273438 281407 228505 212332 248975 250921 162762 35981 -42727
32215 -42727 -44839 -10339 5210 -10697 -11753 49299 142858 180357 125225 35763 -33116 -111641
32203 -111641 -241119 -367044 -387049 -287330 -155514 -61598 2702 60874 99602 102455 79556
32192 79556 40438 -14444 -56709 -38581 35163 95546 99210 75847 53469 6092 -63965 -61079
32180 -61079 85837 274553 314209 167947 8299 -3911 91126 135052 52583 -95367 -212108
$$ packed form
32261H2037l3364p8342n3638q932k0935m1582J1280Q2035N5631m0232p2486j3679
32249a32207L8360L2628R456r739l1011o172J01886J90078J22929l7241r4755
32238A84212k3402L922p3600r3048L8717J59218J06095k3138m6279J1988N137
32227B49822n9374m6908M7792Q2106P969n2902j6173L6643J946q8159j26781p8708
32215d2727k112L4500J5549j5907j056O1052R3559L7499n5132q9462o8879p8525
32203a11641j29478j25925k0005R9719J31816R3916O4300N8172L8728K853k2899
32192G9556l9118n4882m2265J8128P3744O0383L664k3363k2378m7377p0057K886
32180f1079J46916J88716L9656j46262j59648j2210R5037M3926q2469j47950j16741
$$ plain form
32169 -212108 -250696 -224713 -192616 -217733 -297189 -343905 -281115 -140596 -26000 6953 -10235
32158 -10235 -28557 -42940 -78163 -141729 -194653 -164732 -18108 166890 246281 169116 38705
32147 38705 -34801 -77327 -162302 -242514 -201602 -54363 45477 18256 -50503 -72125 -81847 -137770
32135 -137770 -203434 -215621 -181439 -123753 -13132 150021 257957 209679 55939 -68364
32125 -68364 -112756 -114120 -79551 12386 114287 134631 66405 -4684 -23193 -7551 24375 79215
32113 79215 136711 165499 187784 233278 238610 112218 -91551 -192351 -110508 46577 159466
32102 159466 224581 254135 197841 64396 -7363 71404 182794 161150 33915 -41031 -23105
32091 -23105 -15845 -69706 -117341 -115475 -103650 -87803 -1597 156782 265410 235698 140777 100842
$$ packed form
32169b12108l8588K5983L2097k5117p9456m6716O2790J40519J14596L2953j7188
32158a0235j8322j4383l5223o3566n2924K9921J46624J84998P9391p7165j30411
32147C8705p3506m2526q4975q0212M0912J47239R9840k7221o8759k1622r722n5923
32135a37770o5664j2187L4182N7686J10621J63153J07936m8278j53740j24303
32125f8364m4392j364L4569R1937J01901K0344o8226p1089j8509J5642L1926N4840
32113G9215N7496K8788K2285M5494N332j26392k03769j00800Q1843J57085J12889
32102A59466O5115K9554n6294j33445p1759P8767J11390k1644j27235p4946J7926
32091b3105P260n3861m7635J866J1825J5847Q6206J58379J08628k9712r4921l9935
$$ plain form
32079 100842 108552 68065 -29871 -79796 -17628 81692 107007 62666 57120 145414 240552 219268
32067 219268 84711 -38565 -73353 -80121 -138443 -202619 -152647 36916 253619 367673 337097
32056 337097 204311 56449 -12441 29885 111173 135913 104969 86143 78062 7447 -119127
32045 -119127 -175159 -83175 71972 169523 205020 230063 223113 138858 36175 26204 104291
32034 104291 152618 119171 83890 120864 199059 268148 350982 474407 565528 504422 273083
32023 273083 -1723 -157564 -123748 46092 234613 351593 384500 371373 337753 279536
32013 279536 198908 119060 52302 -13306 -78379 -113644 -99788 -60609 -30132 -5684 38336
32002 38336 101697 149930 152428 113251 67992 59394 105585 179722 228282 217815 156186 69525
$$ packed form
32079A00842P710m0487r7936m9925O2168R9320K5315m4341n546Q8294R5138k1284
32067B19268j34557j23276l4788o768n8322o4176M9972J89563K16703J14054l0576
32056C37097j32786j47862o8890M2326Q1288K4740l0944j8826q081p0615j26574
32045a19127n6032R1984J55147R7551L5497K5043o950q4255j02683r971P8087
32034A04291M8327l3447l5281L6974P8195O9089Q2834J23425R1121o1106k31339
32023B73083k74806j55841L3816J69840J88521J16980L2907j3127l3620n8217
32013B79536q0628p9848o6758o5608o5073l5265J3856L9179L0477K4448M4020
32002C8336O3361M8233K498l9177m5259q598M6191P4137M8560j0467o1629q6661
$$ plain form
31990 69525 -17404 -70562 -51481 35291 116744 109830 8485 -107794 -154207 -116747 -51641
31979 -51641 -23194 -41933 -56525 -11337 84250 158897 163503 133858 143461 201854 231170 153190
31967 153190 -19696 -192694 -277730 -266046 -221022 -210285 -242301 -260226 -198293 -55729 80368
31956 80368 102330 -6130 -131181 -131178 17041 203653 323182 378577 420548 439982 388287
31945 388287 274632 162638 76466 -10013 -85189 -89452 -21703 27334 -4598 -69926 -104803
31934 -104803 -133515 -206296 -289775 -307057 -254782 -196320 -156428 -101997 -21674 46725 73050
31923 73050 66870 55327 69395 131206 209035 218678 127914 17860 -31091 -59219 -129999 -169111
31911 -169111 -56186 135304 169535 -32116 -264130 -312261 -216154 -150918 -169543 -200379 -215090
$$ packed form
31990F9525q6929n3158J9081Q6772Q1453o914j01345j16279m6413L7460O5106
31979e1641K8447j8739j4592M5188R5587P4647M606k9645R603N8393K9316p7980
31967A53190j72886j72998q5036J1684M5024J0737l2016j7925O1933J42564J36097
31956H0368K1962j08460j25051LJ48219J86612J19529N5395M1971J9434n1695
31945C88287j13655j11994q6172q6479p5176m263O7749M9037l1932o5328l4877
31934a04803k8712p2781q3479j7282N2275N8462L9892N4431Q0323O8399K6325
31923G3050o180j1543J4068O1811P7829R643r0764j10054m8951k8128p0780l9112
31911a69111J12925J91490L4231k01651k32014m8131R6107O5236j8625l0836j4711
$$ plain form
31900 -215090 -247269 -284124 -278169 -253360 -278068 -331817 -309795 -177100 -25451 49080 50476
31889 50476 40256 53370 83908 109831 110769 87275 60491 27001 -59040 -210353 -342986 -357890
31877 -357890 -269062 -174613 -111673 -29530 87019 164709 146654 69744 -7117 -83937 -177758
31866 -177758 -258022 -284738 -272511 -257378 -224955 -129203 26298 175792 264514 296590 296555 251105
31854 251105 120260 -90317 -295230 -398483 -390388 -336450 -270049 -161361 -22054 41388
31844 41388 -38808 -160774 -164188 -48029 39376 24741 -5639 23692 53056 4041 -88053
31833 -88053 -151961 -208243 -310810 -413274 -408715 -287519 -156896 -97136 -76661 -26322 61705
31822 61705 132469 131351 54669 -46665 -118389 -166041 -237540 -325304 -338573 -225783 -81431
$$ packed form
31900b15090l2179l6855N955K4809k4708n3749K2022J32695J51649P4531J396
31889E0476j0220J3114L0538K5923R38k3494k6784l3490q6041j51313j32633j4904
31877c57890Q8828R4449O2940Q2143J16549P7690j8055p6910p6861p6820r3821
31866a77758q0264k6716J2227J5133L2423R5752J55501J49494Q8722L2076l5m5450
31854B51105j30845k10577k04913j03253Q095N3938O6401J08688J39307O3442
31844D1388q0196j21966l414J16159Q7405j4635l0380K9331K9364m9015r2094
31833h8053o3908n6282j02567j02464M559J21196J30623N9760K0475N0339Q8027
31822F1705P0764j118p6682j01334p1724m7652p1499q7764j3269J12790J44352
$$ plain form
31811 -81431 -53630 -159124 -267313 -276228 -233636 -250798 -342448 -399096 -314600 -116876 48533
31800 48533 77380 30155 53455 184033 302834 306716 237232 177103 109740 -8318 -101453
31789 -101453 -52990 81585 96277 -85999 -284605 -284767 -92559 115501 219924 240126 238427
31778 238427 243750 263764 298874 333813 352341 353116 325442 238923 96739 -33379 -93712 -115726
31766 -115726 -164641 -224533 -211428 -103446 11676 42409 -3467 -46971 -30805 39199 113606
31755 113606 138453 101115 54355 67692 138925 184171 135759 20108 -84258 -133856 -136169
31744 -136169 -112148 -85222 -83796 -107452 -107011 -48319 17691 8385 -71635 -133960 -137530 -137128 -169105
31731 -169105 -171868 -86065 30075 71200 31587 -8229 -16304 -30334 -48478 -8606 94057
$$ packed form
31811h1431K7801j05494j08189q915M2592j7162r1650n6648Q4496J97724J65409
31800D8533K8847m7225K3300J30578J18801L882o9484o0129o7363j18058r3135
31789a01453M8463J34575J4692j82276j98606j62J92208K08060J04423K0202j699
31778B38427N323K0014L5110L4939J8528P75k7674q6519j42184j30118o0333k2014
31766a15726m8915n9892J3105J07982J15122L0733m5876m3504J6166P0004P4407
31755A13606K4847l7338m6760J3337P1233M5246m8412j15651j04366m9598k313
31744a36169K4021K6926J426k3656M41N8692O6010r306q0020o2325l570M02l1977
31731a69105k763Q5803J16140M1125l9613l9816q075j4030j8144L9872J02663
$$ plain form
31720 94057 164554 133750 52042 5896 8905 34321 90630 188122 274613 283710 223021 149891
31708 149891 87252 30644 9638 61445 155313 219894 240784 257409 269112 229628 144785
31697 144785 88083 89070 83436 17155 -63008 -73483 -2769 90577 154669 178399 177438 181461 211459
31684 211459 243732 225174 148025 73446 51298 55371 37665 11256 27374 89972 144294 145014
31672 145014 95690 24857 -39675 -72831 -62410 -23628 18529 62137 122981 199317 266836
31661 266836 311413 343024 368798 373662 345515 308050 302475 326911 312671 187385 -36962
31650 -36962 -262304 -396717 -423757 -377933 -302119 -260540 -334696 -527453 -692800 -650194 -385853
31639 -385853 -75676 107537 146175 122358 90125 51215 3027 -43892 -70906 -51089 14782
$$ packed form
31720I4057P0497l0804q1708m6146L009K5416N6309R7492Q6491R097o0689p3130
31708A49891o2639n6608k1006N1807R3868O4581K0890J6625J1703l9484q4843
31697A44785n6702R87n634o6281q0163j0475P0714R3346O4092K3730r61M023K9998
31684B11459L2273j8558p7149p4579k2148M073j7706k6409J6118O2598N4322P20
31672A45014m9324p0833o4532l3156J0421L8782M2157M3608O0844P6336O7519
31661B66836M4577L1611K5774M864k8147l7465n575K4436j4240j25286k24347
31650c6962k25342j34413k7040M5824P5814M1579p4156j92757j65347M2606K64341
31639c85853L10177J83213L8638k3817l2233l8910m8188m6919k7014J9817O5871
$$ plain form
31628 14782 49952 -37749 -210424 -297212 -202918 -45480 3384 -47783 -50410 44649 122232
31617 122232 91811 20243 20618 90870 131636 84159 -5815 -49031 -9058 55386 42761 -75604
31605 -75604 -202631 -220996 -145748 -109745 -182687 -273700 -257528 -141343 -39554 -11657 -1344
31594 -1344 57162 139738 177102 158373 136056 136722 123756 72245 33512 72029 157767 183640
31582 183640 94915 -56571 -199324 -314381 -387033 -361225 -214437 -31954 75695 107468
31572 107468 147214 220992 265941 244556 201733 181918 166245 132910 117957 164758 253431
31561 253431 326446 355817 347489 307060 240886 172405 122907 90754 77154 111647 213798
31550 213798 338251 396480 341800 212076 83473 549 -39318 -49489 -27083 30190 99486
$$ packed form
31628A4782L5170q7701j72675q6788R4294J57438M8864n1167k627R5059P7583
31617A22232l0421p1568L75P0252M0766m7477q9974m3216L9973O4444j2625j18365
31605g5604j27027j8365P5248L6003p2942r1013J6172J16185J01789K7897J0313
31594a344N8506Q2576L7364j8729k2317O66j2966n1511l8733L8517Q5738K5873
31582A83640q8725j51486j42753j15057p2652K5808J46788J82483J07649L1773
31572A07468L9746P3778M4949k1385m2823j9815j5673l3335j4953M6801Q8673
31561B53431P3015K9371q328m0429o6174o8481m9498l2153j3600L4493J02151
31550B13798J24453N8229n4680j29724j28603q2924l9867j0171K2406N7273O9296
$$ plain form
31539 99486 151409 189664 237928 275838 228936 59539 -155930 -282617 -252292 -103999 79388
31528 79388 230937 309052 302335 238613 160727 91146 38144 14135 12806 -3451 -41982 -34116
31516 -34116 79509 236662 310362 276561 237716 267208 320514 328451 289559 226299 131181
31505 131181 14612 -58301 -38327 48394 153254 258075 332436 314177 201507 101532 107685
31494 107685 176831 204264 172070 136739 112819 71178 30759 46402 104082 124990 91035
31483 91035 80257 143975 215024 180924 13541 -199713 -330702 -309695 -177111 -40476 37054
31472 37054 89398 168936 257136 304392 317877 330552 306434 176769 -18353 -121314 -35389
31461 -35389 151893 268985 238654 119594 13906 -20732 9585 60861 93792 99378 77883
$$ packed form
31539I9486N1923L8255M8264L7910m6902j69397k15469j26687L0325J48293J83387
31528G9388J51549P8115o717o3722p7886o9581n3002k4009j329j6257l8531P866
31516c4116J13625J57153P3700l3801l8845K9492N3306P937l8892o3260r5118
31505A31181j16569p2913J9974Q6721J04860J04821P4361j8259j12670r9975O153
31494A07685O9146K7433l2194l5331k3920m1641m0419J5643N7680K0908l3955
31483I1035j0778O3718P1049l4100j67383k13254j30989K1007J32584J36635P7530
31472C7054N2344P9538Q8200M7256J3485J2675k4118j29665j95122j02961Q5925
31461c5389J87282J17092l0331j19060j05688l4638L0317N1276L2931N586k1495
$$ plain form
31450 77883 9268 -118708 -256549 -313778 -251599 -129062 -48563 -72934 -182851 -281203 -255574
31439 -255574 -87590 105223 187009 154205 110918 109990 105850 72658 67093 126829 189255 175445
31427 175445 98049 25730 -12204 -28087 -25398 -4803 12571 19657 47217 104260 135242 93915
31415 93915 20728 -16924 -21909 -29345 -8883 96492 246087 320493 280886 215471 197911 191765
31403 191765 146824 105571 131601 184670 161069 44754 -62962 -72498 -413 79390 118062
31392 118062 97462 8856 -123922 -230349 -254454 -219746 -191860 -189110 -178169 -148725 -126980
31381 -126980 -103918 -23579 115573 209273 161195 9961 -123097 -184969 -217774 -252737 -260948
31370 -260948 -218131 -146166 -71181 110 46260 33326 -29144 -90201 -131299 -178258 -228038
$$ packed form
31450G7883o8615j27976j37841n7229O2179J22537Q0499k4371j09917r8352K5629
31439b55574J67984J92813Q1786l2804m3287r28m140l3192n565N9736O2426j3810
31427A75445p7396p2319l7934j5883K689K0595J7374P086K7560N7043L0982m1327
31415I3915p3187l7652m985p436K0462J05375J49595P4406l9607o5415j7560o146
31403A91765m4941m1253K6030N3069k3601j16315j07716r536P2085P9803L8672
31392A18062k0600q8606j32778j06427k4105L4708K7886K750J0941K9444K1745
31381a26980K3062Q0339J39152R3700m8078j51234j33058o1872l2805l4963q211
31370b60948M2817P1965P4985P1291M6150j2934o2470o1057m1098m6959m9780
$$ plain form
31359 -228038 -239261 -216957 -217942 -232975 -162235 24866 199156 232409 168171 124081 97794
31348 97794 11946 -90441 -63101 115365 277811 280822 161959 30854 -82782 -193660
31338 -193660 -268229 -270596 -248414 -276660 -339958 -348885 -258722 -106989 52116 184464 254664
31327 254664 236858 160488 95459 77311 86777 112296 183963 315366 443765 469890 359068
31316 359068 184226 60933 39091 57975 15595 -109579 -218063 -191292 -29401 139898
31306 139898 194801 133546 43070 -13157 -42629 -77600 -124206 -160223 -150313 -61248 97647
31295 97647 238677 252522 137511 28006 38959 117034 120939 29855 -29017 20152 82032
31284 82032 38809 -61814 -69975 49864 172254 185138 117116 56095 13742 -67348 -199618
$$ packed form
31359b28038j1223K2304r85j5033P0740J87101J74290L3253o4238m4090k6287
31348I7794q5848j02387K7340J78466J62446L011j18863j31105j13636j10878
31338a93660p4569k367K2182k8246o3298q927R0163J51733J59105J32348P0200
31327B54664j7806p6370o5029j8148R466K5519P1667J31403J28399K6125j10822
31316C59068j74842j23293k1842J8884m2380j25174j08484K6771J61891J69299
31306A39898N4903o1255r0476n6227k9472l4971m6606l6017R910Q9065J58895
31295I7647J41030J3845j15011j09505J0953P8075L905r1084n8872M9169O1880
31284H2032m3223j00623q161J19839J22390J2884o8022o1021m2353q1090j32270
$$ plain form
31273 -199618 -299805 -264235 -79627 147845 276907 249917 126636 4674 -70708 -111850
31263 -111850 -144496 -192242 -272720 -360187 -372738 -256341 -78846 16693 -37296 -174066 -290021
31252 -290021 -349822 -378214 -397248 -405470 -394089 -357908 -299443 -226440 -135239 -14962 102697
31241 102697 127495 7038 -168645 -230671 -116196 65211 161622 119999 -6579 -120588
31231 -120588 -132897 -32297 69939 44303 -75664 -108312 29336 191424 202637 92843
31221 92843 15289 899 -58511 -203260 -328518 -338445 -260639 -165596 -68713 32351 97629
31210 97629 89566 36471 -6077 -35439 -95329 -192736 -258293 -212306 -71141 35324 -7377
31199 -7377 -147827 -203684 -80841 100520 157927 71229 -28158 -52397 -34816 -24483 -17499
$$ packed form
31273a99618j00187L5570J84608K27472J29062k6990j23281j21962p5382m1142
31263a11850l2646m7746q0478q7467j2551J16397J77495R5539n3989j36770j15955
31252b90021n9801k8392j9034q222J1381L6181N8465P3003R1201J20277J17659
31241A02697K4798j20457j75683o2026J14475J81407R6411m1623j26578j14009
31231a20588j2309J00600J02236k5636j19967l2648J37648J62088J1213j09794
31221I2843p7554j4390n9410j44749j25258r927P7806R5043R6883J01064O5278
31210I7629q063n3095m2548k9362n9890r7407o5557M5987J41165J06465m2701
31199g377j40450n5857J22843J81361N7407q6698r9387k4239J7581J0333O984
$$ plain form
31188 -17499 -12416 -30069 -40475 39340 224119 408595 486068 460900 405845 370275 367052 380771
31176 380771 346738 196455 -22690 -148536 -91447 47331 115354 96228 70482 57844 14164
31165 14164 -51877 -79517 -65794 -68971 -99504 -106217 -81942 -86725 -140171 -175788 -138158 -57446
31153 -57446 6386 35005 38776 28718 29384 67738 124775 149711 141398 155176 205444 231198
31141 231198 196238 153194 152916 152109 82213 -31111 -91500 -56567 19807 57510 18242 -75336
31129 -75336 -143844 -101728 42995 163760 150948 55491 31872 145220 302538 380203 355436
31118 355436 295645 272406 306521 356563 350704 270727 201833 237928 333501 332053 173573 -10993
31106 -10993 -73140 -40211 -46136 -117886 -143079 -47724 96559 174975 164188 122034 97091 96004
$$ packed form
31188a7499N083j7653j0406P9815J84779J84476P7473k5168n5055l5570l223J3719
31176C80771l4033j50283k19145j25846N7089J38778O8023j9126k5746j2638m3680
31165A4164o6041k7640J3723l177l0533o713K4275m783n3446l5617L7630Q0712
31153e7446O3832K8619L771j0058O66L8354N7037K4936q313J3778N0268K5754
31141B31198l4960m3044k78q07o9896j13324o0389L4933P6374L7703l9268r3578
31129g5336o8508M2116J44723J20765j2812r5457k3619J13348J57318P7665k4767
31118C55436n9791k3239L4115N0042n859p9977o8894L6095R5573j448j58480j84566
31106a0993o2147L2929n925p1750k5193R5355J44283P8416j0787m2154k4943j087
$$ plain form
31094 96004 106836 112455 101953 99768 158895 291453 428551 486662 455874 382951 286679 148316
31082 148316 -11083 -105415 -71532 47761 143071 148733 91089 37587 21717 19261 -13558
31071 -13558 -81325 -131556 -108472 -25498 39152 32109 -13175 -27809 -3216 -1075 -68563 -175162
31059 -175162 -247335 -249188 -214413 -203481 -237975 -279354 -271953 -201047 -98799 134 83751 141113
31047 141113 151812 117681 72013 29064 -38017 -127365 -161084 -80589 38141 58691 -27347
31036 -27347 -87571 -44222 31012 68303 123444 249457 347799 295673 165769 151276 278881
31025 278881 365021 292433 165790 114224 90619 -3978 -108538 -80454 62829 143337 65341
31014 65341 -79395 -172727 -210680 -235146 -236264 -199242 -170516 -193000 -224011 -196163 -126884 -90639
$$ packed form
31094I6004J0832N619j0502k185N9127J32558J37098N8111l0788p2923r6272j38363
31082A48316j59399r4332L3883J19293R5310N662n7644n3502j5870k456l2819
31071a3558o7767n0231K3084Q2974O4650p043m5284j4634K4593K141o7488j06599
31059a75162p2173j853L4775J0932l4494m1379P401P0906J02248R8933Q3617N7362
31047A41113J0699l4131m5668m2949o7081q9348l3719Q0495J18730K0550q6038
31036b7347o0224M3349P5234L7291N5141J26013R8342n2126j29904j4493J27605
31025B78881Q6140p2588j26643n1566k3605r4597j04560K8084J43283Q0508p7996
31014F5341j44736r3332l7953k4466j118L7022K8726k2484l1011K7848O9279L6245
$$ plain form
31002 -90639 -101547 -100465 -56614 -10024 745 -10189 -23468 -59867 -137963 -221105 -252668 -231585
30990 -231585 -214255 -241391 -293317 -326934 -336270 -359691 -430846 -532751 -604679 -593530 -496653
30979 -496653 -357257 -228312 -147202 -132140 -180455 -266362 -355550 -425444 -457944 -419229 -284910
30968 -284910 -102723 9778 -23150 -140841 -212898 -199402 -189309 -261447 -365926 -393409 -326461
30957 -326461 -258436 -269825 -344564 -416656 -444655 -417638 -336909 -230629 -153057 -125447 -98187
30946 -98187 -15387 96626 153671 124086 64541 33336 14919 -40716 -135966 -217233 -231770
30935 -231770 -165433 -39216 100481 194456 203990 138287 36946 -68252 -159685 -218300 -232327
30924 -232327 -216155 -189585 -142844 -61152 16231 17682 -54208 -92105 -13121 117258 159386
$$ packed form
31002i0639j0908J082M3851M6590J0769j0934j3279l6399p8096q3142l1563K1083
30990b31585J7330k7136n1926l3617r336k3421p1155j01905p1928J1149R6877
30979d96653J39396J28945Q1110J5062m8315q5907q9188o9894l2500L8715J34319
30968b84910J82187J12501l2928j17691p2057J3496J0093p2138j04479k7483O6948
30957c26461O8025j1389p4739p2092k7999K7017Q0729J06280P7572K7610K7260
30946i8187Q2800J12013N7045k9585n9545l1205j8417n5635r5250q1267j4537
30935b31770O6337J26217J39697R3975R534o5703j01341j05198r1433n8615j4027
30924b32327J6172K6570M6741Q1692P7383J451p1890l7897P8984J30379M2128
$$ plain form
30913 159386 84172 4983 10459 45416 7973 -96424 -174154 -185900 -183290 -199960 -191220 -121308
30901 -121308 -45192 -38895 -81689 -78138 6649 98021 115570 73430 43496 56276 83063 97857
30889 97857 108498 124951 137359 137298 128981 105641 46094 -45461 -126520 -169951 -201138 -245185
30877 -245185 -266474 -216066 -123559 -73206 -83921 -86130 -42280 -14360 -61166 -135756 -159088 -146653
30865 -146653 -172132 -231976 -243901 -177294 -90545 -28857 16252 19981 -92856 -313321 -490244
30854 -490244 -500916 -418904 -409342 -493975 -531267 -424946 -244867 -112869 -56336 -25336 5794
30843 5794 18037 5274 -2215 21624 62676 86153 83794 81424 84872 38539 -113913 -318888
30831 -318888 -421311 -326915 -117597 40733 69556 9194 -72156 -122689 -94061 16781 115860
$$ packed form
30913A59386p5214p9189N476L4957l7443j04397p7730j1746K610j6670Q740O9912
30901a21308P6116O297m2794L551Q4787R1372J7549m2140k9934J2780K6787J4794
30889I7857J0641J6453J2408o1q317k3340n9547r1555q1059m3431l1187m4047
30877b45185k1289N0408R2507N0353j0715k209M3850K7920m6806p4590k3332J2435
30865a46653k5479n9844j1925O6607Q6749O1688M5109L729j12837k20465j76923
30854d90244j0672Q2012R562q4633l7292J06321J80079J31998N6533L1000L1130
30843E794J2243j2763p489K3839M1052K3477k359k370L448m6333j52452k04975
30831c18888j02423R4396K09318J58330K8823o0362q1350n0533K8628J10842R9079
$$ plain form
30820 115860 96043 -15577 -83072 -52320 -20517 -76593 -164224 -168359 -72520 36930 79338
30809 79338 39441 -39820 -77676 -12441 116496 188234 144819 63317 34347 31752 -23004 -117409
30797 -117409 -161080 -122174 -67015 -63684 -109907 -161267 -185010 -183623 -190660 -228145 -256034 -212124
30785 -212124 -124120 -102832 -169322 -180722 -25029 189585 268337 196079 121363 107625 71596
30774 71596 -22797 -86291 -73666 -74963 -154950 -231791 -213606 -148912 -133535 -152408 -127603 -62804
30762 -62804 -26440 -26910 -6638 57527 129328 170757 157726 68702 -67255 -140757 -68239 81950
30750 81950 150601 76755 -42479 -83406 -23012 71812 124654 107766 63613 72010 158387 244612
30738 244612 237336 151930 90699 105581 149933 171533 179228 188172 162932 68113 -54381 -108163
$$ packed form
30820A15860j9817j11620o7495L0752L1803n6076q7631m135R5839J09450M2408
30809G9338l9897p9261l7856O5235J28937P1738m3415q1502k8970k595n4756r4405
30797a17409m3671L8906N5159L331m6223n1360k3743J387p037l7485k7889M3910
30785b12124Q8004K1288o6490j1400J55693K14614P8752p2258p4716j3738l6029
30774G1596r4393o3494J2625j297p9987p6841J8185O4694J5377j8873K4805O4799
30762f2804L6364m70K0272O4165P1801M1429j3031q9024j35957p3502P2518J50189
30750H1950O8651p3846j19234m0927O0394R4824N2842j6888m4153Q397Q6377Q6225
30738B44612p276q5406o1231J4882M4352K1600P695Q944k5240r4819j22494n3782
$$ plain form
30726 -108163 -42860 89642 180774 161687 60614 -28794 -32545 54193 188320 315216 379551
30715 379551 347180 248191 164552 141012 138476 105698 53715 15638 -17839 -59178 -64775 2953
30703 2953 83526 78958 -7599 -83296 -104554 -103928 -80352 15913 155644 204323 90117 -86822
30691 -86822 -180826 -167210 -118902 -84723 -64518 -51266 -24668 51858 159943 201979 125325
30680 125325 23800 24546 109325 149772 99889 39827 21058 -16016 -124632 -243181 -272436
30669 -272436 -207726 -128532 -83782 -44505 35189 150761 248845 278672 235291 153789 65914
30658 65914 -19827 -87317 -98042 -47256 -8735 -61504 -176907 -246457 -231881 -211137 -243013
30647 -243013 -267288 -209052 -120783 -120273 -205934 -237281 -121272 66254 187832 204572 168397
$$ packed form
30726a08163O5303J32502R1132j9087j01073q9408l751Q6738J34127J26896O4335
30715C79551l2371r8989q3639k3540k536l2778n1983l8077l3477m1339n597O7728
30703B953Q0573m568q6557p5697k1258O26K3576R6265J39731M8679j14206j76939
30691h6822r4004J3616M8308L4179K0205J3252K6598P6526J08085M2036p6654
30680A25325j01525P46Q4779M0447m9883o0062j8769l7074j08616j18549k9255
30669b72436O4710P9194M4750L9277P9694J15572R8084K9827m3381q1502q7875
30658F5914q5741o7490j0725N0786L8521n2769j15403o9550J4576K0744l1876
30647b43013k4275N8236Q8269N10q5661l1347J16009J87526J21578J6740l6175
$$ plain form
30636 168397 106483 592 -127994 -198475 -167218 -90620 -52215 -61136 -61494 -17084 55499 122840
30624 122840 161457 156963 118873 92198 109293 130540 85376 -19084 -91416 -83480 -61695 -104334
30612 -104334 -184257 -220097 -199691 -167659 -115921 9132 179115 265216 194635 48952 -51867
30601 -51867 -98911 -153124 -203207 -163484 -11929 153240 220656 175433 79312 -9556 -65471
30590 -65471 -83796 -83400 -101355 -146699 -166599 -93678 67448 227004 297863 283646 263371 291717
30578 291717 334169 316615 228515 144106 126998 146668 130624 83847 96239 212176 345179
30567 345179 368818 265572 134213 58808 24971 -21283 -79267 -92978 -23299 110639 254519
30556 254519 358323 396766 376874 334071 303937 286780 251925 187308 127415 106000 90331
$$ packed form
30636A68397o1914j05891j28586p0481L1257P6598L8405q921l58M4410P2583O7341
30624A22840L8617m494l8090k6675J7095K1247m5164j04460p2332P936K1785m2639
30612a04334p9923l5840K0406L2032N1738J25053J69983Q6101p0581j45683j00819
30601e1867m7044n4213n0083L9723J51555J65169O7416m5223r6121q8868n5915
30590f5471j8325L96j7955m5344j9900P2921J61126J59556P0859j4217k0275K8346
30578B91717M2452j7554q8100q4409j7108J9670j6044m6777J2392J15937J33003
30567C45179K3639j03246j31359p5405l3837m6254n7984j3711O9679J33938J43880
30556B54519J03804L8443j9892m2803l0134j7157l4855o4617n9893k1415j5669
$$ plain form
30545 90331 6127 -154084 -288722 -296093 -201348 -121226 -113382 -124902 -95311 -36739 15833 59487
30533 59487 80193 27384 -95895 -178762 -130217 -15598 37921 33588 75345 165749 190164
30522 190164 124712 92106 139421 123698 -56701 -251994 -250583 -92770 -6506 -65859 -110007
30511 -110007 -22116 97138 111013 55744 56318 123432 152313 86973 -11038 -53966 -24520 22783
30499 22783 18164 -67283 -196773 -296446 -318008 -272016 -208236 -181099 -220460 -301930 -354431 -337443
30487 -337443 -301454 -320043 -368745 -342765 -212075 -86437 -82290 -175191 -234724 -177717 -42887
30476 -42887 74649 130731 168820 250616 350499 352129 187274 -52700 -205355 -220024 -183933
30465 -183933 -181278 -210945 -239428 -237754 -156550 29267 226821 288875 212203 159944 233885
$$ packed form
30545I0331q4204j60211j34638p371R4745Q0122P844j1520K9591N8572N2572M3654
30533E9487K0706n2809j23279q2867M8545J14619N3519m333M1757R0404K4415
30522A90164o5452l2606M7315j5723j80399j95293J411J57813Q6264n9353m4148
30511a10007Q7891J19254J3875n5269N74O7114K8881o5340r8011m2928K9446M7303
30499B2783m619q5447j29490r9673k1562M5992O3780K7137l9361q1470n2501J6988
30487c37443L5989j8589m8702K5980J30690J25638M147r2901n9533N7007J34830
30476d2887J17536N6082L8089Q1796R9883J630j64855k39974j52655j4669L6091
30465a83933K655k9667k8483J674Q1204J85817J97554O2054p6672n2259P3941
$$ plain form
30454 233885 343316 369219 330736 289286 212580 71191 -29516 23130 149013 164828 45625
30443 45625 -51538 -11029 132548 299193 436821 485645 407461 274152 209115 222272 218799
30432 218799 182038 209150 326109 403569 327192 146741 -13653 -103361 -137259 -125525 -86570
30421 -86570 -64344 -64660 -29149 69200 159174 158679 84175 22651 34565 122248 246275 334551
30409 334551 325164 240629 174021 168360 161274 83121 -44644 -146411 -177907 -143925 -82468 -55104
30397 -55104 -94263 -142720 -118465 -52975 -63883 -160059 -198963 -105351 -5818 -39760 -145557
30386 -145557 -169809 -107753 -80271 -117402 -126559 -72441 -41032 -96234 -192758 -272029 -343047 -412130
30374 -412130 -410042 -262803 -8754 205178 248538 120784 -55094 -153088 -153283 -111885 -45872
$$ packed form
30454B33885J09431K5903l8483m1450p6706j41389j00707N2646J25883J5815j19203
30443D5625r7163M0509J43577J66645J37628M8824p8184j33309o5037J3157l473
30432B18799l6761K7112J16959P7460p6377j80451j60394q9708l3898J1734L8955
30421h6570K2226l16L5511R8349Q9974m95p4504o1524J1914Q7683J24027Q8276
30409C34551r387q4535o6608n661p086p8153j27765j01767l1496L3982O1457K7364
30397e5104l9159m8457K4255O5490j0908r6176l8904R3612R9533l3942j05797
30386a45557k4252O2056K7482l7131r157N4118L1409n5202r6524p9271p1018o9083
30374d12130K088J47239K54049K13932M3360j27754j75878r7994j95M1398O6013
$$ plain form
30363 -45872 77709 228157 293723 243229 209691 311753 467458 512171 448759 428601 497092
30352 497092 519380 397857 224571 141708 148951 137949 59717 -28747 -65544 -65836 -92280 -171468
30340 -171468 -254657 -265081 -178370 -35024 122150 272323 367260 340085 220327 161183 259584
30329 259584 407836 430562 319808 209798 157540 100783 25637 8348 54403 50346 -58972
30318 -58972 -175371 -202061 -175417 -163986 -151497 -116036 -119422 -200299 -261229 -192061 -51687
30307 -51687 2100 -66525 -143748 -146206 -109523 -89251 -86168 -101634 -167586 -262983 -273595 -115764
30295 -115764 127626 271603 240234 154341 170316 273636 305025 187772 36030 -12907
30285 -12907 10763 -16083 -99389 -122522 -40426 56719 98447 120580 145421 105894 -21701
$$ packed form
30363d5872J23581J50448O5566n0494l3538J02062J55705M4713o3412k0158O8491
30352D97092K2288j21523j73286q2863P243j1002p8232q8464l6797k92k6444p9188
30340a71468q3189j0424Q6711J43346J57174J50173R4937k7175j19758n9144R8401
30329B59584J48252K2726j10754j10010n2258n6757p5146j7289M6055m057j09318
30318e8972j16399k6690K6644J1431J2489L5461l386q0877o0930O9168J40374
30307e1687N3787o8625p7223k458L6683K0272L083j5466o5952r5397j0612J57831
30295a15764K43390J43977l1369q5893J5975J03320L1389j17253j51742m8937
30285a2907K3670k6846q3306k3133Q2096R7145M1728K2133K4841l9527j27595
$$ plain form
30274 -21701 -116601 -61321 77222 129223 45354 -63875 -86755 -15459 92991 178007 201826
30263 201826 178493 169309 203006 227992 194799 143480 138397 153947 111295 9676 -62861 -45128
30251 -45128 39958 135872 196332 190807 129785 70614 38454 -31230 -197017 -386407 -459296
30240 -459296 -386687 -273328 -203055 -156898 -97451 -40488 -10636 1704 9040 8468 9057 21306
30228 21306 17442 -31727 -84926 -77717 -39897 -63470 -137492 -130416 15211 177450 215609 148831
30216 148831 92499 88241 92424 89287 119372 206018 321848 422823 469873 435756 337207 240309
30204 240309 187461 139381 39022 -83775 -127115 -38566 118413 226203 218090 125201 41447
30193 41447 40424 111336 177129 176943 119814 62548 57504 114299 178878 160545 30702 -108946
$$ packed form
30274b1701r4900N5280J38543N2001q3869j09229k2880P1296J08450Q5016K3819
30263B01826k3333r184L3697K4986l3193n1319n083J5550m2652j01619p2537J7733
30251d5128Q5086R5914O0460n525o1022n9171l2160o9684j65787j89390p2889
30240d59296P2609J13359P0273M6157N9447N6963K9852J2340P336n72N89J2249
30228B1306l864m9169n3199P209L7820k3573p4022P076J45627J62239L8159o6778
30216A48831n6332m258M183l137L0085Q6646J15830J00975M7050l4117r8549r6898
30204B40309n2848m8080j00359j22797m3340Q8549J56979J07790q113r2889q3754
30193D1447j023P0912O5793j86n7129n7266n044N6795O4579j8333j29843j39648
$$ plain form
30181 -108946 -121665 -7854 90837 79154 17039 2712 34847 55392 52884 42320 3320
30170 3320 -74549 -134490 -129258 -108977 -136691 -161819 -92408 37776 103951 81454 64165 81977
30158 81977 50352 -52667 -109760 -52661 1749 -74549 -204466 -205173 -52326 95962 121288
30147 121288 59690 -8529 -54957 -59874 7296 108300 137299 73479 45526 152495 290020
30136 290020 271222 85062 -93270 -149670 -155450 -198832 -216522 -98087 109315 221266 133928
30125 133928 -69127 -235402 -289946 -245087 -141986 -31330 34162 39007 17699 -888 -36333
30114 -36333 -113642 -204821 -254573 -251443 -235813 -240264 -250709 -226210 -139480 -7567 99143 98631
30102 98631 -17363 -149978 -183657 -108985 -20426 6590 -7909 -5696 22618 39467 20415
$$ packed form
30181a08946j2719J13811R8691j1683o2115j4327L2135K0545k508j0564l9000
30170C320p7869n9941N232K0281k7714k5128O9411J30184O6175k2497j7289J7812
30158H1977l1625j03019n7093N7099N4410p6298j29917p07J52847J48288K5326
30147A21288o1598o8219m6428m917O7170J01004K8999o3820k7953J06969J37525
30136B90020j8798j86160j78332n6400n780m3382j7690J18435K07402J11951q7338
30125A33928k03055j66275n4544M4859J03101J10656O5492M845k1308j8587l5445
30114c6333p7309r1179m9752L130J5630m451j0445K4499Q6730J31913J06710n12
30102I8631j15994j32615l3679P4672Q8559K7016j4499K213K8314J6849j9052
$$ plain form
30091 20415 -21808 -57729 -58533 -10792 54412 64434 -19124 -133962 -177852 -142012 -121974 -165009
30079 -165009 -174156 -38341 179938 287200 199538 50450 19778 132108 283187 397410
30069 397410 470306 493288 439541 329273 228438 168322 130557 114687 139215 158024 69666
30058 69666 -137827 -328706 -377099 -326787 -314577 -373357 -402004 -323041 -185824 -91404 -71684
30047 -71684 -72604 -27789 71380 166582 189652 135604 64920 25503 8206 4314 53796 173759
30035 173759 280212 274842 201137 207872 327631 395165 259504 4199 -142537 -85228 53591
30024 53591 127139 139380 176455 240893 244821 151003 37065 -5070 23520 60934 81332 101710
30012 101710 108843 48823 -86773 -210832 -217565 -94052 73351 195953 262267 319333 387838
$$ packed form
30091B0415m2223l5921q04M7741O5204J0022q3558j14838m3890L5840K0038m3035
30079a65009r147J35815K18279J07262q7662j49088l0672J12330J51079J14223
30069C97410P2896K2982n3747j10268j00835o0116l7765j5870K4528J8809q8358
30058F9666k07493j90879m8393N0312J2210n8780k8647P8963J37217R4420J9720
30047g1684r20M4815R9169R5202K3070n4048p0684l9417j7297l892M9482J19963
30035A73759J06453n370p3705O735J19759O7534j35661k55305j46736N7309J38819
30024E3591P3548J2241L7075O4438L928r3818j13938m2135K8590L7414K0398K0378
30012A01710P133o0020j35596j24059o733J23513J67403J22602O6314N7066O8505
$$ plain form
30001 387838 406695 280634 2276 -290378 -423950 -365317 -245577 -195366 -206431 -186090
29991 -186090 -95406 22883 120053 179586 191731 151089 85680 43798 43629 65193 86492 92897
29979 92897 60510 -24564 -129038 -192259 -181825 -97090 62745 276530 458913 519891 485640
29968 485640 485536 580188 668587 624211 473801 366538 383709 447963 427890 281859 82596
29957 82596 -65810 -117116 -110998 -128195 -208912 -312569 -368812 -362312 -341299 -337623 -312913 -215505
29945 -215505 -74590 6485 -36002 -150331 -229094 -218675 -139442 -26100 94203 169198 138123
29934 138123 14950 -94301 -101856 -35323 13707 6204 -25433 -47942 -59278 -58702 -35746 8037
29922 8037 59711 109662 135682 96172 -12636 -112196 -113868 -28231 54995 87531 96448 101435
$$ packed form
30001C87838J8857j26061k78358k92654j33572N8633J19740N0211j1065K0341
29991a86090R0684J18289R7170N9533J2145m0642o5409m1882j69K1564K1299O405
29979I2897l2387q5074j04474o3221J0434Q4735J59835K13785J82383O0978l4251
29968D85640j04R4652Q8399m4376j50410j07263J7171O4254k0073j46031j99263
29957H2596j48406n1306O118j7197q0717j03657n6243O500K1013L676K4710R7408
29945b15505J40915Q1075m2487j14329p8763J0419P9233J13342J20303P4995l1075
29934A38123j23173j09251p555O6533M9030p503l1637k2509j1336N76K2956M3783
29922H037N1674M9951K6020l9510j08808r9560j672Q5637Q3226L2536Q917M987
$$ plain form
29910 101435 80113 36292 25118 70087 116823 115973 102853 143690 235774 307763 299658 210733
29898 210733 90415 8680 9877 66577 100063 71100 28923 47252 132934 221993 252701
29887 252701 227555 212682 273018 386072 433883 325897 123730 -15013 -21238 24973 31384
29876 31384 7596 -1658 -20000 -101479 -230560 -330963 -359436 -342271 -330991 -354745 -399717
29865 -399717 -413482 -355254 -255388 -184335 -149996 -85430 37758 156226 216207 253081 313062
29854 313062 368423 379193 366184 340549 237063 27902 -158383 -167081 -39773 29542 -40994
29843 -40994 -133237 -125686 -47556 15492 59324 125717 197679 211787 150342 68460 35628 69350
29831 69350 116820 106971 42311 15878 91532 193102 181427 29477 -156260 -284038 -357666
$$ packed form
29910A01435k1322m3821j1174M4969M6736q50j3120M0837R2084P1989q105q8925
29898B10733j20318q1735J197N6700L3486k8963m2177J8329Q5682Q9059L0708
29887B52701k5146j4873O0336J13054M7811j07986k02167j38743o225M6211O411
29876C1384k3788r254j8342q1479j29081j00403k8473J7165J1280k3754m4972
29865c99717j3765N8228R9866P1053L4339O4566J23188J18468N9981L6874N9981
29854C13062N5361J0770j3009k5635j03486k09161j86285q698J27308O9315p0536
29843d0994r2243P551P8130O3048M3832O6393P1962J4108o1445q1882l2832L3722
29831F9350M7470r849o4660k6433P5654J01570j1675j51950j85737j27778p3628
$$ plain form
29820 -357666 -399173 -389442 -327098 -266047 -240930 -214183 -146590 -70817 -45873 -74485 -105008 -87424
29808 -87424 -5081 113873 201325 208956 175118 179031 218908 206880 107838 969 -41301 -55571
29796 -55571 -104668 -162299 -161965 -113039 -82190 -87596 -96155 -113767 -193261 -335782 -448881 -439510
29784 -439510 -322616 -209626 -189887 -233722 -227507 -115086 20582 56065 -10676 -61007 -19149
29773 -19149 61781 101205 99480 96577 89276 52684 -1368 -45966 -82718 -115190 -120010 -94203
29761 -94203 -87277 -131584 -182975 -185947 -153263 -123802 -94130 -60616 -72169 -151257 -210381 -153724
29749 -153724 -31705 20821 -12446 -11048 85294 183995 188706 140051 141863 213643 279482 263913
29737 263913 154318 2819 -99006 -82152 26644 115858 97873 -9689 -117733 -151838
$$ packed form
29820c57666m1507R731O2344O1051K5117K6747O7593P5773K4944k8612l0523J7584
29808h7424Q2343J18954Q7452P631l3838L913L9877j2028r9042j06869m2270j4270
29796e5571m9097n7631L34M8926L0849n406q559j7612p9494j42521j13099R371
29784d39510J16894J12990J9739m3835O215J12421J35668L5483o6741n0331M1858
29773a9149Q0930L9424j725k903p301l6592n4052m4598l6752l2472m820K5807
29761i4203O926m4307n1391k972L2684K9461K9672L3514j1553p9088n9124N6657
29749a53724J22019N2526l3267J398R6342R8701M711m8655J812P1780O5839j5569
29737B63913j09595j51499j01825J6854J08796Q9214j7985j07562j08044l4105
$$ plain form
29727 -151838 -98769 -2517 71914 94432 92430 97463 90428 44246 -1386 21110 94811 120759
29715 120759 50050 -56062 -122346 -147631 -162499 -162330 -128300 -68530 1557 78910 142388 152395
29703 152395 116568 102857 142278 169196 111528 -4283 -97486 -143377 -172541 -186583 -148069
29692 -148069 -52112 48705 95324 61092 -49336 -194326 -294127 -283564 -177954 -62995
29682 -62995 -18527 -63032 -149947 -197631 -159432 -100108 -156454 -358767 -531150 -462689 -170784
29671 -170784 102113 170167 86812 10651 -6384 -12910 -17549 20203 70634 23207 -160754
29660 -160754 -357645 -401807 -262488 -57165 85226 128705 115277 98840 100584 91808 12647
29649 12647 -156041 -329883 -376338 -264336 -121972 -100092 -201677 -296826 -290267 -208394 -116277
$$ packed form
29727a51838N3069R6252P4431K2518k002N033p035m6182m5632K2496P3701K5948
29715A20759p0709j06112o6284k5285j4868J69L4030N9770P0087P7353O3478J0007
29703A52395l5827j3711L9421K6918n7668j15811r3203m5891k9164j4042L8514
29692a48069R5957J00817M6619l4232j10428j44990r9801J0563J05610J14959
29682f2995M4468m4505q6915m7684L8199N9324n6346k02313j72383O8461K91905
29671a70784K72897O8054q3355p6161j7035o526m639L7752N0431m7427j83961
29660a60754j96891m4162J39319K05323J42391M3479j3428j6437J744q776p9161
29649A2647j68688j73842m6455J12002J42364K1880j01585r5149O559Q1873R2117
$$ plain form
29638 -116277 -24335 80029 163823 179288 147161 148936 225607 322124 347784 269045 131858
29627 131858 11799 -43701 -35626 6918 61561 123660 180211 188350 110592 -16763 -79021
29616 -79021 11472 199213 312149 235680 43302 -80388 -35250 119413 275508 386875
29606 386875 440210 396589 245900 82367 32648 108892 205746 239306 208163 118606 -40621
29595 -40621 -211964 -268820 -182449 -107012 -197788 -397549 -511205 -463906 -371913 -357073 -399602
29584 -399602 -404265 -323378 -170112 19585 185704 257356 222625 151742 104320 46213 -87673
29573 -87673 -270051 -383412 -349152 -205799 -47108 72256 143190 154420 93172 -5776 -58581
29562 -58581 -10876 97056 167414 140215 35943 -78828 -135903 -87666 66070 259940 406940
$$ packed form
29638a16277R1942J04364Q3794J5465l2127J775P6671R6517K5660p8739j37187
29627A31858j20059n5500Q075M2544N4643O2099N6551Q139p7758j27355o2258
29616g9021R0493J87741J12936p6469j92378j23690M5138J54663J56095J11367
29606C86875N3335m3621j50689j63533m9719P6244R6854L3560l1143q9557j59227
29595d0621j71343n6856Q6371P5437r0776j99761j13656M7299R1993J4840m2529
29584c99602m663Q0887J53266J89697J66119P1652l4731p0883m7422n8107j33886
29573h7673j82378j13361L4260J43353J58691J19364P0934J1230o1248r8948n2805
29562e8581M7705J07932P0358k7199j04272j14771n7075M8237J53736J93870J47000
$$ plain form
29551 406940 472446 473367 409945 266721 101737 46233 144467 259062 231454 96330 25810
29540 25810 77468 128485 88289 49108 145502 350273 506462 517112 415141 271464 124051
29529 124051 902 -64322 -69936 -57444 -60434 -66540 -46095 -1206 28179 4853 -57841 -90224
29517 -90224 -29623 95767 168820 97539 -82032 -238194 -267542 -169444 -21866 80212 76747
29506 76747 -21228 -140007 -214394 -250118 -292131 -344587 -364505 -332717 -282311 -242517 -197029
29495 -197029 -121675 -30540 40905 73268 62249 10129 -50212 -46915 70708 262463 418520
$$ packed form
29551D06940O5506R21o3422j43224j64984n5504R8234J14595k7608j35124p0520
29540B5810N1658N1017m0196l9181R6394K04771J56189J0650j01971j43677j47413
29529A24051j23149o5224n614J2492k990o106K0445M4889K9385k3326o2694l2383
29517i0224O0601J25390P3053p1281j79571j56162k9348R8098J47578J02078l465
29506G6747r7975j18779p4387l5724m2013n2456j9918L1788N0406L9794M5488
29495a97029P5354R1135P1445L2363j1019n2120o0341L297J17623J91755J56057
$$ [...]
##END NTUPLES=NMR SPECTRUM
##END=
