##TITLE=31Pdec_SRglu_Ac20
 , 24 sc
 27.09.2021
##JCAMPDX= 6.0         $$ Bruker NMR JCAMP-DX V2.0
##DATA TYPE= NMR SPECTRUM
##DATA CLASS= NTUPLES
##ORIGIN= UXNMR, Bruker Analytische Messtechnik GmbH
##OWNER= root
$$ XWIN-NMR		Version 3.5
$$ Mon Sep 27 12:00:38 2021 Russian Standard Time (UT+4h)  she@DPX200
##.OBSERVE FREQUENCY= 81.013821
##.OBSERVE NUCLEUS= ^31P
##.ACQUISITION MODE= SIMULTANEOUS
##.ACQUISITION SCHEME= undefined
##.AVERAGES= 24
##.DIGITISER RES= 16
##SPECTROMETER/DATA SYSTEM= spect
##.PULSE SEQUENCE= zgpg30
##.SOLVENT NAME= CDCl3
##.SHIFT REFERENCE= (INTERNAL, CDCl3, 0, 248.564)
##AUDIT TRAIL= $$ (NUMBER, WHEN, WHO, WHERE, WHAT)
$$ ##TITLE= Audit trail, XWIN-NMR		Version 3.5
$$ ##JCAMPDX= 5.01
$$ ##ORIGIN= Bruker BioSpin GmbH
$$ ##OWNER= she
$$ F:/spectra/data/she/nmr/P31/1/pdata/1/auditp.txt
$$ ##AUDIT TRAIL=  $$ (NUMBER, WHEN, WHO, WHERE, WHAT)
(   1,<2021-09-27 11:59:20.39 +0400>,<she>,<DPX200>,
      <created by zg, POWCHK disabled, PULCHK disabled
       configuration hash MD5:
       00 E9 B6 7A A2 85 ED C7 34 08 36 98 17 FE 4E 26
       data hash MD5: 32K
       3E 18 3A 93 B2 C2 6A 59 18 10 B2 3D FC D1 06 11>)
(   2,<2021-09-27 11:59:38.64 +0400>,<she>,<DPX200>,
      <Start of raw data processing
       efp BC_mod = 2 LB = 1 FT_mod = 6 PKNL = 1 PHC0 = -8338.998 PHC1 = 660.2697 SI = 64K 
       data hash MD5: 64K
       A1 6F 6E 18 79 57 B6 06 63 2B 2B A5 C3 D9 6E 07>)
(   3,<2021-09-27 12:00:07.29 +0400>,<she>,<DPX200>,
      <pk PHC0 = -613.5807 PHC1 = 562.0005 
       data hash MD5: 64K
       1C F6 55 53 D7 92 F2 6D 0F 8F 29 77 DC C9 1F 59>)
$$ ##END=
$$ 
$$ hash MD5
$$ A2 31 7D D8 AA 3B 14 40 64 2A 98 60 0D C4 1A E5
##$RELAX= 
##$RELAX= 
##$RELAX= 
##$RELAX= 
##$RELAX= 
##$RELAX= 
##$RELAX= 
##$RELAX= 
$$ Bruker specific parameters
$$ --------------------------
##$DU= <F:/spectra>
##$EXPNO= 1
##$NAME= <P31>
##$PROCNO= 1
##$TYPE= <nmr>
##$USER= <she>
##$AMP= (0..31)
100 100 100 100 100 100 100 100 100 100 100 100 100 100 100 100 100 100 
100 100 100 100 100 100 100 100 100 100 100 100 100 100 
##$AQSEQ= 0
##$AQ_mod= 1
##$AUNM= <au_zg>
##$AUTOPOS= <>
##$BF1= 81.014009
##$BF2= 200.13
##$BF3= 200.13
##$BF4= 200.13
##$BF5= 200.13
##$BF6= 200.13
##$BF7= 200.13
##$BF8= 200.13
##$BYTORDA= 1
##$CFDGTYP= 0
##$CFRGTYP= 5
##$CHEMSTR= <none>
##$CNST= (0..31)
1 1 145 1 1 1 1 1 1 1 1 1 1 1 1 1 1 1 1 1 1 1 1 1 1 1 1 1 1 1 1 1 
##$CPDPRG= <waltz16>
##$CPDPRG1= <>
##$CPDPRG2= <waltz16>
##$CPDPRG3= <>
##$CPDPRG4= <mlev>
##$CPDPRG5= <mlev>
##$CPDPRG6= <mlev>
##$CPDPRG7= <mlev>
##$CPDPRG8= <mlev>
##$CPDPRGB= <>
##$CPDPRGT= <>
##$D= (0..31)
0 1 0 0 0 0 0 0 0 0 0 0.03 2e-05 3e-06 0 0 0 0 0 0 0 0 0 0 0 0 0 0 0 0 
0 0 
##$DATE= 1632729559
##$DBL= (0..7)
120 120 120 11 120 120 24 19 
##$DBP= (0..7)
150 150 150 150 150 150 150 150 
##$DBP07= 0
##$DBPNAM0= <>
##$DBPNAM1= <>
##$DBPNAM2= <>
##$DBPNAM3= <>
##$DBPNAM4= <>
##$DBPNAM5= <>
##$DBPNAM6= <>
##$DBPNAM7= <>
##$DBPOAL= (0..7)
0.5 0.5 0.5 0.5 0.5 0.5 0.5 0.5 
##$DBPOFFS= (0..7)
$$ [...]
##$SUBNAM2= <"">
##$SUBNAM3= <"">
##$SUBNAM4= <"">
##$SUBNAM5= <"">
##$SUBNAM6= <"">
##$SUBNAM7= <"">
##$SUBNAM8= <"">
##$SUBNAM9= <"">
##$SW= 501.771253377433
##$SWIBOX= (0..15)
0 1 3 0 0 0 0 0 0 0 0 0 0 0 0 0 
##$SW_h= 40650.406504065
##$TD= 32768
##$TD0= 1
##$TE= 0
##$TE2= 300
##$TE3= 300
##$TEG= 300
##$TL= (0..7)
0 120 53 12 22 120 120 120 
##$TP= (0..7)
150 150 150 150 150 150 150 150 
##$TP07= 0
##$TPNAME0= <>
##$TPNAME1= <>
##$TPNAME2= <>
##$TPNAME3= <>
##$TPNAME4= <>
##$TPNAME5= <>
##$TPNAME6= <>
##$TPNAME7= <>
##$TPOAL= (0..7)
0.5 0.5 0.5 0.5 0.5 0.5 0.5 0.5 
##$TPOFFS= (0..7)
0 0 0 0 0 0 0 0 
##$TUNHIN= 0
##$TUNHOUT= 0
##$TUNXOUT= 0
##$USERA1= <user>
##$USERA2= <user>
##$USERA3= <user>
##$USERA4= <user>
##$USERA5= <user>
##$V9= 5
##$VALIST= <valist>
##$VCLIST= <CCCCCCCCCCCCCCC>
##$VD= 0
##$VDLIST= <DDDDDDDDDDDDDDD>
##$VPLIST= <PPPPPPPPPPPPPPP>
##$VTLIST= <TTTTTTTTTTTTTTT>
##$WBST= 1024
##$WBSW= 4
##$XGAIN= (0..3)
0 0 0 0 
##$XL= 0
##$YL= 0
##$YMAX_a= 6960
##$YMIN_a= -2817
##$ZGOPTNS= <>
##$ZL1= 120
##$ZL2= 120
##$ZL3= 120
##$ZL4= 120
##$ABSF1= 0
##$ABSF2= 0
##$ABSG= 0
##$ABSL= 0
##$ALPHA= 0
##$AQORDER= 0
##$ASSFAC= 0
##$ASSFACI= 0
##$ASSFACX= 0
##$ASSWID= 0
##$AUNMP= <proc_1d>
##$AZFE= 0.1
##$AZFW= 0.5
##$BCFW= 0
##$BC_mod= 2
##$BYTORDP= 0
##$COROFFS= 0
##$CY= -3
##$DATMOD= 1
##$DC= 0
##$DFILT= <>
##$DTYPP= 0
##$F1P= 0
##$F2P= 0
##$FCOR= 1
##$FTSIZE= 65536
##$FT_mod= 6
##$GAMMA= 0
##$GB= 0
##$INTBC= 1
##$INTSCL= 5.30512e-09
##$ISEN= 30
##$LB= 1
##$LEV0= 0
##$LPBIN= 0
##$MAXI= 10000
##$MC2= 0
##$MEAN= 0
##$ME_mod= 0
##$MI= 50
##$NCOEF= 0
##$NC_proc= -8
##$NLEV= 6
##$NOISF1= 182.463
##$NOISF2= 159.3651
##$NSP= 0
##$NTH_PI= 0
##$NZP= 0
##$OFFSET= 248.5645
##$PC= 4
##$PHC0= -8952.579
##$PHC1= 1222.27
##$PH_mod= 1
##$PKNL= yes
##$PPARMOD= 0
##$PSCAL= 0
##$PSIGN= 0
##$REVERSE= no
##$SF= 81.014009
##$SI= 65536
##$SIGF1= 159.3651
##$SIGF2= -187.1042
##$SINO= 113.3802
##$SIOLD= 16384
##$SREGLST= <1H.CDCl3>
##$SSB= 0
##$STSI= 65536
##$STSR= 0
##$SW_p= 40650.406504065
##$SYMM= 0
##$S_DEV= 0
##$TDeff= 32768
##$TDoff= 0
##$TI= <>
##$TILT= no
##$TM1= 0
##$TM2= 0
##$TOPLEV= 0
##$USERP1= <user>
##$USERP2= <user>
##$USERP3= <user>
##$USERP4= <user>
##$USERP5= <user>
##$WDW= 1
##$XDIM= 65536
##$YMAX_p= 584957936
##$YMIN_p= -181771976
$$ End of Bruker specific parameters
$$ ---------------------------------
##NTUPLES= NMR SPECTRUM
##VAR_NAME=  FREQUENCY,     SPECTRUM/REAL,   SPECTRUM/IMAG
##SYMBOL=    X,             R,               I
##VAR_TYPE=  INDEPENDENT,   DEPENDENT,       DEPENDENT
##VAR_FORM=  AFFN,          ASDF,            ASDF
##VAR_DIM=   65536,         65536,           65536
##UNITS=     HZ,            ARBITRARY UNITS, ARBITRARY UNITS
##FACTOR=    0.620285442955139, 1,           1
##FIRST=     20137.2065510759, 0,            0
##LAST=      -20513.1999529892, 0,           0
##MIN=       -20513.1999529892, -181771976,  0
##MAX=       20137.2065510759, 584957936,    0
$$ Real data points
##PAGE= N=1
##DATA TABLE= (X++(R..R)), XYDATA
$$ [...]
##PAGE= N=2
##DATA TABLE= (X++(I..I)), XYDATA
15138 743134 180940 -749254 -1654570 -1455750 -276144 687225 977398 1170509 1638939
15129 1638939 2198953 2591852 2403167 1215172 -407690 -1272978 -1692303 -3492540 -6702996
15120 -6702996 -8412314 -6780129 -3960752 -2656851 -2052864 -255629 1425737 787189
15112 787189 -41593 3358820 10058990 12788509 6640026 -4052390 -9828008 -6064029
15104 -6064029 2420232 6424036 1793819 -6296156 -9328305 -5318322 -127358 1414997
15096 1414997 1316551 2862359 4074938 1751955 -1578314 -1219978 1143570 -580499 -6928478
15087 -6928478 -11775131 -11659322 -9518885 -7945655 -5458647 -1695098 62219 -1370319
15079 -1370319 -2342196 -548609 1324647 1419212 2651128 6676151 9125123 6031825 822389
15070 822389 -563848 1812615 3661270 3835734 4266079 4703010 3313411 1268470 1344397
15061 1344397 2677504 1964777 -454239 -535054 3239617 7736381 9655981 8625199 5726904
15052 5726904 2317392 349170 719091 1388470 68655 -1810921 -1120712 1659220 2968269
15043 2968269 1777023 758635 1646626 3156041 3964910 4265378 3938711 2648264 2047036
15034 2047036 4126100 6872451 5727090 529238 -3127470 -1378131 2740067 3996615
15026 3996615 1832378 -182899 384098 2678895 4438397 4190922 2397652 1208517
15018 1208517 1928860 2631136 292373 -4528031 -7701629 -6707674 -3113375 574994 3326119
15009 3326119 4067449 1580883 -2275643 -2824196 1426375 5941685 5876972 1988425 -1616595
15000 -1616595 -2789046 -1578223 1865461 6009054 7045790 3450453 -314130 1075660
14992 1075660 6216104 8983466 7359371 5339234 5816211 6649948 5451952 3780331
14984 3780331 3749501 3876997 1913150 -212974 1763520 7926371 12846215 11771401 5969739
14975 5969739 563309 -1306485 -233077 2410015 6131438 9404825 9245815 5278701
14967 5278701 2148293 4206663 8658092 8395054 2253170 -2274451 1041250 8554099
14959 8554099 11784223 8306848 3294732 1713397 3408420 5629408 6369755 4637236
14951 4637236 804648 -2295889 -1338363 3305400 7426192 7935703 6084984 4896690
14943 4896690 5198745 5348732 3698130 358551 -2872363 -3986546 -2584158 65080
14935 65080 3081091 6660469 9575129 8250926 1306963 -6441506 -8388263 -4202017
14927 -4202017 448873 2346586 4284619 8757911 12761828 12104983 7679094 3708256
14919 3708256 1676839 -405488 -3660898 -6526282 -7179853 -5437452 -2234499 1056465
14911 1056465 2998005 3190273 2568598 1500656 -1215196 -5688499 -8619385 -6477068
14903 -6477068 -734118 2858217 747297 -4931530 -9877110 -12085663 -11513320 -7864391
14895 -7864391 -1486204 4623701 6726280 4621226 1778376 613140 20930 -1080571
14887 -1080571 -456885 4119998 9799504 11037345 7239052 3922658 4893315 7304080
14879 7304080 7057217 5239578 5129531 5779185 3823327 188223 -693681 1596793 2203066
14870 2203066 -1424848 -5390622 -4861260 -35755 5352609 8285507 7517618 3626746
14862 3626746 -241833 -777823 875349 353626 -2743423 -3331989 1221971 6364079 6877805
14853 6877805 3706279 277810 -3525861 -8586607 -11570199 -8943675 -3563317 -1102696
14845 -1102696 -1558944 -401766 3051568 4811403 3315213 994413 -1409593 -5666937
14837 -5666937 -10290332 -10392468 -5356297 -992029 -1566269 -4674742 -6491116 -7057875 -7298468
14828 -7298468 -5606089 -1395766 1779524 938162 -1292985 -397979 3366116 5817717
14820 5817717 4875579 2297635 322497 -509425 -605054 -453943 -272691 317588 1294821
14811 1294821 903348 -2349169 -6173004 -6426507 -3464662 -2400645 -5239282 -7408375
14803 -7408375 -5117922 -1437859 -731971 -1370632 404529 2760257 1079527 -3408372
14795 -3408372 -4762062 -1694376 791656 -272578 -2068492 -1959372 -1378481 -1540959 -557730
14786 -557730 2240082 3611323 1337889 -1959609 -3286784 -3938743 -5819572 -6398850 -2319831
14777 -2319831 3831323 5633344 1502273 -3305743 -4111703 -2347397 -2040074 -3674183
14769 -3674183 -3978185 -769142 3794019 5056346 807573 -5669957 -8403936 -5271819
14761 -5271819 -310312 1970926 2556571 5066799 8505190 7900051 2628933 -1555289
14753 -1555289 -1474011 -2086726 -8175104 -14718504 -12656736 -2497627 5628412 6106285 4231172
14744 4231172 5722306 7444065 4175393 -1151040 -1518777 2838958 4915228 1935061
14736 1935061 -1456551 -1819817 -1816877 -3936185 -5166500 -1989527 3163861 4738950 1331273
14727 1331273 -3263494 -5007326 -3017421 889194 3778388 3505589 756396 -1512142
14719 -1512142 -1645227 -946153 -755489 182767 3638316 8596251 11907958 11458832 7597961
14710 7597961 2571081 -560446 22106 2856191 4716809 4791107 5093728 6005916 4715444
14701 4715444 17798 -4731203 -6455154 -7120701 -9800755 -12443808 -10427368 -4243412
14693 -4243412 329446 -60994 -2846338 -4577760 -5314639 -6232514 -6340629 -4233557 -966341
14684 -966341 1472494 3357014 6329040 9658613 10004197 6025712 1521605 1700728 6431120
14675 6431120 9661696 6889875 972003 -2097960 -1406936 -1068809 -2498298 -1844589 3222604
14666 3222604 8700633 9244296 4710550 -1290357 -6413577 -9833950 -10212453 -7333830
14658 -7333830 -3985813 -2629133 -1776861 968898 4107834 4237697 1352346 -1687969
14650 -1687969 -3697175 -5413502 -6579850 -6739536 -7560045 -10110048 -11327046 -8178986
14642 -8178986 -4080135 -5153622 -10271934 -11378825 -5206068 1477011 1202740 -4612127
14634 -4612127 -9083409 -9157949 -7427074 -6757962 -7001432 -6797979 -6164141 -6448959 -8122368
14625 -8122368 -9178699 -7049501 -2625644 -140758 -1308440 -2252405 722443 5023321
14617 5023321 5689410 3130502 1727540 2368646 2361706 1817052 3364876 5404384 2820137
14608 2820137 -4075504 -8169434 -5570613 -777215 1039840 926035 1796904 2738823 1916078
14599 1916078 750380 1021396 1350002 137590 -1311821 -1596866 -1582834 -1245483 1783124
14590 1783124 7464087 11268841 10195911 7016392 5346221 4517488 2609225 437857
14582 437857 -849207 -2113257 -3209085 -2240022 -488128 -2186403 -6079497 -4426255
14574 -4426255 4685119 11844812 9970918 5666885 7930464 12568209 9401248 280122
14566 280122 -3015693 2815020 8818096 8898923 7028983 7203062 6875586 4136152 2562315
14557 2562315 4664137 7498757 8355002 8526920 8665103 6867979 4116736 4840546 8921493
14548 8921493 9933631 5128048 647940 2340198 7226043 8897594 6250976 2105578
14540 2105578 -2043088 -5016880 -4243621 -190627 1555176 -2100411 -5812238 -3069620
14532 -3069620 3822172 7116217 4697280 1538600 1215695 2029692 1856135 1663504 2769448
14523 2769448 4151943 4199867 3305875 3578250 6414787 10287408 11246955 7184678 1194118
14514 1194118 -2267338 -4345973 -10051662 -18312963 -20122812 -10842145 1224081 4893025
14506 4893025 834995 -1222974 2203355 4332736 -83826 -6845115 -9183330 -6770735
14498 -6770735 -4044426 -3502204 -4536434 -6411015 -8691985 -9806943 -8089149 -4194943
14490 -4194943 -928303 -700122 -3649346 -7542676 -9212714 -7301560 -4058222 -2987951
14482 -2987951 -4063503 -3081388 2753727 10147707 12955603 9620252 4862143 3428160
14474 3428160 4732316 5595922 6127739 9101220 13698957 14446855 8832660 2415585 2165885
14465 2165885 6683190 8023108 2887828 -3212820 -4139308 -601328 2980193 4950745
14457 4950745 6242248 6515831 4293775 -255281 -5295822 -9038418 -9879123 -6903775
14449 -6903775 -2184937 -60776 -1688366 -3031643 -1183024 489202 -2307079 -7096904
14441 -7096904 -7787756 -3991931 -1211409 -1893761 -2356154 150786 2827502 2075325 -1602935
14432 -1602935 -5943935 -10137078 -12878104 -11051992 -4152219 2708744 4249020 1820026
14424 1820026 953418 3245022 4758592 2517624 -1269188 -2783968 -1659744 -576211
14416 -576211 -1319877 -3132052 -4489410 -4989731 -5132119 -5043359 -4118034 -1959990 652584
14407 652584 2022039 870962 -2330442 -5048581 -4076007 1530387 8433196 11348204
14399 11348204 8722602 4924729 4810753 7075943 6090098 511788 -3704622 -1070712
14391 -1070712 5649393 9015368 6823315 4204108 5481433 8090550 6959271 2141492
14383 2141492 -1407610 -803790 1391856 1429249 -573113 -1423079 721952 4497239 7438169
14374 7438169 8488252 8212550 7365975 5754345 2649019 -1505824 -4276331 -3309232 594453
14365 594453 3860702 4202278 2768572 1321639 -700250 -4221749 -7224566 -6364898 -1492329
14356 -1492329 4072595 7661601 9158728 8919275 6761284 3651728 1781514 2102677
14348 2102677 3864859 6722099 10493872 12727826 10400015 5205049 2998277 5775579
14340 5775579 8220346 5302904 -430091 -3125764 -1958485 -330142 948396 4017449
14332 4017449 8201823 9380294 6026928 1735380 534427 2772850 6331370 8942145
14324 8942145 8733368 5416064 1624536 488347 1548001 1782152 661653 784881 3079174
14315 3079174 5041886 4769916 3308978 1904219 484024 155939 3197380 8448402
14307 8448402 10594623 6904398 1320492 -1242423 -1320374 -1865263 -2015654 1036607 5841954
14298 5841954 7865718 6475215 5590081 6771297 6557813 2433048 -2644860 -4203390
14290 -4203390 -1849700 1516490 3686775 3892559 1777991 -1399562 -2073158 1875049
14282 1875049 7390274 9437141 7553875 5768368 5799344 4537509 72846 -3892411
14274 -3892411 -3339183 -754195 -1723087 -5912717 -7065937 -2787393 1216001 -421937
14266 -421937 -4477069 -3757234 2606924 8301373 8367429 4293385 561394 -73948 2659543
14257 2659543 6907937 8619920 4379628 -3673254 -8083182 -3657963 6199373 12579948
14249 12579948 10152485 2063422 -3979493 -3637679 364935 2328733 435203 -2098939
14241 -2098939 -2556038 -2293731 -3011148 -2739445 685605 4478649 4106668 455899 -1552166
14232 -1552166 -1049080 -1758125 -3802102 -2088412 4288081 7906283 3329258 -3815032
14224 -3815032 -4278607 1947427 6798495 5919428 2609594 809672 477763 443811 486433
14215 486433 -479809 -3749225 -7251264 -6752821 -1898833 2602547 2998297 248626 -3129510
14206 -3129510 -6053931 -7293898 -5014130 -318022 2219259 414707 -1935825 -354011
14198 -354011 3798450 5471306 3017066 -364801 -1673431 -1473782 -1999270 -4203806 -7229258
14189 -7229258 -9319674 -8940083 -6080193 -2635920 -732755 -678154 -1081784 -638205 823420
14180 823420 2608663 3707568 3307740 1418286 -916778 -2121951 -897895 2741959
14172 2741959 6570415 7299384 4232841 1033912 1666134 5043128 6533420 4701287
14164 4701287 2859893 2962988 2167533 -1932335 -6311624 -6489063 -2888016 817941 3652361
14155 3652361 7056570 10028179 9696885 6614174 4459042 3870303 1588808 -2877141
14147 -2877141 -4889283 -1671423 2861413 3909302 2743452 3534714 6007087 6264874
14139 6264874 3654024 1924906 3539388 6794354 8996713 9177377 7422887 4831689
14131 4831689 4355700 7959904 12229537 10874409 3267599 -3486925 -3646160 -357515
14123 -357515 -308848 -3613012 -4080862 1130041 7220317 8535948 5901187 4502934 6368515
14114 6368515 7900622 5005844 -1270061 -5541758 -4259077 136090 2164575 -249258
14106 -249258 -4050194 -5901701 -6371014 -7630566 -8864935 -6852497 -949979 4952483
14098 4952483 6361652 2943716 -1258184 -1986056 812270 2649495 -549036 -7027536
14090 -7027536 -10648332 -8693769 -5588148 -6509583 -9909429 -10257345 -6544740 -3204248
14082 -3204248 -2895874 -3456836 -2865759 -2273572 -2304811 -1072224 1498700 1812323 -1417506
14073 -1417506 -3274848 800243 7440757 9203736 4231266 -2556000 -6607871 -7352487
14065 -7352487 -5460616 -1597140 1734521 1725835 -291726 137345 3995936 7018602 5990175
14056 5990175 3099748 1907040 2334355 2466135 2650759 4364718 6369023 5354883 405728
14047 405728 -5494812 -8775613 -8603389 -6542274 -4116020 -1713928 203928 32222 -3210261
14038 -3210261 -7013260 -6810968 -2024291 1800877 133816 -3280602 -1196579 5772069
14030 5772069 8757125 3254452 -4058454 -5010375 -1132791 620676 -424793 1277091
14022 1277091 6765543 9640693 5796737 -185026 -2005611 -419829 -378481 -2255948
14014 -2255948 -1420227 3748360 8323884 7206801 1974535 -1244290 669857 4908335
14006 4908335 6976259 5402661 1636529 -2468422 -5248730 -4684698 152323 6941635
13998 6941635 11416609 11593512 9408429 7693844 7123830 6988685 7276351 8324694 9318116
13989 9318116 8742089 6019402 1696090 -3361172 -7820047 -9634237 -7498291 -2613684
13981 -2613684 1903585 3449628 1674105 -1219668 -1481194 3151234 9984881 12597495
13973 12597495 7793566 176492 -2940203 -412379 2249543 1160804 -1184126 -801760
13965 -801760 1996856 4551683 6563966 8863393 9205872 4208503 -4205111 -8945788
13957 -8945788 -6448708 -1622011 -989275 -3605493 -3110009 2369715 7403713 7197283 3661639
13948 3661639 1094485 -147620 -1625539 -1384453 3854173 11529231 13770373 6810255
13940 6810255 -4046034 -10846666 -11086084 -7267578 -1903621 3476199 6493443 5203105
13932 5203105 1018635 -2371481 -3053701 -2097743 -1233959 -1151461 -1722136 -2375934 -2565764
13923 -2565764 -2639541 -3125787 -2638627 1014855 6276403 7792719 3799255 48518 1938312
13914 1938312 5757774 3848092 -3234283 -6950422 -3449470 1347102 1461231 -1160931
13906 -1160931 -2022441 -1528315 -2216789 -3068356 -1940396 -450704 -1089354 -1849336 881535
13897 881535 5667033 7602325 5713944 3607967 2932236 1322117 -2419977 -5736551
13889 -5736551 -6312375 -4868641 -2576972 765089 4350046 5518377 3447308 970991
13881 970991 527849 675608 -960438 -3316617 -3325912 -617524 1889547 1752713 -715625
13872 -715625 -3760280 -5876930 -6037764 -3958494 -957965 386518 -1551297 -5495465
13864 -5495465 -7898315 -5983684 -546361 4402329 5246928 2036092 -2173438 -4856058
13856 -4856058 -6060540 -7120311 -8585813 -9919814 -10319687 -9145203 -6126794 -1937471
13848 -1937471 1600167 2558944 643645 -1952370 -1834393 2441612 8087363 10005905
13840 10005905 6041121 -404869 -4142866 -3820594 -2286919 -2150346 -3263786 -4520923
13832 -4520923 -5480835 -5297530 -2430437 2866774 7438504 8563401 7344031 6826104 7521915
13823 7521915 7170850 5015740 3796853 5963576 9340201 8880558 2990980 -3831480
13815 -3831480 -6150394 -4265905 -3397655 -6185859 -8964377 -7241398 -2266840 1219075
13807 1219075 2345557 4767811 9578163 12195291 8813032 2509337 -608774 704681
13799 704681 2559090 2396070 1589441 1400048 378179 -2512541 -5223430 -5508885 -4475314
13790 -4475314 -4468520 -4602485 -1717926 3921008 7078252 3652671 -3506017 -7436007 -5178189
13781 -5178189 -564851 1435054 657207 502185 2537701 4654498 4078317 190639 -5630458
13772 -5630458 -11136941 -13842570 -12288595 -7654565 -3150270 -1044951 -853397 -691403
13764 -691403 460029 2203099 3555306 3781112 2815129 1022648 -1641369 -5517826 -9474664
13755 -9474664 -10432652 -6610280 -589349 3252666 4068385 4464586 5108536 3211308 -2091810
13746 -2091810 -6390543 -4874886 1579134 7760873 9807740 7251827 1498769 -4654070
13738 -4654070 -7417151 -5245423 -1180346 535677 -639225 -2402709 -3900647 -5788010
13730 -5788010 -6941817 -5132349 -1250433 651771 -1592096 -5756576 -8118346 -6380264
13722 -6380264 18067 9193827 16294878 17302335 13881599 10808647 8384160 2464344
13714 2464344 -6589551 -11129425 -6419075 1378395 3075545 -967255 -2602198 1350759
13706 1350759 5107511 3472789 -899940 -2620027 -1342149 -561555 -1244269 -768927 2275850
13697 2275850 5404995 5218616 1520394 -2551588 -4114687 -3544025 -3487451 -5131644 -6506282
13688 -6506282 -5189660 -1691315 1273090 2279301 2161964 1677475 463264 -971049
13680 -971049 -477440 2672996 5394920 3947160 -668077 -2924956 468880 5796295
13672 5796295 6450225 1318834 -3472372 -2153494 3549238 7097960 5654524 2745900
13664 2745900 2382174 3956267 4558377 3470790 1804478 -246543 -2684676 -3568532 -1066588
13655 -1066588 2750700 3571693 539568 -2912955 -4415436 -5313160 -6703192 -6557941 -3494108
13646 -3494108 -514088 -1373522 -4772880 -5887083 -3239014 -557750 -1244617 -3873089
13638 -3873089 -4455597 -1310986 3524894 6513275 5447335 1246888 -2420869 -2511964 -221983
13629 -221983 173377 -2998321 -5914255 -3875403 2154402 6048539 3833735 -1614961
13621 -1614961 -4429529 -2824642 -280373 8680 -557690 1411923 5924117 9203825
13613 9203825 8616909 5701245 3334617 1833518 -321173 -3115696 -4616728 -3623926
13605 -3623926 -767543 2882250 6306113 7706207 5721855 2270479 1752862 5808693
13597 5808693 10609257 11169411 7077317 2187920 -194335 220573 2182919 4406236
13589 4406236 5541935 4650584 2339029 395533 32840 1105650 2689521 3564528 2665966
13580 2665966 139473 -2440665 -3645440 -3177004 -798940 3745123 8372586 8853931
13572 8853931 4196590 -516331 -579114 1058369 -1818641 -8189954 -10352221 -5725548
13564 -5725548 -952471 -1310233 -2900854 -436340 2961992 703175 -6102202 -10011108
13556 -10011108 -8418664 -6058778 -6073231 -5461478 -1540722 2600162 2473808 -1345035 -4229670
13547 -4229670 -3152570 806089 4383862 5138796 3274755 1152076 719653 2078048
13539 2078048 5079048 10188009 15845837 17634579 13539457 7786822 5121258 3516107
13531 3516107 -1642531 -7810704 -7413203 -172194 4929534 2810284 -253693 3003809
13523 3003809 9529391 11144748 6438094 1014141 -1173576 -699565 1149374 3440944
13515 3440944 3932683 1171304 -2434602 -3508777 -2501658 -1919523 -1461090 847889 4083353
13506 4083353 5429754 4803229 4306096 4025668 2500860 398355 -431092 -531559 -1288909
13497 -1288909 -1142060 1971196 5751415 6439746 5455114 7143564 10532116 10055604 4942204
13488 4942204 983618 1487827 3104187 2745455 2063319 2166423 445501 -3319751 -3665875
13479 -3665875 2620602 9924113 10549134 4656765 -1469182 -4058062 -3754660 -1399019
13471 -1399019 2743349 6604921 7558179 5626206 2583740 -869929 -4378186 -6271159
13463 -6271159 -5698517 -4661629 -5049748 -5680785 -5158163 -5067384 -6760318 -7563708 -4495475
13454 -4495475 312785 2411898 1491621 365798 -824539 -3985702 -7455656 -6744709
13446 -6744709 -1467120 3335117 3841606 1444885 -707296 -1379988 -575764 1350268 2924916
13437 2924916 2699670 1526143 1049181 446708 -1910990 -4253813 -3208850 391045 2299344
13428 2299344 1786107 2560544 5657746 6835769 3371489 -1306114 -2653423 -838886
13420 -838886 1125434 1562004 16208 -3487818 -6697875 -6270451 -2972593 -1733160 -4035827
13411 -4035827 -5025449 -1545842 2212383 1926817 890697 3958269 7770750 5160866
13403 5160866 -2592858 -6439202 -2714947 2276338 2561204 232024 -102968 1399515
13395 1399515 1925503 857775 -1188536 -4395863 -7330519 -6236455 -666776 3623344
13387 3623344 1971547 -1916173 -1245563 3455439 5332798 1911760 -1703497 -1433241
13379 -1433241 106851 -736856 -2511941 -2101733 -412794 -125375 -557769 433352 1400023
13370 1400023 -634387 -4055418 -4075795 -307888 2578535 2579513 2954188 5228571 5650869
13361 5650869 2057294 -1401635 -1157277 -693741 -4034094 -7247634 -4231058 2045004
13353 2045004 3171194 -767605 -713161 6383232 11771840 8202373 670931 -1952360
13345 -1952360 596008 2637198 2712636 3749498 6132128 7498361 7647673 7664337 5851372
13336 5851372 540985 -4450725 -3599899 1543493 3658949 137257 -3824010 -3875137 -2504394
13327 -2504394 -3860031 -7089055 -8018517 -4854590 253754 3837421 4012445 1913079
13319 1913079 448209 639886 424573 -1229307 -1579641 1090013 2717714 -1173071 -7217659
13310 -7217659 -7760096 -2018747 3158409 3968900 3835777 5683381 7533881 8102481 9365085
13301 9365085 10566946 7350832 751736 -1054424 4609857 8677924 3987367 -2441330
13293 -2441330 -165701 7752826 9792278 4282893 684588 3512612 6729212 5662716
13285 5662716 3784297 4175793 3438011 -1157314 -5687004 -5777768 -3232007 -1942458 -1975324
13276 -1975324 -1930940 -2819210 -5309464 -6814712 -5309354 -2786381 -1383295 453698 4217636
13267 4217636 7260343 6698424 4371463 3423394 2561972 -1318714 -6499126 -7492222 -2384344
13258 -2384344 4888839 9531364 10006911 7562050 4681442 3892577 5624741 7439707
13250 7439707 7127928 5497730 4189833 2506153 -808625 -4188314 -4921344 -3218573
13242 -3218573 -1496811 -506038 711855 1953238 2368878 3142640 6022129 9484142 9996807
13233 9996807 7154750 4129896 2915069 2575639 2373056 2866758 3293164 1605605 -1711819
13224 -1711819 -3181591 -912822 3297979 7251455 10321565 11186654 7702763 1249979
13216 1249979 -2378932 587391 6964698 10596523 9130377 4712360 378567 -1762226
13208 -1762226 -947064 1046852 997041 -1222844 -1420826 3078934 8777424 10238314 6903150
13199 6903150 2513998 -150786 -486405 1725215 5036005 5136612 -157080 -6006227
13191 -6006227 -5930199 -1178551 1319300 120007 1116812 6570766 9893032 5576881 -1915690
13182 -1915690 -4787296 -2744009 -1043452 -1244395 -759666 371475 -647165 -3118361
13174 -3118361 -3026744 -37857 1711318 857821 785304 2567561 2216869 -1857371 -4554833
13165 -4554833 -1821459 2330625 2219109 -40744 1742859 6958433 8484268 3706136
13157 3706136 -1760952 -2858883 -1471313 -1376427 -1962183 -655533 1971993 3334044 2865583
13148 2865583 1872050 1132599 1161968 2974476 6145312 8070134 7679268 7728671 10340390
13139 10340390 12316221 8780537 423579 -6740949 -8497360 -5925880 -2207662 369991
13131 369991 153911 -3229239 -6932063 -6784882 -2408582 2074961 3253642 1679298 -757893
13122 -757893 -3404276 -5323407 -4460750 -699323 2684513 3055938 1883022 1684451 1444699
13113 1444699 -1785659 -7665254 -12083725 -12100039 -9141438 -6799375 -6858913 -7900013 -7057873
13104 -7057873 -3198449 1195937 1926141 -2393188 -8320301 -10851000 -8111041 -2335883
13096 -2335883 2752048 4767626 4030439 3232564 4943002 8581084 10739410 9191001
13088 9191001 5434642 2564048 2019529 3304681 5301681 6722596 6797533 6568130 7685325
13079 7685325 8942071 6688537 625756 -3696847 -1302980 5414365 9841527 9491674
13071 9491674 7358165 6040415 4896771 3133419 1737540 1383472 1311608 925785 57370
13062 57370 -2312888 -6678527 -10461259 -10272700 -6975040 -4815395 -4955140 -3951500 9098
13053 9098 3554298 3102255 -142409 -2856925 -4295775 -5477684 -6199648 -5794409 -4861921
13044 -4861921 -3632505 -675288 4145818 7765557 8123356 8059915 11178798 15461594 15338742
13035 15338742 9422615 1992191 -2979780 -5015136 -4187786 168865 6157253 8990441
13027 8990441 6744759 3318404 2698286 2998382 -76478 -5711176 -8514628 -6434751
13019 -6434751 -3687217 -4321424 -6575252 -6288642 -3178610 -103946 2341821 6114622
13011 6114622 10576085 11693341 8290171 5145645 6512779 9421245 7802069 1771692
13003 1771692 -2174313 -451258 2865795 2380620 -1194119 -2677993 525860 5478385
12995 5478385 7060491 3090912 -3203474 -5711346 -1872744 3768757 4835448 1391870
12987 1391870 -886315 -24372 -951328 -7037859 -13594610 -14215659 -9899331 -6707350 -6807728
12978 -6807728 -7287136 -6436796 -5500505 -4279791 -492972 5226901 8233539 5896848 1608276
12969 1608276 588622 3565015 6284965 4404657 -1834792 -7309496 -6876057 -1254502
12961 -1254502 3434637 3290794 1343675 2187435 4823260 4961510 2110732 -819432 -3337387
12952 -3337387 -6698573 -8279527 -3813561 3982008 6517177 1524425 -3025506 -953218
12944 -953218 3101753 2120941 -1851258 -1894348 2241037 4834668 4662014 6690989 12660921
12935 12660921 16889085 14093155 6739878 1592200 1652707 4060965 4527716 1915287
12927 1915287 -1271343 -2135371 -832167 -57595 -958191 -1302253 1051381 4587216 5876736
12918 5876736 3638850 -528966 -4028188 -4429159 -884568 3688445 4302606 270156
12910 270156 -2923621 -1422164 462280 -3572739 -11418845 -14554346 -9926177 -3593207
12902 -3593207 -1535243 -2484017 -1951060 1258246 5010599 6793810 4806950 -579593
12894 -579593 -5046787 -3779688 1782327 4851569 2785498 724366 2738883 4692502
12886 4692502 1134104 -4719514 -4653076 2355544 8159853 6437165 545531 -1573624
12878 -1573624 2944883 9454148 11433335 7188163 1366516 -166261 2914773 5227066
12870 5227066 3030989 -913902 -2132724 -1220951 -1877044 -4180348 -4953789 -4103466 -4881464
12861 -4881464 -7076301 -5785278 588053 6297913 5930254 2002255 484224 1993913
12853 1993913 2694995 1870278 2565596 4939409 4957943 1362941 -1093925 1719523 7195644
12844 7195644 9938476 9100263 7883183 7467938 5832066 2358299 -543837 -1405852 -1811593
12835 -1811593 -2829541 -2288156 1800135 7042638 8903049 6399591 2919517 1526783
12827 1526783 1912112 2285199 1931395 966647 -530288 -1838340 -1418582 1209646 4360027
12818 4360027 6171996 6791452 7133989 6349283 2719601 -2681917 -5372702 -2081649 4815778
12809 4815778 9192581 7821902 3910196 3055363 6474900 9876986 9123970 5007069
12801 5007069 1143526 -1017779 -2533342 -3275118 -1511025 2030985 3249021 340670
12793 340670 -2186003 1184502 8816343 13200669 10841776 6849696 7541081 11641187
12785 11641187 12512620 7770435 2417882 1564445 3625581 3378886 -335481 -3538771
12777 -3538771 -3444016 -2214684 -2872642 -4320725 -3334404 -53777 1928820 976968 -248736
12768 -248736 1088728 4093745 5969950 5823808 4806337 3964313 3875472 5169391 7344621
12759 7344621 8125306 6228859 3798850 3454659 3762399 1113405 -3893740 -6092775 -3331318
12750 -3331318 -450927 -2429392 -6427219 -5354053 1453335 6162926 2660468 -5128806
12742 -5128806 -8444721 -5046213 -1152095 -2021972 -4809155 -3290450 2985612 8280820
12734 8280820 8933602 7832977 8997003 11230043 10624631 7410312 5942004 7864911
12726 7864911 9453368 7346810 3639882 2642362 4623552 5728918 3363159 -817120
12718 -817120 -3247799 -2109201 1335330 3847366 2917007 -663219 -3496158 -3711939 -3184405
12709 -3184405 -4220594 -5649699 -4740733 -1976144 -678920 -1901200 -2896528 -1446492
12701 -1446492 1179639 2815927 3416405 3929919 4231381 3761413 2565974 525390 -2523414
12692 -2523414 -4846300 -3600671 746328 3617350 2368478 305303 1444883 4046924
12684 4046924 3851094 1785467 2788045 7190108 9117320 5100037 -627537 -2079589
12676 -2079589 964613 4385271 5846177 6247958 6674972 6730118 5386683 2065301 -2335990
12667 -2335990 -5052113 -4024461 -1400574 -1699809 -5427268 -7810631 -5650581 -1763932
12659 -1763932 71574 825101 3059480 5471376 5456555 4565134 5825367 7297592 4497764
12650 4497764 -1211390 -3128151 928174 5353057 5339160 3074118 2418717 2509603 773377
12641 773377 -1530861 -1390203 774991 2331808 3257623 5628692 9073458 10558014 8847911
12632 8847911 6164781 4779770 4112624 2070618 -1846784 -5424233 -5702792 -2444189
12624 -2444189 766797 359223 -2494954 -3349054 -868565 1495958 1259202 441567 1040249
12615 1040249 900227 -2147644 -5240793 -4242977 -370181 1834895 1612227 1960546 3606542
12606 3606542 4554962 5178751 7683738 10096150 7315511 -210508 -5467231 -5299601 -5149887
12597 -5149887 -9064908 -11544092 -5941794 4009790 9107742 8081419 7420726 9121343
12589 9121343 8124702 3285603 1448263 6317845 11073827 8237625 1120497 -1711515
12581 -1711515 607366 1748048 -363540 -967801 2188800 4610317 2623640 -999117
12573 -999117 -2399893 -2652011 -4450059 -6655876 -6461991 -4270322 -2323372 -652231 1628777
12564 1628777 2934904 1375995 -1149078 -1411629 -349980 -1479415 -4392630 -4842178
12556 -4842178 -1562088 1995200 3681955 5358342 7726740 7414488 2398851 -3481838
12548 -3481838 -5149007 -2855454 -766797 -994158 -2253324 -2909440 -2263551 156905 3833774
12539 3833774 6416115 5834422 2743149 -624829 -3007404 -4169489 -3931284 -2828119
12531 -2828119 -2358917 -3058763 -3813273 -4230423 -5425865 -7022451 -6343044 -2816081 38141
12522 38141 77672 720048 5561584 11649218 13147942 9862082 6830386 6639720 7621361
12513 7621361 8927396 11262365 12249412 7590139 -1161030 -5844393 -1988617 4738538
12505 4738538 6118904 1840982 -1756855 -941940 1812504 2659392 1030903 -1129363
12497 -1129363 -2435820 -3187102 -4148126 -5129919 -5423027 -5574397 -7248134 -10273034 -11616720
12488 -11616720 -9450438 -6569353 -6673222 -8561254 -7981479 -4540889 -2071966 -1917622
12480 -1917622 -1056448 1635931 2473942 -837730 -4463891 -3572127 979686 4664904 5311088
12471 5311088 3520684 -390843 -5629021 -8722403 -6641651 -1839447 -234467 -3638297
12463 -3638297 -7377584 -6417308 -1285054 3534238 5383073 5831012 7758400 11478271
12455 11478271 14391714 14045833 10668236 6531241 3786677 3404400 4963882 6515734
12447 6515734 6048843 4297358 4175034 5720149 4404639 -2238219 -8979226 -8723330 -2305656
12438 -2305656 3062253 4126195 4010045 4457607 3036030 -222031 -583670 3812372 8317364
12429 8317364 8986771 7409114 5062146 -161235 -7099021 -8239833 -231451 8607263
12421 8607263 9065429 4311801 3737509 7535290 7405619 1014054 -4210642 -2518273 3190841
12412 3190841 7425449 8312598 6179825 1947375 -1466150 -1189994 1231087 2203559 2569124
12403 2569124 5941297 10751262 10912440 5514654 946868 1365840 3563306 3772387 3223784
12394 3223784 3792902 3957872 2648046 1956302 2589681 1659292 -1495166 -2466075 1141585
12385 1141585 4702918 3324024 -727657 -2309398 -1262222 -629635 -194134 2485474
12377 2485474 6529713 8422580 7053280 3954367 99838 -3581873 -4462980 -1380649
12369 -1380649 2109937 2054999 73731 419190 2725004 3038775 1104145 675231 2321731
12360 2321731 1778101 -2987000 -8089918 -9352952 -7485634 -5212003 -2852272 224278
12352 224278 2425063 1528822 -1864682 -5107812 -6937321 -7977169 -8317577 -6713996 -2682017
12343 -2682017 1765294 3389428 1029072 -2490867 -2616963 1958187 7342841 8854955
12335 8854955 6767155 5510523 7090142 8097507 5000077 300057 267218 6529765
12327 6529765 12787130 11647219 3259543 -5161864 -7979531 -6466287 -4590179 -2658761
12319 -2658761 1526249 6790068 8478682 5125563 1322102 1701242 4942986 6500167
12311 6500167 4985845 2502155 166430 -2683461 -4998652 -3674097 1958393 8023966
12303 8023966 10267225 8670970 6440543 5784124 6429964 7430413 8304677 8138126 5367531
12294 5367531 -96885 -5148839 -5675870 -1205177 3875254 5095814 3161598 2658711
12286 2658711 5788085 9595794 10003662 6564020 2184784 -103891 1035170 4809665
12278 4809665 8101821 7319820 2294136 -2804342 -3884575 -868181 4038879 9538464
12270 9538464 14219476 14833626 9599405 2200175 -1428417 29396 3062362 5207969
12262 5207969 6778356 7069137 4237309 35943 -740464 2361429 3940979 1466565
12254 1466565 -197460 2620345 4938443 777640 -6122115 -7363355 -3070674 -950910
12246 -950910 -2987430 -2975052 1193871 3076625 -255386 -1385505 5277437 12589935 10988395
12237 10988395 3819062 1950785 6555029 8443232 3770322 -693364 327643 3335085
12229 3335085 4319075 5314192 7900978 7901288 2508590 -3311865 -3696987 -470342 946713
12220 946713 90587 159173 1746147 3541091 6072917 9243743 9379547 4511465 -567190
12211 -567190 -611058 1843274 1111649 -1989051 -2722878 -1850032 -3588511 -5779389 -1867406
12202 -1867406 7079744 11994136 9066214 4245838 2151927 -264465 -5237193 -8207045
12194 -8207045 -5659207 -1596291 -446947 167569 3690794 7393206 7291612 5623979
12186 5623979 6891999 10024001 10546174 7562707 3062742 -2669359 -9367123 -13387841
12178 -13387841 -11819182 -7758003 -6135806 -6583263 -5782838 -4277882 -4715689 -5331615 -2033678
12169 -2033678 3770964 5998188 2720635 -1656585 -3538843 -4001883 -4676233 -4919179 -4519056
12160 -4519056 -4900236 -6137214 -6332999 -5070565 -4100343 -3677318 -1674385 2407413 5640720
12151 5640720 5408229 2632766 34519 -1047486 -1199374 -1634045 -2810498 -3601422 -2395204
12142 -2395204 195953 1325608 44829 -673925 1774714 5557016 7347978 7063399
12134 7063399 6470803 5520107 3915555 3934990 6976921 9231325 6124313 -127973 -2976217
12125 -2976217 -941569 1183219 579837 -44832 1827652 4727809 6836614 8714338
12117 8714338 10446786 10130685 7235051 4175334 2895887 2682762 2305027 1450841 -394010
12108 -394010 -3307933 -5081689 -3676712 -1518156 -3009569 -7404395 -8843297 -4410573
12100 -4410573 2462428 7703450 10851661 12101495 10163591 5626342 2296836 2518124
12092 2518124 4389485 5529426 6194420 6984040 6993517 5908798 4605822 2672111 -778173
12083 -778173 -3256844 -1002263 3856332 4120063 -2144471 -7955053 -7306989 -3132579 -1543062
12074 -1543062 -3342352 -5586149 -6811197 -6200324 -2127917 3696916 5164846 55175
12066 55175 -5002222 -3638818 417527 -575021 -5882874 -7654874 -3042357 2666032 4728054
12057 4728054 3850921 1831038 -1438364 -4997334 -5789402 -2592291 2178914 5547493
12049 5547493 6307091 4447482 1159055 -985316 -735048 -280801 -1812169 -3502676 -2574417
12040 -2574417 -617462 -1189139 -3348395 -2917888 204019 1547723 -642619 -3006842
12032 -3006842 -3071761 -2528153 -2820930 -2335350 -382865 273495 -2184036 -5077941 -5116084
12023 -5116084 -3264841 -2861175 -4697157 -6464682 -5746566 -1716592 4655503 10352289
12015 10352289 11810998 8728332 5374112 6202929 10669339 13982479 12728296 8203755
12007 8203755 3840625 686543 -2955352 -7341418 -9008054 -5153703 700482 1344958
11999 1344958 -4791920 -10827092 -10304806 -5292201 -2145286 -2453729 -2911817 -1971611 -1199628
11990 -1199628 -901401 354028 1898253 1406095 -677327 -1609754 -1204702 -1506059 -1781797
11981 -1781797 672732 4397848 4597363 1341904 422415 3734236 5555502 2049743
11973 2049743 -2039643 -1253791 1740917 1377532 -1368675 -1860507 -852744 -2914268 -7285321
11964 -7285321 -8000563 -3403767 1337125 2552319 2800454 5023976 7207748 6132885
11956 6132885 2877163 1286623 3003260 6329628 8468857 7370412 3043665 -1711838
11948 -1711838 -3627035 -3001284 -3358492 -6026900 -7669929 -5213232 -954078 194312
11940 194312 -2431291 -4119083 -966666 4808358 6980188 2289546 -5575440 -9587204
11932 -9587204 -6881451 -1459485 1406366 1768167 3571838 7660482 10014043 7832425
11924 7832425 3805278 2149595 3082363 3882348 3423649 2687936 2045872 935535 -433932
11915 -433932 -1515439 -2859463 -4866865 -6156531 -5731539 -5451165 -7042886 -7933953 -4524936
11906 -4524936 819325 1463343 -3718828 -7917042 -6531053 -4302632 -7396166 -12396918
11898 -12396918 -10009428 1233467 11454268 11298415 2768381 -4387867 -4200530 566111
11890 566111 3695603 2886503 1123281 1954064 4859830 6051521 3316622 -1309406 -3921480
11881 -3921480 -2430962 2411525 7838747 10170788 7248796 1205623 -3047823 -3503243
11873 -3503243 -3034777 -4091175 -4414529 -1130086 3408496 4063135 147117 -3626847 -3054353
11864 -3054353 1846008 8365788 13148813 13354259 9068484 4122287 1695151 258484
11856 258484 -2985501 -6576212 -7126342 -5529853 -5445469 -6449019 -4522532 791796 5676014
11847 5676014 8644332 11543721 13329976 9790559 1303250 -5664541 -7024458 -4865722
11839 -4865722 -1123731 5084190 11165476 10486425 2674985 -3322882 -1963987 744231
11831 744231 -1795353 -5546514 -3965352 -356390 -1838495 -6028974 -4989074 432631
11823 432631 1571781 -3636001 -8027727 -7576585 -6259508 -6832038 -6198587 -2934556 -985986
11814 -985986 -1982812 -1069171 5064767 11702560 12314494 7145444 1622628 -635975 36863
11805 36863 1598588 1961716 218572 -2247513 -3429968 -3575478 -4075532 -4170584 -2186594
11796 -2186594 565878 1232254 378535 1100275 3433548 4338790 3040911 1454259 -332138
11787 -332138 -3490555 -5797645 -3838234 255423 1280798 327214 3465902 9979258
11779 9979258 11298226 4822308 -702895 1238983 4767373 1812488 -4992844 -7504253
11771 -7504253 -4246354 700549 6040255 11866948 13725481 7303591 -2672963 -6701286
11763 -6701286 -3132916 883045 883987 244685 2896948 7228197 9195839 7222718 2817571
11754 2817571 -354574 1861399 9630537 16713009 16524968 10161851 4275940 1742271
11746 1742271 -538368 -4547826 -7300537 -5588864 -419818 4901042 7981924 7737390
11738 7737390 4714042 1826585 1870257 3820340 4393906 3092830 2160084 1716465 -568570
11729 -568570 -4175556 -4752021 -361546 5137593 7212823 5941490 3984299 2348319
11721 2348319 780572 -75311 296463 662631 -341135 -2203085 -3698867 -4590733 -4907516
11712 -4907516 -4415324 -4085973 -5656414 -7928776 -6405034 340167 6336707 4452273
11704 4452273 -4097749 -10798931 -10336901 -5617675 -1417706 2038281 6097030 8316336
11696 8316336 5215403 -1121747 -4496359 -3118606 -1903146 -4457132 -7131995 -4432498
11688 -4432498 2709812 8172118 8405274 4889471 -687 -5027042 -8110108 -7023177
11680 -7023177 -3263177 -1349061 -2737209 -3887911 -1985789 954441 1842658 1092488
11672 1092488 802373 1093451 1049106 1052165 1535497 1481000 655299 1120853 3881785 6347300
11662 6347300 6087373 4800887 5218269 6322625 5565751 3911878 4143148 5327495 3898724
11653 3898724 200687 -751852 3828209 10448226 13623028 11734884 7572459 4902894
11645 4902894 5119327 5973754 3887271 -1190626 -4476317 -1986970 4031313 8125149
11637 8125149 8599431 7939578 7471289 5891916 2927778 302698 -1320294 -2668395 -2886770
11628 -2886770 -132087 4340218 6637904 5665249 4299754 4165014 3209229 56282 -2890258
11619 -2890258 -2707255 422004 4233166 6469091 5368761 1314122 -1652694 1856
11611 1856 3202316 1448420 -4861839 -7590691 -2955045 2297212 1368215 -2350213 -2046289
11602 -2046289 830649 14217 -3733403 -3595644 1189420 3431691 -207554 -3856464
11594 -3856464 -2270896 1049191 409504 -2900786 -3877626 -2775396 -4474799 -9986617
11586 -9986617 -14198709 -12832126 -7521632 -2489116 886782 4145637 8048744 11073212
11578 11073212 11601414 10162156 8547085 7121469 4450555 389206 -1897381 769674
11570 769674 6621651 10044953 8410599 5046365 3819886 3725141 1955796 94985 2602016
11561 2602016 9350986 14332136 13292782 8821017 5453682 3193789 -408890 -4181651
11553 -4181651 -4390336 -1623545 -1513481 -6589212 -11389446 -9260544 -1806875 2696674
11545 2696674 29256 -4982522 -5666878 -2239209 -159488 -1659166 -3115773 -1179944
11537 -1179944 2498242 4792160 6127764 8354378 9512093 5651238 -1766107 -5156939
11529 -5156939 -62819 8360487 11553067 8047172 3891747 3693619 5496833 5210366
11521 5210366 2554878 549276 861610 1794672 915525 -1184426 -650222 5024145 12357925
11512 12357925 14312887 8731130 1762129 212226 2766536 2677340 -2295291 -7349897
11504 -7349897 -7841026 -4282601 504181 4556534 5602403 1370712 -6174808 -10488623
11496 -10488623 -7544347 -952894 2707955 1692375 -297518 333460 3366632 5892623
11488 5892623 5711657 4070016 4840711 9411708 13378875 11621098 6006758 3381897
11480 3381897 5674133 7635334 5821303 3565409 4126709 5073575 3692042 2322320
11472 2322320 3246566 3437516 168845 -2864281 -1446396 1465739 1150244 397506 5054681
11463 5054681 12788653 15178125 10261275 4677114 3168333 3721342 3722606 3369281 1761245
11454 1761245 -3222771 -9476069 -11621761 -9011526 -6528956 -6167586 -4596376 -813631
11446 -813631 921431 -1532045 -4483554 -4952387 -4616809 -4430523 -1973486 2447836 3850067
11437 3850067 856945 -667867 2922532 6352796 3840917 -1587025 -3616057 -2544396
11429 -2544396 -2746578 -4115756 -3207380 -396788 799992 68839 315703 2557974 5436958
11420 5436958 8260820 10454897 10106364 6939370 4096196 3345299 2264685 112539
11412 112539 1157348 6487313 8595218 2343049 -4159034 -222696 9730759 11632234
11404 11632234 3447582 -2337916 499695 2785106 -3109115 -9985453 -8080455 -726823
11396 -726823 2381934 646363 618139 2874838 1513277 -4551246 -8978442 -7244781 -1483554
11387 -1483554 4507225 9041171 10662319 8118778 3525817 1110119 1805638 2887623
11379 2887623 3166243 4214918 6129363 6825387 6402064 7370180 9303008 8412587 4479730
11370 4479730 2861698 6327246 9819108 7777454 2591846 405279 1473068 753954
11362 753954 -3360166 -6984692 -7278128 -5454293 -2639507 1925421 7068227 9068154
11354 9068154 7207151 5682484 7265978 8895084 6745365 2246543 -714653 -1820827
11346 -1820827 -3409815 -5497459 -5962609 -4591375 -3076290 -1824785 -416516 -290711
11338 -290711 -2859299 -5419060 -3402489 2887274 7895444 7922015 4768612 1551977 -839744
11329 -839744 -1667104 836390 5954181 9452139 9022920 7663934 8541721 9659160 7747321
11320 7747321 5014546 6759779 12744156 15999558 11633285 3145838 -2189161 -1882460
11312 -1882460 273705 138779 -1843441 -2138134 874309 4643394 5214167 1443511 -4013389
11303 -4013389 -7373692 -6690412 -2649113 2472904 6567398 9116915 10791529 11378636
11295 11378636 9337337 4694540 938482 1437024 4522505 5133675 1584283 -2353133
11287 -2353133 -2942228 -961070 888078 2184368 3988786 5846991 6269207 5152095
11279 5152095 3461642 1252624 -1838626 -4468528 -4054556 111656 5418584 8313597
11271 8313597 7822812 6243895 6127904 7035657 6452836 3935885 2148790 2556482 2728170
11262 2728170 548567 -1449300 28722 2850120 2455061 -2741 1130003 6280767
11254 6280767 9106869 6738378 4567039 6996046 9822860 7236341 1260679 -2025357
11246 -2025357 -1845455 -1695010 -1707090 1003230 5651353 8000109 7102226 6159705 6546871
11237 6546871 6285754 4917589 4785627 6412438 7089280 5432066 3567400 3454836 4228213
11228 4228213 4295072 3316939 1412066 -1017121 -2421802 -1752676 -818646 -2015687 -4109797
11219 -4109797 -3833220 -1374000 -148248 -933203 -686300 1906021 4048051 3475494 1641861
11210 1641861 719181 911096 2098198 4567105 6730667 5828607 2347226 -56200 -337448
11201 -337448 -1333320 -3627542 -3464754 351030 2947636 984132 -1303185 985479 4944967
11192 4944967 4978951 2989177 5484781 11868249 13998957 8496315 1933686 1001886 3725630
11183 3725630 4307847 1903233 46830 434966 1635251 2370612 2661681 2728809 3151115
11174 3151115 4713794 6020389 3383319 -4032461 -10857755 -10834903 -4414161 2259941
11166 2259941 4915892 4141189 1842590 -744892 -1508207 1259491 4863312 4015408 -1479114
11157 -1479114 -5138468 -2468989 2863137 4856373 3437253 2698560 3917982 5241311
11149 5241311 6295211 7980592 8845577 6804909 3942537 4454717 7745276 8701805 5513753
11140 5513753 2202822 2181256 4103104 5634670 6564405 6336687 3536650 387152 2572459
11131 2572459 10779604 16934508 13632327 4068234 -2220720 -1021891 3884008 7646847
11123 7646847 8749243 7315270 3853367 78921 -2389897 -4288341 -7039442 -9498917
11115 -9498917 -9362917 -7180072 -5604998 -4782905 -1844452 4331881 10530114 12497893
11107 12497893 9422650 4530057 1889864 2406862 2746638 -459247 -5090419 -4920345
11099 -4920345 2022189 9580279 10726662 6110350 2010044 1932019 4104423 5745066
11091 5745066 5583299 2809812 -2426625 -7260476 -7977781 -4025910 1783810 6422057
11083 6422057 8114426 6268324 2591893 799163 2423826 4516285 4160283 2869585
11075 2869585 3056098 2936066 -380087 -5037291 -6984840 -6557438 -6827274 -7016455 -4110066
11066 -4110066 -192771 -951737 -6423000 -10286924 -9583944 -8154485 -8543803 -7634607 -3457752
11057 -3457752 224346 205318 -849819 330284 1973265 1427388 601263 2327891 4808592
11048 4808592 4573778 2241692 843297 916459 1550870 3748263 8080624 11194685 9689089
11039 9689089 6021667 5465980 7959857 8170411 3910156 -429987 -257732 3327472 6045653
11030 6045653 6039603 4634268 3052654 707043 -3100332 -6817294 -6901704 -1364220 6804990
11021 6804990 11248474 8599076 2298497 -1372541 -164771 3130807 5778476 8224450
11013 8224450 11212757 12472125 9068851 2430496 -1817021 -78703 5022901 8193439
11005 8193439 7592083 5235346 2723688 3153 -1981159 -1589822 -467246 -2909820
10997 -2909820 -8992358 -12422269 -8678488 -1819990 973822 -1182959 -3523983 -3327795
10989 -3327795 -1870581 -324653 1019899 458794 -3019204 -6082777 -4664150 -474747
10981 -474747 1449008 848699 1766731 4481481 4922252 2635018 2013398 4097650 4480898
10972 4480898 1689793 288436 2423914 3521885 580310 -2127376 -659120 1684307
10964 1684307 856075 -356562 2156207 5811697 6153651 5515730 8813993 13595411 12919446
10955 12919446 7056799 3853571 6786695 10298084 9076761 5503545 4610917 6333330
10947 6333330 6425970 2421060 -4154940 -9890908 -11985454 -9967876 -6266040 -4104463
10939 -4104463 -4166597 -4334395 -2964792 -1041583 -542279 -1829199 -3397043 -3583082 -1948851
10930 -1948851 749953 3394798 4994374 4732484 2662654 697321 1280026 3846029
10922 3846029 4409994 756023 -3763643 -4441945 -1445291 1753274 4256209 7210422
10914 7210422 8972340 7159119 5100324 8767146 16092825 17510026 10311616 4310618
10906 4310618 7781074 14981354 15063923 8071551 3497286 5740861 9432468 8727912 4162844
10897 4162844 -525658 -2995642 -2659373 -368654 1586689 1911450 2305587 4507293 6831314
10888 6831314 6872714 5939570 6881119 8877263 8633875 5946992 3963942 4362925 6012786
10879 6012786 7875813 9536119 9475285 6801045 4372863 6135081 11160023 14169806
10871 14169806 12479064 8871900 6834201 6256988 5107666 2706357 -76395 -2079062
10863 -2079062 -2249977 -181510 2887931 4523880 3236260 -55163 -2798030 -3220318
10855 -3220318 -2382254 -3185349 -6250757 -7989078 -5078884 371388 3632748 4278938 5469184
10846 5469184 6796832 4297173 -1231429 -3076443 1167881 5154065 3871395 1419109
10838 1419109 3004645 5526298 3459650 -871682 -1089449 2653972 5072298 5200361
10830 5200361 6187187 7336835 4917547 556495 511266 5514220 8658160 5300984 -968910
10821 -968910 -4328593 -3698972 -1724194 -731040 -1455801 -3097554 -3933108 -3744616 -4557731
10812 -4557731 -6724538 -6853324 -3182704 68520 -1498961 -5299277 -5963659 -3725258
10804 -3725258 -2128004 -271677 4852894 10353719 10559881 7443579 8844713 15664045
10796 15664045 19664971 15760790 8336566 3200413 1032500 1263095 4668397 8892658
10788 8892658 8639674 3989466 1910727 5776860 9783233 7892103 2337982 -1237679
10780 -1237679 -1790730 -1489426 -1006830 -502827 -1171048 -2097740 166109 5475468 8236899
10771 8236899 5385675 1332916 859319 2185708 2037361 2549881 6849308 11621947 11082106
10762 11082106 6137692 2874866 2964766 2023669 -2296823 -6487748 -6982459 -5121705 -3877531
10753 -3877531 -2751730 1041412 7486001 12644509 13385076 11600726 11706276 14179048
10745 14179048 14441636 9640588 3536716 1463461 2834263 3122993 1750481 2491939
10737 2491939 6147245 8546494 7195686 4873986 4657880 5678340 5895050 5314536 4598251
10728 4598251 3987135 4977151 9155982 14048625 14544801 10236628 6815293 8098386 11342644
10719 11342644 12901919 13576292 15086538 15925903 14604472 12904486 11935525 9048186
10711 9048186 3228321 -329207 3357456 10712344 13498226 9643092 4691782 3085830
10703 3085830 3407395 2888102 1824499 1660739 2123556 2627828 4456559 8949465 13995876
10694 13995876 14602029 8263052 -945271 -5483452 -2246173 4188532 7342614 6022282
10686 6022282 3718492 2825822 2807787 3065439 3844419 4418799 3847104 3567468 5819940
10677 5819940 9434241 10758032 8950832 6702305 5559130 4568398 3889542 5289033
10669 5289033 8142469 9418131 8922839 10080877 13810572 16120909 14112246 10306189
10661 10306189 8400284 8362109 8491362 8960262 10115939 9942033 6602473 1993651 -9790
10652 -9790 1851796 5044106 6073615 3805574 697317 558607 3939971 6701375 5055542
10643 5055542 641817 -2117330 -2129674 -1571740 -1234335 -290893 331472 -828042 -1733074
10634 -1733074 911918 5533512 7006484 4487025 2843687 5334963 9297260 10093698
10626 10093698 5852490 -1654022 -7450002 -6062706 1899295 7925447 5676854 302783
10618 302783 959223 6760291 8941954 5416223 3024492 5111064 7285775 7176350 8098675
10609 8098675 10383370 9253944 4906085 4519190 9559860 11147903 4249999 -2792822
10601 -2792822 -508478 7666882 11869654 10264186 8502034 9062232 9551174 9416363 10990599
10592 10990599 14194443 15458770 12405919 6828296 3069571 4536521 10810556 17865300
10584 17865300 22226761 23750861 22744013 17754422 9945693 5378652 7047455 8918125
10576 8918125 5272765 1325909 5008587 12513531 13795926 9429694 8730496 12724011
10568 12724011 13352001 9623920 9593335 14600860 16411037 12800069 11331407 14105924
10560 14105924 13346964 6444992 1233326 1847958 3282433 4022101 9330384 17651733
10552 17651733 19231573 13198651 10294650 13709485 13933751 7978842 5680939 10376921
10544 10376921 12027427 7214792 6838093 15248169 21108724 18316242 16182510 19226150
10536 19226150 18016312 10712061 10977175 21913775 25722215 13990684 4417517 10907998
10528 10907998 21144010 22053950 22862663 32256459 37313124 28195744 20120348 26380225
10520 26380225 32813637 24625127 14974263 19512421 26186276 19777229 12968268 21639778
10512 21639778 32422825 27782691 20239030 27311977 36437036 31121822 26616643 40271709
10504 40271709 53072966 43475208 31439684 42082788 55954342 47754418 40968330
10497 40968330 63367908 84444186 69147358 55542485 91244759 132104380 116938899
10490 116938899 109974511 217550020 360335608 306810561 -209 -309766246 -368300519
10483 -368300519 -226146747 -113745328 -114907545 -127687660 -88907061 -57753514 -74035728
10476 -74035728 -86034788 -57181558 -30368743 -41524882 -58055344 -47251309 -33173675
10469 -33173675 -42601487 -54769037 -45944064 -33724735 -38783228 -45250355 -34436754 -21082494
10461 -21082494 -23531252 -30087710 -24899736 -18467674 -24506948 -32100285 -26885323 -17401354
10453 -17401354 -16824605 -19000576 -14007690 -8550705 -11295309 -15435916 -13249442 -11118956
10445 -11118956 -14615117 -15638070 -8802136 -3603878 -6782312 -9800756 -6761711 -6895960
10437 -6895960 -15976685 -23198964 -20265478 -15966093 -17797117 -16750682 -5682626 3903600
10429 3903600 32919 -9178008 -9547100 -3065371 -620595 -3372125 -5774017 -7561077
10421 -7561077 -9906601 -8632044 -2310998 1948712 91649 -1770361 -101857 -1723800
10413 -1723800 -9948046 -15804972 -12857320 -7878163 -6892874 -4282616 3305673 6353085
10405 6353085 -1543473 -10219404 -8930300 -3635754 -4575210 -8293259 -6680731 -3299422
10397 -3299422 -5406636 -8831195 -6104401 -1919048 -5409004 -13294552 -15009946 -9605155
10389 -9605155 -4687414 -3215668 -3017986 -4674403 -9017205 -11565762 -9178439 -6788067
10381 -6788067 -8712507 -10256238 -7059738 -4565772 -7987133 -11556336 -9061369 -6249215
10373 -6249215 -10227132 -15111892 -12023045 -5486077 -5053143 -7597783 -3861836 3083696
10365 3083696 2761539 -3201693 -3586112 2253108 3476482 -2890862 -7499917 -5291136
10357 -5291136 -2240960 -2751600 -3033685 -431564 1570907 803299 -511551 -2211597 -6775612
10348 -6775612 -12087020 -12602472 -8817511 -6585359 -6399299 -3084030 2921840 4507794
10340 4507794 231850 -2706573 -961688 -266456 -3808369 -5263813 274808 6586710
10332 6586710 5133053 -1921386 -4966112 -146999 6999971 9597622 6177150 -3681
10324 -3681 -4648726 -5232514 -2364457 1145500 3097863 3380756 2575684 231223 -4623619
10315 -4623619 -11270354 -16014191 -14504684 -7010055 -230144 -638703 -6350769 -9676470
10307 -9676470 -7880534 -6038242 -7901489 -10309813 -9917073 -9211991 -10938839 -11920963 -8388432
10298 -8388432 -3223485 -1579237 -2461617 -921998 3728135 7766905 9221058 8778178
10290 8778178 6335994 1788452 -2362499 -3871737 -4380027 -5817803 -5827209 -1926196 2325705
10281 2325705 1353857 -3760738 -6560345 -4499281 -1586981 -1806502 -4395681 -5967223
10273 -5967223 -4157964 536379 4392813 3417385 -1381115 -4235436 -2179893 1243637
10265 1243637 2295925 2366546 3454398 3451664 647861 -1965728 -2198042 -3555690 -8694824
10256 -8694824 -12935224 -11193490 -6811529 -5888905 -7026109 -5088267 -1548199 -1828321
10248 -1828321 -4812390 -4509752 -811665 678892 -1185801 -2252361 -2051546 -4148852
10240 -4148852 -6952804 -3961163 4604258 9496792 5340932 -1837071 -4014211 -1580356
10232 -1580356 76156 -917337 -2566770 -3633890 -4439466 -5079622 -5705018 -7164196 -9575692
10223 -9575692 -11296970 -10190015 -5417601 1423122 6372830 6380017 3730698 3999071 7557015
10214 7557015 7660429 719526 -6621220 -6512908 -1574841 -139010 -3062302 -3693353 618010
10205 618010 5533080 8059161 9847634 11425053 10434857 6946130 4172806 2747183
10197 2747183 112478 -3593797 -4926326 -3209244 -1486629 -623481 1875049 6343256
10189 6343256 9749806 10741539 10664887 9342574 5410075 917858 -398031 432798 -837206
10180 -837206 -3643976 -3134654 733478 2162481 -877059 -3375963 -1835423 946906
10172 946906 2272785 3945239 7134465 9137639 8723956 8958027 11096617 10997256 5492868
10163 5492868 -2110031 -6510871 -6751206 -5419244 -5175090 -7993241 -13780383 -18163850
10155 -18163850 -16269161 -10138294 -7066778 -8935502 -9455221 -4671418 477074 361259
10147 361259 -2441648 -1830619 2527306 6003357 6185412 4418262 2183933 44518 -1059470
10138 -1059470 -447921 1258357 3186698 4727210 4576069 2108595 59424 2009211
10130 2009211 6510706 8167917 5613298 3327507 3828180 3682040 207850 -3216224
10122 -3216224 -2524246 719688 2585879 2783720 3144490 2938297 -4715 -5060413 -8931464
10113 -8931464 -9048627 -5299287 -132295 2267685 -276611 -4286241 -4259030 -578011 892937
10104 892937 -1644797 -2548499 2164391 7854766 7834968 2778000 -1129317 -512755 2931852
10095 2931852 6149701 6873903 3948595 -1186631 -4769461 -4763305 -2956765 -1687260 -1194271
10086 -1194271 -1494873 -3228382 -4899519 -3456003 164235 680970 -3454304 -6619345
10078 -6619345 -4590736 -1607068 -3586161 -8367237 -9034674 -4424681 193660 1866067
10070 1866067 3174197 6223378 8541399 6708629 1015634 -4909603 -7470187 -5690069
10062 -5690069 -1787498 760641 495395 -1146811 -2440672 -3359739 -4498948 -5980323
10054 -5980323 -8092514 -10786119 -11913693 -8811290 -2678892 1675105 1837747 398788
10046 398788 103699 81229 -860664 -880848 1721032 4765072 4977919 2582674 288458
10037 288458 -558022 -368608 357765 802686 -382093 -2957497 -4365413 -2857757 289124
10028 289124 2968513 4554503 4845816 3269930 614922 -973154 -1130807 -1872120 -4026344
10019 -4026344 -6170110 -8020021 -10884858 -13238321 -10585684 -2622716 3838780 2972546
10011 2972546 -2408942 -5347237 -4141895 -2910061 -4441135 -6745930 -6516170 -3152356
10003 -3152356 908187 2627797 1417297 -99277 505252 1968148 1622476 185361
9995 185361 447393 1723909 543717 -2773427 -3728335 -1107416 847384 -145733 -455788
9986 -455788 3019895 7526562 8853373 6613880 2224555 -3676940 -8706988 -8576775 -3184133
9977 -3184133 1542198 1468049 -479952 -418425 -75643 -2820063 -7169201 -8905590 -6770267
9968 -6770267 -2481635 1975220 4346301 2950958 -13539 54956 3383070 5179348 3416397
9959 3416397 1399416 766355 -848733 -2608654 490383 7240321 8139669 -175710 -7426233
9950 -7426233 -4521405 2227222 1027177 -7973875 -15124999 -15821452 -12682807 -7525646
9942 -7525646 -1053982 2756212 1305438 -441292 2997568 7734165 6573378 1439885
9934 1439885 -39008 2445263 2589509 -557856 -1762589 -241301 -1194096 -5941698 -9120938
9925 -9120938 -6961906 -1498022 3868455 6912259 5396421 -429369 -5155225 -4003281
9917 -4003281 279423 1978559 1074681 970739 972697 -1509801 -4351694 -4068089 -2836211
9908 -2836211 -4420138 -6317994 -4009160 337610 1569420 322731 -8624 -652219 -3410716
9899 -3410716 -4710276 -2868910 -4739180 -14530279 -23309816 -21802267 -15803854 -15065169
9891 -15065169 -15567180 -9323810 -2957613 -6988958 -14598157 -12951336 -8165215 -14194291
9883 -14194291 -24096842 -21512819 -14806688 -25170115 -44099429 -44745720 -38122570 -66460454
9875 -66460454 -123140962 -133643466 -54081464 54384055 98326979 69592057 37156712
9868 37156712 41014815 53618142 45063708 29036634 27440842 32906392 29625970 21715629
9860 21715629 19329379 18362504 12526200 8203275 11240483 13866533 9029841 4324242
9852 4324242 8277824 14966281 15234803 12344002 13662258 16242041 13363345 7806529
9844 7806529 6523772 8031030 6140452 1559104 -130408 1666470 3291253 4207397
9836 4207397 6303586 8817096 9982596 10399351 9802715 5052984 -3405215 -8252799 -4600621
9827 -4600621 2037712 3278060 -930553 -4764048 -5849882 -5518174 -3491126 838778
9819 838778 4644947 5366934 5453474 7691354 9102090 5904356 1469341 2103329 6946404
9810 6946404 9351923 7173070 4609234 4290002 4432920 4216570 5479846 7970613 8655441
9801 8655441 7177484 6852665 8743117 9688588 8076878 6780819 7803128 8301983 5355419
9792 5355419 1464969 1415045 5401267 8940898 9056937 7414988 6892594 7479716 6979379
9783 6979379 4593783 2104753 1366080 1987015 2488289 2832532 4084890 5746744 5536591
9774 5536591 2571011 -1075602 -3162683 -4004524 -4901386 -5345662 -3903041 -1178082 208698
9765 208698 -1248790 -4188384 -5982129 -5289040 -2928447 -670254 771971 2276574 4311530
9756 4311530 5195253 3131385 -384399 -1790682 -477894 427767 -648582 -1157552 708199
9747 708199 2197101 605229 -1319092 727142 5277289 7087198 5655913 5863107 9471908
9738 9471908 11960727 10016101 6726117 5794196 5224534 1481785 -3426914 -4476525 -1424608
9729 -1424608 1282154 1591182 1450459 1313052 -1149148 -5177452 -5271308 1154747 8557583
9720 8557583 9906153 5648273 1489110 -621853 -3628184 -7784038 -7999212 -1311197
9712 -1311197 7220736 9898883 5675185 572468 -368888 1722208 2811120 1646220
9704 1646220 478603 1302309 3246912 4018526 2927722 1565083 1500747 2195141 1922570
9695 1922570 356929 -844652 -269536 1342105 2041725 1072200 -246130 155604 3197798
9686 3197798 7811276 11654553 12943417 11974089 10637753 10028602 8893131 5443497 906145
9677 906145 -235005 4671014 11575835 12698127 5774216 -1967756 -1868365 5502690 11409583
9668 11409583 10361872 6039055 4494062 5921906 6405233 4514622 1965142 -410188
9660 -410188 -3072485 -4977958 -4238632 -1411388 1044586 2230579 2701638 1741093 -1453414
9651 -1453414 -4326486 -3149556 864235 2052956 -1741122 -5715588 -4551912 992433
9643 992433 6000148 7154600 4672220 932435 -1002480 451995 3379212 4457815
9635 4457815 3605394 3691933 5174055 5031892 2500618 1373643 3772670 5703417 2778080
9626 2778080 -2661943 -4607966 -1786597 1288733 851799 -2368394 -5804386 -8044796
9618 -8044796 -8403184 -5922621 -360679 6241981 9780994 7067872 -141650 -5010860
9610 -5010860 -2054248 6261327 11942557 10627801 5413199 1488249 732100 2348006
9602 2348006 4676838 4856582 668339 -5445283 -7939161 -5334497 -1859916 -722564
9594 -722564 -785652 -1558252 -5223038 -10665274 -12026293 -7505604 -3218691 -3179323 -2198905
9585 -2198905 4474525 10906129 8659008 520195 -3520139 -1012104 1753076 1345937
9577 1345937 384452 -88217 -1954750 -3504975 -596966 4696530 5250983 240606 -3007890
9568 -3007890 -574545 2746609 2377696 360482 -609363 -2247890 -5567966 -6985899 -3997034
9559 -3997034 470053 3328056 5941736 9567514 11142346 8082213 3274861 1073627
9551 1073627 1616240 2627166 3486662 4197660 3687240 2370982 3139191 6760741 9638477
9542 9638477 9047287 7070130 6347328 5746151 3729677 2255838 3234724 4334609 2720264
9533 2720264 465686 1793293 6494409 10007909 9148652 4883258 438047 -1144422
9525 -1144422 1072026 4572487 5477353 3170392 647725 -573284 -2513533 -6249692
9517 -6249692 -9270538 -9576279 -8656751 -7817972 -5400444 -723604 2893763 2523717 -166924
9508 -166924 -2294281 -3920445 -5550392 -5246602 -2178290 497457 504249 661608 3599105
9499 3599105 5817232 2646476 -3544552 -6116473 -3541149 -290139 720156 1133647
9491 1133647 2836382 5344665 7576603 8524192 6720547 2546890 -104614 1656705
9483 1656705 4928710 5054393 3023219 3721873 7506401 9087599 5459683 94856 -2112437
9474 -2112437 -370156 2719035 4394541 3417381 906976 -236922 1293161 3198277
9466 3198277 3204810 3037162 5445900 8970839 9869706 8043112 6452140 5529840 3179370
9457 3179370 -61278 -1134097 83293 724136 829207 3670783 8973851 11656001 9706872
9448 9706872 7947050 10605390 14654015 14434980 9517901 4065717 993742 478205 2131236
9439 2131236 4793522 5475118 2237308 -2213761 -2878394 1382553 6380656 7758613 5857566
9430 5857566 4636329 6715591 10455535 12020640 9806426 5987304 3466254 2471873
9422 2471873 1264579 -748577 -2253833 -1966348 205119 3612501 7009508 8582168
9414 8582168 7413262 4795260 2859511 2282319 2391715 2577534 2197233 363506 -2258594
9405 -2258594 -2717244 795397 5717020 7665850 5351325 847934 -3466185 -5465409
9397 -5465409 -2635709 5055663 12494163 13878892 9854534 6414270 6746644 8152689
9389 8152689 7271548 4148773 328092 -3058764 -4176265 -1323805 3640195 6145187
9381 6145187 4654610 2457434 2533547 3936142 4613709 4455627 3917203 2784229 1959533
9372 1959533 3401432 6581229 8013059 6097830 3565330 3330138 4715261 5518190 5035778
9363 5035778 3327496 301023 -2693654 -3078149 -504750 2520090 4595799 6755394
9355 6755394 8729237 7978340 4312042 1257662 577026 -128233 -1755047 -843213 3769362
9346 3769362 6713196 3903093 40688 1684233 6258014 5649070 -978078 -6072178
9338 -6072178 -5571691 -4029767 -5709592 -7384518 -3999350 3116266 8082243 7968030 4792796
9329 4792796 1532322 -657853 -1680383 -1532182 -801687 -1013537 -3493837 -7466931 -9638149
9320 -9638149 -7063656 -1121589 2984363 2225905 -240369 676287 4930142 7593239 5970553
9311 5970553 3143808 3277775 5920172 6912593 3817421 -1287680 -4309501 -3447570 -648420
9302 -648420 972505 473051 -801543 -1798183 -2758993 -3581047 -3375918 -2570716 -3176311
9293 -3176311 -5346682 -5794780 -1895667 4244413 8200296 8345056 6181219 3130285 35399
9284 35399 -1317591 205684 2291879 1515509 -1265117 -1269343 3565163 9366398 11135805
9275 11135805 8326759 4175651 1593711 1405379 3060708 5269443 6660090 6957832
9267 6957832 6925778 6666961 5203288 2518647 624367 1187158 2982124 3320703 1675774
9258 1675774 178799 205664 264071 -1297071 -2765819 -938243 3322561 4698947 763892
9249 763892 -3154937 -528747 6375465 8266524 1175893 -8137859 -11219615 -7640366
9241 -7640366 -2557008 1075251 3373289 3880429 2329952 1328323 3321408 5876512
9233 5876512 4657482 462700 -1408055 1241938 5013385 6391685 5518946 3809987
9225 3809987 1777982 349759 943898 3008490 4114634 3157088 1112777 -1172729 -3117849
9216 -3117849 -3015226 -163727 2157557 15047 -5199313 -8506260 -8475512 -7385219 -4895190
9207 -4895190 1563932 9414503 11680292 7528410 4508046 6813762 9049515 6470965
9199 6470965 3478189 4954629 6244580 799902 -7250487 -8221032 -1787546 3084470
9191 3084470 1923851 -1046199 -2309972 -3099425 -2867570 1859717 9307356 11695794 6646070
9182 6646070 1890224 4051463 9476427 11411540 10046069 9156095 7989772 3820272
9174 3820272 -846008 -1083757 2137344 3260814 997099 -429899 1210072 3387355
9166 3387355 4145467 4518252 4326563 981345 -5254083 -9475890 -8506752 -5313772 -4128165
9157 -4128165 -4621238 -4426964 -4375676 -6637211 -9303002 -7755626 -1616272 3751886 3814943
9148 3814943 -73127 -3428075 -3794697 -1508588 2364452 6403063 8328070 6608296
9140 6608296 2583959 -536960 -865701 915152 2992579 3809318 2444590 -700279 -3544598
9131 -3544598 -4201652 -3292596 -2710885 -2086205 1000804 6415941 10015115 9039812 6505634
9122 6505634 6827394 8673681 6562828 -518541 -6718033 -6975325 -2924219 1242343 4770702
9113 4770702 8310121 9125302 3942757 -4462341 -9211793 -8447805 -7221552 -8756417 -9439303
9104 -9439303 -5940066 -2204229 -3703919 -7931045 -7500133 -1873315 1158318 -2772226
9096 -2772226 -7897318 -6995682 -1712697 893279 -1001858 -2483783 2474 4313466
9088 4313466 6837271 6739990 4801442 1625254 -1267170 -1490764 901825 2270364 -214290
9079 -214290 -4341301 -5130152 -765472 5255169 7694279 4554006 -1029127 -3504665 -368094
9070 -368094 4947091 6931367 4754863 2982191 4950367 8274659 8810304 6523050 4538273
9061 4538273 4108470 3936501 3683521 4556825 6148133 5895580 2804255 -630136 -1487500
9052 -1487500 194463 2141760 2657279 1802658 740844 584912 1248229 1322408 -59588
9043 -59588 -1514615 -928029 1477546 3251565 2970540 1640179 648299 225726 404973
9034 404973 1561615 3230523 4111742 4021442 4193282 5027304 5412481 4941886 4626171 4538722
9024 4538722 3261672 996067 502403 2946630 5371981 4795929 2434914 907591 -438872
9015 -438872 -3619117 -7137000 -7406567 -4297719 -919440 1788156 5515357 9326243 9228051
9006 9228051 4719202 774026 498289 440055 -2870573 -5903499 -3193643 3166166 5563930
8997 5563930 1944849 -1512680 -212490 2156817 41206 -5126905 -6976476 -2983815
8989 -2983815 2995653 6277231 6003309 4414849 4328309 7274393 11477180 11847757 5146511
8980 5146511 -4488214 -8658016 -4545416 1819329 3995038 3158701 4520156 8898174
8972 8898174 12375220 12522497 10129583 5648749 -844482 -5993162 -4958315 1518850
8964 1518850 6654530 6373550 4049923 4015054 5128594 4567445 3625168 4686095 5613293
8955 5613293 2756265 -2373479 -4907746 -3967018 -3052337 -3961178 -5439633 -7163740 -9582308
8946 -9582308 -10205490 -6039816 40159 1665852 -1406762 -2748349 63392 1615503
8938 1615503 -1325994 -3548962 -372290 3755198 2503867 -1597739 -1581527 2121028 2690982
8929 2690982 -1488695 -4394359 -2134813 1880286 3337553 2865834 3125784 4382999 5257560
8920 5257560 4763805 2182496 -2217256 -5615271 -5133063 -2599702 -3116731 -7731107 -11311348
8911 -11311348 -9412346 -3788015 954701 3039266 3486651 3074878 2076335 1414703 1811724
8902 1811724 2727500 3513077 4538383 6226442 8089898 9263727 8903855 6359353 2665840
8893 2665840 975180 2724479 4357134 1778155 -2629231 -2680239 1652590 3252076 -1323686
8884 -1323686 -6725431 -8039691 -8396929 -11777198 -14106007 -9108666 747127 7262700
8876 7262700 8270441 8190499 8032585 3923307 -3396030 -6579863 -2594305 1844516 345554
8867 345554 -3840019 -4155235 -1488923 -1894570 -6258279 -8985791 -6543908 -1762765 1051498
8858 1051498 1013656 -321065 -1371608 -787092 1926152 4851598 5061428 2658852 1272535
8849 1272535 3402541 7449248 10771645 13395014 16406225 18460981 17053492 12820455
8841 12820455 9512481 9076177 9327169 7651724 4722109 2733691 1833949 801083 110361
8832 110361 1315224 3564882 3898472 1831108 645698 2318726 3772045 1081067 -4130050
8823 -4130050 -6019652 -2180410 3282614 5299702 3693725 1620047 283827 -1839901
8815 -1839901 -5043335 -6662735 -4483197 2814 3427494 4644918 5130211 5676046 4928955
8806 4928955 1964937 -1464551 -2673025 -1037084 1929493 4508151 5517341 4317942
8798 4317942 1891885 917579 2521503 3707029 803625 -4741783 -7229567 -4018893
8790 -4018893 1150878 3525868 3165108 3314258 5138715 6593675 5565988 2408658 -9598
8781 -9598 1811857 8416099 15060915 15558846 9880544 5135528 6782969 11636784 12639828
8772 12639828 8192607 2910864 651158 977636 2106637 3397503 4395727 4467596 4122104
8763 4122104 4491765 5206200 4751087 2908041 907987 -576953 -1623610 -1695601 -213599
8754 -213599 1886940 3077640 3104177 2294326 468982 -1307818 -1034 5135997 9519151
8745 9519151 8396666 3346785 -814957 -3703212 -8137184 -12491086 -11506493 -5454507
8737 -5454507 -1250390 -2211161 -3444149 -670483 2700074 1726054 -2102203 -3968747 -2615559
8728 -2615559 585289 5469475 10915958 12442365 7695018 1804611 1594633 6228151
8720 6228151 9016554 7060015 3517388 1102573 -1021712 -3588782 -5374408 -5820471
8712 -5820471 -5657895 -4413137 -835205 3813216 6222858 5169832 2324498 -843478
8704 -843478 -3821577 -5098911 -3047618 1150911 4693743 7067388 9392478 10383943 7194728
8695 7194728 570297 -4909689 -6352884 -4653625 -1021692 4047509 7751523 6132163
8687 6132163 213388 -3568533 -1576530 2316286 2830282 363107 -1081461 87676
8679 87676 2309768 3751310 3113632 -301189 -4948653 -7671288 -7960389 -8843192 -11463931
8670 -11463931 -12311650 -8840085 -4226137 -2522709 -2265043 298271 4175801 5368065
8662 5368065 4090376 4406209 6987778 7895554 5217348 1820380 361197 256330 979086
8653 979086 3621317 7159762 7779486 4759238 2911086 5649021 9177896 7773014 2126583
8644 2126583 -2207008 -2830990 -1958535 -754377 2309551 6722709 8590426 6121257 2562582
8635 2562582 1171829 648617 -1397972 -3516353 -3077919 -1846153 -3927332 -8589754 -10182689
8626 -10182689 -6331143 -1619112 -811932 -2363425 -1938302 780545 2890966 3679999 4640373
8617 4640373 5248231 3599472 1115842 1611622 4721476 5137214 461773 -4492769 -4089031
8608 -4089031 1003854 6086925 8576499 8518401 6115399 2806382 2201875 5499022 8208967
8599 8208967 6249760 3001511 4303869 8124170 6749830 -593021 -5580341 -3615904
8591 -3615904 -710282 -2963964 -6520215 -4871417 -594402 -1146731 -5856743 -6317379 282226
8582 282226 6672164 6423797 2246588 -69439 -228020 -1338366 -3223417 -2953903 -263968
8573 -263968 1994325 2390912 2604952 4342476 6775195 7488057 4947214 196181 -3367772
8564 -3367772 -2857815 648328 2595019 -213975 -6307206 -11664672 -13608697 -11899501
8556 -11899501 -8053989 -4878426 -4601253 -5875355 -4772406 -526008 2320954 69653
8548 69653 -4492600 -6127469 -4504155 -3028578 -1948554 1753248 7474650 9678507 5465894
8539 5465894 -812417 -2999127 -76034 4467790 7345371 7277601 4521437 938676 -1141571
8530 -1141571 -1677450 -2641039 -4008635 -2952780 1267136 4840284 4453419 1986761 1094235
8521 1094235 1560798 642312 -1745354 -2922742 -1688853 376983 1195222 -437421 -4317046
8512 -4317046 -7499044 -5851791 91339 3661919 528676 -4240711 -3053966 2697014
8504 2697014 5071308 2450397 1589645 5546409 8177331 4574180 -497987 -355732 3153818
8495 3153818 3696175 890043 -600467 -74327 -1303366 -4388320 -4295471 855904 5897041
8486 5897041 5745771 2126553 34873 621333 1070513 -186748 -1580666 -1469254 -461994
8477 -461994 63226 214261 1154021 2877044 3683412 2461723 621665 476389 2088671
8468 2088671 3419885 3568914 3585688 3505525 1467400 -2447902 -4340520 -1459704 3027872
8459 3027872 3965232 1701843 1482959 5497086 9820169 10316296 7762241 5253466 3719496
8450 3719496 2523710 2180333 3618622 5998263 7798665 9406637 12258377 15446010
8442 15446010 15321903 9519157 545219 -5697867 -5409153 -711231 2691494 1788169 -1039965
8433 -1039965 -2267396 -2100793 -2769806 -3664764 -2145826 1000963 1466483 -1775177 -3860596
8424 -3860596 -1047340 3254402 3309957 -614237 -3231333 -2231814 -600684 -888305 -1523416
8415 -1523416 -193143 2304146 3338884 1549106 -2600379 -7584616 -11049282 -10926455
8407 -10926455 -7526142 -3358471 -136008 2696339 5731073 7552358 6342005 2669269
8399 2669269 -622119 -1217942 423860 1564751 214581 -2013582 -1232789 3312690 6815669
8390 6815669 4587043 -967044 -2954288 454925 3720553 2566223 49414 865495
8382 865495 3810029 4526451 2918303 2548176 4064679 4545523 3161214 2465198 3374743
8373 3374743 3471892 1632927 207769 784658 1517985 909074 931379 3674515 7489312
8364 7489312 9312656 8849179 7739016 6197118 3193635 -1066315 -5071953 -7523489
8356 -7523489 -7356923 -3830060 1560881 5037856 4611347 2458028 1081939 -483992 -3581162
8347 -3581162 -5627513 -3377822 1206730 3478177 3640412 6003482 10466506 11134039 5551859
8338 5551859 -565490 -1415154 931722 1019821 -1486462 -2916126 -2447557 -2364889 -2927554
8329 -2927554 -2212582 -405981 661646 1879110 5592000 9777397 9096921 3225047 -1322362
8320 -1322362 -280475 2485815 1863918 -338384 709720 4021637 4141041 240712 -2372873
8311 -2372873 -663339 1731273 773838 -1635001 -923733 3235702 6749853 6653307 4007691
8302 4007691 1641676 1114337 1992333 2860424 2946531 3057214 4160437 4963074 2767601
8293 2767601 -2345821 -6358018 -6069501 -3001868 -293866 2129434 5849339 8947916
8285 8947916 7329422 1343088 -3213997 -2298605 1432435 2659053 -325179 -5128930
8277 -5128930 -8485185 -8033936 -3372206 2426853 4560167 2124778 -122132 1901917
8269 1901917 5909741 7047807 5069399 3576449 3741353 3644638 3234045 4652862 7020191
8260 7020191 6161881 1424098 -2019373 -487840 2771057 3143509 2077761 4116446 8677315
8251 8677315 10353513 7268553 3964637 4454650 6657669 6592763 5139279 6608139 11346536
8242 11346536 13795510 9533421 1729174 -2268491 -91454 2983129 1459989 -3153038
8234 -3153038 -5152650 -2793518 276611 1625820 3758132 9191089 15145549 16576422
8226 16576422 12994026 8927328 7933704 8973412 8978583 6608880 2745435 -910004 -2896499
8217 -2896499 -2992724 -2802946 -4220915 -6932845 -8778695 -9007399 -9439926 -11315388 -12596801
8208 -12596801 -10325849 -4962957 -408449 399183 -1694368 -4047988 -5524876 -6736546
8200 -6736546 -7882324 -7739460 -4931411 427541 6401033 10317361 10714949 8856495 7745316
8191 7745316 8633675 9063303 5913122 108335 -3872563 -3684832 -1974947 -2261036 -4203302
8182 -4203302 -5055952 -3919752 -1813030 1015126 4430574 5878892 2588217 -3208756
8174 -3208756 -5264233 -1216385 3792610 3691547 -943663 -4571506 -4027194 -1207667 674916
8165 674916 801921 619159 1615369 3429910 3829529 1473049 -1162799 232047 5864725
8156 5864725 10361628 9066205 3481891 -1746147 -4639399 -5674453 -4530369 -1416462
8148 -1416462 285629 -2063589 -4724619 -1676994 5468647 8104848 3040379 -2235432
8140 -2235432 -582517 4224541 3744312 -2350325 -6725949 -5755714 -3147947 -2043799 -585615
8131 -585615 2418447 3705165 1475319 237028 4363818 9913828 9141608 2228708 -1922277
8122 -1922277 2055098 8646018 9609896 5073495 1692063 2254107 2864573 505130 -2029951
8113 -2029951 -1114393 1647402 1969580 -431734 -1655575 -38329 797841 -2983572 -9401384
8104 -9401384 -12208737 -8283902 -1512542 1580179 -1034973 -5359643 -6429201 -3350450
8096 -3350450 806053 2428463 -83516 -5516330 -10194379 -10508286 -6838318 -3775138
8088 -3775138 -4468607 -6161602 -4182627 789367 3448910 1851794 186718 2054288
8080 2054288 5104527 5096392 2125382 -436476 -1008347 -607751 -104906 470826 1035623
8071 1035623 2117098 4841433 8109687 8190327 4185339 1264984 4029447 8592731 6859107
8062 6859107 -1760533 -8791424 -7998971 -2810562 6124 -583031 -809960 1011014 2690745
8053 2690745 2089226 -421243 -3208175 -4961507 -5071136 -3811193 -2141194 -722077 428110
8044 428110 1065043 516375 -1247468 -3452213 -5798328 -8562776 -10928028 -10776248 -7176824
8035 -7176824 -1986244 2019145 3898243 4804040 6160179 8040740 8924179 7123085 3016028
8026 3016028 -736573 -2175392 -2298342 -2823720 -2934162 -714807 3032148 5517483 6251061
8017 6251061 7297479 9165535 10071253 9804368 10251246 10813139 7715397 345830 -5767203
8008 -5767203 -5790960 -2208635 -673296 -1806154 -1698543 899147 2843598 2148516 957400
7999 957400 1748818 3786135 5052928 5513647 6459199 7659795 7095790 3858915 309440
7990 309440 122413 3743592 6887335 5042645 -1087399 -6574482 -8314568 -7430091 -5527783
7981 -5527783 -2170493 2295364 4756172 3065963 -354359 -1446494 485975 3080399
7973 3080399 4472603 3941322 775576 -4324701 -7907272 -7045919 -3291047 -553790 54539
7964 54539 286698 697109 187619 -776607 -372056 891120 516667 -1139948 -324453 4078593
7954 4078593 7558492 5803177 898085 -1576724 -33006 2163465 2705787 3301596 5263796
7945 5263796 5683999 1481427 -4345425 -5016329 760357 6154743 5390264 1583926 1021535
7936 1021535 2816428 898317 -4777499 -6904604 -2428451 2133150 890781 -2609551
7928 -2609551 -2306068 309282 -16535 -2534888 -2270878 754197 1764451 -240742 -1338111
7919 -1338111 165067 2064975 3692055 6388405 8449847 6586959 3079417 4132415
7911 4132415 9679073 12293828 8398979 2893082 -243706 -3706486 -8784575 -9775142
7903 -9775142 -3124184 4571375 5397583 1761804 1152431 3603643 3441236 845171 1944284
7894 1944284 7620852 11178222 8711867 4309629 2726268 3375169 4196163 5612514 7364858
7885 7364858 6379348 1634513 -2459611 -1208151 4309274 9104187 9881780 6525934 735059
7876 735059 -4169975 -4704870 -1606708 -592486 -5392858 -11847768 -12746798 -7362503 -1858339
7867 -1858339 -341567 -201948 1994786 4149958 1868921 -3955001 -7100389 -3977665
7859 -3977665 1761079 4307452 2923373 1268289 823707 -1116917 -6000033 -10077746
7851 -10077746 -8762370 -3087414 1430772 1795886 197868 -511444 -616882 -1359915 -1878775
7842 -1878775 -918462 177973 -834569 -3157994 -3730198 -2096752 -1490063 -3825177 -6233465
7833 -6233465 -4916972 -907563 894501 -1806724 -5848574 -6926622 -4586070 -1536785
7825 -1536785 456977 2119560 4585994 7350713 8596955 7065939 3674107 1298973
7817 1298973 2164923 5209432 7160215 6550239 5038601 4106663 2765198 211996 -1605400
7808 -1605400 -815854 823339 537794 -635119 491380 3524374 4888555 4118645 5001510
7799 5001510 9068538 12355927 10984621 6447390 2853677 1842124 2463285 3183043 1853033
7790 1853033 -3024170 -8565869 -8805765 -2956974 1608780 -883940 -5571504 -3639090
7782 -3639090 4402669 9200740 5940989 286730 -578951 3099349 6376965 6659248 4719618
7773 4719618 1878727 -563205 -1037734 488453 1716617 993136 -48575 1504146 5978422
7764 5978422 10477005 11652319 8733813 4485565 2966066 5212831 7720918 6848422
7756 6848422 3784229 2481659 3299980 2290277 -2768411 -9163102 -13097347 -13420706 -10302908
7747 -10302908 -3833146 3940405 8801322 8904852 7133235 6558911 6176804 3975648 1628460
7738 1628460 2236733 4883005 5502108 2898439 313475 490904 2078284 1978917 -733179
7729 -733179 -4388105 -6927009 -7400654 -5770634 -2270480 2356857 6076622 6356429 3064858
7720 3064858 -465359 -1403810 -1533947 -4206793 -7721027 -6483631 24990 4624789 1868200
7711 1868200 -4441255 -7392170 -6632561 -6449298 -7266377 -5757271 -2197896 -833997 -2469352
7702 -2469352 -2968719 -590038 975468 -766982 -2578255 -755354 3129713 5167013
7694 5167013 4550384 2683576 -395987 -4910531 -8348671 -7233959 -1519845 5084322
7686 5084322 8820624 8638142 6338204 5165357 6895149 9353601 8651596 4718865 1930763
7677 1930763 2844377 4649377 4357182 4136319 7530214 12594766 13292795 7061437 -2500406
7668 -2500406 -9908366 -11825046 -8007478 -1750580 1403900 -1043731 -5067314 -5145184 -1678026
7659 -1678026 538276 70353 11708 1660729 2611075 1977718 2036142 3182204 2841557
7650 2841557 1476267 3611705 9463423 11642106 5446019 -2650825 -3360588 2204241
7642 2204241 5051423 2002268 -1077686 200440 2643553 2080856 -136563 -632877 389051
7633 389051 547807 -699850 -2435849 -4308659 -5532751 -3942399 1206886 6830515 8771227
7624 8771227 6185891 1658521 -1920403 -3088328 -1707775 972171 2705537 2125627
7616 2125627 49188 -1637504 -1771517 -407208 1335401 1706725 21642 -1910627 -1697399
7607 -1697399 289666 1580452 1491476 1407719 1025414 -1708888 -5614500 -5612773 202527
7598 202527 6583671 7603408 3871934 -305508 -3565208 -6688677 -8175225 -6292963
7590 -6292963 -3819422 -4970989 -8520909 -9557139 -7350049 -5500265 -4670301 -1932617
7582 -1932617 2029218 2236513 -2138527 -5478615 -4533078 -2778623 -2701818 -938471 4090334
7573 4090334 6751730 2991152 -1471005 447841 5441242 5370859 1070909 625453 5307900
7564 5307900 7559311 3827246 -213418 285880 2713398 3891297 5816120 10049181
7556 10049181 13001204 11787390 9359635 9042966 8969519 6724834 4611905 5073224 5513740
7547 5513740 3384744 2132635 5821825 11562837 13868470 13151578 12933830 12045608 7807224
7538 7807224 4207418 7291577 13548931 13256164 6022650 2218036 6239821 9243388
7530 9243388 3840393 -3812972 -4309794 345357 1527440 -1653843 -2401854 1727199 5688120
7521 5688120 5638241 3561231 2445765 2455728 2904954 3815806 4829335 5636525 7071995
7512 7071995 8916058 8231476 3635260 -685424 96286 4090995 5502799 3519043 2500445
7503 2500445 3961420 4868644 4308471 5168176 7656129 7478664 2873613 -2152783 -4201655
7494 -4201655 -4737466 -5231895 -3689717 239041 1943506 -1553584 -5802526 -4811326 335032
7485 335032 3649690 2692910 167904 -1178361 -891296 740407 2782725 3134273 875816
7476 875816 -2091568 -4028654 -5688084 -7178805 -5852714 -1048458 2447525 555277
7468 555277 -3264100 -2756422 1877421 5457933 6601603 8168886 9997519 8801417 5710198
7459 5710198 6119843 10131224 10615067 4069545 -3401289 -5290230 -3768167 -4099096 -5120830
7450 -5120830 -2158937 3672359 6334765 4116770 1517346 1453020 1442739 -664693 -2122166
7441 -2122166 366343 4854875 6299503 3184861 -1063854 -3004860 -2785708 -2136023 -1149028
7432 -1149028 846858 2293690 130557 -5663465 -10437971 -9678048 -4347557 523384
7424 523384 1901906 1128888 304135 -1093944 -4613951 -9319732 -11669492 -9106851 -3194197
7415 -3194197 1342491 1184128 -2134912 -4397750 -4257591 -4494885 -6819655 -8287974 -5705131
7406 -5705131 -1534474 -1414413 -6257322 -10673394 -9823009 -4616899 768342 3620975 3654773
7397 3654773 1643210 -1247195 -3906223 -5788180 -6272166 -4303017 -471291 1667837
7389 1667837 -702470 -5197308 -6757261 -4406371 -1972613 -2153197 -3819715 -5512004
7381 -5512004 -7246568 -7953527 -5570289 -1146742 1345613 777187 113070 573907 -276475
7372 -276475 -2619591 -2498716 822064 1658611 -3135198 -7593645 -5194859 651965 2012887
7363 2012887 -897631 -576632 5479934 11293258 11782732 8746023 5857832 3446903 540585
7354 540585 -2208991 -3837943 -4286779 -3146055 -75318 3033604 3542323 2070068 1538858
7345 1538858 1978964 416612 -3186557 -4339176 -480495 4550769 5142778 622898 -4814860
7336 -4814860 -6933992 -4398038 1227541 6426336 7883646 5368491 1954033 634870
7328 634870 1436197 2232249 1557884 260956 735058 4101101 7931102 8364433 5398071
7319 5398071 3692688 6140649 9321368 8519760 4756923 2582814 2825736 2652741 1744307
7310 1744307 2709435 5303463 5870982 3475115 1349044 1001693 85244 -2173792 -2685494
7301 -2685494 -133303 1886808 361995 -2623521 -3891199 -3842042 -3929363 -3037120 -3996
7292 -3996 2980283 2937164 109046 -3073630 -4926787 -4601128 -2033551 390088 -559902
7283 -559902 -3770043 -4129475 -386346 1986853 -809941 -4453933 -3234370 891191 1789500
7274 1789500 -1192735 -3205492 -1940375 81410 653883 361438 124069 229886 1212914
7265 1212914 2316623 645437 -4378168 -7880697 -5494822 -200895 2280839 2681427
7257 2681427 5833094 10505725 9977023 3565860 -834330 1468414 5344175 5165974 3757168
7248 3757168 6154015 9921434 8935888 3757257 899814 2699499 4602387 3221352
7240 3221352 1170973 1635178 2748342 877800 -3212276 -5235815 -3425360 -379959
7232 -379959 1152287 1301082 961700 -436142 -2914071 -4046829 -2330331 -1003765 -4329105
7223 -4329105 -10279939 -11765927 -6519791 -987206 -1549224 -6135634 -8501444 -7215815
7215 -7215815 -5403093 -4135895 -1844672 787635 978345 -1013729 -1768199 -141580 1574689
7206 1574689 2286881 3336979 4393397 2773648 -1638849 -4925166 -4374977 -1743691 254994
7197 254994 1339921 2018646 1793816 643376 -429022 -1328884 -2523834 -2505801 547048
7188 547048 4188029 3645953 -420882 -1465032 3372050 8541145 8152887 3760316 157893
7179 157893 -1899792 -3981190 -4920674 -2929309 -100268 312363 -886142 -884748 -22430
7170 -22430 -252647 -514566 1428886 4240931 5108927 5024627 6638189 8146509 5304568
7161 5304568 -784556 -3940534 -1738526 1339604 844947 -2363372 -5177087 -6092505 -4506147
7152 -4506147 -453134 3272992 2875806 -671925 -1571297 2976775 8675430 10168445 7501985
7143 7501985 4036315 1644993 1109052 3725556 8573785 10999259 8207135 4330753
7135 4330753 5283240 9871869 11134529 6487733 1467289 1846343 6223243 9037477 7990743
7126 7990743 5320162 3322452 1879086 252442 -1240590 -1979259 -1773892 -181926 3487230
7117 3487230 8512300 12163938 12054391 8739117 5081096 3309297 3367163 3612244 2301619
7108 2301619 -950483 -4172572 -4379766 -1306577 1328897 344459 -2312827 -2468328 -270299
7099 -270299 354904 -1111435 -207955 5096003 10305838 10831290 8252459 6350696 4852223
7090 4852223 1894937 -653423 -13993 1778660 1015845 -541304 1761313 6572262 7332068
7081 7332068 2550415 -1697123 -1357817 6760 -1941478 -5550198 -6764313 -4964885
7073 -4964885 -1865683 1516485 3820295 3205025 1188397 2516736 8043629 12071265
7065 12071265 10519097 7286310 7780692 10213715 9176860 4976455 3028318 5231874
7057 5231874 7765718 7252436 4376230 1448320 302968 2105947 5554381 6325883 2414357
7048 2414357 -1277735 1472456 8973197 13469359 11987965 9339631 9461859 9958783 7594279
7039 7594279 3733715 954509 -1292534 -3746230 -3664490 1355373 7994819 10147669 6630234
7030 6630234 2339563 1606197 3381469 3913713 2054745 213601 599954 2181308 2521289
7021 2521289 2012611 3963606 9330966 13720002 12448532 7229294 4180853 5465167
7013 5465167 6870427 4599544 628411 -784082 992800 3111412 3399227 1907748
7005 1907748 -480594 -2762752 -3635479 -2212258 1138018 5190092 8554503 9974768
6997 9974768 9191107 7601108 6591750 5378554 2533447 -659002 -1432379 -374085 -1145233
6988 -1145233 -4028840 -4070791 1459262 7671157 8384403 4975090 3697641 5766914 6068747
6979 6068747 2097475 -1678696 -786333 2546488 3347718 1458993 697275 1984286 2242650
6970 2242650 609927 1006447 5890966 10990080 10440728 5428925 2727536 4605267 5641895
6961 5641895 1781207 -2598577 -1163649 4360162 6458154 2701413 -1436663 -769051
6953 -769051 3742336 8120611 9692459 7194135 1174667 -4168752 -3927767 1015294 4602575
6944 4602575 4121021 3125636 4030481 3847084 765466 -1061780 1708697 5341156 5287287
6935 5287287 3876781 5080940 6078656 2173094 -3156282 -2370987 3485296 5893256 2694682
6926 2694682 1033918 4663261 7962676 6345921 3700201 3970919 3109727 -3392084 -10715805
6917 -10715805 -10597761 -3698216 1742814 2160735 2318556 6474580 12119667 14263687 11693801
6908 11693801 7074962 3621858 3088364 4974780 6570601 5216196 1292028 -2024430
6900 -2024430 -2300529 -297351 1313753 1102076 487109 1925183 5172176 6496437 3389495
6891 3389495 -1028347 -1546090 1489970 2430355 -798975 -3210059 -969919 1960222 186344
6882 186344 -4108177 -4675990 -1274197 715921 -40913 1097597 5664409 7921773 3242804
6873 3242804 -4418457 -7697402 -5118045 -1096742 916518 980303 -310794 -2885125 -5000731
6864 -5000731 -3568218 1954682 8037359 10671554 9282974 6275796 3824216 2107721
6856 2107721 94144 -2805345 -5666620 -6335391 -3472083 1090863 3060454 326903
6848 326903 -3571541 -2951601 2450819 6108240 2990023 -3067410 -3884541 2120775 7860135
6839 7860135 7106079 1838602 -1971782 -2226242 -1236955 -1111222 -2169834 -4323587 -6696414
6830 -6696414 -7084868 -4831300 -2893265 -3798165 -5048470 -2555908 2577131 5592521 5916109
6821 5916109 7692276 11491364 11689403 5303713 -1864110 -2776686 795546 1479320 -2399529
6812 -2399529 -4984972 -2629478 526158 -585690 -3930596 -3652038 541512 2236338
6804 2236338 -2619216 -9545601 -11236310 -7028449 -2828517 -2386091 -3223942 -2441231 -1917718
6795 -1917718 -4294268 -7234892 -6625411 -3785298 -4074486 -8351549 -10968548 -7465836 119197
6786 119197 7119699 11213703 11683177 8048874 2331945 -903470 75740 1713817 840323
6777 840323 -713978 -580015 -1065858 -5060915 -9780509 -10311100 -7388812 -5582493 -5082107
6768 -5082107 -2180184 2129877 1557548 -5409887 -11608789 -10932666 -6342918 -3807872 -3070577
6759 -3070577 26651 5271983 8211155 7286795 5496712 5060632 4960000 4242958 3953603
6750 3953603 4984190 7088209 10507895 15393285 19005887 17147431 10054472 3758922
6742 3758922 3187429 6139790 6702666 3070240 -817088 -763929 3055239 7014920 7714225
6733 7714225 4441077 -673021 -4520015 -5658915 -5005443 -3552184 -528712 4751126
6725 4751126 10091004 11713200 8626582 3937572 1296245 1505830 3116339 4695166
6717 4695166 5522308 5363831 4733839 4534720 4628866 3771407 1692017 -115610 -704563
6708 -704563 -1144122 -2068069 -1466411 2451281 7155463 7769517 3380903 -1509773 -2754104
6699 -2754104 -1245526 -476251 -1635683 -3151431 -3643303 -3080702 -1595642 803510 3200400
6690 3200400 3970244 2612312 670771 244868 1613688 2688903 1477690 -672695 429879
6681 429879 6506802 12896734 12697653 5183429 -2721604 -4590828 -1398253 1653395 2482124
6672 2482124 3109679 5015293 7299940 9083865 10225489 9335023 4387500 -3539030 -9804699
6663 -9804699 -11057059 -8696452 -6171190 -4574457 -2610282 305142 2885229 3838563
6655 3838563 3771879 4824966 8230519 12020499 12090281 6949073 652318 -1356022 774668
6646 774668 1446825 -2421564 -6871810 -6544012 -2078806 1352848 1165255 -715664 -2312657
6637 -2312657 -3999180 -5864623 -6276370 -4747448 -3558351 -4377325 -5115032 -2490951 3298394
6628 3298394 8665074 10891699 10389851 8996961 7983005 7828876 8018485 6562932 1742101
6619 1742101 -4535742 -6893280 -1929869 7369071 14542640 16434670 15065075 13128631
6611 13128631 10515623 6426224 2494292 1471729 3736536 7007955 9031163 9017034
6603 9017034 7098956 4248732 2403125 2692449 3547663 2509606 -9486 -1029835 449476
6594 449476 1753848 703886 -860011 96974 3015963 4337309 2308723 -1036464 -2660182
6585 -2660182 -1471328 1615229 4974672 7203153 7769099 7022952 5180314 2008021 -1609976
6576 -1609976 -3068241 -941916 2365763 3361111 2397834 2863288 5341589 6378258 4535531
6567 4535531 3806180 7750873 12929041 12382999 4696303 -4252679 -8357213 -6576619 -1133122
6558 -1133122 5630414 11327221 13801311 13269601 11948071 10343188 6703302 1534180
6550 1534180 -1017681 900108 2925157 493613 -3883140 -4251759 -390034 2321116
6542 2321116 1703050 1339349 3352056 4686672 3041035 996990 803251 45805 -3088634
6533 -3088634 -4770173 -1366826 3216152 2690936 -1291012 -1322137 3834442 7267366 5281854
6524 5281854 3277224 6803959 12996018 15813105 15169238 15145959 16114626 14735579 10693989
6515 10693989 7717407 7348401 6407240 2258097 -2836471 -4754157 -2903338 -661666
6507 -661666 -1295978 -4606165 -7275921 -6226102 -2002100 1487802 1403160 -493290 -177538
6498 -177538 3206520 6290939 6080712 3438704 1003169 -365738 -1239520 -1139771 1004518
6489 1004518 4127594 5439945 4515625 4552480 7544520 10173868 7812862 1777206 -1678918
6480 -1678918 -414113 226372 -4129400 -9357685 -8577810 -2450386 2307809 3236302 4036769
6471 4036769 5991410 5137217 597304 -1455894 3187610 9651547 11533835 10687546 12645422
6462 12645422 16002477 14434271 7749806 2770159 2773627 3496752 1272249 -1635061 -2476038
6453 -2476038 -2728108 -3692238 -2451059 3172063 9080195 9115572 3138832 -2843650 -3635814
6444 -3635814 790319 6714955 9860647 8075222 3191898 -202313 597705 3592881
6436 3592881 4806312 2596368 -1710013 -5831397 -7815437 -6821260 -4082838 -1969262
6428 -1969262 -1253272 -840956 -612342 -1890741 -4041303 -3831407 -265801 3062755 3320345
6419 3320345 3205909 6506359 10988906 10453399 3510818 -3852888 -5254676 -526068 5454419
6410 5454419 8264720 7345168 5328663 4773164 5401445 5159967 3954918 4111961 6081587
6401 6081587 6589989 3429977 -651660 -2053415 -1681897 -2086777 -1626667 2934982 9047000
6392 9047000 9901367 4254764 -1001369 -205982 3909349 5064128 1456578 -3913843 -7597129
6383 -7597129 -7475567 -3232415 1837078 2091524 -4010526 -10667636 -11111945 -5587891 66280
6374 66280 2101343 1582835 586850 -362896 -898201 -77671 2080607 4230740 5085328
6365 5085328 3726606 -645230 -6932131 -10854234 -8677803 -2480448 1476975 520195
6357 520195 -1392636 61256 3311690 3687010 450502 -2396070 -1831099 748268 2188013
6348 2188013 1101834 -2105753 -6373175 -9625924 -9220043 -4909099 -239552 1298458
6340 1298458 799043 2063641 5558803 7522465 5881816 3621907 4079113 5706767 4722705
6331 4722705 1184344 -1171152 -391000 1811733 3401207 3934592 3085187 702388 -1127882
6322 -1127882 416630 4305229 5990656 3752199 1274386 2024656 4509309 5571371
6314 5571371 5007026 3794245 1044117 -3237748 -5196476 -1955156 2451900 1589810 -3609446
6305 -3609446 -5524278 -968806 4222734 3896793 -323652 -3007802 -2846052 -2358827 -2364567
6296 -2364567 -1287911 1030227 2659887 2604540 1690134 539921 -983370 -2459615 -3150295
6287 -3150295 -3351587 -3581931 -2939029 -524650 2046468 2413842 1653412 3342662 7599452
6278 7599452 9463095 5291454 -1813608 -5574245 -3833891 278397 3132801 3619736
6270 3619736 2034015 -883120 -3246672 -2879182 1722 2501538 2398723 646787 -193031
6261 -193031 917278 2541369 2326377 -679547 -4682911 -6449812 -4863784 -2449688 -1887138
6252 -1887138 -2078336 -188408 3262481 5014244 4818844 6083659 9307900 9615333 3979776
6243 3979776 -3141235 -5626309 -3981793 -2941958 -3224221 -1391431 3139879 6748247
6235 6748247 7430691 6886759 6362963 5259139 4281373 4841955 4762161 445666 -5403653
6226 -5403653 -4936461 3120043 9566000 7034547 202253 -2084652 239247 593784 -2581029
6217 -2581029 -4281233 -1978373 1037110 1722227 766732 -555580 -1723465 -657903 4534273
6208 4534273 10497258 10622425 3909535 -2834583 -3719048 -439030 2044434 2400636 2492904
6199 2492904 3196514 3868850 4115223 3790576 2906053 3007870 6346516 11963978 15010630
6190 15010630 12058592 5217542 -751531 -3406281 -3113569 -1029152 1078588 820160
6182 820160 -2574194 -6936394 -9430884 -8857129 -5091244 1180952 6857119 7607721 3066275
6173 3066275 -1567791 -1475464 2523820 6809302 10005210 12061180 11313016 6807002 1643670
6164 1643670 -452398 -611674 -2453996 -5368385 -5141559 -966728 3399118 6008978 8920776
6155 8920776 12464617 12620462 7219095 547701 -2138075 -1671525 -2303200 -4092601 -2920222
6146 -2920222 2193450 6505902 5904722 2493119 1271426 3173042 4480576 2798286
6138 2798286 459573 599337 2156992 1494882 -1926131 -4691587 -4649986 -3728710 -3925189
6129 -3925189 -3528166 -279500 3808591 4529797 1516003 -1526928 -2540040 -3320940 -5232064
6120 -5232064 -6313697 -4580002 -1531504 -80360 -663223 -1584670 -2159246 -3431580 -5973258
6111 -5973258 -8334947 -8006508 -3850454 2020549 5211368 3227087 -1363401 -3562736
6103 -3562736 -1876225 286760 -479469 -3468915 -5591336 -5104605 -2300435 1672670 5070669
6094 5070669 6094210 4724897 2901778 1736255 7986 -3289434 -6512842 -7148142
6086 -7148142 -4857929 -1418274 1110880 1108577 -1775691 -4986508 -4385377 728501 5874407
6077 5874407 6857082 4799641 3104533 1958468 -267432 -2115328 -456958 3667040
6069 3667040 5342005 2466507 -1769591 -3677438 -2676674 339673 4271815 6595458
6061 6595458 4905890 981205 -432951 1917790 4530845 5420861 6670969 8642027
6053 8642027 7240101 853983 -4831174 -3914751 1547565 5498762 6500821 6721918 5593589
6044 5593589 1492622 -2214514 -505078 4327676 4766997 57607 -1589854 4708546
6036 4708546 12983095 14964051 10423934 4738837 1063798 -304785 1217560 5128303
6028 5128303 7989096 7412325 5562456 4874979 3407106 -854718 -4150716 -1463205 4884165
6019 4884165 7538069 4564177 1396634 1897993 3545287 3119169 1661300 1156074 775460
6010 775460 -514352 -1090232 476881 2276625 1533389 -1703700 -5408898 -8057045 -8466186
6001 -8466186 -5666356 -1200666 745499 -1867646 -5762699 -6304055 -2931127 1521100
5993 1521100 4876213 6426068 5775649 3977718 4028282 6823224 8318168 4809832 -236029
5984 -236029 306948 6848849 11541001 8738759 2214042 -990109 -11946 548077 -1590519
5975 -1590519 -3860590 -3671330 -1974423 -1200136 -2122264 -3776054 -4890487 -4626688 -3106516
5966 -3106516 -1762958 -2022310 -3132421 -2554914 673286 4123631 4714256 2454416 -35532
5957 -35532 -1373570 -2964780 -6202722 -9730686 -10819455 -8705368 -5218906 -2461320 -1195547
5948 -1195547 -1359447 -2518200 -3378604 -2457817 -222417 750945 -926520 -3081756 -2634348
5939 -2634348 94665 1891959 1372430 708190 1764836 2873327 1469961 -1530344 -2647051
5930 -2647051 -865192 794385 -453169 -3233710 -3789160 -625417 4044126 7041166
5922 7041166 7174998 5559279 4024860 3562598 3981754 4842014 6217963 7731106 7300490
5913 7300490 2946020 -3475368 -6800657 -4776563 -1558489 -2188569 -5622468 -7267196
5905 -7267196 -6906253 -8488284 -11991751 -12078295 -7096862 -2943604 -3711081 -4389295 931319
5896 931319 8275923 9174026 4274837 2721562 7909058 12377869 9144360 982755 -4877191
5887 -4877191 -5518503 -2286792 2984207 7832432 9289393 7680675 6802674 7603108 6049082
5878 6049082 421625 -4310913 -3753509 -844520 -16717 751321 5273279 10160678 8537377
5869 8537377 1231333 -3608868 -2106706 1257104 1950673 1124472 1395248 2740645 4657163
5860 4657163 7437003 9447628 7856812 3735715 1546179 1798355 -303456 -6261415
5852 -6261415 -10069797 -6849111 -954608 -80902 -4308852 -6623338 -3070315 2573718
5844 2573718 4429796 1237655 -3283926 -4786174 -2514747 136893 -247791 -2585448
5836 -2585448 -2878980 -357711 1384598 564288 377054 3168502 5283496 2113371 -4210192
5827 -4210192 -7111575 -4578673 -1268868 -1531888 -4253536 -5457023 -3140007 1323007
5819 1323007 4580474 3826130 -246383 -3144611 -1168324 4016020 7493429 7349549 6222038
5810 6222038 6625313 7584385 6915366 4733160 3225030 3794247 5273918 4843636 1023740
5801 1023740 -3866944 -5292563 -1576936 3742396 5997773 4550274 2191025 912801
5793 912801 667566 1119931 1811760 1279415 -1233773 -3770496 -4091729 -3294736 -3839985
5784 -3839985 -4923965 -3942920 -2158325 -3827004 -8706310 -10610511 -5881414 1132617
5776 1132617 4244282 3327304 2318843 2416896 1665570 -517741 -2629122 -3931535 -4447802
5767 -4447802 -3068486 744874 4199040 3948731 1232533 307599 1819401 1985539 -918464
5758 -918464 -3595567 -2933280 -375181 1132421 1268031 881459 -543993 -2878956 -3293050
5749 -3293050 263740 5280661 7897297 8405377 9663570 11111147 9042913 3184283
5741 3184283 -1490875 -1096754 2530112 5444761 6797333 7955733 8658650 6922270 2107006
5732 2107006 -3657529 -6772767 -4577891 1965752 7511972 6572961 -258267 -6502286
5724 -6502286 -7423763 -4878642 -2997528 -2305911 -1029494 537733 782831 239914 714396
5715 714396 2108505 3286540 4701420 6855503 7771615 5780576 3246865 3289607 4361090
5706 4361090 2975499 414780 887641 3757811 4184611 1723960 1231504 3844491 4334926
5697 4334926 123245 -3995271 -3808112 -2015661 -2280439 -2815848 -834862 1852716 2846850
$$ [...]
##END NTUPLES=NMR SPECTRUM
##END=
