##TITLE=31Pdec_SRglu_Ac20'
 , 124 sc
 27.09.2021
##JCAMPDX= 6.0         $$ Bruker NMR JCAMP-DX V2.0
##DATA TYPE= NMR SPECTRUM
##DATA CLASS= NTUPLES
##ORIGIN= UXNMR, Bruker Analytische Messtechnik GmbH
##OWNER= root
$$ XWIN-NMR		Version 3.5
$$ Mon Sep 27 12:47:31 2021 Russian Standard Time (UT+4h)  she@DPX200
##.OBSERVE FREQUENCY= 81.013821
##.OBSERVE NUCLEUS= ^31P
##.ACQUISITION MODE= SIMULTANEOUS
##.ACQUISITION SCHEME= undefined
##.AVERAGES= 124
##.DIGITISER RES= 16
##SPECTROMETER/DATA SYSTEM= spect
##.PULSE SEQUENCE= zgpg30
##.SOLVENT NAME= CDCl3
##.SHIFT REFERENCE= (INTERNAL, CDCl3, 0, 248.564)
##AUDIT TRAIL= $$ (NUMBER, WHEN, WHO, WHERE, WHAT)
$$ ##TITLE= Audit trail, XWIN-NMR		Version 3.5
$$ ##JCAMPDX= 5.01
$$ ##ORIGIN= Bruker BioSpin GmbH
$$ ##OWNER= she
$$ F:/spectra/data/she/nmr/P31/1/pdata/1/auditp.txt
$$ ##AUDIT TRAIL=  $$ (NUMBER, WHEN, WHO, WHERE, WHAT)
(   1,<2021-09-27 12:46:14.10 +0400>,<she>,<DPX200>,
      <continue with go, POWCHK disabled, PULCHK disabled
       configuration hash MD5:
       00 E9 B6 7A A2 85 ED C7 34 08 36 98 17 FE 4E 26
       data hash MD5: 32K
       34 50 8F D4 B8 FD 13 5A 2C 4B 86 32 FF 8C CE A5>)
(   2,<2021-09-27 12:46:20.85 +0400>,<she>,<DPX200>,
      <Start of raw data processing
       efp BC_mod = 2 LB = 1 FT_mod = 6 PKNL = 1 PHC0 = -8514.877 PHC1 = 195.2688 SI = 64K 
       data hash MD5: 64K
       D5 FF A0 13 0A 2E 8E BC E7 8A 5F EF 7C 65 40 D7>)
(   3,<2021-09-27 12:46:57.92 +0400>,<she>,<DPX200>,
      <pk PHC0 = 12.15933 PHC1 = -12 
       data hash MD5: 64K
       E3 F8 7A 7F 75 9A 4D 2E 63 11 EC 16 9E AC F7 B7>)
$$ ##END=
$$ 
$$ hash MD5
$$ F5 CF A5 1E 08 7A F8 8F 7A 78 C0 74 FE 80 A9 20
##$RELAX= 
##$RELAX= 
##$RELAX= 
##$RELAX= 
##$RELAX= 
##$RELAX= 
##$RELAX= 
##$RELAX= 
$$ Bruker specific parameters
$$ --------------------------
##$DU= <F:/spectra>
##$EXPNO= 1
##$NAME= <P31>
##$PROCNO= 1
##$TYPE= <nmr>
##$USER= <she>
##$AMP= (0..31)
100 100 100 100 100 100 100 100 100 100 100 100 100 100 100 100 100 100 
100 100 100 100 100 100 100 100 100 100 100 100 100 100 
##$AQSEQ= 0
##$AQ_mod= 1
##$AUNM= <au_zg>
##$AUTOPOS= <>
##$BF1= 81.014009
##$BF2= 200.13
##$BF3= 200.13
##$BF4= 200.13
##$BF5= 200.13
##$BF6= 200.13
##$BF7= 200.13
##$BF8= 200.13
##$BYTORDA= 1
##$CFDGTYP= 0
##$CFRGTYP= 5
##$CHEMSTR= <none>
##$CNST= (0..31)
1 1 145 1 1 1 1 1 1 1 1 1 1 1 1 1 1 1 1 1 1 1 1 1 1 1 1 1 1 1 1 1 
##$CPDPRG= <waltz16>
##$CPDPRG1= <>
##$CPDPRG2= <waltz16>
##$CPDPRG3= <>
##$CPDPRG4= <mlev>
##$CPDPRG5= <mlev>
##$CPDPRG6= <mlev>
##$CPDPRG7= <mlev>
##$CPDPRG8= <mlev>
##$CPDPRGB= <>
##$CPDPRGT= <>
##$D= (0..31)
0 1 0 0 0 0 0 0 0 0 0 0.03 2e-05 3e-06 0 0 0 0 0 0 0 0 0 0 0 0 0 0 0 0 
0 0 
##$DATE= 1632732119
##$DBL= (0..7)
120 120 120 11 120 120 24 19 
##$DBP= (0..7)
150 150 150 150 150 150 150 150 
##$DBP07= 0
##$DBPNAM0= <>
##$DBPNAM1= <>
##$DBPNAM2= <>
##$DBPNAM3= <>
##$DBPNAM4= <>
##$DBPNAM5= <>
##$DBPNAM6= <>
##$DBPNAM7= <>
##$DBPOAL= (0..7)
0.5 0.5 0.5 0.5 0.5 0.5 0.5 0.5 
##$DBPOFFS= (0..7)
$$ [...]
##$SUBNAM2= <"">
##$SUBNAM3= <"">
##$SUBNAM4= <"">
##$SUBNAM5= <"">
##$SUBNAM6= <"">
##$SUBNAM7= <"">
##$SUBNAM8= <"">
##$SUBNAM9= <"">
##$SW= 501.771253377433
##$SWIBOX= (0..15)
0 1 3 0 0 0 0 0 0 0 0 0 0 0 0 0 
##$SW_h= 40650.406504065
##$TD= 32768
##$TD0= 1
##$TE= 0
##$TE2= 300
##$TE3= 300
##$TEG= 300
##$TL= (0..7)
0 120 53 12 22 120 120 120 
##$TP= (0..7)
150 150 150 150 150 150 150 150 
##$TP07= 0
##$TPNAME0= <>
##$TPNAME1= <>
##$TPNAME2= <>
##$TPNAME3= <>
##$TPNAME4= <>
##$TPNAME5= <>
##$TPNAME6= <>
##$TPNAME7= <>
##$TPOAL= (0..7)
0.5 0.5 0.5 0.5 0.5 0.5 0.5 0.5 
##$TPOFFS= (0..7)
0 0 0 0 0 0 0 0 
##$TUNHIN= 0
##$TUNHOUT= 0
##$TUNXOUT= 0
##$USERA1= <user>
##$USERA2= <user>
##$USERA3= <user>
##$USERA4= <user>
##$USERA5= <user>
##$V9= 5
##$VALIST= <valist>
##$VCLIST= <CCCCCCCCCCCCCCC>
##$VD= 0
##$VDLIST= <DDDDDDDDDDDDDDD>
##$VPLIST= <PPPPPPPPPPPPPPP>
##$VTLIST= <TTTTTTTTTTTTTTT>
##$WBST= 1024
##$WBSW= 4
##$XGAIN= (0..3)
0 0 0 0 
##$XL= 0
##$YL= 0
##$YMAX_a= 6554
##$YMIN_a= -11538
##$ZGOPTNS= <>
##$ZL1= 120
##$ZL2= 120
##$ZL3= 120
##$ZL4= 120
##$ABSF1= 0
##$ABSF2= 0
##$ABSG= 0
##$ABSL= 0
##$ALPHA= 0
##$AQORDER= 0
##$ASSFAC= 0
##$ASSFACI= 0
##$ASSFACX= 0
##$ASSWID= 0
##$AUNMP= <proc_1d>
##$AZFE= 0.1
##$AZFW= 0.5
##$BCFW= 0
##$BC_mod= 2
##$BYTORDP= 0
##$COROFFS= 0
##$CY= -3
##$DATMOD= 1
##$DC= 0
##$DFILT= <>
##$DTYPP= 0
##$F1P= 0
##$F2P= 0
##$FCOR= 1
##$FTSIZE= 65536
##$FT_mod= 6
##$GAMMA= 0
##$GB= 0
##$INTBC= 1
##$INTSCL= 5.30512e-09
##$ISEN= 30
##$LB= 1
##$LEV0= 0
##$LPBIN= 0
##$MAXI= 10000
##$MC2= 0
##$MEAN= 0
##$ME_mod= 0
##$MI= 50
##$NCOEF= 0
##$NC_proc= -7
##$NLEV= 6
##$NOISF1= 182.463
##$NOISF2= 159.3651
##$NSP= 0
##$NTH_PI= 0
##$NZP= 0
##$OFFSET= 248.5645
##$PC= 4
##$PHC0= -8502.718
##$PHC1= 183.2688
##$PH_mod= 1
##$PKNL= yes
##$PPARMOD= 0
##$PSCAL= 0
##$PSIGN= 0
##$REVERSE= no
##$SF= 81.014009
##$SI= 65536
##$SIGF1= 159.3651
##$SIGF2= -187.1042
##$SINO= 113.3802
##$SIOLD= 16384
##$SREGLST= <1H.CDCl3>
##$SSB= 0
##$STSI= 65536
##$STSR= 0
##$SW_p= 40650.406504065
##$SYMM= 0
##$S_DEV= 0
##$TDeff= 32768
##$TDoff= 0
##$TI= <>
##$TILT= no
##$TM1= 0
##$TM2= 0
##$TOPLEV= 0
##$USERP1= <user>
##$USERP2= <user>
##$USERP3= <user>
##$USERP4= <user>
##$USERP5= <user>
##$WDW= 1
##$XDIM= 65536
##$YMAX_p= 204558835
##$YMIN_p= -184534654
$$ End of Bruker specific parameters
$$ ---------------------------------
##NTUPLES= NMR SPECTRUM
##VAR_NAME=  FREQUENCY,     SPECTRUM/REAL,   SPECTRUM/IMAG
##SYMBOL=    X,             R,               I
##VAR_TYPE=  INDEPENDENT,   DEPENDENT,       DEPENDENT
##VAR_FORM=  AFFN,          ASDF,            ASDF
##VAR_DIM=   65536,         65536,           65536
##UNITS=     HZ,            ARBITRARY UNITS, ARBITRARY UNITS
##FACTOR=    0.620285442955139, 1,           1
##FIRST=     20137.2065510759, 0,            0
##LAST=      -20513.1999529892, 0,           0
##MIN=       -20513.1999529892, -184534654,  0
##MAX=       20137.2065510759, 204558835,    0
$$ Real data points
##PAGE= N=1
##DATA TABLE= (X++(R..R)), XYDATA
$$ [...]
##PAGE= N=2
##DATA TABLE= (X++(I..I)), XYDATA
13003e19804j891966J38744K250529K042741L54868n94180m44903j72920K67466
12994A430575J511892K774598K466184N56784j477205k807750l643313l744310
12986b932545k497747o63766k65034k025795l969257l194407J209665O802014
12978g536872R155260N743507o89012m155296k242524R32755P41261j270016m54946
12969B24117K879200L791820R79154j164116l08845n6427k828281m512564j196360
12960b192302L255491K597184j821194l320458n21315J483292L46878m48026J053759
12951D33309J845736L43098k89234J380903J326795k647771n397727k042076L269847
12942a777120L044308j848066l494637R03204N296355M096805q28683m397393
$$ y = [-519804, -2411770, -2273026, -22497, 2020244, 2375112, 1780932, 1336029, 1163109, 1430575, 2942467, 5717065, 8183249, 8740033, 7262828, 4455078, 811765, -2932545, -5430292, -6094058, -6359092, -8384887, -12354144, -15548551, -14338886, -7536872, 1618388, 7361895, 6672883, 2517587, 275063, 1207818, 1949079, 679063, 224117, 3103317, 6895137, 7874291, 6710175, 6401330, 6344903, 3516622, -995942, -2192302, 1063189, 3660373, 1839179, -1481279, -2002594, -519302, -172424, -620450, 433309, 2279045, 2622143, 2332909, 3713812, 5040607, 2392836, -3004891, -5046967, -1777120, 1267188, -580878, -4075515, -3172311, 2124044, 6220849, 5392166, 994773]
12934I94773m733837l026293o77187J013256R64731k0742J70137J629438K060891
12925a624833O92090j92255J013219K526992J858865q35546l504770m571700l593332
12916h231270j409571k51275j483956k832711p41967L855450N724693K736419
12908b634188p53484l72438K052772K189133J96196k19074J776440K855065N64799
12899E655221l430166n572340m122673o35154J402375J95611j680889j83940M053622
12890d318333N679897K344490j390401r35706J282040K41449l064445l168991
12882c330000Q71834L820378K092093j611419k888326j244030M60797j12882k436593
12873d378148l429333n85708M083173N296647J737251j167378P32140L337287
$$ y = [994773, -3739064, -6765357, -7442544, -6429288, -5464557, -5485299, -5315162, -3685724, -1624833, -932743, -1124998, -111779, 2415213, 4274078, 3438532, -66238, -4637938, -8231270, -9640841, -9892116, -11376072, -14208783, -14950750, -11095300, -5370607, -2634188, -3387672, -3760110, -1707338, 481795, 677991, 458917, 2235357, 5090422, 5655221, 2225055, -3347285, -7469958, -8105112, -6702737, -6507126, -8188015, -8371955, -4318333, 1361564, 3706054, 2315653, 1379947, 2661987, 2903436, -161009, -3330000, -2458166, 1362212, 3454305, 1842886, -1045440, -2289470, -1828673, -1941555, -4378148, -7807481, -8393189, -4310016, 986631, 2723882, 1556504, 2288644, 5625931]
12865E625931J071215k897572j311730M134390M242388k439328o176345j414902
12857H34047M191218K189343l520591l962874N29296K258778r25316l534795k146870
12848d087764M84122J306154Q02120J61196o14132j154429r41013q94415j497658
12839f435819o28821K826746N017528J877094l537953m415357l57992K288970
12831c365604O97141q25260O66573J630107q78878l056783n48002L541688K825652
12822F86634k532400o026008m106167M9650K600043M034014N944303O401300K287179
12813I338548m711538q065769l881882L517488O000298J307531m342450m278296
12805e116070N97221M034032K732816p64966k682645k156848n22107P33704O21104
$$ y = [5625931, 6697146, 3799574, 2487844, 6622234, 10864622, 8425294, 2248949, 834047, 5025265, 7214608, 3694017, -268857, 260439, 2519217, 1593901, -1940894, -4087764, -3603642, -2297488, -1495368, -1334172, -1948304, -3102733, -4043746, -4938161, -6435819, -7064640, -4237894, 779634, 2656728, -881225, -5296582, -5654574, -3365604, -2668463, -3493723, -2827150, -1197043, -2075921, -5132704, -5680706, -2139018, 686634, -1845766, -7871774, -11977941, -11928291, -9328248, -5294234, 650069, 7051369, 9338548, 4627010, -3438759, -7320641, -3803153, 2197145, 3504676, -837774, -5116070, -4518849, -484817, 2247999, 1483033, -1199612, -3356460, -3878567, -3144863, -2523759]
12796b523759n64008p14285J686639M530497M075894L35979k510256j985151m34022
12787A897528o74938j639531r80573L69038l10982k496594k377968J625869N919981
12778A331830N820085J328113k923253l422561j753862j624476l220519l155966
12770g620609j41236K534603J892160k74493n93910O01344O75106m74868r74230
12761d376133r90267j770035j714000J443955M903234L133015l121149o110536
12753h601916j624453N027666O555736K643755j889332l779862k669229N98382
12745c739253L428783K447148j582317l117326L61230L571369Q78309m779195
12737b531252n825284q94419L813778L450438P93j586508N57934L613282K987875
$$ y = [-2523759, -3087767, -3802052, -2115413, 2415084, 6490978, 6826957, 4316701, 2331550, 1897528, 1222590, -416941, -1397514, -1028476, -1339458, -3836052, -6214020, -4588151, 1331830, 7151915, 8480028, 5556775, 2134214, 380352, -1244124, -4464643, -7620609, -7761845, -5227242, -3335082, -3609575, -4203485, -3602141, -2927035, -3401903, -4376133, -5366400, -7136435, -8850435, -7406480, -2503246, 629769, -2491380, -8601916, -10226369, -5198703, 1357033, 4000788, 2111456, -1668406, -4337635, -3739253, -310470, 2136678, 554361, -2562965, -2201735, 1369634, 2247943, -2531252, -8356536, -9250955, -5437177, -1986739, -1985946, -3572454, -3014520, 598762, 3586637]
12728C586637k390985p114487m543231L685917P961406L428291k880768k506002
12720g73222K140175K968869m91019j821861L80587Q57114j914838k824461L71563
12711a107093K781077Q18643j959991j335149Q77145P46143j448326k708809k005240
12702e341600l60333J269350K076892J659987J218406J849136J695575j373951
12694B693462m645823l391934J093256K632131J79419o32304K060923K600546
12686B589676j608707m073055J65140N185198L201426k769450l953238K96337
12678i66673K636296j98550l969037n004205m001856j502393L308023Q060290
12670a638105P689887J511499m815738o169563l279648j33073P37854l18379p71280
$$ y = [3586637, 1195652, -5918835, -10462066, -6776149, 1185257, 4613548, 1732780, -773222, 1366953, 4335822, 3844803, 2022942, 2403529, 3260643, 1345805, -1478656, -1107093, 1673984, 2492627, 532636, -802513, 74632, 820775, -627551, -3336360, -5341600, -5701933, -4432583, -2355691, -695704, 522702, 2371838, 4067413, 2693462, -1952361, -5344295, -4251039, -1618908, -1439489, -2071793, -10870, 2589676, 980969, -3092086, -2926946, 2258252, 5459678, 2690228, -1263010, -966673, 1669623, 1471073, -2497964, -7502169, -11504025, -13006418, -9698395, -1638105, 6051782, 7563281, 2747543, -3422020, -6701668, -6834741, -6096887, -6415266, -7186546]
12661g186546J801475N821867N801213k16836n661772l162081M361271O858043
12653H416634J199717m951218m774984j032414j0876k239813l476927j462037
12645h331918K185471M787871M628013J737633j637770k929428k308327j775835
12637c644290j280742Q87339L610805L218649m61613k734630q40768J899758J322959
12628A977467j753459l673105k828379O6366L532030M924654J953665k966199
12620A233040l781154Q21108M353155J739078k738158j966901L027924N020731
12612G708823J519747k793551m034431l345324k525026q91218J909937M123165
12604A672122M520670L746433K166058o59091l818787n317622m785232l132288
$$ y = [-7186546, -5385071, 436796, 6238009, 6021173, 359401, -2802680, 1558591, 8416634, 9616351, 4665133, -109851, -1142265, -1153141, -3392954, -6869881, -8331918, -6146447, -1358576, 3269437, 5007070, 3369300, 439872, -1868455, -3644290, -4925032, -4037693, -426888, 2791761, 2330148, -404482, -1245250, 654508, 1977467, 224008, -3449097, -6277476, -6211110, -2679080, 2245574, 4199239, 1233040, -2548114, -1727006, 2626149, 4365227, 1627069, -339832, 2688092, 7708823, 9228570, 6435019, 2400588, -944736, -3469762, -4360980, -2451043, 1672122, 6192792, 9939225, 12105283, 11446192, 7627405, 2309783, -2475449, -5607737]
12596e607737o9994M282288O106395J557902n787395p191323n92607N598233L980913
12587B276675j859699l616447j66534K700790J801577m07689j299999q76361Q46393
12578f01294L981935N692256K045063n416715r406111n617495J726851N575358
12570b020152M265160J174383j141773k689725l326304k250256k25690Q49619
12562e364738J106599K648966N402229N759767J384037m530129o483425l478420
12554c555114J37288Q37731K8866N07849J438583m0014l366823m487472j720397
12545a0219503J745136K673049J938902J630116J091327o87498j303772J680244
12537a451999M928123K542006m526249q043786l562170L320166N125707K373576
$$ y = [-5607737, -5677731, -1395443, 4710952, 6268854, 481459, -6709864, -7302471, -1704238, 2276675, 416976, -3199471, -3366005, -665215, 1136362, 728673, -571326, -1447687, -601294, 3380641, 9072897, 11117960, 5701245, -3704866, -9322361, -7595510, -2020152, 2245008, 3419391, 2277618, -412107, -3738411, -5988667, -6214357, -5364738, -4258139, -1609173, 3793056, 9552823, 10936860, 6406731, -76694, -3555114, -3417826, -2580095, -2551229, -2043380, -604797, -644811, -4011634, -8499106, -10219503, -8474367, -5801318, -3862416, -2232300, -1140973, -1828471, -3132243, -1451999, 3476124, 6018130, 1491881, -6551905, -10114075, -6793909, -1668202, 705374]
12529G05374P19152J739581K186257N73055j234306k531469m497939o061469m238665
12520a2640429K11068K477644J107201R04159N143030R088325O140379j957875
12512A0473502o582143l756866Q11365R1426m664813o264293k074609K080928
12504i885503J29040n213019n584295J254343P551285N955127j94650j855115
12496g842787K511773N114147R27561m743806m285445J317570M609915K344942
12488d6130j171654j203342J268819J888099j083787m776713n054875j195083
12480a1374666K927472K969560n91604k903136j030999K406155L400894K031574
12472b164750J134519J176172l8105k762540l762711n85605M597286O944355M204607
$$ y = [705374, 1424526, 3164107, 5350364, 5923419, 4689113, 2157644, -2340295, -8401764, -12640429, -12429361, -9951717, -8844516, -7940357, -2797327, 6290998, 12431377, 10473502, 3891359, 134493, 945858, 1037284, -3627529, -9891822, -11966431, -9885503, -9756463, -14969482, -20553777, -19299434, -11748149, -5793022, -5987672, -7842787, -5331014, -216867, 710694, -4033112, -8318557, -7000987, -2391072, -46130, -1217784, -2421126, -1152307, 735792, -347995, -5124708, -10179583, -11374666, -8447194, -5477634, -6069238, -8972374, -10003373, -7597218, -4196324, -2164750, -1030231, 145941, 107836, -2654704, -6417415, -7003020, -2405734, 4538621, 8743228]
12463H743228q31559l334125j741008O97113M52846j472581j678724m01372j259274
12454h25456m286951m320586P91819N210652L105945k169673l022951P75062K613115
12445b129024L97757m36143L149407O107336L191706k970394o041748m247373
12437b978476l35385L335703N299159L461929j967194n862961l535058K187948
12429c94335M129935P80688k009976k42955K520272J324639k394498l202140K07066
12420G18696L252982J623529l580970p235282n278036J334239O707739N214278
12412B757175j783136o125370k446036M261001M890235j004890m491686j95063
12404d137770O415704P745565M149798N53586j766655l829105l665500K02431
$$ y = [8743228, 7911669, 4577544, 2836536, 3533649, 3986495, 2513914, 835190, 433818, -825456, -5112407, -9432993, -8641174, -3430522, -324577, -2494250, -5517201, -4742139, -2129024, -1731267, -2167410, 981997, 7089333, 10281039, 7310645, 1268897, -2978476, -3313861, 21842, 5321001, 8782930, 6815736, 952775, -2582283, -394335, 3735600, 4516288, 2506312, 2263357, 4783629, 6108268, 3713770, 511630, 718696, 3971678, 5595207, 2014237, -5221045, -10499081, -9164842, -2457103, 2757175, 974039, -5151331, -7597367, -3336366, 1553869, 548979, -3942707, -4137770, 2277934, 10023499, 14173297, 14726883, 12960228, 9131123, 5465623, 5668054]
12396E668054L131981L49343l790343j725209L699853K452322n531151q637874
12388d383024k101176M237189K433826j379446L20976K805829q01163n130291
12380c997280j529816N295476M012971l928962o269331J24364N460726L751130
12372B919278M0092j043196j532848k012290J004218N852350N007567k026745
12364H208426n767601j634064K670799M86689l273441k014300J372808J301173
12356A350489m43526K51226J481209J84410q09220J381748K707615p39279m406910
12347I57762k763833L44050j612303n468905l186763M045212P157475L268269
12339B740964j397792k210686q79492M34571J613720J153555k264703n047489
$$ y = [5668054, 8800035, 9149378, 5359035, 3633826, 7333679, 9786001, 4254850, -4383024, -6484200, -2247011, 186815, -1192631, -871655, 1934174, 1133011, -3997280, -5527096, -231620, 3781351, -147611, -6416942, -6292578, -831852, 2919278, 2959370, 1916174, 383326, -1628964, -624746, 5227604, 10235171, 8208426, 2440825, 806761, 3477560, 3964249, 690808, -1323492, 49316, 1350489, 906963, 1158189, 2639398, 2823808, 2014588, 3396336, 6103951, 5364672, 957762, -1806071, -1462021, -3074324, -8543229, -11729992, -7684780, -527305, 2740964, 1343172, -867514, -1747006, -1312435, 301285, 1454840, -809863, -5857352]
12331e857352k863870J204723N78148l520828l516754J710132M956539L031160
12323d278102J359084L306202M001405n89937o020834o139143j722232K563362
12315g520195M904795N509395L547832m48127k856882j915805j097375l512215
12307c388577o120501l979542J980264N846733M425494N21280j319323J2537J599369
12298d22266L34185k756439l066254J321240N759665M722746j10886k156596K68016
12289C893411K112584L03443j792542r28474N51198o62690l056886k996511k06951
12280b783418K670839L583992J837056j915430m618960l069469J005638K069916
12272a219836r73595k428905J235706N190067L596193j259029k923396p41746
$$ y = [-5857352, -8721222, -7516499, -6938351, -10459179, -13975933, -12265801, -7309262, -4278102, -2919018, 387184, 4388589, 3798652, -2222182, -8361325, -10083557, -7520195, -2615400, 2893995, 6441827, 5993700, 3136818, 1221013, 123638, -3388577, -9509078, -13488620, -11508356, -5661623, -1236129, -714849, -2034172, -2021635, -422266, -88081, -2844520, -5910774, -4589534, 1170131, 5892877, 5781991, 3625395, 3893411, 6005995, 6309438, 4516896, 3588422, 4139620, 3476930, 420044, -2576467, -2783418, -112579, 3471413, 5308469, 3393039, -1225921, -4295390, -3289752, -1219836, -2193431, -4622336, -3386630, 1803437, 5399630, 4140601, 1217205, 475459]
12264D75459L81692j439071k788906j107701J854926L307465K496125J86756k136861
12255A229884k777361j826002j578359k620299j720940K834017O302891L125953
12247B969784l856287n981512q39334M427402L661030l18840j603294j99646l16280
12238b056977k558238l173678m76491K456763K358780m7210j748753j355114k187
12229f603105M90535o30561k398389k686287l80315K531023K451736j198203m410937
12220a2834503l474370k9795J508103O41359R75699L451073M161296J142384j321280
12211e780034P29483L827646K165118k623883l480320Q69165L895405J833889
12203A436469p33491Q07592L400258K103083r93463j66392L806563L785953k836606
$$ y = [475459, 857151, -581920, -3370826, -4478527, -2623601, 683864, 3179989, 3366745, 1229884, -1547477, -3373479, -4951838, -7572137, -9293077, -6459060, -156169, 2969784, -886503, -6868015, -7707349, -3279947, 381083, 62243, -1541051, -1740697, -2056977, -4615215, -7788893, -8265384, -5808621, -3449841, -3497051, -5245804, -6600918, -6603105, -6112570, -6743131, -9141520, -11827807, -12208122, -9677099, -7225363, -8423566, -12834503, -16308873, -16338668, -14830565, -14189206, -13213507, -9762434, -5601138, -4458754, -5780034, -5050551, -1222905, 942213, -1681670, -5161990, -4292825, -397420, 1436469, 702978, 1510570, 4910828, 7013911, 6020448, 5854056, 9660619, 13446572, 10609966]
12194A0609966r067962o968158J837228P765080M663235l247899o890012l087490
12186d386012K559979L495153r0855l217546l212909j508232K39458J904535L058054
12177a158375K951641K331373K067340O38089l095949n623221k654790L064105
12169a479787M270357K53200j800131J468550M289328J841216k080247k609448
12161D153038j720088k283594j311778L050910M394305k396851r720217o668661
12153a2502936L430725P077428J016108m102626j650412K111931R86995j029217
12145d662004J099019L752921J779417j981454k195316m77158j425859l438476
12137g548910j506861L389241N273597K458991p25866j177581l12915O0821K77166
$$ y = [10609966, 1542004, -5426154, -3588926, 4176154, 8839389, 5591490, -1298522, -4386012, -1826033, 1669120, 1578265, -1639281, -4852190, -6360422, -6120964, -4216429, -1158375, 1793266, 4124639, 6191979, 6830068, 3734119, -1889102, -4543892, -1479787, 2790570, 3043770, 1243639, 2712189, 7001517, 8842733, 6762486, 4153038, 2432950, 149356, -1162422, 1888488, 6282793, 3885942, -5834275, -12502936, -9072211, -1994783, -978675, -5081301, -6731713, -4619782, -3632787, -4662004, -3562985, 189936, 1969353, -12101, -2207417, -2684575, -4110434, -7548910, -9055771, -5666530, -392933, 2066058, 1340192, 162611, -150304, -89483, 187683]
12128A87683N77249K29123n17031o37243o45686j900592l670397l627189j316155
12119a1320238J233373K331610K079856J299865P71671J002621J325980L32552
12111i42710j450496j249052J673851L795790K092241j335377k658141k038257
12103b112151k030740k363271r59272J291320J749688J086118K024634L666613
12095B352939K512026j021634k814746k036606j877216k600830n69723M057479
12087a998311N609830J854528j955288j667377l08872j111854j228687J672075
12079H66044K950293j378895n995318l947450J304615J295894k944931k733445
12071a0583193K894740N236421Q79374k661056o0202L332142J698899j514054
$$ y = [187683, 764932, 994055, 477024, -160219, -805905, -2706497, -6376894, -10004083, -11320238, -10086865, -7755255, -5675399, -4375534, -3603863, -2601242, -1275262, -942710, -2393206, -3642258, -1968407, 1827383, 3919624, 2584247, -73894, -2112151, -4142891, -6506162, -7465434, -6174114, -4424426, -3338308, -1313674, 2352939, 4864965, 3843331, 1028585, -1008021, -2885237, -5486067, -6055790, -1998311, 3611519, 5466047, 3510759, 1843382, 1534510, 422656, -806031, 866044, 3816337, 2437442, -3557876, -7505326, -6200711, -4904817, -7849748, -10583193, -7688453, -2452032, -1572658, -4233714, -4293916, -961774, 737125, -776929]
12063g76929r75816R66027n784j065492K288170O108043L017490m791390p208323
12054b444004j100982N042189L459969k922932o206163m033438m77139O07124
12046h075376n03475j186644O0844K179454L144501K651804K093485J773242M86016
12037B623851j257986q91617J355917J202969k728286m896921q54392M489319
12029i57146L401461k368885l863955J141033M983390K368210k248906k818132
12021c62930m82022K17971j099883j543562j55420J520822J895378K19495k475977
12012b266128k493153K521163P967489O297219j654290o040951k044041K711394
12004D998702K45538n220772m743378N62331J989042k015101l835562J41238L790182
$$ y = [-776929, -1752745, -786718, -792502, -1857994, 430176, 6538219, 9555709, 4764319, -2444004, -3544986, 1497203, 4957172, 2034240, -4171923, -8205361, -8682500, -8075376, -8578851, -9765495, -9704651, -7525197, -4380696, -1728892, 364593, 2137835, 2623851, 1365865, 474248, 1830165, 3033134, 304848, -4592073, -5446465, -957146, 2444315, 75430, -3788525, -2647492, 2335898, 4704108, 2455202, -362930, -844952, -626981, -1726864, -3270426, -3425846, -1905024, -9646, 209849, -2266128, -4759281, -2238118, 5729371, 12026590, 10372300, 4331349, 2287308, 4998702, 5244240, 23468, -4719910, -4157579, -2168537, -4183638, -8019200, -7877962, -4087780]
11995d087780J573249k927455l085656J349753N265475N283951K203564j350380
11987D224721k822730j079794J926408K515812q4530k533105k364082j497291
11979a714591k341477l066790m83439L886229M940091J206018l112949m273076
11971d959984l306678k265812p1069M162730O634675L059731l680192n961503
11963f388102k085315J552892Q84745Q2808K933565M909999P52237n075335m329400
11954f761906J467542L187164j010167l259514J74514L024813O10071k317620
11946d885103p18676K153717J793445O88168K278759L236286j24124l372157q39703
11937B10612L622826K434168k534274k886002J968444M022319K94239k977070
$$ y = [-4087780, -2514531, -5441986, -8527642, -7177889, -1912414, 3371537, 5575101, 4224721, 1401991, 322197, 2248605, 4764417, 4679887, 2146782, -217300, -1714591, -4056068, -7122858, -7606297, -3720068, 1220023, 2426041, -686908, -4959984, -8266662, -10532474, -10603543, -6440813, 193862, 3253593, -426599, -6388102, -8473417, -6920525, -6035780, -5952972, -3019407, 1890592, 2642829, -2432506, -6761906, -5294364, -2107200, -3117367, -6376881, -6202367, -3177554, -2567483, -4885103, -5603779, -3450062, -1656617, -968449, 1310310, 4546596, 4422472, 1050315, 210612, 3833438, 6267606, 3733332, 847330, 2815774, 6838093, 7132332, 4155262]
11929D155262j528437P39675k84807k638574l356447l221851l168547j774809
11921a1078535O76785J122631o30489o71195K098203L679439K363256K005956
11913d33949M319320M496250n21862n464302m439753j30929J355843M97884J729736
11904A408238M018730K421600k249912l682382m76028J488295r78478l242774
11896a292711j189131J531989k14781l888808k697185L669437P955301N429061
11888I303172k10389k944353k181560j205449r60244K51938K099813J860038p50357
11879E262609k379844j126288P01472R02287R92545K523028K930518o94111n644976
11870C467240o217065j718606K704275L482542K408955J999287J470118l85216
$$ y = [4155262, 2626825, 3366500, 3081693, 443119, -2913328, -6135179, -9303726, -11078535, -10401750, -9279119, -9909608, -10580803, -8482600, -4803161, -2439905, -433949, 3885371, 8381621, 7859759, 2395457, -2044296, -2175225, -819382, -321498, 1408238, 5426968, 7848568, 5598656, 1916274, 1440246, 2928541, 1950063, -1292711, -2481842, -949853, -1164634, -5053442, -7750627, -4081190, 3874111, 9303172, 9092783, 6148430, 3966870, 2761421, 1801177, 2053115, 4152928, 6012966, 5262609, 2882765, 1756477, 2457949, 3360236, 4352781, 6875809, 9806327, 9112216, 3467240, -2749825, -4468431, -1764156, 1718386, 4127341, 6126628, 7596746, 7211530]
11862G211530j847815r68740N39276n47716l675093m366665P674O220557Q338769
11853A0911777M401567j431690l947271k753734j400601j627377j614057l07177
11845B231437K35542j259816k387626r42142J023904L55863k115346l033775j325613
11836g217572J526473M062218M795033K235252j785813k251653J516514K744834
11828E625286k758891q127698m921368K810124M082053j473433l305779K299377
11820e770329O417036K805743k489602k491341j04610m17637q14511K854298O873866
11811F862913N167009m37300l411734k408342q06025K68307J666320K001678P8640
11802H981466j470590q21555j355935n051718o190462J42563P451625N665762
$$ y = [7211530, 5363715, 4394975, 4934251, 4386535, 711442, -3655223, -3647549, 2573008, 10911777, 15313344, 13881654, 9934383, 7180649, 5780048, 4152671, 2538614, 2231437, 2466979, 1207163, -1180463, -2122605, -1098701, -742838, -2858184, -5891959, -7217572, -5691099, -1628881, 3166152, 5401404, 3615591, 1363938, 2880452, 5625286, 2866395, -5261303, -10182671, -7372547, -3290494, -4763927, -8069706, -5770329, 646707, 3452450, 962848, -1528493, -1633103, -2050740, -2865251, -10953, 6862913, 12029922, 11592622, 8180888, 5772546, 4966521, 5234828, 6901148, 8902826, 8981466, 7510876, 6689321, 5333386, 281668, -5908794, -5766231, 1685394, 7351156]
11794G351156k947178o573994j969359J560483j913661n977721l274502L199994
11786a0544782O174433M752419K711600J065815j355725l043268j469756J802765
11778I3501K514380k18723k846390k365742L60445K481168K405045P29097r80521
11769B172260j815396k010753j875273q73060J439010M062807N211927M032936
11761A0344458R38782l000845o064772o369315l719505j81804K139062K726213
11753c187726J540045j309347l580106j788385L521617O566573L640205j308384
11745D094492k283527M08988K089385J489955J059941J094366m19333k577175
11737D957092k040415Q85523J938646n96091l726748m669755l536835q90469K770500
$$ y = [7351156, 4403978, -2170016, -4139375, -2578892, -4492553, -10470274, -13744776, -10544782, -4370349, 382070, 3093670, 4159485, 2803760, -239508, -1709264, 93501, 2607881, 2389158, -457232, -2822974, -2462529, 18639, 2423684, 3152781, 2172260, 356864, -1653889, -3529162, -4402222, -2963212, 1099595, 6311522, 10344458, 11283240, 8282395, 2217623, -4151692, -7871197, -8053001, -5913939, -3187726, -1647681, -2957028, -6537134, -8325519, -4803902, 1762671, 5402876, 4094492, 1810965, 2219953, 4309338, 5799293, 6859234, 7953600, 7534267, 4957092, 2916677, 3802200, 5740846, 5144755, 1418007, -3251748, -6788583, -7679052, -4908552]
11728d908552M868934K862685j202791k891511j925019j442516j467885M80966
11720e625689K695640R24301k734936j329841M642708N941571o57926o098195
11712b242367l457914Q19210j496866n791205k456603N962946P644781j80158
11704a198176p129293m993724K350512O894520O566371L884977O19706k125311
11696D869582k454771l6805K237418J478064j594411l638113k383392J080199
11688d42229L079845J114506k514523k834587P56405K821999o9467l522018k081163
11679c691232J772581J772331j448459j595585J998564K810828j510743m350827
11671d242542n04864N312860N451134Q6375m289012m002162r27895J857873K799055
$$ y = [-4908552, -39618, 2823067, 1620276, -1271235, -3196254, -4638770, -6106655, -5625689, -2930049, -2005748, -4740684, -6070525, -1427817, 4513754, 3855828, -2242367, -5700281, -4881071, -6377937, -12169142, -14625745, -8662799, -1018018, -1198176, -8327469, -13321193, -10970681, -4076161, 2490210, 6375187, 6994893, 4869582, 2414811, 2378006, 4615424, 6093488, 4499077, 860964, -1522428, -442229, 2637616, 3752122, 1237599, -1596988, -840583, 1981416, 1911949, -1610069, -3691232, -1918651, -146320, -1594779, -3190364, -1191800, 1619028, 108285, -4242542, -4747406, 565454, 6016588, 6102963, 1813951, -2188211, -3116106, -1258233, 1540822]
11662A540822J469472r48135j608071P82866L535209L045045o54865m313091n283573
11653b434321l297450J35745K465094J766909q53932k180290j196005o5168R8323
11644e561095P64038J575718q04293n945963o763663Q72001R520752Q580704o65968
11635A572231o478930k982569L196110M285437J288179j055824j993336k257476
11627d426178J30670N164673O658555K14982p693377o893252J382619N320397
11619a40911l49541o699870m042969M252867P705003L709252q94039j290178j83272
11610B066342j029263k210411q53023J946187L269003K995551K726093J849725
11602A0760204j503260o046001p511032m128176Q11925L317518L420168L405472
$$ y = [1540822, 3010294, 2062159, 454088, 1236954, 4772163, 7817208, 7162343, 2849252, -2434321, -5731771, -5596026, -3130932, -1364023, -2217955, -4398245, -5594250, -5659418, -5561095, -4797057, -3221339, -4025632, -9971595, -16735258, -15863257, -6342505, 2238199, 1572231, -4906699, -7889268, -4693158, -407721, 880458, -175366, -2168702, -4426178, -4295508, 869165, 7527720, 7742702, 49325, -6843927, -5461308, -140911, -490452, -7190322, -11233291, -6980424, 724579, 4433831, 3539792, 2249614, 2066342, 1037079, -1173332, -2026355, -80168, 3188835, 6184386, 8910479, 10760204, 9256944, 3210943, -4300089, -8428265, -7616340, -4298822, -878654, 2526818]
11594B526818K952180n37104o383506q970759m468706K741401M541380K9712k758463
11585a0327047J602291P368771N705366j864745n442151j721095J489976j460652
11577d649286m545638j20054P737830Q610908J263088n387187n970536m225214
11569g286089l722183j984661K671153O020850M508082J102823l08603j225042
11561b23670l979649n616330k441687K764727M268744J676140r19038j756355
11553f227118j818893q36661J198761R55466l247255n811554j025801O003677
11545a0809378N001854l050516n741789J956208R269567N642427l762158o504284
11537g998069n99400M999033M314847L44999j928284j458701N35753K860778L784897
$$ y = [2526818, 5478998, 4941894, -1441612, -10412371, -14881077, -12139676, -7598296, -7568584, -10327047, -8724756, -1355985, 4349381, 2484636, -2957515, -4678610, -3188634, -4649286, -9194924, -9314978, -1577148, 7033760, 8296848, 2909661, -3060875, -7286089, -11008272, -12992933, -10321780, -4300930, 207152, 1309975, 1001372, -223670, -4203319, -9819649, -12261336, -9496609, -5227865, -3551725, -4470763, -6227118, -8046011, -8882672, -7683911, -6728445, -9975700, -15787254, -16813055, -10809378, -5807524, -8858040, -14599829, -12643621, -3374054, 2268373, -1493785, -7998069, -8597469, -3598436, 716411, 1061410, -866874, -2325575, -1789822, 1070956, 4855853]
11528D855853J863820j624856l486441k347782N4377J171469n8503k590345l980150
11519f142558k783134p79089q94518k469925j607157K692656O338279N910968
11511B65522K869165j87044l155886n349137l555695K322356N997407K764399
11503A971087k677001k596451K231869M307400J199437j849077j236038J55584
11495A506810q70682k639714k126735N00200L102143M315061L661084J542487
11487H990654j83608k12178l75176l164063o876334o921021k309678K683339L951312
11478d416753J624711j528080k828596r15500K770452M199657J565845j212169
11470g40433L74441M203286M404100N20229k043907p53572R71346L84849p44848
$$ y = [4855853, 6719673, 5094817, 1608376, -739406, -685029, 486440, 427937, -2162408, -6142558, -8925692, -9704781, -10599299, -13069224, -14676381, -11983725, -5645446, 265522, 3134687, 2947643, -208243, -5557380, -9113075, -6790719, -793312, 1971087, -705914, -3302365, -1070496, 3236904, 4436341, 2587264, 1351226, 1506810, 636128, -2003586, -4130321, -3630121, -527978, 3787083, 7448167, 8990654, 8807046, 8594868, 8219692, 5055629, -1820705, -8741726, -11051404, -8368065, -4416753, -2792042, -4320122, -7148718, -8064218, -5293766, -1094109, 471736, -740433, -365992, 3837294, 8241394, 8761623, 6717716, 5964144, 6935490, 7320339, 6575491]
11461F575491o38609n53236j358190j746906j530014k209954l072575j528006
11453f061999J726267L203983K878685L570706L581065j709979q923677p382288
11445i117237M299235J2200797N608578o794768r286986j334277M275034J930012
11437A780388r90048J033425L103743M4943m214033l127192K394644N832542L678094
11428I536506j863240o413239o564810j623957M890181P054573K503671m273228
11420C246457o590673k857688K386610M054426J449068k133678l147003p68727
11412d361208K736745L988021J540878k336064l626624j271645R52426q84683
11404c262154m873628n029188K47231N131805M210732M4905r06169K378014M793223
$$ y = [6575491, 5936882, 5383646, 4025456, 2278550, 748536, -1461418, -4533993, -6061999, -4335732, -1131749, 1746936, 5317642, 8898707, 7188728, -1734949, -9117237, -4818002, 7382795, 12991373, 6196605, -3090381, -4424658, -149624, 1780388, 790340, 1823765, 4927508, 4972451, 758418, -2368774, 25870, 5858412, 9536506, 7673266, 1260027, -5304783, -6928740, -2038559, 5016014, 7519685, 3246457, -3344216, -6201904, -3815294, 239132, 1688200, -445478, -3592481, -4361208, -1624463, 2363558, 3904436, 1568372, -2058252, -3329897, -2377471, -3262154, -8135782, -13164970, -12917739, -7785934, -3575202, -3530297, -4436466, -2058452, 2734771]
11395B734771K738626k005261n778181o477671l626253J290328M661249M282349
11387b180043K465208K339821K676341P11397j876356j535682K13403q34495l234107
11378a254513j668329K986169L815804p05590m017095k372788J07809K32173Q94002
11369a982358L470291L531823q63393m327864k905720m20265p73067j246815Q69177
11360d648191K371823Q84000J9792J499851J40072n997882q834816k516457N390337
11351a1691471M992680o32379k125279M86738P68027o61838J486741M877329K753001
11342B53549k548619k181458L799778O117832J828728j735014j34233K121457
11334G522020J119847o60821q65537j101212j860821j124445K99633q49438l610601
$$ y = [2734771, 5473397, 3468136, -2310045, -8787716, -12413969, -11123641, -6462392, -2180043, 285165, 2624986, 5301327, 6012724, 4136368, 2600686, 2814089, 1979594, -1254513, -2922842, 63327, 3879131, 3173541, -843554, -3216342, -3108533, -2876360, -1982358, 1487933, 5019756, 4156363, -171501, -3077221, -3497486, -4270553, -5517368, -4648191, -2276368, -1392368, -1372576, 127275, 267347, -5730535, -14565351, -17081808, -11691471, -6698791, -7331170, -9456449, -8969711, -8201684, -8863522, -7376781, -2499452, 253549, -2295070, -4476528, -676750, 5441082, 7269810, 5534796, 5400563, 7522020, 8641867, 7981046, 7115509, 6014297, 4153476, 3029031, 3328664, 2479226, -1131375]
11325a131375l549074n49808J217394Q10822O29171J42647k290117l062401J677288
11316f105453O423023K854606n084028n264928L148223P888928L298975k161860
11308D997486k004051j263678l982902m435622J134652N551757K480467k494571
11300a6462j654757K263273K255350j238848l447620m033106m739085l699899
11292a4311154N38245M255743M223457L002614L006002J400170l164708n461822
11284f511453k058156J728121L73533k630443j499714K042945L360127L247317
11276a947723L782261K080955l170125n264951N74006O549732K733311o387307
11268a049841p959834n64533M780095K773622K69937K534298M552270O01357o121246
$$ y = [-1131375, -4680449, -5230257, -4012863, -3202041, -2572870, -2430223, -4720340, -7782741, -6105453, 317570, 3172176, -1911852, -7176780, -4028557, 3860371, 7159346, 4997486, 2993435, 1729757, -2253145, -6688767, -5554115, -2358, 2478109, -16462, -1671219, 592054, 2847404, 1608556, -1839064, -5872170, -10611255, -14311154, -13772909, -9517166, -5293709, -2291095, 714907, 2115077, -1049631, -6511453, -8569609, -6841488, -6467955, -9098398, -10598112, -8555167, -5195040, -1947723, 1834538, 3915493, 745368, -4519583, -3945577, 2604155, 5337466, -1049841, -9009675, -9574208, -4794113, -2020491, -1750554, 783744, 5336014, 5937371, -183875]
11259a83875q703665n623883l10407M124511O056890M510417N34477k307260j293776
11250c196571K126466L605430P74623l269659k678195L286101P104801K027822
11242I780818p113931q807829r75518N941649M463439k73331j054405J74080j287230
11233H47742l101095j198533J387253J16866j901701K79618L257181Q64924m064021
11224c511766m021823K16275J721398O0031O37790L054044J851764j584073j7176
11215a593536N715471N907899k009918q008837m496788K954297N219330J872758
11207E560676j601509k332228p96090J776640K823277j28946m843258n995360
11199e536798k966489k59141Q96706L970249Q328014P578719M67683m822372k440506
$$ y = [-183875, -8887540, -14511423, -14821830, -10697319, -4640429, -130012, 404465, -1902795, -3196571, -1070105, 2535325, 3309948, 40289, -2637906, 648195, 7752996, 9780818, 2666887, -6140942, -7116460, -1174811, 3288628, 3015297, 1960892, 2134972, 847742, -2253353, -3451886, -2064633, -1947767, -3849468, -3569850, -312669, 552255, -3511766, -7533589, -7317314, -5595916, -5535885, -4898095, -1844051, 7713, -1576360, -1593536, 4121935, 10029834, 8019916, 11079, -4485709, -1531412, 3687918, 5560676, 3959167, 1626939, 830849, 2607489, 5430766, 5301820, 458562, -5536798, -8503287, -8762428, -7865722, -3895473, 4432541, 12011260, 12478943, 7656571, 5216065]
11190E216065K321797J852519k486986m234131j825884J443935L233720K574721
11182H095756j224098n296711l935062K364618M694167j082702n789291m24129
11174b597452Q026902O049757m730614q996114j089434O779979L817055l975724
11166C284355n001967N99797L979468K038813n38453p63263l24805j70126N95458
11157C699277O29419k307333n797848m865704j97166K157984N04176O4352L415781
11148b697062N443939K065980k423633k400169O9670p6896j586730N623L032435
11139A433157J921684k632311m203259j202031J348278J291281K195378M914030
11131E066207M631889l81401m517954l369329q0467Q86650K86093K05503m55489
$$ y = [5216065, 7537862, 9390381, 6903395, 2669264, 843380, 2287315, 5521035, 8095756, 6871658, 1574947, -2360115, 4503, 4698670, 3615968, -2173323, -2597452, 5429450, 11479207, 6748593, -2247521, -3336955, 3443024, 7260079, 3284355, -1717612, -1117815, 2861653, 4900466, 4362013, 3598750, 3273945, 3103819, 3699277, 4328696, 2021363, -3776485, -8642189, -8839355, -6681371, -6177195, -6112843, -2697062, 2746877, 4812857, 2389224, -10945, 58725, -18171, -1604901, -1599278, 1433157, 3354841, 722530, -3480729, -4682760, -3334482, -2043201, 152177, 5066207, 9698096, 9316695, 4798741, 1429412, 1348945, 2235595, 2521688, 2727191, 2271702]
11122B271702k091365j533790K163689M307070J671987k099980k887805k378322
11114e76814k915074j977173K135065M754678J868205k359324k231811J90167
11106a112081J49953l18639L027613O429772K605754o347776j0324398n423745
11098a1313547J672518M102499K278042J19686p2620J686167L063496J033839
11090B570080k754546j783113M980826P857931k87093j0698225r631686O95704
11082i050122M969238j920885q000398l437457N794049Q984120N499887J800970
11074D639402O86029J34600j304751k898148l187600j075436K069672J955569
11066A019337k772268o024347k007871M461032L951111k363496m003573J497522
$$ y = [2271702, 180337, -1353453, 810236, 5117306, 6789293, 4689313, 1801508, -576814, -3491888, -5469061, -3333996, 1420682, 3288887, 929563, -1302248, -1112081, -962128, -1280767, 1746846, 8176618, 10782372, 4434596, -5889802, -11313547, -9641029, -5538530, -3260488, -3140802, -3213422, -1527255, 1536241, 2570080, -184466, -1967579, 3013247, 10871178, 10584085, -114140, -9745826, -9050122, -4080884, -6001769, -14002167, -17439624, -11645575, -2661455, 2838432, 4639402, 5325431, 5460031, 4155280, 1257132, -1930468, -3005904, -936232, 1019337, -1752931, -7777278, -9785149, -5324117, -1373006, -3736502, -7740075, -6242553]
11058f242553M401905m35569m259075J254034R866070R731211K65136q403489
11050F177670r229244m390173L38127J805739Q22473L78418J902855K964029J084040
11041A853934j279166k81853K016013O56488k589444j190347L876172L809926
11033F871723l257737p554376k809943L518944K159604l898968n344814n93755
11025a0909322M157360M850341K561462l35093j436360J188836N323071N112886
11017A0513181p81264n955464n115120j117202J017741J455071J952689P63653
11009B733285k902632m534685q31012L867468L840712N13566j334847j634474
11001b82619k832212l508877j083234J965819J164088k589071m249627j604392
$$ y = [-6242553, -1840648, -2276217, -6535292, -5281258, 4584812, 14316023, 14581159, 6177670, -3051574, -7441747, -7103620, -5297881, -4475408, -4096990, -2194135, 769894, 1853934, 574768, 292915, 2308928, 2965416, 375972, -814375, 3061797, 6871723, 3613986, -3940390, -6750333, -3231389, -1071785, -4970753, -10315567, -10909322, -6751962, -1901621, 659841, 324748, -1111612, 77224, 5400295, 10513181, 9731917, 3776453, -1338667, -2455869, -1438128, 16943, 1969632, 2733285, -169347, -4704032, -5535044, -1667576, 2173136, 2686702, 1351855, -282619, -3114831, -6623708, -7706942, -5741123, -4577035, -7166106, -11415733, -13020125]
10993a3020125L170689O720381O151302R72837l798357j514997N862573P860264
10985A2404567K73473p510386o098540N02408K845985L64294j456692k009684
10977f84575l375218k353737M131721R543233N399175l988465o350786Q1830M893244
10968G296422K478360j214747j008655l08228k508082l976456r44355L323158
10960C137417L323235j042938n183180n140789n72518M709515N123637l45134
10952D009245n261632l446070K244934M248051J370311j195055j394361k035450
10944a460027l341630j917064J907859L254754P73503j273167n09830M73239k1851
10935b114214k39732L38426M143l40110K110202N435676M159498j443938m560529
$$ y = [-13020125, -9849436, -3129055, 3022247, 3995084, 196727, -1318270, 4544303, 12404567, 12678040, 5167654, -930886, -428478, 2417507, 2781801, 1325109, -684575, -4059793, -6413530, -2281809, 7261424, 12660599, 8672134, 2321348, 2403178, 7296422, 9774782, 8560035, 7551380, 7243152, 4735070, 758614, -185741, 3137417, 6460652, 5417714, 234534, -4906255, -5478773, -769258, 4354379, 4009245, -1252387, -4698457, -2453523, 1794528, 3164839, 1969784, 575423, -1460027, -4801657, -6718721, -4810862, -1556108, -782605, -2055772, -2565602, -2092363, -2114214, -2353946, -2015520, -2011377, -2351487, -241285, 5194391, 9353889, 7909951, 3349422]
10926C349422k365544J85614l80240q12187J352444K661716O39847j095534L46910
10917C882448J407233j376615m580319l449122K78529J786616O54795m25577r92659
10908b814671j615143m03593L879836P477998N603831n30542m949716m293936
10900B354064o49563J971408J298184j936185m453397l529857n84378P09718J68747
10891d651259Q35023K352847N73649m004657m397837J843974O736231L567782
10883B855753j719968L54955O885814O476024k561172r172899o296988k05091
10875c383572R80761q89029L7553K672603J910808j508813k225398K06049P90975
10866a408063j541112j567162K751551N271538J069543m320032k067925O013233
$$ y = [3349422, 983878, 1169492, 789252, -22935, 1329509, 3991225, 4631072, 3535538, 3882448, 5289681, 3913066, -667253, -4116375, -3837846, -2051230, -1396435, -1822012, -2814671, -4429814, -4833407, -953571, 6524427, 12128258, 11597716, 6648000, 2354064, 1704501, 3675909, 4974093, 3037908, -1415489, -4945346, -5529724, -4820006, -4651259, -3816236, -1463389, -889740, -4894397, -9292234, -7448260, -712029, 2855753, 1135785, 1490740, 8376554, 14852578, 12291406, 3118507, -3178481, -3383572, -2402811, -3291840, -3254287, -581684, 1329124, -179689, -2405087, -2199038, -1408063, -2949175, -4516337, -1764786, 3506752, 4576295, 256263, -1811662, 4201571]
10858D201571Q716836J350781p231082p032603j50391L925100J978872p90984
10850D968100m85070O59677k04845j908705k090350o89395J048154J996977P53482
10841D048025k894875n610441l566228J380861L072871j53574l123079k287636
10833i134076p64341j338596m10103N196200J0156007P158473r85338m185935
10825E692291J80638L845718R99721l037139j230541L497056K967121l286233
10817I628632p283530m457392M87461J458153n81556n86562K405444M302023K231937
10808G604610j627534l019977n20955L050332L316296j254282o880118p516873
10800f848501j848827M089168L720043j592681m237106n82471M365132M141471
$$ y = [4201571, 12918407, 14269188, 7038106, 5503, -144888, 3780212, 5759084, 4968100, 4483030, 5142707, 4937862, 3029157, 938807, 249412, 1297566, 3294543, 4048025, 1153150, -4457291, -8023519, -6642658, -3569787, -3723361, -6846440, -9134076, -9898417, -11237013, -11647116, -6450916, 3705091, 10863564, 9878226, 5692291, 5872929, 9718647, 10718368, 7681229, 6450688, 9947744, 12914865, 9628632, 2345102, -2112290, -1624829, -166676, -748232, -1334794, 1070650, 5372673, 7604610, 5977076, 2957099, 2436144, 5486476, 8802772, 7548490, 668372, -6848501, -8697328, -4608160, -888117, -2480798, -6717904, -7300375, -2935243, 1206228]
10792A206228o92294m075066k480327J563149L314704R70226k897102l886985
10784f977467l10701M229490M225181r23906n495896m367021P74487M304892L765663
10775g75278J201629j126176k809366l331115j403023K737249O384940O728944
10767G607804L323883j775407n459069n619142k909917r4628J054842J229234
10759b642400J334158P37891p19778j188979K47930J074331r74215l270085j453631
10750f854778L287992M725370M32248m102301k792998K552960M617337M50113
10742B315943m536720l563204K712177O818060L783664k693747n175348j894379
10734b233554J880927J646364q53112j368194P64290K806304K895144J515448
$$ y = [1206228, 513934, -3561132, -6041459, -4478310, -1163606, -193380, -3090482, -6977467, -7288168, -3058678, 1166503, 242597, -5253299, -9620320, -8845833, -4540941, -775278, 426351, -699825, -3509191, -6840306, -8243329, -5506080, 878860, 7607804, 10931687, 9156280, 3697211, -1921931, -4831848, -4926476, -3871634, -2642400, -1308242, -570351, -1290129, -2479108, -2231178, -1156847, -2131062, -5401147, -6854778, -3566786, 1158584, 1590832, -2511469, -5304467, -2751507, 1865830, 2315943, -2220777, -5783981, -3071804, 3746256, 7529920, 4836173, -339175, -2233554, -352627, 1293737, 440625, -927569, -163279, 2643025, 5538169, 7053617]
10726G053617j54291j184157r78151j7731L71365L0354J86967O72154o56361l947126
10716A376640n505304k667909J648485K514145l93706k971974k434101K95960
10708h137764L215489N106514M914005K097709j907173m433689m191497k231944
10700e568350o40499q37979k231669k202557R08899M552147M330247L20437k328924
10691c698248n80551K441852K844814J544337J277630J561968N22356j007571
10683D906587j142159n22432p47191j399095j743322k755352m309329l538646
10675a1250939L84269L303278K040327l20584K47659J946509J166654m54455O63763
10666b273519K902058K496222R52479J975560L333544j6672o088166p675637l572913
$$ y = [7053617, 6899326, 5715169, 4737018, 4719287, 5090652, 5121006, 5307973, 5980127, 5323766, 1376640, -4128664, -6796573, -5148088, -2633943, -3027649, -5999623, -8433724, -8137764, -4922275, 184239, 5098244, 7195953, 5288780, 855091, -3336406, -5568350, -6208849, -7046828, -9278497, -11481054, -10572155, -6020008, -1689761, -1369324, -3698248, -4278799, -1836947, 1007867, 2552204, 3829834, 5391802, 5914158, 4906587, 3764428, 3241996, 2494805, 1095710, -647612, -3402964, -7712293, -11250939, -10866670, -7563392, -5523065, -5843649, -5595990, -3649481, -2482827, -2937282, -2273519, 628539, 3124761, 4077240, 6052800, 9386344, 9369672, 3281506, -4394131, -7967044]
10657g967044M32661J774263L504695N728412M010301j368600l699538r73646
10649A441504m1419m824599q572345m469078K830355M324771O83409K69264N108169
10640c249969P672897K830354m294380n916634k216339M05308o05427j076916
10632f451106K051661N080932L287429j063288j855905J034356J480955k543385
10624A021649n235479k504973J315676J075568o11602J353078N110308M863866
10616F388091O01019k362555k081424j525659k084620j743475Q0470J153016M70129
10607a105008k74976M28508K294800L876109L008249j236843n525864n026398
10599c561423r78452J17457k559677j746780M754235P655225O15642p722512o399588
$$ y = [-7967044, -7534383, -5760120, -2255425, 3472987, 7483288, 6114688, 2415150, 1441504, 1400085, -3424514, -11996859, -16465937, -13635582, -9310811, -8627402, -8358138, -3249969, 4422928, 7253282, 2958902, -2957732, -5174071, -4768763, -5374190, -6451106, -4399445, 681487, 3968916, 2905628, 1049723, 2084079, 3565034, 1021649, -4213830, -6718803, -5403127, -4327559, -4939161, -3586083, 1524225, 6388091, 6989110, 4626555, 2545131, 1019472, -1065148, -2808623, -2728153, -1575137, -1105008, -1379984, -951476, 1343324, 5219433, 8227682, 6990839, 1464975, -3561423, -4539875, -4422418, -6982095, -8728875, -3974640, 3680585, 4296227, -3426285, -9825873]
10590i825873Q03523K968114K49941Q66366M584108L904536q03787j931465P95391
10581A610854N63304k348303j141075K707451M41812o807713p504166N51121N418679
10572f508036P44537m568045k716523Q54144o03045l318052j660572J674751K358005
10563a3742836K407847M097519M225292J268045O2719K826756L733466q90446
10555C988362n080227l060418J023746P17888k084974j843902P26769J094068
10547d518688o32546n65969J882068L163082R54146k709408l501918J72458L829440
10538a927335J528671m423843m402011L590751Q250171K187434m648935p61573
10530f06670O868655M442497m484210n342688K037557M884039J404284J716825
$$ y = [-9825873, -9022350, -6054236, -5804295, -4937929, -353821, 3550715, 2746928, 815463, 1610854, 2174158, -174145, -1315220, 1392231, 1834043, -4973670, -12477836, -11926715, -6508036, -5763499, -10331544, -13048067, -12193923, -12796968, -16115020, -17775592, -16100841, -13742836, -11334989, -7237470, -3012178, -1744133, -1681414, 1145342, 4878808, 3988362, -1091865, -4152283, -3128537, -2410649, -4495623, -6339525, -5612756, -4518688, -5151234, -5717203, -3835135, -672053, 282093, -2427315, -5929233, -5756775, -1927335, -398664, -4822507, -9224518, -5633767, 2616404, 4803838, 154903, -606670, 6261985, 10704482, 6220272, 877584, 2915141, 7799180, 9203464, 10920289]
10522A0920289N985952L865506l682723m492825J362034R95408o421066p707332
10514H25243j017163J291679k247755j2706P079174N391287l022481j822560O690126
10505A3154844L383863r213903p956621N894408N402718r935204r215564J0048983
10497A563524J1818697r784742j3138034J1782006J5844891j7069403k6967208
10490b5950269J1896006J7552474p0356122j54710585r7003635O5149381J50995249
10483a02427501Q6845917q991132j9392987K0171946K2591413o392374r568749
10476a7163467J0115825R291210q825219p674578R681385J0342316m291856n237549
10468c761933O791225N924309o881519o950885N636901P219807l897856o205880
$$ y = [10920289, 16906241, 20771747, 17089024, 12596199, 13958233, 14953641, 8532575, 825243, -191920, 1099759, -1147996, -1160702, 5918472, 11309759, 8287278, 6464718, 13154844, 16538707, 7324804, -631817, 5262591, 10665309, 730105, -8485459, 1563524, 13382221, 3597479, -9540555, 2241451, 18086342, 1016939, -25950269, -14054263, 3498211, -66857911, -221568496, -318572131, -253422750, -102427501, -15581584, -24572716, -43965703, -23793757, -1202344, -7594718, -17163467, -7047642, 2243568, -6581651, -14256229, -4574844, 5767472, 1475616, -3761933, 3029292, 8953601, 2072082, -4878803, 758098, 7977905, 4080049, -2125831]
10460b125831K776785L534723o086326o695762M870663Q938585r26960p315746
10452c029869j089440M656926P11911l497444j74876L358554N25316k786721n81719
10443a907362L219936L544374J754179M24616l63084k07204M33153j764241o328998
10434a194631n761783K215741P056905R79128p044636n868545o34867j316662
10426a1569350l285745K405896Q773026L648335o590813n885423M106270P579207
10418h18597J827191j506795n2299k622671q015100m963654N024544P023171j764512
10409e868722o813643r91691N453580M714853K332336K636144J172726k382239
10401B53344p12385N808121O558732q91551n856193l359240j320893l378069k011653
$$ y = [-2125831, 650954, 4185677, -1900649, -8596411, -3725748, 5212837, 4285877, -3029869, -4119309, 537617, 1249528, -2247916, -2422792, 935762, 1461078, -1325643, -1907362, 1312574, 4856948, 6611127, 7035743, 6672659, 6465455, 6898608, 5134367, -1194631, -6956414, -4740673, 2316232, 3295360, -3749276, -9617821, -10252688, -11569350, -14855095, -12449199, -3676173, -27838, -6618651, -12504074, -8397804, -818597, 1008594, -498201, -550500, -3173171, -11188271, -16151925, -11127381, -4104210, -5868722, -12682365, -13674056, -8220476, -3505623, -1173287, 1462857, 2635583, 253344, -459041, 5349080, 11907812, 11016261, 5160068, 1800828, 479935, -2898134, -4909787]
10392d909787M345287N219307k314237n526317K163626Q150173J656321p646972
10384A137401o045518K317359M836521J122486o87348K223j597875l544283o88231
10375c147265M014205L594996r28047k956321j516415p69894j357470p64535L67784
10366c462962j84426j018459J37747J663638J600417J735133K758151Q28321m815883
10357g58323o981984q70987O545491O159358N17829j546687M44578J7593l302962
10348B23906l885677j696673k581564o027807l946757N192349J1243163O688282
10340E209222k134833m656156p77623J467904r31773l114410j539937J208893
10332e268713J952051J443192J136995J25768j761637j865442O32248J692242
$$ y = [-4909787, -564500, 4654807, 2340570, -3185747, -1022121, 7128052, 8784373, 1137401, -4908117, -2590758, 2245763, 3368249, 2680901, 2683124, 1085249, -2459034, -3147265, 866940, 4461936, 3533889, 577568, -938847, -1708741, -3066211, -3830746, -3462962, -3647388, -4665847, -4528100, -2864462, -1264045, 471088, 3229239, 4057560, -758323, -7740307, -8611294, -2065803, 4093555, 4611384, 3064697, 3509275, 3526868, 223906, -3661771, -5358444, -7940008, -13967815, -17914572, -12722223, -1479060, 5209222, 3074389, -1581767, -2359390, -891486, -1823259, -4937669, -6477606, -5268713, -3316662, -1873470, -736475, -610707, -2372344, -4237786, -3605538, -1913296]
10324a913296j180458l089331J108287O502530L830362n030698p722708r8609
10316g593921O639842L174446l915438m002344P04659J357173j193081O22206
10308d206458N557114M809443j992950n318352j657744J397120r12709k853743
10300e178279P21419N260657M382227l74902l229073k192568Q84068L681322L760281
10291G715152J07645l622862k397018K301746L585832o10991m807027m809896
10283b537419k415131J99246L353599N336129K861760j722306j887182K004892
10275E193588K079490l471726o111602j018295M487145K983685j663399k397659
10267H1227l43266l5039m02471J222375K402851R71754R06180M574533N537598
$$ y = [-1913296, -3093754, -6183085, -5074798, 1427732, 5258094, 227396, -7495312, -7593921, -954079, 2220367, -1695071, -5697415, -4992756, -3635583, -4828664, -4206458, 1350656, 6160099, 4167149, -1151203, -2808947, -1411827, -2324536, -5178279, -4456860, 803797, 5186024, 4811122, 1582049, -610519, 273549, 3954871, 7715152, 7822797, 4199935, 1802917, 4104663, 7690495, 7079504, 2272477, -2537419, -4952550, -4753304, -1399705, 3936424, 6798184, 5075878, 3188696, 5193588, 7273078, 3801352, -2310250, -3328545, 1158600, 4142285, 2478886, 81227, -262039, -297078, -699549, 522826, 2925677, 3897431, 4803611, 9378144, 14915742]
10258A4915742j541451r657627q598578p20780L314496J113072m38323J405838
10250b07611K290868Q01040O62543K146233J090545k204419k329234J251933K371852
10241E873750j341398m384331k732066K14936L35584j184592j800954j662432
10233f681503q58862J637698L857816J855375k721355l050487J787800L962470
10225b11048l51591l654079O06056O087131L214552m831041o714293n53124M547409
10216a860028M027020L235771N092096L704977m273169j1140275q414993O83138
10208h945463O474087N899774L071803N61759k005675l114872j041594Q75611
10200A775430j763941n928303m536549J775932M756013J532588j234081J153290
$$ y = [14915742, 13374291, 3716664, -4881914, -5602694, -2288198, -1175126, -1613449, -207611, 2083257, 2884297, 3546840, 5693073, 6783618, 4579199, 2249965, 3501898, 5873750, 4532352, 148021, -2584045, -2369109, -2033525, -3218117, -5019071, -6681503, -7540365, -5902667, -2044851, -189476, -2910831, -5961318, -4173518, -211048, -562639, -4216718, -3610662, 2476469, 5691021, 859980, -5854313, -6407437, -1860028, 2166992, 5402763, 10494859, 14199836, 9926667, -1213608, -9628601, -8945463, -2471376, 3428398, 6500201, 7061960, 5056285, 1941413, 899819, 1775430, 11489, -5916814, -10453363, -8677431, -3921418, -2388830, -3622911, -2469621]
10192b469621M312821L282000L86159m93341o78369k153667k493608k10290P34187
10183B16271j965954l183335J259640O032988M256241q24269j147762K882664
10175G526484M002787N77309k107764j882933j883911k985970k428418o2248J532910
10166B288246K700580N075327N538674K05136o533982o211120N66411M554476
10158H183748J907924j787869k459080k585350l420030j960268J564080K262579
10150A705734n64427j869421m65779q37512k930449n54714O416151Q987458L104784
10141A2991825l553785m410801l222011l958087k131217N143461R875522M250271
10133A4985178o078308r838079n830697j265507Q80298L165436N510293M833361
$$ y = [-2469621, 1843200, 5125200, 5511359, 5018018, 4339649, 2185982, -307626, -517916, 216271, -1749683, -4933018, -3673378, 2359610, 6615851, 5791582, 4643820, 7526484, 11529271, 12106580, 9998816, 8115883, 6231972, 3246002, 817584, 755336, 2288246, 4988826, 10064153, 15602827, 15807963, 9273981, 3062861, 3629272, 8183748, 10091672, 8303803, 5844723, 3259373, -160657, -2120925, -556845, 1705734, 1141307, -728114, -1193893, -2031405, -4961854, -5516568, 899583, 9887041, 12991825, 9438040, 5027239, 1805228, -2152859, -4284076, 859385, 10734907, 14985178, 8906870, -931209, -6761906, -8027413, -7147115, -3981679, 1528614, 6361975]
10125F361975J505271r32944j487318j912755k787835l406009l398059j781250
10117g838924K137825N192381L074838j759921k202664J518988J405153l564104
10109b036428l887595L447225P156479r4876p974969m856413L211549L989193
10101a045835p9715J279518N696951K445700o632669q375773J59304P616144O737251
10092G800876K283339q31051l590462n145180j955988L037382K400653k755898
10084A243671l673477O15536J621032k658629l867613Q92562L243917r44580l490612
10075g018193J430143O564913L975304k138477l781354j502951J72227J600760
10067f97628L743949K544011l553918p260289k790367L546068K671580k721595
$$ y = [6361975, 7867246, 6934302, 5446984, 3534229, 746394, -2659615, -6057674, -7838924, -5701099, -508718, 2566120, 806199, -1396465, 122523, 1527676, -2036428, -5924023, -2476798, 4679681, 4584805, -3390164, -8246577, -5035028, -1045835, -1125550, 153968, 5850919, 8296619, 1663950, -6711823, -6552519, 1063625, 7800876, 10084215, 9253164, 5662702, 517522, -1438466, 1598916, 3999569, 1243671, -2429806, -1814270, -193238, -2851867, -6719480, -5826918, -2583001, -3527581, -7018193, -5588050, 976863, 4952167, 2813690, -967664, -2470615, -2298388, -697628, 3046321, 5590332, 2036414, -5223875, -8014242, -4468174, -1796594, -4518189]
10059d518189l310570J230880K833706n67192k177896J368150M373661J530372
10051G62922l973661n345369r19924M845583O694193L265704k064022m490549
10043a225123k658136N25468K336623K996460K773859N8812m693029o630180k495877
10034i011123L515478M693792J007072j613282l03232J711978J466178N17869
10026A984730J119574K177746J593778q7157j017326j306534k348293l750090
10018a633572l425488q76806J571942J633731o0696r79752J1937J417360J119882
10009a221462j010882k641088j178451K911492N298250K276334l440877m586346
10001c593030Q39391N375291K155475m291843m237269K228348N425556J844044
$$ y = [-4518189, -7828759, -6597879, -3764173, -4331365, -6509261, -5141111, -767450, 762922, -3210739, -8556108, -9476032, -4630449, 2063744, 5329448, 3265426, -1225123, -3883259, -3357791, -1021168, 1975292, 4749151, 4807963, 114934, -6515246, -9011123, -5495645, -801853, 205219, -1408063, -1711295, 683, 1466861, 1984730, 3104304, 5282050, 6875828, 6788671, 5771345, 4464811, 2116518, -1633572, -5059060, -5935866, -4363924, -2730193, -2790889, -3770641, -3758704, -2341344, -1221462, -2232344, -4873432, -6051883, -3140391, 2157859, 4434193, 993316, -3593030, -2753639, 2621652, 4777127, 485284, -3751985, -1523637, 3901919, 5745963]
9993E745963o66286K871047N465194K18662p294802p800473k825340m48746j575333
9984f310114j071876R24563n0503k496976p23477L785836L834703l16785m67016
9975b891645N120799P927993L156556k762230l190895o85366j37126o15497K17409
9966F139998N09258j204027j883100J28346R35120j715240k942238J257150N777506
9957G002773L493687l181762n492619j206247K887581J231109l665929n823009
9949d754416l133112J501094M080411L107773k0439l241198n450812n570256k157034
9940a5637989L630643O638246L284067k411464k947983K551823P046904N067874
9932G222121r17168m861242m181358j178156m3413k785180o231365m702442J780639
$$ y = [5745963, 5079677, 7950724, 13415918, 13634580, 6339778, -1460695, -4286035, -4734781, -6310114, -7381990, -6457427, -6507930, -9004906, -9728383, -5942547, -2107844, -2424629, -2891645, 2229154, 10157147, 13313703, 10551473, 7360578, 6675212, 6538086, 5922589, 6139998, 6649256, 5445229, 3562129, 3690475, 4625595, 2910355, -31883, 1225267, 7002773, 10496460, 7314698, 1822079, 615832, 3503413, 4734522, 1068593, -4754416, -7887528, -6386434, -2306023, 801750, 781311, -2459887, -7910699, -13480955, -15637989, -12007346, -5369100, -2085033, -4496497, -7444480, -4892657, 2154247, 7222121, 6304953, 1443711, -2737647, -3915803, -3959216, -6744396, -12975761, -17678203, -15897564]
9923a5897564N440127J420546l746680j369753N500830O666059J119888j821154
9915b687701K120940O210363M220403j167838m295482l519485l54384K085792
9907B612608k29417o583447q720136j942727M953845K008009m411704j455836
9899a3768805O905410N587999m136363n439966L587391N165001n751812j0286743
9891a8137888J403566J1541057N286238m269085j592982L475537k885804r920615
9883a5099976k564048P517646J643791j0332359q268658l088800j9901014m5152763
9875i5246181l5210005J5602040N7214464N0136417J4717973o275301m295013
9868c355606J103554J581677L703461O212033J000846p953740q096874R14706
$$ y = [-15897564, -10457437, -9036891, -12783571, -14153324, -8652494, -1986435, -866547, -2687701, -566761, 5643602, 9864005, 8696167, 4400685, 881200, 526816, 2612608, 2383191, -4200256, -12920392, -14863119, -9909274, -7901265, -12312969, -13768805, -6863395, -1275396, -5411759, -10851725, -7264334, -2099333, -7851145, -18137888, -16734322, -5193265, 92973, -4176112, -5769094, -2293557, -5179361, -15099976, -17664024, -10146378, -8502587, -18834946, -27103604, -30192404, -50093418, -95246181, -130456186, -114854146, -57639682, -7503265, 7214708, 939407, -3355606, -2252052, -670375, 3033086, 9245119, 10245965, 2292225, -5804649, -4889943]
9860d889943O573795K917526k943007l620580L0257L655457M699937K673505o99161
9851H397786k372567j867708j523494j375698J064995M439900L924526K2029j131063
9842I578706J365310J384676k190619k567442J519296J627327m788350p336464
9834a407560j29842O080275P03019q500439p503507J972779O855232L466022l03130
9825A232849k76654k17623k033825l063955k702123k601694j456102K267068M594154
9816d257905J319910l568831l235931R13673K210002Q6720p04432P3573j378764
9807h541985m122185l449120L29927K594549K678486L168639K798547j077405
9799e620547m745246k412513L155005M149306P56343J81789L233074L291025n14890
$$ y = [-4889943, 1683852, 4601378, 1658371, -1962209, -1931952, 1723505, 6423442, 9096947, 8397786, 6025219, 4157511, 2634017, 1258319, 2323314, 6763214, 10687740, 10709769, 9578706, 10944016, 12328692, 10138073, 7570631, 9089927, 10717254, 5928904, -1407560, -1537402, 4542873, 5245892, -3254547, -10758054, -8785275, -1930043, 1535979, 1232849, 956195, 738572, -1295253, -4359208, -7061331, -9663025, -11119127, -8852059, -4257905, -2937995, -6506826, -9742757, -8829084, -6619082, -6532362, -7236794, -7163221, -8541985, -12664170, -16113290, -15783363, -13188814, -10510328, -7341689, -4543142, -5620547, -10365793, -12778306, -9623301, -5473995, -4717652, -4535863, -1302789, 1988236, 1473346]
9790A473346r07208M092719O510635J510824m662867m998123j696113m39963j530235
9781f46985j994291j117939N10134K858065M179606J621756l387969n373522k592367
9772e943512O22943J045407L17300j30615j513219k994709j267822K785268L934396
9763c144563J625048J552007N055136N403104n41581n390567k624019K495375
9755D429940J506571l540406l998163J343221N125112K980888j552358l723820
9747B570985k942597q06751J486190K897802K862781K118263J308103k05643k340162
9738F948971l090316j604116k65365j155100k564949j636669J444920M136011
9730B213387M494936J941631k356717m732271k236184K177717K253845k286919
$$ y = [1473346, 566138, 4658857, 11169492, 12680316, 8017449, 3019326, 1323213, 883250, -646985, -2641276, -3759215, -3249081, -391016, 3788590, 5410346, 2022377, -3351145, -5943512, -5320569, -4275162, -3957862, -4088477, -5601696, -8596405, -9864227, -7078959, -3144563, -1519515, 32492, 5087628, 10490732, 9949151, 4558584, 1934565, 4429940, 5936511, 2396105, -1602058, -258837, 4866275, 7847163, 6294805, 2570985, -371612, -1178363, 307827, 3205629, 6068410, 8186673, 9494776, 9289133, 6948971, 3858655, 2254539, 1989174, 834074, -1730875, -3367544, -1922624, 2213387, 6708323, 8649954, 6293237, 1560966, -675218, 1502499, 3756344, 1469425]
9722A469425m823586k433929l20861j765241j677116L396489O524562O69688q269984
9713g230553r216608k671136J540216Q43501K012396O727597P557395J390233
9705I53041m170453k830140J057046J042909j023135J08083L272834L008340j460383
9696d1858n131136l852513J554693O516317O114535m35776p388350p760776k201686
9687a2626550J624788o1086k223619L01451M783759N544181K356289q59690k163966
9678c324443j907072q7047K401483K927245J200422N21763J513223k00397n368138
9669b322961o555927N50050P352815L751855n113875n547765L220624P651972
9661B986788J379886n500604l575053J758807J320663k561485j931858K268328
$$ y = [1469425, -3354161, -5788090, -6108951, -7874192, -9551308, -6154819, 369743, 1039431, -7230553, -16447161, -19118297, -17578081, -16734580, -14722184, -7994587, -437192, 953041, -3217412, -6047552, -4990506, -3947597, -4970732, -4862649, -1589815, 1418525, -41858, -5172994, -9025507, -7470814, -954497, 5160038, 4724262, -2664088, -10424864, -12626550, -11001762, -11062848, -13286467, -12985016, -8201257, -2657076, -300787, -1160477, -3324443, -5231515, -5318562, -2917079, 10166, 1210588, 1732351, 3245574, 3045177, -2322961, -8878888, -8328838, -976023, 2775832, -2338043, -7885808, -4665184, 2986788, 4366674, -1133930, -4708983, -2950176, -1629513, -4190998, -6122856, -3854528]
9653c854528K432505k270216m810522j875908K017414K671351J571016J656651
9645b462237K949800L924955L566703J307478k113592l898892k327438O5037k18791
9636G93023k122258j674290J577571L930327L104647N17833j940957l621821l680365
9627c116290j673440M42327M33003m71477L60199J968019J301114r10665q57942
9618b525152J791487L277559K144543J018501J250246J006959l75867j315675
9610F272601j973435l780649m522297n02869N465630N919062N10867k493281L81885
9601E277514K085972k336927o751606m736170p75472j551595l407660O53414O906753
9592d635777N885152j505519m920236r37931K861504J146511k234228k831451
$$ y = [-3854528, -1422023, -3692239, -8502761, -10378669, -8361255, -5689904, -4118888, -2462237, 487563, 4412518, 7979221, 9286699, 7173107, 3274215, 946777, 1011814, 793023, -1329235, -3003525, -1425954, 2504373, 5609020, 6126853, 4185896, 564075, -3116290, -4789730, -4347403, -3914400, -4385877, -4025678, -2057659, -756545, -1667210, -2525152, -733665, 2543894, 4688437, 5706938, 6957184, 7964143, 7588276, 6272601, 4299166, 518517, -4003780, -4506649, 958981, 6878043, 7388910, 4895629, 5277514, 7363486, 5026559, -1725047, -6461217, -7236689, -8788284, -12195944, -11542530, -4635777, 1249375, -256144, -5176380, -6114311, -3252807, -2106296, -4340524, -7171975]
9584g171975j976809j534555J183K919431M214707K884156J716113J809838Q36215
9575C698304j733973l314260l262263l466206l333990p36754J850296j6181l483939
9566a3798966j083654N803818O861008l36163m861374K56522O539685M320426
9558C701302j749145k143661J177774M98062j954164J691243Q193161N737077
9550A5151649o177566j3247854o586873M939503Q112327K212112l893525m971644
9542d461871k913104p88025N03000R45150P11917L44760j3589m99136k42319J574087
9532d839130L129282J502895k524023m525330k376781J107146K717955K638124
9524c169862K063688N24844k008184l213542j411409J531944K796334K376699
$$ y = [-7171975, -9148784, -10683339, -10682156, -7762725, -3548018, -663862, 1052251, 2862089, 3698304, 1964331, -1349929, -4612192, -8078398, -11412388, -12149142, -10298846, -10315027, -13798966, -14882620, -9078802, -2217794, -2553957, -7415331, -7158809, -619124, 3701302, 1952157, -191504, 986270, 1484332, -469832, 1221411, 9414572, 15151649, 8974083, -4273771, -10860644, -5921141, 2191186, 4403298, 509773, -4461871, -7374975, -8163000, -7660000, -6714850, -6002933, -5658173, -5671762, -6170898, -6413217, -4839130, -1709848, -206953, -2730976, -7256306, -9633087, -8525941, -5807986, -3169862, -1106174, -581330, -2589514, -5803056, -7214465, -5682521, -2886187, -509488]
9516e09488J856423J115207q20091k648300j761881J456012L148897J071825j862420
9507A046184j243224K455962L857860k4728m869175m093603K192642O770956M428539
9498A0521413j845004n473015m204104r23897J161751J145625m03207k042678
9490b063116k003018k63277R39396M34827J44284J570977K565238P18471k116245
9481g2463k458888o56997L64014K97598Q92433J457701M0860j646795j06172L202945
9471A314236L049593p99192k380866Q49303L548916J083102l090643l282273k81910
9462A0266J165647L74112M75369J942711J913872m06595k440810k705919k609198
9453b280545l031879k581411m80032J563273J851462J051345O69955Q70250J270244
$$ y = [-509488, 1346935, 2462142, 1642051, -1006249, -2768130, -1312118, 1836779, 2908604, 1046184, -197040, 2258922, 6116782, 6092054, 1222879, -2870724, -678082, 6092874, 10521413, 8676409, 3203394, -1000710, -1924607, -762856, 382769, -20438, -2063116, -4066134, -4329411, -3390015, -2955188, -2810904, -1239927, 1325311, 2043782, -72463, -2531351, -3188348, -2824334, -2526736, -1634303, -176602, -135742, -1782537, -1888709, 1314236, 4363829, 3564637, 1183771, 2033074, 5581990, 6665092, 3574449, 292176, 10266, 1175913, 1550025, 2025394, 3968105, 5881977, 5475382, 3034572, 328653, -2280545, -5312424, -7893835, -8373867, -6810594, -4959132, -3907787, -3237832, -2367582, -1097338]
9444a097338K398307M329726M756238J041343n314107q672890n488205R68197
9436g078729M347289K738600l21052j809736k394311k899393j847327J071396
9428h193263K731659J112869q87961Q6985K348540K393715J012196J017562J146686
9419B768988j582796m862168l548157J071888K143244j392829k292303L033543
9411d660590P652566M324847l425839o637683l243368J125020K144314Q18968
9403a901765l44736l80400N95354J572627J000501p73315j045779R87235J951726
9394A661448p82419m433478m646041j786878N43088J451674K877428M870547N114675
9385D870044L039374Q17503N0087J91463K40645k69441j638440l389615l937893
$$ y = [-1097338, 1300969, 5630695, 10386933, 11428276, 6114169, -2558721, -8046926, -7078729, -2731440, 7160, -313892, -2123628, -4517939, -7417332, -9264659, -8193263, -5461604, -4348735, -5236696, -5149711, -2801171, -407456, 604740, 1622302, 2768988, 1186192, -3675976, -7224133, -6152245, -4009001, -5401830, -7694133, -4660590, 2991976, 7316823, 3890984, -2746699, -5990067, -4865047, -2720733, -1901765, -2246501, -2626901, -2031547, -458920, 541581, -231734, -1277513, -290278, 1661448, 879029, -3554449, -8200490, -9987368, -9444280, -7992606, -5115178, -244631, 4870044, 7909418, 8726921, 8777008, 8968471, 9209116, 8939675, 7301235, 3911620, -26273]
9376b6273k598227r58637p36104j601634k335941k138400J26341M703492P682946
9367B117563L755798m986622q591419k319304N328675M331660j993328k671616
9359e028593L503212O633545J646780m659608m912941p72822K440576L449007
9351B299156L052718M87641l605057n202867k230461J731483K519233O60126j362734
9342a650762l187208m652560l678365K06365L433306L054455J000946N49189J490726
9333c433908J919296J852307K008041J893928J790734L190143M692142J988227
9325A5900910m655899q077242m066432J678500K289654J03945Q16658K256347
9317F246441j248682o609027n511888O59448J646122m273276o219061J256857
$$ y = [-26273, -2624500, -3583137, -4319241, -5920875, -8256816, -10395216, -10268875, -5565383, 2117563, 5873361, 886739, -7704680, -10023984, -4695309, -363649, -2356977, -5028593, -1525381, 5108164, 6754944, 2095336, -2817605, -3590427, -1149851, 2299156, 5351874, 5839515, 2234458, -2968409, -5198870, -3467387, -948154, -288028, -1650762, -4837970, -9490530, -13168895, -12962530, -9529224, -6474769, -5473823, -4924634, -3433908, -1514612, 337695, 2345736, 4239664, 6030398, 9220541, 13912683, 15900910, 11245011, 3167769, -898663, 779837, 3069491, 3173436, 3990094, 6246441, 4997759, -1611268, -7123156, -6463708, -4817586, -9090862, -15309923, -14053066]
9309a4053066Q011863M062399m485937n507695M97435L528775J254007M33715
9301f258504K674294J540769m155506n867015R14266P791988N305006l001187
9293a055889o030702o76026N633087O194382K147202j700464k818197j635203
9285E8190J10733N53884o83819j815118j311741j47469J41528O5001M42923L784
9275b582104k002013k745012K90331L809639K402547k748109m773264j469069
9267i817054J514484Q5755j788058R51805N850153O522500J918099l052900m571082
9258b386298l185039r10501J086588K067249J812906J096904M72004l86891q78674
9249a211752P32124L767256M188548J57055m091035l566947M49655K645790J122560
$$ y = [-14053066, -6041203, -1978804, -6464741, -11972436, -11475001, -7946226, -6692219, -6258504, -3584210, -2043441, -6198947, -12065962, -11151696, -3359708, 1945298, -1055889, -7086591, -7762617, -2129530, 4064852, 6212054, 4511590, 1693393, 58190, 168923, 722807, 38988, -1776130, -3087871, -3235340, -3093812, -3028811, -2585888, -2582104, -4584117, -7329129, -7038798, -3229159, -826612, -3574721, -8347985, -9817054, -8302570, -8216815, -10004873, -9053068, -3202915, 3319585, 5237684, 2184784, -2386298, -5571337, -6481838, -5395250, -3328001, -1515095, -418191, 53813, -333078, -1211752, -479628, 3287628, 7476176, 7633231, 3542196, -24751, 424904, 3070694, 4193254]
9240D193254j462566k676160k154609p2200K258996J937315j255446k484756J154912
9231e61260M104884k42284p659704p466952J232769P374523M344566j022193n74706
9222d70357K802590K074747j514042j640410J465719J638561k174181l689379
9214a506752P09209O090261N706423k56593n328460m466700O15403L624167R06581
9205F093539m002208m516005M69445M970278L764027j336043m918410m639010
9197d114387k005860P62519J925148N72903j710466j838280J21458M40228j859014
9188g705751k334649J513609M680135J712747m200648n353930m15025M976783
9180g126729O857260N990350L467656l88793l257654l020587k252909m417359
$$ y = [4193254, 2730688, 54528, -2100081, -2172281, 86715, 2024030, 768584, -1716172, -561260, 3543624, 3301340, -4358364, -11825316, -10592547, -3218024, 1126542, 104349, -470357, 2332233, 4406980, 2892938, 1252528, 2718247, 4356808, 2182627, -1506752, -797543, 5292718, 10999141, 10742548, 5414088, 947388, 1562791, 5186958, 6093539, 2091331, -2424674, -1955229, 3015049, 6779076, 5443033, 524623, -4114387, -6120247, -5357728, -3432580, -2859677, -4570143, -6408423, -6286965, -5846737, -7705751, -10040400, -8526791, -3846656, -2133909, -6334557, -11688487, -12103512, -7126729, -269469, 5720881, 9188537, 8799744, 5542090, 2521503, 268594, -4148765]
9172d148765o440554k407201N426042P683965J601649m545438l778518N81630
9164f027190K341375J577178J088380P4700k466935l118792O80882M652072L354367
9155B156037j264564l219314j743259q74308j789914j969726r07948n84841o74607
9146a0872444J151423M161773M791498K117880j059020k319460j094971K576995
9138e46326O427223N214637k636101r572737p156373J372277M869236M43461l467116
9129e051819j663974M11364j998264m071588n53638M350980M330886J771590K428962
9120d5501M491221K542685j303750n33952L487039K903765l073525o280105k866934
9111f79057J120882M03467j961710j611664K56837J628248M181629P769326O909701
$$ y = [-4148765, -10589319, -12996520, -7570478, 113487, 1715136, -2830302, -6608820, -6027190, -3685815, -2108637, -1020257, -945557, -3412492, -6531284, -5850402, -1198330, 2156037, 891473, -2327841, -4071100, -4945408, -6735322, -8705048, -9612996, -10197837, -10872444, -9721021, -5559248, -767750, 1350130, 291110, -2028350, -3123321, -546326, 5880897, 11095534, 8459433, -1113304, -8269677, -6897400, -2028164, -1584703, -5051819, -6715793, -6304429, -8302693, -12374281, -12927919, -8576939, -4246053, -2474463, -45501, 4445720, 6988405, 5684655, 5150703, 8637742, 11541507, 8467982, 2187877, -679057, 441825, 845292, -1116418, -2728082, -2471245, -842997, 3338632, 11107958, 18017659]
9102A8017659p91632q003260o578069N87390L709227k73538n116421n095807j120684
9093d665135K828352M182034K493629l52737r09916J592609L067984J21441m332192
9084D026069n379015l638111k952930k748704L35970M245707K952336l044127
9076f202805n602070q91377M714533M447421O15857m24327K147565M164146L181759
9067F150702P3023l453544n086186k350807L411876O155402K218864l945690n235026
9058b061386j285571J767212j49747m589681o426165l308006K575818O456114
9050g021412N392682J553748o32042p34473k032852m289175k645045L305155N894224
9041a209190N11859n412689k403183O235849Q886006K849149k869804k222661
$$ y = [18017659, 17226027, 9222767, 2644698, 3232088, 6941315, 6667777, 1551356, -3544451, -4665135, -1836783, 2345251, 4838880, 4486143, 3576227, 5168836, 8236820, 8358261, 4026069, -1352946, -4991057, -7943987, -10692691, -10356721, -6111014, -3158678, -6202805, -11804875, -12696252, -7981719, -3534298, -2918441, -3342768, -1195203, 2968943, 6150702, 6223725, 2770181, -2316005, -4666812, -1254936, 4900466, 7119330, 3173640, -2061386, -3346957, -1579745, -1729492, -6319173, -12745338, -16053344, -13477526, -7021412, -1628730, -74982, -707024, -1441497, -3474349, -7763524, -10408569, -7103414, -1209190, -697331, -6110020, -8513203, -2277354, 6608652, 9457801, 6587997, 4365336]
9033D365336L44930m57780k389348j251945J917293L765991L554702J451992l049307
9024H251864p554292p004822j442955J925754j036101m732741k987273P83556
9016a3797010m3388l273664j371205N285341Q275176M489111M77940J262504L041655
9007D346460J027333k288784k042538O96649J340311m49358r66356R86865K623260
8998E273842J867205l45437k339766l075102j611079J519157K768375p80524n996175
8989b719504o188744l37846M514213K762166j859419k116564J850399L197490
8981h97809p48214m327140k115145L213216N050906J859518j859442k174248K17859
8972a780499K269393K173057L38180j493835j889544j354061j730477l214628
$$ y = [4365336, 4710266, 4252486, 1863138, 611193, 2528486, 6294477, 9849179, 11301171, 8251864, 697572, -6307250, -7750205, -5824451, -6860552, -11593293, -14580566, -13797010, -13840398, -17114062, -18485267, -13199926, -4924750, -435639, 42301, 1304805, 4346460, 5373793, 3085009, 1042471, 1739120, 3079431, 2630073, 1663717, 2650582, 5273842, 7141047, 6795610, 4455844, 1380742, -230337, 1288820, 4057195, 3276671, -2719504, -8908248, -9246094, -4731881, -1969715, -3829134, -5945698, -4095299, -897809, -1646023, -5973163, -8088308, -4875092, 175814, 2035332, 175890, -1998358, -1780499, 488894, 2661951, 3000131, 1506296, -383248, -1737309, -3467786, -6682414]
8964f682414l453306r79300K292257L940202M310994M311427K416579k124843
8956D031596n182466k275323L551811M483415p97487m913792k835288J264201
8948b673333J705160j44730j90062M73171j460781l854168j769041L462729M966043
8939E14988O62613l482933k352924J577888L123580J774924P33776J204567J216863
8930D973342o55493k942533l000250k04193K941743L303000Q41934j452701k002530
8921A802319k639994m324507l930433Q46550N851751N118014r582k450804p9494
8912A83820J748390l34972k556055j234421J193053J479423J231028K402265K319507
8903F432038j034134l336305k82329L930045K006743m716563p715158l658262
$$ y = [-6682414, -10135720, -11115020, -8822763, -4882561, -571567, 3739860, 6156439, 4031596, -1150870, -3426193, 125618, 4609033, 3811546, -1102246, -3937534, -2673333, -968173, -1112903, -1302965, -829794, -2290575, -6144743, -7913784, -4451055, 514988, 1177601, -2305332, -4658256, -3080368, 43212, 1818136, 2551912, 3756479, 4973342, 4317849, 1375316, -1624934, -1829127, 1112616, 4415616, 5257550, 3804849, 1802319, -837675, -5162182, -9092615, -8246065, -2394314, 2723700, 2714118, 263314, 183820, 1932210, 1597238, -958817, -2193238, -1000185, 479238, 1710266, 4112531, 6432038, 5397904, 2061599, 1779270, 5709315, 7716058, 2999495, -4715663, -8373925]
8895h373925K039106M091341K718030m11124m601156p208047m938353K14681K555596
8886a3913851J575200K306538N182015L976220k580048o006351q65323N637319
8878d688281M621876o91691j545389J316979J69518m971950n906935o08617L204088
8869i100402J259692p03097K143788N178618K781732j689273j587227K045399
8861C29230K600271j494681n160307m844785k383017l17526J630934L964603M968889
8852g06389L029793m98028k524612j691384L31751Q62791q60240k978520l313823
8843h348661j692316P75507L627903O323973O458702J956851m527168o932828
8835b358037l195577J724113K483356K08454l84624J564589K594855J089718l47875
$$ y = [-8373925, -6334819, -2243478, 474552, 63428, -4537728, -11745775, -16684128, -16469447, -13913851, -12338651, -10032113, -4850098, -873878, -3453926, -9460277, -10325600, -4688281, -66405, -758096, -2303485, -986506, -816988, -5788938, -11695873, -12304490, -9100402, -7840710, -8543807, -6400019, -1221401, 1560331, -128942, -1716169, 329230, 2929501, 1434820, -3725487, -8570272, -10953289, -11270815, -9639881, -5675278, -706389, 2323404, 1825376, -699236, -2390620, -2058869, -1196078, -2056318, -5034838, -8348661, -10040977, -9265470, -5637567, 686406, 7145108, 9101959, 4574791, -2358037, -5553614, -3829501, -1346145, -1137691, -1522315, 42274, 2637129, 3726847, 3378972]
8826C378972M20722J401638m16245m159364n721046k969216J668047M377433M129686
8817B110627K319683l56786l829645n686724k354219M728705Q015927K921910
8809G869478m848848o139646o86822L377547J683213j516287j572410L03362J382241
8800a48172J734315J147783k178762o197731m567573L458147Q765543M294767
8792F308317m040711n756393q67552J956774l68267k193638J92346L440515M117099
8783B788490L550347L471405K637069K05447k021765k663291k502034k219252
8775C246416j740685j815382k548015j278130L338752O427026K378928n280527
8767B728383o922867n40285N281724M163646r3379j660645j196362j373805o15287
$$ y = [3378972, 3799694, 5201332, 4785087, 625723, -5095323, -8064539, -6396492, -2019059, 2110627, 4430310, 4073524, 243879, -5442845, -7797064, -3068359, 4947568, 7869478, 3020630, -3119016, -3805838, -428291, 1254922, -261365, -1833775, -1530413, -148172, 1586143, 2733926, 555164, -5642567, -10210140, -6751993, 2013550, 6308317, 2267606, -3488787, -4356339, -2399565, -2767832, -4961470, -4769124, -1328609, 2788490, 6338837, 9810242, 12447311, 12652758, 10630993, 7967702, 5465668, 3246416, 1505731, -309651, -2857666, -4135796, -797044, 5629982, 8008910, 2728383, -4194484, -4734769, 546955, 4710601, 4617222, 2956577, 1760215, 386410, -228877]
8758b28877K656629M668396J528781l913872o236216n227964l974952k346457
8750a3074532J439549N063053M423844P85334l63915K425698M643374K681394
8742H023799j826239n319780o171245m315922m00424L402938M308967K074726
8734b23180l31729j58307K122968L757397K813303j6205k282884k318692q52767
8725B509904J49278k27764j464567k687879k894032j229095J245031J693404k43527
8716c149247p48823K025093L211695j556630o975317m403198L785005O254429
8708a556993K05820m266090q75352L279657J167099k131526K40998M081851K405450
8699B550914j305292p3715K739389l76944n869594m115717L243112N426056Q77455
$$ y = [-228877, 2427752, 7096148, 8624929, 4711057, -1525159, -6753123, -10728075, -13074532, -11634983, -6571930, -2148086, -1362752, -1726667, 699031, 5342405, 8023799, 6197560, 877780, -5293465, -9609387, -10009811, -6606873, -2297906, -223180, -554909, -713216, 1409752, 5167149, 7980452, 7964247, 5681363, 3362671, 2509904, 2659182, 2431418, 966851, -1721028, -4615060, -5844155, -4599124, -2905720, -3149247, -3898070, -1872977, 1338718, -217912, -7193229, -11596427, -7811422, -1556993, -1351173, -5617263, -6492615, -3212958, -2045859, -4177385, -3936387, 145464, 2550914, 1245622, 1171907, 3911296, 3534352, -2335242, -6450959, -3207847, 2218209, 3095664]
8690C095664j234726J495775Q79016n234620p273713m14577O481131N366271Q88407
8681D048628J48594J009671r96377l185280j851181q0138j114774j334769J916632
8672a438994L192161j335369m691349p4765N966322L235996m831710o619953j212592
8663g810253J907646J09854L27644M142994M286401j060304l551041Q54758M330317
8654C538016M05127n296572m911454n34830J463469J446931L250088N100921K651351
8645G113047k226859l988840k620281k449199l216345m99853M859717N816626
8637B788013k33820o534249o084983o57749L158643L131439K210016K406785K396601
8628B580696R23361r61153j818070j640198q81457N11814J994905J864349n02445
$$ y = [3095664, 1860938, 3356713, 4235729, -998891, -8272604, -8687181, -2206050, 3160221, 4048628, 4197222, 5206893, 4210516, 1025236, -825945, -906083, -2020857, -3355626, -1438994, 1753167, 417798, -4273551, -4348316, 1618006, 4854002, 22292, -6597661, -7810253, -5902607, -5792753, -5465109, -1322115, 2964286, 1903982, -1647059, -792301, 3538016, 3943143, -1353429, -6264883, -6799713, -5336244, -3889313, -639225, 4461696, 7113047, 4886188, 897348, -1722933, -4172132, -7388477, -7888330, -3028613, 2788013, 2554193, -3980056, -10065039, -10722788, -7564145, -4432706, -2222690, 184095, 2580696, 3504057, 2542904, 724834, -915364, -1796821, -1285007, 709898, 2574247, 2071802]
8619B071802k630288j250247L122334N816909L314160k431208o394126o118589
8611d499253l154059K06891K958654M144314K644020m58836j803228m2756J808988
8602A804735P59314j314473o32670J859203J457536k229792l360688J243096N924804
8593E511065L939023j675848j787646M719237Q125223J979496o676113o814952
8585G319485J190954O662599L337814l982470p783901o403013k468360J603863
8577e23029L621561J552576l149381n403339k704608J453057K982104K547225
8569C76166K312643J188304k155124m721804l108223J52271j9462k829116k783651
8560a1587996J095420L800228K974252K464462M885825O599530L782758j202834
$$ y = [2071802, -558486, -1808733, 1313601, 7130510, 10444670, 8013462, 1619336, -4499253, -7653312, -7446421, -4487767, -343453, 2300567, 1841731, 38503, -4253, 1804735, 2564049, 1249576, 616906, 2476109, 3933645, 1703853, -1656835, -413739, 5511065, 9450088, 7774240, 5986594, 10705831, 18831054, 20810550, 14134437, 7319485, 8510439, 15173038, 18510852, 14528382, 6744481, 341468, -2126892, -523029, 3098532, 4651108, 1501727, -3901612, -6606220, -5153163, -2171059, 376166, 2688809, 3877113, 1721989, -2999815, -6108038, -5955767, -5975229, -8804345, -11587996, -10492576, -6692348, -3718096, -1253634, 3632191, 10231721, 14014479, 12811645]
8552A2811645l697453l405487k932834k571347j036763O18804L51063p88547j40191
8543g91110J655205J400576j061709k150907l19772J220266n89706l787435l910873
8534h335465m4684L902964L835494M5896l183915k190393K101618N122958L715550
8525D970023m51761l150500k404396K20835K422819L309500K722297N85753k084637
8516F139933l212140k140767r03059j366249k067806j22220L953741N936551L308813
8507I526797j327837l871949l729538k902512j928902j72028Q89139r27089l569108
8498h013027k158213L035983N222444R56927l687666j921856L125190L476361
8490C6143q77576k543549P40845L044720R45224j498397j333290j658415l610740
$$ y = [12811645, 9114192, 5708705, 2775871, 204524, -832239, -213435, 137628, -650919, -791110, 864095, 2264671, 1202962, -947945, -1267717, -47451, -637157, -4424592, -8335465, -8380149, -4477185, -641691, -595795, -3779710, -5970103, -3868485, 1254473, 4970023, 4518262, 1367762, -1036634, -815799, 1607020, 4916520, 7638817, 8224570, 6139933, 2927793, 787026, -116033, -1482282, -3550088, -3672308, 281433, 6217984, 9526797, 8198960, 4327011, 597473, -2305039, -4233941, -4405969, -3516830, -4443919, -8013027, -10171240, -7135257, -1912813, -955886, -4643552, -6565408, -3440218, 36143, -841433, -3384982, -2644137, 400583, 1345807, -152590, -1485880, -3144295, -6755035]
8481f755035j976290M850878Q518384K717099n248564m983469L86836J47038n056109
8472g399232m386773L238729N646531j997379p527840r15848R028882Q329540
8464D016610o16053m272163M03389L406234m67555m434585k776874J10108j316609
8455e947498m101321k287809L292337O646364N006383Q87862k298573l061160
8447a863415j667523J04310K51477o98872K322K831354M322029J910843k021432
8438C171093l387494j553261J159991L008047L206240Q92261l062355m742003
8430a307481j210162M762645P059075L226636l127570o691059n354030j273802
8422c915748J427605P08648r04757L25209L171610K618667j177634j038600N579080
$$ y = [-6755035, -8731325, -3880447, 4637937, 7355036, 2106472, -2876997, -2490161, -2343123, -7399232, -11786005, -8547276, -2900745, -4898124, -12425964, -13341812, -4312930, 4016610, 3400557, -871606, -468217, 2938017, 2470462, -1964123, -4740997, -4630889, -5947498, -10048819, -12336628, -9044291, -2397927, 2608456, 3496318, 1197745, -1863415, -3530938, -3426628, -3175151, -3874023, -3871701, -1040347, 3281682, 5192525, 3171093, -216401, -1769662, -609671, 2398376, 5604616, 6496877, 3434522, -1307481, -2517643, 2245002, 9304077, 12530713, 9403143, 2712084, -2641946, -3915748, -2488143, -1779495, -2684252, -2359043, 812567, 3431234, 2253600, 1215000, 6794080]
8413F794080R399151J906934r640260j0737798j218188M359296p13198n802149
8405e652132j388262N709869M805826j154682k251985J336999J636967k025353
8397A017247l065294p56445p04997k652039m36412M755919M085923k848468m723032
8388e327598K945143Q501835K221214p163879n625362M177876P431538k8614o802426
8379C29727m088868K838995M590375M86509l172038k373238J262087L741321K760548
8370F375418k29686j604337m21912j60431l162574n847804l680044J231902K960035
8361d539433R53722L09775L047702N443255M885721L177386J400398k307129p196913
8352E174484p938864k091106M891068O197008J928343k791331m956981n129146
$$ y = [6794080, 16193231, 18100165, 8459905, -2277893, -3496081, 863215, 150017, -5652132, -7040394, -1330525, 3475301, 2320619, 68634, 1405633, 3042600, 1017247, -2048047, -2804492, -3509489, -6161528, -6597940, -1842021, 2243902, -604566, -5327598, -2382455, 6119380, 8340594, 1176715, -4448647, -270771, 7160767, 7132153, 329727, -3759141, -920146, 3670229, 4156738, 984700, -1388538, -126451, 3614870, 6375418, 6145732, 4541395, 4119483, 3959052, 796478, -5051326, -8731370, -7499468, -4539433, -3585711, -3275936, -228234, 5215021, 10100742, 13278128, 14678526, 12371397, 5174484, -2764380, -4855486, 35582, 6232590, 8160933, 5369602, 412621, -4716525]
8344d716525m066986j798776R78825L238363M463744L743923P5557m734583o042889
8335h859347j771145M137921O152909L438325m44597k394192k008625l95443R46762
8326a197432Q37255m49201j440176j407981p09792P24744K803666L303765J14442
8317B579290m096595l932514O88479L504570J174894j789647q17361J431739N35697
8308g21448j644520n89052K558629K864537k41825k894572l436594l221205k022090
8299i348140J239134L922888K099656k423138l477955N18561M539837M551462
8291A622305J793683j302161m055463n205294k859831J603632M097101L450304
8283h55724K088225P06438k274250n290918m114189O27719L116338J845184K135245
$$ y = [-4716525, -8783511, -10582287, -9603462, -6365099, -1901355, 1842568, 1918125, -2816458, -8859347, -10630492, -6492571, -339662, 3098663, 2654066, 259874, -1748751, -2144194, -1197432, -360177, -809378, -2249554, -3657535, -4367327, -3642583, -838917, 2464848, 2579290, -1517305, -5449819, -4761340, -1256770, -81876, -1871523, -2688884, -1257145, -721448, -2365968, -2955020, -396391, 2468146, 2226321, -668251, -4104845, -7326050, -9348140, -8109006, -4186118, -2086462, -4509600, -7987555, -7468994, -2929157, 1622305, 3415988, 2113827, -1941636, -7146930, -10006761, -8403129, -4306028, -855724, 1232501, 1938939, -335311, -5626229, -9740418, -9112699, -5996361, -4151177, -2015932]
8274b015932N691544N709737j685256q436739n242327L881246P005304J456539
8266F364116l923637l099897k30941r23830l815207m389419j829257J548670M048112
8257f251290M803079L083685l9338j573208k53823J568967J335807l58463j363848
8248I51568j035732m003J485068L234874M259266L723602J856167q74641m139174
8239I456995o555769o037588k686925M43554J075950M22684M24563M40737o92679
8230c708478j420147J7650J406846l33476k562099N23766P584335R161848Q46381
8221A1516626q644338q632982j111918L498329K121229J069025K918077K030699
8213D764747l765890o942886j791160N579742O260639J694754m29118R48323N49298
$$ y = [-2015932, 3675612, 9385349, 7700093, -736646, -5978973, -2097727, 4907577, 6364116, 2440479, -659418, -890359, -1814189, -5629396, -10018815, -11848072, -10299402, -6251290, -1448211, 1635474, 1596136, 22928, -230895, 1338072, 2673879, 2315416, 951568, -84164, -88167, 1396901, 4631775, 8891041, 12614643, 14470810, 13596169, 9456995, 2901226, -3136362, -5823287, -5379733, -4303783, -3881099, -3456536, -3015799, -3708478, -5128625, -5110975, -3704129, -4037605, -6599704, -6075938, 1508397, 10670245, 11516626, 2872288, -5760694, -6872612, -3374283, -1253054, -184029, 2734048, 4764747, 998857, -5944029, -7735189, -2155447, 4105192, 5799946, 5370828, 6319151, 6868449]
8204F868449k501462l362541m35513K438497K986725K501292Q03274l362033o706401
8195g69713m195309J632063K523910k628138n593063k122235J779197J036052
8187h337236l07274K088753M470513K630173K22671J314550J713451k942637o819232
8178e966268k563465M509842L248895m961163p686220j089488N038538M188815
8170e280514K348840N230304P555071K738894n145188p603710m197339o84913
8162e038555J031633L024930M250753J538184l208342m186916n77686K097310
8154a068689O88782j371207q22300k01097k814607n823788l491473L756140Q343015
8145b805224M824847l115127p134013l869746K282325N172305L118520r96988
$$ y = [6868449, 4366987, 1004446, 568933, 3007430, 5994155, 8495447, 9298721, 5936688, -769713, -4965022, -3332959, -809049, -3437187, -9030250, -11152485, -9373288, -8337236, -8644510, -6555757, -2085244, 544929, 767600, 2082150, 3795601, 852964, -5966268, -8529733, -4019891, -770996, -5732159, -13418379, -14507867, -9469329, -5280514, -2931674, 2298630, 9853701, 12592595, 7447407, -156303, -4353642, -5038555, -4006922, -981992, 3268761, 4806945, 1598603, -2588313, -3165999, -1068689, -379907, -1751114, -2573414, -2774511, -5589118, -11412906, -14904379, -11148239, -2805224, 2019623, -1095504, -8229517, -12099263, -9816938, -4644633, -1526113, -2523101]
8137b523101l480056k679730K19444K103400P94693k175940k961621k45752L026255
8128g922408L743381K427745J358522Q58758l15567k146527l085084k003846P98381
8119f286645L499650L162397j392507o283637n691402r6780K973985m03523m095035
8110a4613497j179122N020604O331728K684947R45318K545126K077714j349197
8102B463621j533283L250648N645323R30335m929389m845124j095050M21028K11184
8093E19293J807809L214405J53595n076574o083790k189293J397982K061670J752243
8084b442660J566264J014400J715253M887337O072707K09733q155284q540887
8076c673137K6718O251110K650634m217447m883545o16589J235810k20202M8839
$$ y = [-2523101, -6003157, -8682887, -8463443, -6360043, -5565350, -7741290, -10702911, -10948663, -7922408, -4179027, -1751282, -392760, 465998, 150431, -1996096, -5081180, -7085026, -6286645, -2786995, 375402, -1017105, -7300742, -12992144, -13088924, -10114939, -10518462, -14613497, -15792619, -10772015, -4440287, -1755340, -810022, 1735104, 3812818, 2463621, 930338, 4180986, 9826309, 10756644, 5827255, 982131, -112919, 308109, 519293, 2327102, 5541507, 5695102, 618528, -5465262, -7654555, -6256573, -4194903, -2442660, -876396, 138004, 1853257, 6740594, 12813301, 13023034, 4867750, -3673137, -3646419, 2604691, 5255325, 1037878, -3845667, -4462256, -3226446, -3446648, -3397809]
8067c397809L067604M604844K947866R67552J83316j407884m614417o777766n491237
8058i917931j470484K777219M729234L000067n54380j396359J652429L200286
8050B020081j107538o238500l931400L975953O856203J001029m891335l334842
8042e650349J330969J508213j748271k579992o21845M18092O52247K539339M110267
8033d1330J497981l364059m971568k895780r78906N38664L924087O227450K268467
8024B205006m375287l789608M647452R535777M341573l266513m726288l237340
8016A334772n046512o839288k216580N257428O546431J320791k664370k304799
8008d612127j376728j179577J128107M572530M147509k0734j806171P27573K377100
$$ y = [-3397809, -330205, 4274639, 7222505, 8190057, 8373373, 6965489, 2351072, -4426694, -9917931, -11388415, -8611196, -3881962, -881895, -1436275, -2832634, -1180205, 2020081, 912543, -5325957, -9257357, -5281404, 1574799, 2575828, -2315507, -5650349, -4319380, -2811167, -4559438, -7139430, -7761275, -7343183, -6690936, -4151597, -41330, 1456651, -1907408, -6878976, -9774756, -10753662, -10214998, -6290911, -63461, 2205006, -2170281, -5959889, -1312437, 8223340, 12564913, 9298400, 4572112, 1334772, -3711740, -10551028, -12767608, -7510180, -963749, 357042, -2307328, -4612127, -5988855, -7168432, -6040325, -1467795, 2679714, 2658980, 852809, 1580382, 3957482]
7999C957482M41580o98597J891886M003734J591418k449299l634667k778835k653145
7990c28443k341098n0248K070395R44860k229958m015598l514600j574236J804308
7981i234618N461712N659268J073309l497535k949915J028548L207769K570886
7973C319424J697759Q03522j638435l924797l097955r01806j088619j479539L275919
7964c034527J0275095R026115k658926j2232078q571565K300131O157983M20096
7956A682324m930428m022459j668738k065118j547896K767917N781702K584430
7948a418266k355497j798320K623989L364021q25067l747180k146950N44624J424206
7939d334440J716789J665771j010668m975960m395472K065710P349713N509637
$$ y = [3957482, 4399062, 3700465, 5592351, 9596085, 11187503, 8738204, 5103537, 2324702, -328443, -2669541, -2719789, -649394, 295466, -1934492, -5950090, -9464690, -11038926, -9234618, -3772906, 1886362, 2959671, -537864, -3487779, -2459231, 748538, 3319424, 5017183, 5820705, 4182270, 257473, -2840482, -3742288, -4830907, -6310446, -3034527, 7240568, 16266683, 13607757, 1375679, -7195886, -4895755, 1262228, 1682324, -3248104, -7270563, -8939301, -11004419, -12552315, -9784398, -4002696, -1418266, -3773763, -5572083, -2948094, 415927, -409140, -4156320, -6303270, -5758646, -4334440, -2617651, -951880, -1962548, -6938508, -11333980, -9268270, -1918557, 3591080]
7931C591080j23652k977488k443893j588813k47640K934160M829399J435786m430692
7922I78247n894851k000973J343829O42899r19559J99984K357402J872424j360947
7913b781545l627334j709819L206873N960887L112851j840677k335837J585952
7905A571351K876768j065243l559299K3911L659752R25361l192434q21965M256402
$$ y = [3591080, 3467428, 489940, -1953953, -3542766, -3790406, -856246, 3973153, 5408939, 978247, -4916604, -6917577, -5573748, -4930849, -5850408, -5650424, -3293022, -1420598, -2781545, -6408879, -8118698, -4911825, 1049062, 4161913, 2321236, -14601, 1571351, 4448119, 3382876, -176423, -152512, 3507240, 4432601, 1240167, 418202, 4674604]
$$ [...]
##END NTUPLES=NMR SPECTRUM
##END=
