##TITLE=31Pdec_SR_kw
 CDCl3, 124 sc
 7.06.2021
##JCAMPDX= 6.0         $$ Bruker NMR JCAMP-DX V2.0
##DATA TYPE= NMR SPECTRUM
##DATA CLASS= NTUPLES
##ORIGIN= UXNMR, Bruker Analytische Messtechnik GmbH
##OWNER= root
$$ XWIN-NMR		Version 3.5
$$ Mon Jun  7 13:41:00 2021 Russian Standard Time (UT+4h)  she@DPX200
##.OBSERVE FREQUENCY= 81.013821
##.OBSERVE NUCLEUS= ^31P
##.ACQUISITION MODE= SIMULTANEOUS
##.ACQUISITION SCHEME= undefined
##.AVERAGES= 124
##.DIGITISER RES= 16
##SPECTROMETER/DATA SYSTEM= spect
##.PULSE SEQUENCE= zgpg30
##.SOLVENT NAME= CDCl3
##.SHIFT REFERENCE= (INTERNAL, CDCl3, 0, 248.564)
##AUDIT TRAIL= $$ (NUMBER, WHEN, WHO, WHERE, WHAT)
$$ ##TITLE= Audit trail, XWIN-NMR		Version 3.5
$$ ##JCAMPDX= 5.01
$$ ##ORIGIN= Bruker BioSpin GmbH
$$ ##OWNER= she
$$ F:/spectra/data/she/nmr/P31/1/pdata/1/auditp.txt
$$ ##AUDIT TRAIL=  $$ (NUMBER, WHEN, WHO, WHERE, WHAT)
(   1,<2021-06-07 13:39:43.06 +0400>,<she>,<DPX200>,
      <continue with go, POWCHK disabled, PULCHK disabled
       configuration hash MD5:
       00 E9 B6 7A A2 85 ED C7 34 08 36 98 17 FE 4E 26
       data hash MD5: 32K
       DC 09 A0 28 14 AD 0E 62 3E B8 B0 67 5C CA B6 E1>)
(   2,<2021-06-07 13:40:04.31 +0400>,<she>,<DPX200>,
      <Start of raw data processing
       efp BC_mod = 2 LB = 1 FT_mod = 6 PKNL = 1 PHC0 = -5900.873 PHC1 = 124.0748 SI = 64K 
       data hash MD5: 64K
       30 9C EA BC E6 EB 25 A5 63 2A BF DE ED 4D 56 1D>)
(   3,<2021-06-07 13:40:29.14 +0400>,<she>,<DPX200>,
      <pk PHC0 = -8.527153 PHC1 = 73.99998 
       data hash MD5: 64K
       AE CA 1B 0D 1F AD 7C EA 4B DE 07 DE E6 C7 EC 47>)
(   4,<2021-06-07 13:40:33.12 +0400>,<she>,<DPX200>,
      <abs ABSG = 5 
       data hash MD5: 64K
       D4 12 56 ED A9 82 CA AA 41 FA 86 25 30 02 3F 6D>)
$$ ##END=
$$ 
$$ hash MD5
$$ D1 3A 86 1D F8 4D 58 7B 87 1F 71 03 4A 8F 45 17
##$RELAX= 
##$RELAX= 
##$RELAX= 
##$RELAX= 
##$RELAX= 
##$RELAX= 
##$RELAX= 
##$RELAX= 
$$ Bruker specific parameters
$$ --------------------------
##$DU= <F:/spectra>
##$EXPNO= 1
##$NAME= <P31>
##$PROCNO= 1
##$TYPE= <nmr>
##$USER= <she>
##$AMP= (0..31)
100 100 100 100 100 100 100 100 100 100 100 100 100 100 100 100 100 100 
100 100 100 100 100 100 100 100 100 100 100 100 100 100 
##$AQSEQ= 0
##$AQ_mod= 1
##$AUNM= <au_zg>
##$AUTOPOS= <>
##$BF1= 81.014009
##$BF2= 200.13
##$BF3= 200.13
##$BF4= 200.13
##$BF5= 200.13
##$BF6= 200.13
##$BF7= 200.13
##$BF8= 200.13
##$BYTORDA= 1
##$CFDGTYP= 0
##$CFRGTYP= 5
##$CHEMSTR= <none>
##$CNST= (0..31)
1 1 145 1 1 1 1 1 1 1 1 1 1 1 1 1 1 1 1 1 1 1 1 1 1 1 1 1 1 1 1 1 
##$CPDPRG= <waltz16>
##$CPDPRG1= <>
##$CPDPRG2= <waltz16>
##$CPDPRG3= <>
##$CPDPRG4= <mlev>
##$CPDPRG5= <mlev>
##$CPDPRG6= <mlev>
##$CPDPRG7= <mlev>
##$CPDPRG8= <mlev>
##$CPDPRGB= <>
##$CPDPRGT= <>
##$D= (0..31)
0 1 0 0 0 0 0 0 0 0 0 0.03 2e-05 3e-06 0 0 0 0 0 0 0 0 0 0 0 0 0 0 0 0 
0 0 
##$DATE= 1623058620
##$DBL= (0..7)
120 120 120 11 120 120 24 19 
##$DBP= (0..7)
150 150 150 150 150 150 150 150 
##$DBP07= 0
##$DBPNAM0= <>
##$DBPNAM1= <>
$$ [...]
##$SUBNAM3= <"">
##$SUBNAM4= <"">
##$SUBNAM5= <"">
##$SUBNAM6= <"">
##$SUBNAM7= <"">
##$SUBNAM8= <"">
##$SUBNAM9= <"">
##$SW= 501.771253377433
##$SWIBOX= (0..15)
0 1 3 0 0 0 0 0 0 0 0 0 0 0 0 0 
##$SW_h= 40650.406504065
##$TD= 32768
##$TD0= 1
##$TE= 0
##$TE2= 300
##$TE3= 300
##$TEG= 300
##$TL= (0..7)
0 120 53 12 22 120 120 120 
##$TP= (0..7)
150 150 150 150 150 150 150 150 
##$TP07= 0
##$TPNAME0= <>
##$TPNAME1= <>
##$TPNAME2= <>
##$TPNAME3= <>
##$TPNAME4= <>
##$TPNAME5= <>
##$TPNAME6= <>
##$TPNAME7= <>
##$TPOAL= (0..7)
0.5 0.5 0.5 0.5 0.5 0.5 0.5 0.5 
##$TPOFFS= (0..7)
0 0 0 0 0 0 0 0 
##$TUNHIN= 0
##$TUNHOUT= 0
##$TUNXOUT= 0
##$USERA1= <user>
##$USERA2= <user>
##$USERA3= <user>
##$USERA4= <user>
##$USERA5= <user>
##$V9= 5
##$VALIST= <valist>
##$VCLIST= <CCCCCCCCCCCCCCC>
##$VD= 0
##$VDLIST= <DDDDDDDDDDDDDDD>
##$VPLIST= <PPPPPPPPPPPPPPP>
##$VTLIST= <TTTTTTTTTTTTTTT>
##$WBST= 1024
##$WBSW= 4
##$XGAIN= (0..3)
0 0 0 0 
##$XL= 0
##$YL= 0
##$YMAX_a= 6310
##$YMIN_a= -4729
##$ZGOPTNS= <>
##$ZL1= 120
##$ZL2= 120
##$ZL3= 120
##$ZL4= 120
##$ABSF1= 248.5645
##$ABSF2= -253.2056
##$ABSG= 5
##$ABSL= 3
##$ALPHA= 0
##$AQORDER= 0
##$ASSFAC= 0
##$ASSFACI= 0
##$ASSFACX= 0
##$ASSWID= 0
##$AUNMP= <proc_1d>
##$AZFE= 0.1
##$AZFW= 0.5
##$BCFW= 0
##$BC_mod= 2
##$BYTORDP= 0
##$COROFFS= 0
##$CY= -3
##$DATMOD= 1
##$DC= 0
##$DFILT= <>
##$DTYPP= 0
##$F1P= 0
##$F2P= 0
##$FCOR= 1
##$FTSIZE= 65536
##$FT_mod= 6
##$GAMMA= 0
##$GB= 0
##$INTBC= 1
##$INTSCL= 5.30512e-09
##$ISEN= 30
##$LB= 1
##$LEV0= 0
##$LPBIN= 0
##$MAXI= 10000
##$MC2= 0
##$MEAN= 0
##$ME_mod= 0
##$MI= 50
##$NCOEF= 0
##$NC_proc= -8
##$NLEV= 6
##$NOISF1= 182.463
##$NOISF2= 159.3651
##$NSP= 0
##$NTH_PI= 0
##$NZP= 0
##$OFFSET= 248.5645
##$PC= 4
##$PHC0= -5909.4
##$PHC1= 198.0748
##$PH_mod= 1
##$PKNL= yes
##$PPARMOD= 0
##$PSCAL= 0
##$PSIGN= 0
##$REVERSE= no
##$SF= 81.014009
##$SI= 65536
##$SIGF1= 159.3651
##$SIGF2= -187.1042
##$SINO= 113.3802
##$SIOLD= 16384
##$SREGLST= <1H.CDCl3>
##$SSB= 0
##$STSI= 65536
##$STSR= 0
##$SW_p= 40650.406504065
##$SYMM= 0
##$S_DEV= 0
##$TDeff= 32768
##$TDoff= 0
##$TI= <>
##$TILT= no
##$TM1= 0
##$TM2= 0
##$TOPLEV= 0
##$USERP1= <user>
##$USERP2= <user>
##$USERP3= <user>
##$USERP4= <user>
##$USERP5= <user>
##$WDW= 1
##$XDIM= 65536
##$YMAX_p= 359667928
##$YMIN_p= -44196195
$$ End of Bruker specific parameters
$$ ---------------------------------
##NTUPLES= NMR SPECTRUM
##VAR_NAME=  FREQUENCY,     SPECTRUM/REAL,   SPECTRUM/IMAG
##SYMBOL=    X,             R,               I
##VAR_TYPE=  INDEPENDENT,   DEPENDENT,       DEPENDENT
##VAR_FORM=  AFFN,          ASDF,            ASDF
##VAR_DIM=   65536,         65536,           65536
##UNITS=     HZ,            ARBITRARY UNITS, ARBITRARY UNITS
##FACTOR=    0.620285442955139, 1,           1
##FIRST=     20137.2065510759, 0,            0
##LAST=      -20513.1999529892, 0,           0
##MIN=       -20513.1999529892, -44196195,   0
##MAX=       20137.2065510759, 359667928,    0
$$ Real data points
##PAGE= N=1
##DATA TABLE= (X++(R..R)), XYDATA
$$ [...]
$$ plain form
43021 -7936623 1188931 9904966 8308140 -530903 -5830291 -2917738 4394970 11001478
43013 11001478 13881998 12042460 8710712 9777494 15240243 17448880 13169719 10549076
43005 10549076 16621674 24772318 24151592 15695996 8023358 2506646 -5126921 -11782142
42997 -11782142 -9341456 607404 7355671 7177184 6704621 9002741 8824417 4543931
42989 4543931 2655197 6029703 8562740 6236333 3271307 2229408 -1910238 -11796656
42981 -11796656 -20995290 -23499535 -21711136 -19308417 -14948801 -9008048 -6990660 -9048139
42973 -9048139 -6086206 4818661 11278604 3413544 -8021690 -5419196 9807008 20411845
42965 20411845 19191753 15653564 16634127 16194224 9296003 2093575 1267924 2889659
$$ packed form
43021g936623R125554Q716035j596826q839043n299388K912553P312708O606508
43013A1001478K880520j839538l331748J066782N462749K208637m279161k620643
43005A0549076O072598Q150644o20726q455596p672638n516712p633567o655221
42997a1782142K440686R948860O748267j78487m72563K298120j78324m280486
42989D543931j888734L374506K533037k326407k965026j041899m139646r886418
42981a1796656r198634k504245J788399K402719M359616N940753K017388k057479
42973i048139K961933J0904867O459943p865060j1435234K602494J5226204J0604837
42965B0411845j220092l538189R80563m39903o898221p202428q25651J621735
$$ plain form
42957 2889659 -87333 -6045214 -8229139 -5565794 -2632700 -1250386 1358101 6529616
42949 6529616 11477680 13567013 13844625 14701422 15876068 14954339 11854164 10495243 13634690
42940 13634690 17366010 15220706 8482642 6688983 14275409 22348264 20201751 10789008
42932 10789008 5940604 8094607 7396742 -1155633 -8235157 -3807608 7590883 13230735
42924 13230735 9226426 2932133 744854 1974073 4600730 8617531 11281637 6804668
42916 6804668 -4176217 -10645246 -3704881 10149403 15929151 9312326 594493 -1723885
42908 -1723885 -1935375 -6467847 -10682642 -6133004 3204100 3453839 -9772752 -24483180
42900 -24483180 -27852318 -20323357 -10040716 -1154368 5852485 8184061 3275187 -5076620
$$ packed form
42957B889659k976992n957881k183925K663345K933094J382314K608487N171515
42949F529616M948064K089333K77612Q56797J174646r21729l100175j358921L139447
42940A3634690L731320k145304o738064j793659P586426Q072855k146513r412743
42932A0789008m848404K154003o97865q552375p079524M427549J1398491N639852
42924A3230735m004309o294293k187279J229219K626657M016801K664106m476969
42916F804668j0980885o469029O940365J3854284N779748o616825q717833k318378
42908a723885k11490m532472m214795M549638R337104K49739j3226591j4710428
42900b4483180l369138P528961J0282641Q886348P006853K331576m908874q351807
$$ plain form
42892 -5076620 -9782559 -8612537 -4414616 837931 6567351 9398130 4799138 -5935436
42884 -5935436 -14799771 -14855983 -6626939 3515817 9262787 9141448 7598018 10677338
42876 10677338 18725823 24644087 21476831 10278645 -1450996 -7014718 -4262417 4534775
42868 4534775 13195759 15172507 10739646 8020246 12713269 19849616 20689293 14637879
42860 14637879 8146706 4315673 750228 -3632454 -7201387 -10710404 -16294974 -20876664
42852 -20876664 -18191192 -8977906 -1777423 -1048470 -1502401 2312838 7567156 9217514
42844 9217514 8912904 11452056 15528694 14631120 6902582 -963017 -1418139 4735143 8978577
42835 8978577 5033059 -3372868 -6948882 -2767093 2401898 2597638 1233027 4028298
$$ packed form
42892e076620m705939J170022M197921N252547N729420K830779m598992j0734574
42884e935436q864335n6212Q229044J0142756N746970j21339j543430L079320
42876A0677338Q048485N918264l167256j1198186j1729641n563722K752301Q797192
42868D534775Q660984J976748m432861k719400M693023P136347Q39677o051414
42860A4637879o491173l831033l565445m382682l568933l509017n584570m581690
42852b0876664K685472R213286P200483P28953m53931L815239N254318J650358
42844I217514l04610K539152M076638q97574p728538p865599m55122O153282M243434
42835H978577l945518q405927l576014M181789N168991J95740j364611K795271
$$ plain form
42827 4028298 7962849 5255176 -3743711 -10417309 -10393603 -7230751 -2778875 5993871
42819 5993871 17051183 20233471 10982906 -366730 -1077139 7242274 12546356 9795221
42811 9795221 5978945 8260478 14522970 17574907 13968585 6281768 -764102 -4292993
42803 -4292993 -4077447 -903562 4378041 9520796 10713441 6684265 1827634 1494262
42795 1494262 4803699 6432778 4975676 4095437 5282680 5957638 6017120 8968924 13470692
42786 13470692 11022031 -2508996 -18342410 -23688294 -16033082 -3939306 3460935 3692588
42778 3692588 512678 84333 5328429 11646449 11319777 3829377 -2789481 -2930029 -31759
42769 -31759 699448 -220837 -417907 -552950 -565955 2317830 6287173 2848815 -10696842
$$ packed form
42827D028298L934551k707673q998887o673598K3706L162852M451876Q772746
42819E993871J1057312L182288r250565j1349636p10409Q319413N304082k751135
42811I795221l816276K281533O262492L051937l606322p686817p045870l528891
42803d292993K15546L173885N281603N142755J192645m029176m856631l33372
42795A494262L309437J629079j457102q80239J187243O74958N9482K951804M501768
42786A3470692k448661j3531027j5833414n345884P655212J2093776P400241K31653
42778C692588l179910m28345N244096O318020l26672p490400o618858j40548K898270
42769c1759P31207r20285j97070j35043j3005K883785L969343l438358j3545657
$$ plain form
42760 -10696842 -23178757 -22358324 -10515927 1060017 7666354 11850125 13516881 10355791
42752 10355791 5325006 3408071 2915745 -562170 -4190111 -1942710 3922895 6214042
42744 6214042 5481564 8022336 13035142 13934064 11157197 10498928 9438299 83571 -13187423
42735 -13187423 -15456683 -4909591 1289164 -8099482 -22017147 -24457675 -15525172 -5497127
42727 -5497127 851693 3719316 2140350 -1061911 2681752 14078362 19346470 8603302
42719 8603302 -7697645 -13333531 -9397173 -8454631 -12048102 -10533455 -2572164 1823562
42711 1823562 -1197143 -3062179 2853581 11948155 16645681 14631068 6703959 -4615117
42703 -4615117 -12293690 -9335135 1246113 8246359 5739735 -1988280 -9046782 -13426271
$$ packed form
42760a0696842j2481915Q20433J1842397J1575944O606337M183771J666756l161090
42752A0355791n030785j916935m92326l477915l627941K247401N865605K291147
42744F214042p32478K540772N012806Q98922k776867o58269j060629r354728j3270994
42735a3187423k269260J0547092O198755r388646j3917665k440528Q932503J0028045
42727e497127O348820K867623j578966l202261L743663J1396610N268108j0743168
42719H603302j6300947n635886L936358R42542l593471J514647P961291M395726
42711A823562l020705j865036N915760R094574M697526k014613p927109j1319076
42703d615117p678573K958555J0581248P000246k506624p728015p058502m379489
$$ plain form
42695 -13426271 -13770751 -9694937 -6010629 -7242046 -7409314 3575895 21510749 28742165
42687 28742165 18406766 5451525 5547190 13566626 13135513 54033 -14301560 -18400819
42679 -18400819 -10471432 3477195 13805238 12586759 1769628 -6949124 -6234949 -2838958
42671 -2838958 -6650023 -15134419 -17712171 -12435147 -8337231 -11539484 -17585544 -18724204
42663 -18724204 -12539261 -2774752 3440710 151687 -10199943 -15812668 -8292136 5069206
42655 5069206 9020280 -509722 -12586574 -16020929 -9677887 1843922 13227447 17425386
42647 17425386 9688987 -3306033 -7285106 1504549 10153794 6994751 -2559289 -5976979
42639 -5976979 -2036285 1120728 1395424 3920283 8022030 5451045 -5309034 -13277799
$$ packed form
42695a3426271l44480M075814L684308j231417j67268J0985209J7934854P231416
42687B8742165j0335399j2955241R5665Q019436m31113j3081480j4355593m099259
42679a8400819P929387J3948627J0328043j218479j0817131q718752P14175L395991
42671b838958l811065q484396k577752N277024M097916l202253o046060j138660
42663a8724204O184943R764509O215462l289023j0351630n612725P520532J3361342
42655E069206L951074r530002j2076852l434355O343042J1521809J1383525M197939
42647A7425386p736399j2995020l979073Q789655Q649245l159043r554040l417690
42639e976979L940694L157013K74696K524859M101747k570985j0760079p968765
$$ plain form
42631 -13277799 -9357404 712721 4492304 -836458 -7365791 -8865313 -6584238 -2845302
42623 -2845302 3437842 11532859 14779772 7476146 -5871880 -13340871 -8260778 4295808
42615 4295808 14371355 17135608 14657631 11090332 9170905 9797281 11913527 13083950
42607 13083950 12143737 10757973 10750261 10998846 9206497 5985062 4783368 7881327 14001014
42598 14001014 19143207 18483750 9480580 -4230549 -13945951 -14517141 -10572734 -10301874
42590 -10301874 -14467725 -16571347 -13203613 -8143333 -5112378 -2394316 2644963 8295707
42582 8295707 10839802 8853276 3012875 -4928812 -11084248 -11349483 -6765157 -3088205
42574 -3088205 -2688222 -1233501 4783620 12133805 16251518 17589169 17668538 13602291 3246893
$$ packed form
42631a3277799L920395J0070125L779583n328762o529333j499522K281075L738936
42623b845302O283144Q095017L246913p303626j3348026p468991N080093J2556586
42615D295808J0075547K764253k477977l567299j919427O26376K116246J170423
42607A3083950r40213j385764p712K48585j792349l221435j201694L097959O119687
42598A4001014N142193o59457r003170j3711129r715402n71190L944407K70860
42590a0301874m165851k103622L367734N060280L030955K718062N039279N650744
42582H295707K544095j986526n840401p941687o155436k65235M584326L676952
42574c088205L99983J454721O017121P350185M117713J337651P9369m066247j0355398
$$ plain form
42565 3246893 -7339853 -8972753 -904754 8793219 13668403 13914274 11673291 7667638
42557 7667638 3179260 -54382 -2902520 -7264199 -11273603 -11300576 -9090123 -10760237
42549 -10760237 -16956015 -20086781 -14559909 -4655387 1727578 3000303 3062381 3696735
42541 3696735 2994427 312286 -1644460 -244494 4003664 8040868 8519276 4122517
42533 4122517 -2690555 -6651426 -3880992 4664692 13972225 18324170 14528690 4838860
42525 4838860 -2447582 887748 13281527 22931770 21234606 14014557 13377907 19969310
42517 19969310 21983096 13745736 5369548 6903911 11462824 6284539 -4077319 -1940451
42509 -1940451 14036391 20849047 2577556 -23938940 -30035095 -13199756 3442015
$$ packed form
42565C246893j0586746j632900Q067999R697973M875184K45871k240983m005653
42557G667638m488378l233642k848138m361679m009404k6973K210453j670114
42549a0760237o195778l130766N526872R904522O382965J272725O2078O34354
42541C696735p02308k682141j956746J399966M248158M037204M78408m396759
42533D122517o813072l960871K770434Q545684R307533M351945l795480r689830
42525D838860p286442L335330J2393779R650243j697164p220049o36650O591403
42517A9969310K013786q237360q376188J534363M558913n178285j0361858K136868
42509a940451J5976842O812656j8271491k6516496o096155J6835339J6641771
$$ plain form
42502 3442015 5451088 1449733 2062443 4208395 3415354 4690038 10260703 10108418 -2605391
42493 -2605391 -17189960 -19637433 -12693293 -8375202 -7916291 -3868195 3189357 5445544
42485 5445544 2436426 312141 -1209181 -6471332 -10242473 -2472511 13138953 21645905
42477 21645905 19471757 17351063 17441470 6867572 -17464493 -35781340 -30699752 -12177628
42469 -12177628 -2388967 -5472193 -7927935 -2924811 1796200 -957901 -7949807 -12592472
42461 -12592472 -13224790 -12412949 -13147000 -16013773 -17127236 -11186223 386133 8430444
42453 8430444 7116642 1482324 -433869 1974345 4090778 3605026 973177 -2331473
42445 -2331473 -1823819 6678586 17029740 15506493 995889 -8022597 2327952 19788133
$$ packed form
42502C442015K009073m001355O12710K145952p93041J274684N570665j52285j2713809
42493b605391j4584569k447473O944140M318091M58911M048096P057552K256187
42485E445544l009118k124285j521322n262151l771141P769962J5611464Q506952
42477B1645905k174148k120694R0407j0573898k4332065j8316847N081588J8522124
42469a2177628R788661l083226k455742N003124M721011k754101o991906m642665
42461a2592472o32318Q11841p34051k866773j113463N941013J1572356Q044311
42453H430444j313802n634318j916193K408214K116433m85752k631849l304650
42445b331473N07654Q502405J0351154j523247j4510604r018486J0350549J7460181
$$ plain form
42437 19788133 22932833 12103182 6056753 11532655 15205210 7510532 -3227058 -6479466
42429 -6479466 -5373313 -8742097 -16655477 -21438091 -17735283 -7031109 3854616 7539504
42421 7539504 4038692 2569588 8755367 13463852 5038551 -10196664 -14204554 -4231884
42413 -4231884 3016235 -1910967 -7729740 -3831555 1549292 -2624119 -9577964 -5987139
42405 -5987139 5332748 10399596 6168357 1786750 791067 -2376553 -8279498 -9446054
42397 -9446054 -3915944 306360 -2122262 -7005822 -9989179 -13172182 -17502469 -17079592
42389 -17079592 -7577660 5383767 12620878 12616365 11187403 12461728 14810194 14590246
42381 14590246 10562480 4915775 1412000 1646655 2750516 635134 -4562094 -9279387
$$ packed form
42437A9788133L144700j0829651o046429N475902L672555p694678j0737590l252408
42429f479466J106153l368784p913380m782614L702808J0704174J0885725L684888
42421G539504l500812j469104O185779M708485q425301j5235215m007890R972670
42413d231884P248119m927202n818773L898185N380847m173411o953845L590825
42405e987139J1319887N066848m231239m381607r95683l167620n902945j166556
42397i446054N530110M222304k428622m883560k983357l183003m330287M22877
42389a7079592R501932J2961427P237111m513j428962J274325K348466k19948
42381A4590246m027766n646705l503775K34655J103861k115382n197228m717293
$$ plain form
42373 -9279387 -12773714 -18013379 -24801744 -27091932 -20903532 -11052770 -5194281 -3719895
42365 -3719895 -1000863 4608457 8151155 6341324 2854746 2538028 4440716 4317550
42357 4317550 1344444 -1763192 -3811136 -6062891 -8477119 -8939151 -6614693 -2635045
42349 -2635045 2734183 9516302 14091065 11232538 2552949 -2376550 2534023 11882080
42341 11882080 17088947 17913367 18719852 17560613 9018365 -3240072 -7923316 -2523888
42333 -2523888 1976185 -2709841 -10912041 -14476853 -16299135 -22510297 -27891091 -21701552
42325 -21701552 -5917873 4753847 2702587 -3284741 -2222234 4491236 8201311 5961633
42317 5961633 1711616 -1393439 -3292644 -3595224 -1466935 1566665 3037566 3696749
$$ packed form
42373i279387l494327n239665o788365k290188O188400R850762N858489J474386
42365c719895K719032N609320L542698j809831l486578l16718J902688j23166
42357D317550k973106l107636k047944k251755k414228m62032K324458L979648
42349b635045N369228O782119M574763k858527q679589m929499M910573R348057
42341A1882080N206867Q24420Q06485j159239q542248j2258437m683244N399428
42333b523888M500073m686026q202200l564812j822282o211162n380794O189539
42325b1701552J5783679J0671720k051260n987328J062507O713470L710075k239678
42317E961633m250017l105055j899205l02580K128289L033600J470901O59183
$$ plain form
42309 3696749 6698136 12329163 16501260 15283723 9136452 2212251 -1382276 -821433
42301 -821433 890478 175365 -2541627 -3004218 954173 6060676 8457117 9040520 10098521
42292 10098521 9442956 4004847 -2114419 -1170258 5345943 5908323 -4684491 -16081029
42284 -16081029 -16474359 -9467069 -7616610 -13427997 -17765967 -15884127 -13442449 -14803426
42276 -14803426 -16302720 -15264945 -15727503 -19242970 -18923040 -10377019 -1203929 -622930
42268 -622930 -5398626 -5900165 -1919780 -1678853 -7169247 -11394636 -10288746 -7325515 -5053584
42259 -5053584 -1614757 2045088 731588 -5591472 -9117478 -5289414 509668 1771666
42251 1771666 -418148 -2228158 -3794014 -5230388 -2282035 6859548 15291005 15482580
$$ packed form
42309C696749L001387N631027M172097j217537o147271o924201l594527N60843
42301h21433J711911p15113k716992m62591L958391N106503K396441N83403J058001
42292A0098521o55565n438109o119266R44161O516201N62380j0592814j1396538
42284a6081029l93330P007290J850459n811387m337970J881840K441678j360977
42276a4803426j499294J037775m62558l515467L19930Q546021R173090N80999
42268f22930m775696n01539L980385K40927n490394m225389J105890K963231K271931
42259e053584L438827L659845j313500o323060l526006L828064N799082J261998
42251A771666k189814j810010j565856j436374K948353R141583Q431457J91575
$$ plain form
42243 15482580 9866994 5869045 3929542 -736669 -6619909 -6225980 1296862 7177336
42235 7177336 5756640 2432546 4464285 10218080 13237184 12392220 11389076 10719238
42227 10719238 7189803 1487158 -397084 4172706 9272233 7765411 694433 -5260922
42219 -5260922 -7805962 -10845523 -16167053 -19497867 -17563525 -13724366 -12137782 -10810862
42211 -10810862 -6635060 -3942199 -9591088 -19927992 -21782984 -9763975 4736975 7039148
42203 7039148 -3243762 -13675877 -14714999 -8083454 -913762 2836668 4225191 6003234
42195 6003234 9050272 11400567 10684271 7100130 2372866 -3553806 -11326562 -17607839
42187 -17607839 -16688819 -8660619 -1004748 1062951 773138 2120355 1545733 -5723596
$$ packed form
42243A5482580n615586l997949j939503m666211n883240L93929P522842N880474
42235G177336j420696l324094K031739N753795L019104q44964j003144o69838
42227A0719238l529435n702645j884242M569790N099527j506822p070978n955355
42219e260922k545040l039561n321530l330814J934342L839159J586584J326920
42211a0810862M175802K692861n648889j0336904j854992J2019009J4500950K302173
42203G039148j0282910j0432115j039122O631545P169692L750430J388523J778043
42195F003234L047038K350295p16296l584141m727264n926672p772756o281277
42187a7607839R19020Q028200P655871K067699k89813J347217n74622p269329
$$ plain form
42179 -5723596 -14678909 -14575782 -3776755 6958800 7552085 -836183 -9922378 -13537664
42171 -13537664 -10461106 -2970498 3988950 5565138 2491761 1833669 9131446 20838236
42163 20838236 27207445 22663258 11751581 4514963 6521239 13719174 17436720 14238801
42155 14238801 9132411 7978456 9238293 6691600 -793359 -7030167 -7369273 -5246572
42147 -5246572 -6101977 -7602539 -1870519 11552686 20560548 13411224 -5154163 -16968764
42139 -16968764 -11159315 3725858 12010767 10135984 6929604 7933405 8871302 5745613
42131 5745613 2566695 4801293 11375063 17453297 19750259 15209679 1059470 -17781563
42123 -17781563 -27402352 -19201901 -1975304 8070687 6585658 2530701 3056926 6224540
$$ packed form
42179e723596q955313J03127J0799027J0735555N93285q388268r086195l615286
42171a3537664L076558P490608O959448J576188l073377o58092P297777J1706790
42163B0838236O369209m544187j0911677p236618K006276P197935L717546l197919
42155A4238801n106390j153955J259837k546693p484959o236808l39106K122701
42147e246572q55405j500562N732020J3423205R007862p149324j8565387j1814601
42139a6968764N809449J4885173Q284909j874783l206380J003801R37897l125689
42131E745613l178918K234598O573770O078234K296962m540580j4150209j8841033
42123a7781563r620789Q200451J7226597J0045991j485029m054957N26225L167614
$$ plain form
42115 6224540 8120892 7991720 5255266 -423289 -4796316 -2733628 2343902 1369103
42107 1369103 -5587114 -6731431 4578399 18885142 23107205 17141826 10521502 7785510
42099 7785510 5716904 2400473 682792 2576055 6282485 9500496 11619967 12486089
42091 12486089 12102655 11126270 9221978 4414603 -3219111 -9222079 -9311527 -4319425 2354055
42082 2354055 9212119 14605720 13894548 5010113 -5157951 -6964699 -183508 6634292
42074 6634292 8727141 9411478 10742669 8563467 882809 -6258354 -7065083 -4379920
42066 -4379920 -3503714 -2766633 1975160 7278481 6056482 431371 634250 9250659 15891504
42057 15891504 11935094 2667081 -1559579 -49702 204295 -2893888 -4915548 -4402089
$$ packed form
42115F224540J896352j29172k736454n678555m373027K062688N077530r74799
42107A369103o956217j144317J1309830J4306743M222063n965379o620324k735992
42099G785510k068606l316431j717681J893263L706430L218011K119471Q66122
42091A2486089l83434r76385j904292m807375p633714o002968q9448M992102O673480
42082B354055O858064N393601p11172q884435j0168064j806748O781191O817800
42074F634292K092849O84337J331191k179202p680658p141163q06729K685163
42066d379920Q76206P37081M741793N303321j221999n625111K02879Q616409O640845
42057A5891504l956410r268013m226660J509877K53997l098183k021660N13459
$$ plain form
42049 -4402089 -4838905 -6098513 -2725660 5542411 9132623 784585 -12426946 -16338563
42041 -16338563 -7007930 5708363 11452529 9986947 7235056 6604185 8105178 12380746
42033 12380746 20127419 27720260 28104807 18559581 5290903 -2747889 -3832682 -3983473
42025 -3983473 -7350417 -10465355 -8784735 -5039601 -5814395 -11535192 -15890454 -15351582
42017 -15351582 -13208273 -12764186 -12809778 -12576332 -14570496 -17779612 -14480252 -1233948
42009 -1233948 11443832 9733662 -4498111 -14596809 -10140415 1365991 6665149 2799700
42001 2799700 -4016855 -9234297 -12427940 -12018854 -5183422 6254270 15017602 15424394
41993 15424394 8634405 14215 -6098094 -7949467 -5615047 -1343324 678520 -2134657
$$ packed form
42049d402089m36816j259608L372853Q268071L590212q348038j3211531l911617
42041a6338563R330633J2716293N744166j465582k751891o30871J500993M275568
42033A2380746P746673P592841L84547r545226j3268678q038792j084793j50791
42025c983473l366944l114938J680620L745134p74794n720797m355262N38872
42017a5351582K143309M44087m5592K33446j994164l209116L299360J3246304
42009a233948J2677780j710170j4231773j0098698M456394J1506406N299158l865449
42001B799700o816555n217442l193643M09086O835432J1437692Q763332M06792
41993A5424394o789989q620190o112309j851373K334420M271723K021844k813177
$$ plain form
41985 -2134657 -7284549 -9612268 -7886223 -6597315 -9675299 -14677866 -15785957 -11029697
41977 -11029697 -3663422 2219702 3978784 10031 -7763011 -11602481 -4788209 7818978
41969 7818978 12830939 4985797 -5975263 -9458657 -7947793 -9911562 -14955377 -15499429
41961 -15499429 -9859695 -3593484 990284 6557261 11487170 9353327 856793 -3304289
41953 -3304289 2609307 8787878 1856801 -16340845 -29423136 -25475406 -9919846 1954844
41945 1954844 2104165 -3178051 -3020625 3869772 8559401 5552081 1182938 3718933
41937 3718933 9909977 9342670 378099 -7017693 -5264561 1880787 6529174 5886852
41929 5886852 1671807 -3327866 -5281852 -1799520 3074863 2424971 -2806558 -3983139
$$ packed form
41985b134657n149892k327719J726045J288908l077984n002567j108091M756260
41977a1029697P366275N883124J759082l968753p773042l839470O814272J2607187
41969G818978N011961p845142j0961060l483394J510864j963769n043815n44052
41961a5499429N639734O266211M583768N566977M929909k133843q496534m161082
41953c304289N913596O178571o931077j8197646j3082291L947730J5555560J1874690
41945A954844J49321n282216J57426O890397M689629l007320m369143K535995
41937C718933O191044n67307q964571p395792J753132P145348M648387o42322
41929E886852m215045m999673j953986L482332M874383o49892n231529j176581
$$ plain form
41921 -3983139 1325703 4137383 -2144959 -11080445 -13296164 -9695698 -6187055 -2078030
41913 -2078030 5706687 11546689 6428655 -6670035 -13840384 -8215286 2234565 7275394
41905 7275394 6848683 7331269 11356891 15520563 14922082 7431645 -4134131 -13005922
41897 -13005922 -14228829 -9761936 -5138986 -1938571 2103799 5899436 3832642 -5897842
41889 -5897842 -16206270 -18088122 -10929437 -3095283 -2407612 -7459556 -9351654 -2543218
41881 -2543218 7511385 10676580 5549986 1105626 3269519 6793148 5301449 2441647
41873 2441647 4869326 9462539 8144337 2788921 3535566 11974317 17648005 13905887
41865 13905887 6333156 1221688 -3820201 -11659306 -17695425 -18127089 -18135017 -22548372 -24855407
$$ packed form
41921c983139N308842K811680o282342q935486k215719L600466L508643M109025
41913b078030P784717N840002n118034j3098690p170349N625098J0449851N040829
41905G275394m26711M82586M025622M163672n98481p490437j1565776q871791
41897a3005922j222907M466893M622950L200415M042370L795637k066794r730484
41889e897842j0308428j881852P158685P834154O87671n051944j892098O808436
41881b543218J0054603L165195n126594m444360K163893L523629j491699k859802
41873B441647K427679M593213j318202n355416P46645Q438751N673688l742118
41865A3905887p572731n111468n041889p839105o036119m31664p928m413355k307035
$$ plain form
41856 -24855407 -16310901 -1891514 4535695 24328 -3646324 2151193 11006022 11952797
41848 11952797 4753903 -1191861 371602 6132367 8705189 5164786 -497049 -2360389
41840 -2360389 707647 4403339 5380288 5719652 8487543 11131124 7800611 -1932423
41832 -1932423 -10882440 -11950023 -5198937 3606954 8969104 9189853 6085497 2461313
41824 2461313 -621706 -3591932 -5076011 -1793810 5686313 10461202 7314822 498830
41816 498830 -2781553 -4404719 -12181467 -24841176 -30645178 -24394548 -15686821 -14006479
41808 -14006479 -14864939 -9666507 -1533588 414266 -2316290 58199 8055387 11181920
41800 11181920 5547724 578181 3641845 9254926 10050923 8516360 9537364 9925693
$$ packed form
41856b4855407Q544506J4419387O427209m511367l670652N797517Q854829R46775
41848A1952797p198894n945764J563463N760765K572822l540403n661835j863340
41840b360389L068036L695692R76949L39364K767891K643581l330513r733034
41832a932423q950017j067583O751086Q805891N362150K20749l104356l624184
41824B461313l083019k970226j484079L282201P480123M774889l146380o815992
41816D98830l280383j623166p776748j2659709n804002O250630Q707727J680342
41808a4006479q58460N198432Q132919J947854k730556K374489P997188L126533
41800A1181920n634196m969543L063664N613081P95997j534563J021004L88329
$$ plain form
41792 9925693 5811605 3944833 12946458 25996580 25619311 7813104 -9731077 -8573737
41784 -8573737 9103831 25739988 29276821 22406826 14409689 10714938 10595508 10186304
41776 10186304 5956449 -2456783 -11406137 -16222749 -15679685 -12623488 -9890119 -7118654
41768 -7118654 -2962600 1017349 1921166 1269831 4886837 13971841 20177058 15286948
41760 15286948 3657068 -2356444 780548 4025440 874593 -3208225 -1692225 1709225
41752 1709225 948126 -362744 4668502 12622619 13869802 7452743 293679 -6659741
41744 -6659741 -18377133 -31173681 -32167548 -17767485 -796715 6538371 6207912 5062057
41736 5062057 3293565 362216 1806478 9421988 13082024 4135448 -9663174 -14738701
$$ packed form
41792I925693m114088j866772R001625J3050122l77269j7806207j7544181J157340
41784h573737J7677568J6636157L536833o869995p997137l694751j19430m09204
41776A0186304m229855q413232q949354m816612N43064L056197K733369K771465
41768g118654M156054L979949R03817o51335L617006R085004O205217m890110
41760A5286948j1629880o013512L136992L244892l150847m082818J516000L401450
41752A709225p61099j310870N031246P954117J247183o417059p159064o953420
41744f659741j1717392j2796548r93867J4400063J6970770P335086l30459j145855
41736E062057j768492k931349J444262P615510L660036q946576j3798622n075527
$$ plain form
41728 -14738701 -11110109 -7483678 -2429451 11810933 27852852 25754132 3327449 -13931763
41720 -13931763 -4978689 17719036 25464206 10839920 -8089777 -16679093 -19200833 -23432390
41712 -23432390 -25830924 -20322870 -11061612 -6048128 -4312422 16591 4376645 16344
41704 16344 -12006409 -18092986 -9907215 3388961 7250461 479065 -5610764 -3518382
41696 -3518382 2797191 6040671 4510579 1585638 1063769 4371494 9060745 9675893
41688 9675893 3331127 -5743196 -10500652 -9099387 -4941950 -444231 3977235 6276451
41680 6276451 5060678 5062426 12339428 22963931 25203240 16051994 7133501 9221343
41672 9221343 18372093 23567309 21583458 16839968 11451901 3881469 -4733088 -10279786
$$ packed form
41728a4738701L628592L626431N054227J4240384J6041919k098720k2426683j7259212
41720a3931763Q953074K2697725P745170j4624286j8929697q589316k521740m231557
41712b3432390k398534N508054R261258N013484J735706M329013M360054m360301
41704A6344j2022753o086577Q185771J3296176L861500o771396o089829K092382
41696c518382O315573L243480j530092k924941n21869L307725M689251O15148
41688I675893o344766r074323m757456J401265M157437M497719M421466K299216
41680F276451j215773J748P277002J0624503K239309r151246q918493K087842
41672I221343R150750N195216j983851m743490n388067p570432q614557n546698
$$ plain form
41664 -10279786 -11248380 -9521104 -6554715 -3079934 -1171122 -2240906 -3898177 -2421496
41656 -2421496 2372978 7093837 8162345 3949749 -3334171 -6367107 2103473 19925023
41648 19925023 35625780 40604348 36745320 29904548 22514879 16155224 13777978 14005384
41640 14005384 10583511 3388668 1629685 8682154 13100655 5208723 -5939349 -5305972
41632 -5305972 5182226 11378907 9784933 8825129 9138346 831002 -16710664 -28731912
41624 -28731912 -24940088 -12468388 -2830894 2622663 7634716 11677209 13092943 13815853
41616 13815853 14664198 12583330 7327504 3838222 3828905 2763951 -607505 -424991 5247569
41607 5247569 8301424 2308911 -7035186 -10255679 -6730046 -2687895 -2500628 -7453531
$$ packed form
41664a0279786r68594J727276K966389L474781J908812j069784j657271J476681
41656b421496M794474M720859J068508m212596p283920l032936Q470580J7821550
41648A9925023J5700757M978568l859028o840772p389669o359655k377246K27406
41640A4005384l421873p194843j758983P052469M418501p891932j1148072O33377
41632e305972J0488198O196681j593974r59804L13217q307344j7541666j2021248
41624b8731912L791824J2471700R637494N453557N012053M042493J415734P22910
41616A3815853Q48345k080868n255826l489282r317j064954l371456J82514N672560
41607E247569L053855n992513r344097l220493L525633M042151J87267m952903
$$ plain form
41599 -7453531 -16399095 -21905269 -13717278 6480957 21529804 19059193 8401700 6900084
41591 6900084 15203405 18623015 10265165 -80526 -1223261 5756981 12180287 12760899
41583 12760899 8813933 5230266 6235251 11093631 13929748 10519154 3542006 -2322636
41575 -2322636 -7281238 -12856372 -14572668 -6436029 7378199 13404121 4220636 -12595707
41567 -12595707 -23677780 -23694833 -16985910 -9052259 -957614 8164906 16421315 19414432
41559 19414432 15433845 8590158 4654645 4469157 4299143 2471674 1698821 3684248
41551 3684248 5464932 3527722 -1309922 -5177418 -4860153 842534 10127452 17301620
41543 17301620 16589383 8397194 -1388941 -8608947 -13059716 -14197254 -11246618 -7934498
$$ packed form
41599g453531q945564n506174Q187991K0198235J5048847k470611j0657493j501616
41591F900084Q303321L419610q357850j0345691j142735O980242O423306N80612
41583A2760899l946966l583667J004985M858380K836117l410594o977148n864642
41575b322636m958602n575134j716296Q136639J3814228O025922r183485j6816343
41567a2595707j1082073j7053O708923P933651Q094645R122520Q256409K993117
41559A9414432l980587o843687l935513j85488j70014j827469p72853J985427
41551C684248J780684j937210m837644l867496L17265N702687R284918P174168
41543A7301620p12237q192189r786135p220006m450769j137538K950636L312120
$$ plain form
41535 -7934498 -9382700 -13376973 -13546256 -11939432 -16506545 -23520633 -17903304 1531891
41527 1531891 13316518 2435209 -16227738 -20007886 -11532725 -9127754 -13439062 -8519596
41519 -8519596 6547854 12834548 2126973 -10692224 -12876234 -10424359 -9968298 -4181537
41511 -4181537 11082724 22078898 16239719 3410938 834788 6459767 5205186 -4622106
41503 -4622106 -10089039 -6666259 -4451075 -9389733 -13803737 -10476144 -4008748 -2198337
41495 -2198337 -5196101 -8902335 -11809300 -12903113 -8665696 2030441 13695627 19410732
41487 19410732 17816255 12451317 7531049 6643303 11322630 17574176 17836859 10536357
41479 10536357 4222309 7327898 16513570 20947886 16784715 10863694 9297913 8943029
$$ packed form
41535g934498j448202l994273j69283J606824m567113p014088N617329J9435195
41527A531891J1784627j0881309j8662947l780148Q475161K404971m311308M919466
41519h519596J5067450O286694j0707575j2819197k184010K451875M56061N786761
41511d181537J5264261J0996174n839179j2828781k576150N624979j254581r827292
41503d622106n466933L422780K215184m938658m414004L327593O467396J810411
41495b198337k997764l706234k906965j093813M237417J0696137J1665186N715105
41487A9410732j594477n364938m920268q87746M679327O251546K62683p300502
41479A0536357o314048L105589R185672M434316m163171n921021j565781l54884
$$ plain form
41471 8943029 3868294 -4183876 -7166836 -1351358 7912022 12726907 10994752 7069571
41463 7069571 5977166 8238226 9532272 4977679 -5185695 -13836998 -12589738 -613135
41455 -613135 13003207 17392979 10698878 1817228 861461 8322806 14622961 10819930
41447 10819930 -1384109 -12016594 -14483376 -11480004 -8308906 -4839184 1675265 8961262
41439 8961262 11262849 7984687 4588769 4096246 3989385 3380865 6227918 13153145 16289815
41430 16289815 8811866 -4123773 -10778771 -7514950 -2076827 -2878041 -10276907 -18433661
41422 -18433661 -21208154 -15852368 -4749301 5827033 11259083 12688976 13672976 14742059
41414 14742059 14526183 13990973 14991089 16142988 14977098 12873472 12526804 11742239 6327166
$$ packed form
41471H943029n074735q052170k982960N815478R263380M814885j732155l925181
41463G069571j092405K261060J294046m554593j0163374q651303J247260J1976603
41455f13135J3616342M389772o694101q881650r55767P461345O300155l803031
41447A0819930j2204039j0632485k466782L003372L171098L469722O514449P285997
41439H961262K301587l278162l395918m92523j06861o08520K847053O925227L136670
41430A6289815p477949j2935639o654998L263821N438123q01214p398866q156754
41422a8433661k774493N355786J1103067J0576334N432050J429893R84000J069083
41414A4742059k15876n35210J000116J151899j165890k103626l46668p84565n415073
$$ plain form
41405 6327166 -915415 -1539152 6146362 12944077 10850112 3688874 824596 4305297
41397 4305297 7804597 6254179 1116480 -3677433 -6435959 -7159143 -5793047 -3542485
41389 -3542485 -4030319 -9694348 -16849956 -18169140 -12684642 -9795191 -17764034 -29974291
41381 -29974291 -30683942 -16002506 -184029 3976345 2128717 6742612 15424480 13759506
41373 13759506 -1998128 -18044258 -21300406 -14071149 -6509505 -3378362 -3448253 -4894657
41365 -4894657 -5491583 -2431653 3186111 5863339 3453575 771094 1793621 3629995
41357 3629995 2990716 3268121 8695955 15349647 15261161 7636070 -833149 -5928306 -9205980
41348 -9205980 -10885732 -7041520 2239541 7711469 878193 -12734488 -17742570 -8387594
$$ packed form
41405F327166p242581o23737P685514O797715k093965p161238k864278L480701
41397D305297L499300j550418n137699m793913k758526p23184J366096K250562
41389c542485m87834n664029p155608j319184N484498K889451p968843j2210257
41381b9974291p09651J4681436J5818477M160374j847628M613895Q681868j664974
41373A3759506j5757634j6046130l256148P229257P561644L131143o9891j446404
41365d894657n96926L059930N617764K677228k409764k682481J022527J836374
41357C629995o39279K77405N427834O653692q8486p625091q469219n095157l277674
41348i205980j679752L844212R281061N471928o833276j3612681n008082R354976
$$ plain form
41340 -8387594 3126262 3301184 -3803381 -4444067 1373465 -881326 -14485330 -21233971
41332 -21233971 -7673847 12185751 16311112 6676993 2239893 6325340 4531741 -5483451
41324 -5483451 -7615512 3216449 9841015 2741092 -1724889 9916051 21167960 9692891
41316 9692891 -15535911 -26052860 -14891287 -1295786 1567840 -726147 -3401685 -10573497
41308 -10573497 -19085356 -16053797 -943269 8172401 186144 -13059370 -17027370 -15968290
41300 -15968290 -20850715 -27837329 -24708042 -11888885 -1612522 1251163 3925541 11042252
41292 11042252 16824964 15106561 9026514 6211292 8423598 9930606 5242575 -3686903
41284 -3686903 -9238908 -7490599 -3787167 -6067677 -14094627 -19790075 -17662135 -9669119
$$ packed form
41340h387594J1513856J74922p104565o40686N817532k254791j3604004o748641
41332b1233971J3560124J9859598M125361r634119m437100M085447j793599j0015192
41324e483451k132061J0831961O624566p099923m465981J1640940J1251909j1475069
41316I692891k5228802j0516949J1161573J3595501K863626k293987k675538p171812
41308a0573497q511859L031559J5110528R115670p986257j3245514l968000J059080
41300a5968290m882425o986614L129287J2819157J0276363K863685K674378P116711
41292A1042252N782712j718403o080047k815222K212306J507008m688031q929478
41284c686903n552005J748309L703432k280510q026950n695448K127940P993016
$$ plain form
41276 -9669119 -37947 8386193 12217468 9306955 3991838 3084719 4942185 1346052
41268 1346052 -7074596 -8000518 4307211 18231363 20367234 12752230 5251655 -412914
41260 -412914 -7217505 -10497069 -3163033 9819702 15250405 9172860 -275482 -6017276
41252 -6017276 -7248170 -3375912 5241769 11283825 7459819 -587671 -872977 5580304
41244 5580304 6139476 -1625803 -5541108 41102 5439092 4632620 6324565 16116354
41236 16116354 23334831 18655096 11286962 13455007 19093535 14861399 3558764 -1458000
41228 -1458000 911149 628566 -3574792 -4174748 -2853670 -9157904 -20129099 -20348939
41220 -20348939 -6353065 6574252 7753673 4710396 5930065 5666870 -3837879 -17571680
$$ packed form
41276i669119R631172Q424140L831275k910513n315117r07119J857466l596133
41268A346052q420648r25922J2307729J3924152K135871p615004p500575n664569
41260d12914o804591l279564P334036J2982735N430703o077545r448342n741794
41252f017276j230894L872258Q617681O042056l824006q047490k85306O453281
41244E580304N59172p765279l915305N582210N397990q06472J691945R791789
41236A6116354P218477m679735p368134K168045N638528m232136j1302635n016764
41228a458000K369149k82583m203358n99956J321078o304234j0971195k19840
41220b0348939J3995874J2927317J179421l043277J219669k63195r504749j3733801
$$ plain form
41212 -17571680 -25874218 -27427095 -24793619 -16738434 -4610756 2691930 -5636 -5960351
41204 -5960351 -8253235 -10237439 -14573705 -12830147 623686 13654780 11091388 -1983756
41196 -1983756 -7973087 -3271927 135929 -2816146 -4494867 -2362102 -4510723 -12674057
41188 -12674057 -15876019 -8508167 -1133912 -4026154 -10740761 -8410268 3250301 13539091
41180 13539091 16699888 16871489 19079653 22781195 24415220 21790474 15717730 9505315
41172 9505315 6212560 5555799 5005878 3640295 2099327 -486757 -5163579 -8984506
41164 -8984506 -7377889 -1403543 2438031 763937 -3167727 -5632710 -7297490 -10446915
41156 -10446915 -15510254 -21248525 -24653786 -21155443 -9758258 2809794 8693752 8666035
$$ packed form
41212a7571680q302538j552877K633476Q055185J2127678P302686k697566n954715
41204e960351k292884j984204m336266J743558J3453833J3031094k563392j3075144
41196a983756n989331M701160L407856k952075j678721K132765k148621q163334
41188a2674057l201962P367852P374255k892242o714607K330493J1660569J0288790
41180A3539091L160797J71601K208164L701542J634025k624746o072744o212415
41172I505315l292755o56761n49921j365583j540968k586084m676822l820927
41164h984506J606617N974346L841574j674094l931664k464983j664780l149425
41156a0446915n063339n738271l405261L498343J1397185J2568052N883958k7717
$$ plain form
41148 8666035 9035555 10578046 8829465 4383088 2997412 4780756 3393903 -2372365
41140 -2372365 -6521221 -7325691 -9736837 -13445282 -10675389 -478441 7094161 6987367
41132 6987367 6606976 9894202 7483948 -6572462 -20554748 -20809680 -12002871 -7630749
41124 -7630749 -8508125 -5886483 243584 2220161 672342 3578129 10463428 12313517
41116 12313517 7693985 5249624 8557555 11197943 9429116 8049024 10117002 11029909
41108 11029909 6750864 -363035 -6816853 -11366965 -11423965 -4420375 5293863 9261297
41100 9261297 6497100 3871829 3693095 1022297 -4100815 -3168374 6592968 14928576
41092 14928576 13097675 7258025 8512712 16026376 19778054 16364484 12409723 13119426
$$ packed form
41148H666035L69520J542491j748581m446377j385676J783344j386853n766268
41140b372365m148856q04470k411146l708445K769893J0196948P572602j06794
41132F987367l80391L287226k410254j4056410j3982286k54932Q806809M372122
41124g630749q77376K621642O130067J976577j547819K905787O885299J850089
41116A2313517m619532k444361L307931K640388j768827j380092K067978R12907
41108A1029909m279045p113899o453818m550112n7000P003590R714238L967434
41100I261297k764197k625271j78734k670798n123112R32441R761342Q335608
41092A4928576j830901n839650J254687P513664L751678l413570l954761P09703
$$ plain form
41084 13119426 15575755 14529167 9013547 1606350 -4655067 -6914798 -3299683 4629787
41076 4629787 11799035 14013910 12060170 9971270 9353578 7500270 2171497 -4301792
41068 -4301792 -8590811 -11775703 -16338771 -19143213 -14183176 -2722097 7020777 11929704
41060 11929704 16778943 22016607 19924839 9314185 2174887 5490832 7630431 -3438894
41052 -3438894 -18274127 -19641066 -10711258 -8969881 -15513393 -13521878 990867 10543786
41044 10543786 5340583 -987380 3911134 10434283 6188967 -664410 4451314 16677920
41036 16677920 19192418 9518566 376549 -1418482 152063 3933760 12872147 21239415
41028 21239415 17098738 1487829 -8669027 -2643288 10080528 14284253 8451847 2338405
$$ packed form
41084A3119426K456329j046588n515620p407197o261417k259731L615115P929470
41076D629787P169248K214875j953740k088900o17692j853308n328773o473289
41068d301792m289019l184892m563068k804442M960037J1461079R742874M908927
41060A1929704M849239N237664k091768j0610654p139298L315945K139599j1069325
41052c438894j4835233j366939Q929808J741377o543512J991515J4512745R552919
41044A0543786n203203o327963M898514O523149m245316o853377N115724J2226606
41036A6677920K514498r673852r142017j795031J570545L781697Q938387Q367268
41028B1239415m140677j5610909j0156856O025739J2723816M203725n832406o113442
$$ plain form
41020 2338405 1821994 4433546 6741351 8721543 10795884 11449524 9361880 6077676
41012 6077676 5457787 10138513 17811566 21447760 15325931 2049367 -7660326 -4182418
41004 -4182418 11178823 26416508 30234368 22978491 14165412 9463003 4862341 -3713624
40996 -3713624 -10966554 -9294403 -1526287 2638104 1770907 4059498 12332619 18654244
40988 18654244 17772327 15376499 16689305 16756696 10871489 6238506 11996898 22892816
40980 22892816 24867268 14946774 4600356 3055752 6854039 7963133 4738593 1894276
40972 1894276 4187988 11745266 18592690 16527107 4278060 -8593490 -11399548 -4252867
40964 -4252867 4350771 9021186 9952769 6513327 -2485665 -11740360 -11804618 -1490505
$$ packed form
41020B338405n16411K611552K307805J980192K074341O53640k087644l284204
41012F077676o19889M680726P673053L636194o121829j3276564r709693L477908
41004d182418J5361241J5237685L817860p255877q813079m702409m600662q575965
40996c713624p252930J672151P768116M164391q67197K288591Q273121O321625
40988A8654244q81917k395828J312806O7391n885207m632983N758392J0895918
40980B2892816J974452r920494j0346418j544604L798287J109094l224540k844317
40972A894276K293712P557278O847424k065583j2249047j2871550k806058P146681
40964d252867Q603638M670415R31583l439442q998992r254695o4258J0314113
$$ plain form
40956 -1490505 9351598 12914521 12588808 14608384 16854350 12752406 2815749 -4980327
40948 -4980327 -5814094 -2807549 87852 4578792 13639320 23862917 27753636 23843174
40940 23843174 19181750 18919718 18122712 9518164 -3659463 -10546174 -8482296 -7303351
40932 -7303351 -14313367 -22641667 -20818444 -8760924 2863643 6243745 2712284 -2630164
40924 -2630164 -5766559 -3631353 4387914 13190470 14764117 6616469 -4776322 -10330912
40916 -10330912 -7035537 171918 4305535 3451119 1364078 1120504 1192389 271759 1753774
40907 1753774 7304285 9603117 1299276 -9959250 -7743048 9620382 24866600 26460995
40899 26460995 23681470 28124564 33714182 28758464 17531645 13722167 18860638 23297945
$$ packed form
40956a490505J0842103L562923l25713K019576K245966m101944r936657p796076
40948d980327q33767L006545K895401M490940R060528J0223597L890719l910462
40940B3843174m661424k62032p97006q604548j3177627o886711K063878J178945
40932g303351p010016q328300J823223J2057520J1624567L380102l531461n342448
40924b630164l136395K135206Q019267Q802556J573647q147648j1392791n554590
40916a0330912L295375P207455M133617q54416k087041k43574P1885r20630J482015
40907A753774N550511K298832q303841j1258526K216202J7363430J5246218J594395
40899B6460995k779525M443094N589618m955718j1226819l809478N138471M437307
$$ plain form
40891 23297945 24188770 26243208 27461845 21110718 11261879 9351743 13960206 11110849
40883 11110849 -1771187 -9198095 -1347570 10954662 13658484 8735898 5928703 6044801
40875 6044801 3745866 -212393 75253 6510021 15879301 23983587 26295457 20214097
40867 20214097 10990342 8490689 13337850 14138738 4185067 -7677497 -10332436 -6272417
40859 -6272417 -4665787 -5110118 584274 13517123 24587594 25558425 16208648 1743746
40851 1743746 -10833748 -15255675 -10473948 -1865385 5149362 9970417 12994998 12481661
40843 12481661 9424696 9324629 13292728 13515920 4514717 -7123657 -12433263 -13624886
40835 -13624886 -17872864 -22121013 -16232844 -332072 12319676 11560310 1016753 -8993720
$$ packed form
40891B3297945Q90825K054438J218637o351127r848839j910136M608463k849357
40883A1110849j2882036p426908P850525J2302232K703822m922586k807195J16098
40875F044801k298935l958259K87646O434768R369280Q104286K311870o081360
40867B0214097r223755k499653M847161Q00888r953671j1862564k654939M060019
40859f272417J606630m44331N694392J2932849J1070471R70831r349777j4464902
40851A743746j2577494m421927M781727Q608563P014747M821055L024581n13337
40843A2481661l056965j00067L968099K23192r001203j1638374n309606j191623
40835a3624886m247978m248149N888169J5900772J2651748p59366j0543557j0010473
$$ plain form
40827 -8993720 -12115444 -8364693 -2468479 -1036815 -6105766 -11485455 -10577773 -6066757
40819 -6066757 -5060194 -6586642 -2918415 6888861 14521432 15270062 14149436 16024271
40811 16024271 18192135 17169313 15296123 15289886 14451531 9938900 4866292 3665904 5400926
40802 5400926 6841824 8591062 12924607 18482818 22260545 24592635 27299813 28929563
40794 28929563 26903626 22947558 21193675 21571622 20356978 17624281 18922200 27488998
40786 27488998 38530756 43801186 39744864 29471003 19094982 14146884 16903344 23656363
40778 23656363 25926582 18605595 7084522 2058179 6017457 9708181 5237482 -2064057
40770 -2064057 -903503 9631416 18642109 18174719 11563912 5290146 563205 -2967875
$$ packed form
40827h993720l121724L750751N896214J431664n068951n379689R07682M511016
40819f066757J006563j526448L668227R807276P632571P48630j120626J874835
40811A6024271K167864j022822j873190o237q38355m512631n072608j200388J735022
40802E400926J440898J749238M333545N558211L777727K332090K707178J629750
40794B8929563k025937l956068j753883L77947j214644k732697J297919Q566798
40786B7488998J1041758N270430m056322j0273861j0376021m948098K756460O753019
40778B3656363K270219p320987j1521073n026343L959278L690724m470699p301539
40770b064057J160554J0534919R010693m67390o610807o273766m726941l531080
$$ plain form
40762 -2967875 -2603113 2301282 6804117 8803103 14939677 29138645 40366360 33872739
40754 33872739 13314187 -879693 2615280 13234803 15938343 10623461 7002792 8873409
40746 8873409 12891307 17476153 23021869 25775234 20671032 10027588 2112368 920770
40738 920770 3709970 8183062 14564773 19867456 18816297 13989015 16770922 31606843
40730 31606843 45404053 41585837 22254002 7139193 9700330 22560514 29823202
40723 29823202 26435497 19365279 14688580 11782680 9417295 9833153 14072357 18260136
40715 18260136 18351113 16134361 17094778 23197936 30575347 34631995 35544635 37373974 42043313
40706 42043313 45954592 44586592 39836714 38900514 43910520 46944623 40202000 28303922
$$ packed form
40762b967875L64762M904395M502835J998986O136574J4198968J1227715o493621
40754C3872739k0558552j4193880L494973J0619523K703540n314882l620669J870617
40746H873409M017898M584846N545716K753365n104202j0643444p915220j191598
40738I20770K789200M473092O381711N302683j051159m827282K781907J4835921
40730C1606843J3797210l818216j9331835j5114809K561137J2860184P262688
40723B9823202l387705p070218m676699k905900k365385M15858M239204M187779
40715A8260136R0977k216752R60417O103158P377411M056648R12640J829339M669339
40706D2043313L911279j368000m749878r36200N010006L034103o742623j1898078
$$ plain form
40698 28303922 23591685 29633570 36923620 36827028 32373359 30985194 32837733 32754022 29811500
40689 29811500 28413649 31268829 36641284 41932268 45803701 47328722 46445705 44536424
40681 44536424 42140706 38188603 34273140 36173361 46182670 56674693 57689375 49981984
40673 49981984 44213891 46966182 53717540 57085737 56249173 55275018 56374558 58432164
40665 58432164 59900388 59991777 57957320 53746677 49870368 51148453 60453506 73463498
40657 73463498 79881761 73996978 63358768 61107624 68742846 74117395 69968417 65342839
40649 65342839 70979177 81511066 83687640 77033122 72770607 74315054 73619123 68450146
40641 68450146 68528357 79009687 90488181 93058241 90062677 89476818 90617889 89240569
$$ packed form
40698B8303922m712237O041885P290050r6592m453669j388165J852539q3711k942522
40689B9811500j397851K855180N372455N290984L871433J525021q83017j909281
40681D4536424k395718l952103l915463J900221J0009309J0492023J014682p707391
40673D9981984n768093K752291O751358L368197q36564r74155J099540K057606
40665E8432164J468224R1389k034457m210643l876309J278085R305053J3009992
40657G3463498O418263n884783j0638210k251144P635222N374549m148978m625578
40649F5342839N636338J0531889K176574o654518m262515J544447o95931n168977
40641F8450146P8211J0481330J1478494K570060k995564n85859J141071j377320
$$ plain form
40633 89240569 88899008 96278341 108894807 117336136 118192043 116860598 118717260 124261515
40625 124261515 131831076 139053933 142794229 142969217 144646083 151271389 158569781 161135747
40617 161135747 161971614 167911165 177778226 183940295 185290608 189447221 200054348 210376224
40609 210376224 213809824 214476001 221729423 237057815 251175902 254099352 246345008 239641187
40601 239641187 245419066 261916765 275577263 277485936 274038290 276423141 284429442 289344553
40593 289344553 290060253 294825446 305798187 313396141 310801625 304358021 302909245 304813927
40585 304813927 303341248 298572877 295419512 294580120 293955226 294861663 297696023 295118100
40577 295118100 280492017 261515249 253539107 258225491 260649633 251084480 238067069
$$ packed form
40633H9240569l41561P379333J2616466Q441329Q55907j331445J856662N544255
40625A24261515P569561P222857L740296J74988J676866O625306P298392K565966
40617A61135747Q35867N939551R867061O162069J350313M156613J0607127J0321876
40609B10376224L433600O66177P253422J5328392J4118087K923450p754344o703821
40601B39641187N777879J6497699J3660498J908673l447646K384851Q006301M915111
40593B89344553P15700M765193J0972741P597954k594516o443604j448776J904682
40585C04813927j472679m768371l153365q39392o24894R06437K834360k577923
40577B95118100j4626083j8976768p976142M686384K424142r565153j3017411
$$ plain form
40570 238067069 233410311 234547962 231161579 221983686 214177115 210048549 205041195 197510358
40562 197510358 190870325 185861478 179133134 170392296 163331439 158357741 151804819 143614575
40554 143614575 137987879 134529675 127242926 115632942 108110345 109171433 111243239 106031897
40546 106031897 97024260 92757316 93299759 92228035 87930123 83830367 80080208 74083739
40538 74083739 67837026 66154067 68176367 68464114 66016494 64658734 65031526 63826587
40530 63826587 60538106 57453029 53765980 47675145 43134773 45603819 52174029 55480985
40522 55480985 55686994 57267158 56244478 45702096 33450390 35474215 48235474 48294747
40514 48294747 28282727 12185313 20361650 38681221 42291190 34234209 35794964 48501674
$$ packed form
40570B38067069m656758J137651l386383r177893p806571m128566n007354p530837
40562A97510358o640033n008847o728344q740838p060857m973698o552922q190244
40554A43614575n626696l458204p286749j1609984p522597J061088K071806n211342
40546A06031897r007637m266944N42443j071724m297912m099756l750159n996469
40538G4083739o246713j682959K022300K87747k447620j357760L72792j204939
40530F3826587l288481l085077l687049o090835m540372K469046O570210L306956
40522E5480985K06009J580164j022680j0542382j2251706K023825J2761259N9273
40514D8294747k0012020j6097414Q176337J8319571L609969q056981J560755J2706710
$$ plain form
40506 48501674 53023212 43067319 34117013 35512668 37346379 32040723 28706249 35962191
40498 35962191 46080728 46960386 38638789 29014348 22457921 19786753 20906393 21741287
40490 21741287 17077868 10595868 12150214 21484544 26787204 24116125 24000477 31318302
40482 31318302 33985791 23205145 10786656 11097557 17176558 12701078 -3277 -3494426
40474 -3494426 6307792 14596061 12403944 9492404 16525357 27704059 29644534 19736237
40466 19736237 8149946 5289912 11861847 19329487 18208958 7501346 -4263247 -8910356
40458 -8910356 -6892035 -2842992 2439352 9689790 14987958 13784219 8760295 5838839
40450 5838839 4461596 295465 -4278140 -2226363 5997761 12502582 14773005 17911534
$$ packed form
40506D8501674M521538r955893q950306J395655J833711n305656l334474P255942
40498C5962191J0118537Q79658q321597r624441o556427k671168J119640Q34894
40490B1741287m663419o482000J554346R334330N302660k671079j15648P317825
40482C1318302K667489j0780646j2418489L10901O079001m475480j2704355l491149
40474c494426R802218Q288269k192117k911540P032953J1178702J940475r908297
40466A9736237j1586291k860034O571935P467640j120529j0707612j1764593m647109
40458h910356K018321M049043N282344P250438N298168j203739n023924k921456
40450E838839j377243m166131m573605K051777Q224124O504821K270423L138529
$$ plain form
40442 17911534 22372151 21029930 12906258 8686247 15141888 22914043 19030074 5763817
40434 5763817 -2687708 322029 6704874 6306678 13802 -2412975 5348455 18379660
40426 18379660 25441255 21699617 14710479 14970293 22086231 25404797 18569811 7681704
40418 7681704 3004004 7667485 17223450 25729256 29168121 26924986 23139807 23202669
40410 23202669 26316963 25444200 17423679 8751906 7445744 12884024 17993843 18564091
40402 18564091 16084013 13585119 12826165 14230533 16243223 15690940 11013550 3994042
40394 3994042 -2558871 -6140496 -3094499 9001202 24803645 32608054 27421814 18694225
40386 18694225 18996284 27455418 31020571 21826801 7211997 557935 6026057 15094804
$$ packed form
40442A7911534M460617j342221q123672m220011O455641P772155l883969j3266257
40434E763817q451525L009737O382845l98196o292876k426777P761430J3031205
40426A8379660P061595l741638o989138K59814P115938L318566o834986j0888107
40418G681704m677700M663481R555965Q505806L438865k243135l785179O2862
40410B3202669L114294q72763q020521q671773j306162N438280N109819N70248
40402A8564091k480078k498894p58954J404368K012690n52283m677390p019508
40394C994042o552913l581625L045997J2095701J5802443P804409n186240q727589
40386A8694225L02059Q459134L565153r193770j4614804o654062N468122R068747
$$ plain form
40378 15094804 16997972 10501092 4324312 6177287 13569593 17538651 13552579 5121795
40370 5121795 -2002183 -4551126 -1650910 4354348 7507681 5082628 4178376 13146949
40362 13146949 26326204 28221352 15762670 4363014 5824765 12384139 12047868 8450382
40354 8450382 12396564 21958721 26051116 23229761 21933396 23939922 22169250 15423006
40346 15423006 11735518 14582957 17613511 16504534 15616404 18739433 22087418 20876242
40338 20876242 15968365 10702051 7101254 6982860 10439334 12262016 7039000 -1310522
40330 -1310522 -2784565 4881857 13399974 15604365 11733773 4072366 -4742364 -7471059
40322 -7471059 2174101 17398528 23280023 16903449 10641566 12034885 14182729 11655827
$$ packed form
40378A5094804J903168o496880o176780J852975P392306L969058l986072q430784
40370E121795p123978k548943K900216O005258L153333k425053r04252Q968573
40362A3146949J3179255J895148j2458682j1399656J461751O559374l36271l597486
40354H450382L946182R562157M092395k821355j296365K006526j770672o746244
40346A5423006l687488K847439L030554j108977q88130L123029L347985j211176
40338B0876242m907877n266314l600797j18394L456474J822682n223016q349522
40330a310522j474043P666422Q518117K204391l870592p661407q814730k728695
40322g471059R645160J5224427N881495o376574o261883J393319K147844k526902
$$ plain form
40314 11655827 11090018 17136074 21952874 19980230 20275264 30624935 40643915 36256366
40306 36256366 22183510 13535755 12063290 8646428 4690524 11326829 27391967 36856518
40298 36856518 31955879 23330223 22341791 27217924 32555460 39570899 48831547 53120459
40290 53120459 46828575 35922507 30641003 32729017 36046302 35840845 31907596 25769769
40282 25769769 19708131 16613168 17282838 19323657 20366701 20010793 17752040 12598998
40274 12598998 6183358 2713059 4142178 8209298 12093308 15011646 17052457 19005129
40266 19005129 23123621 29763404 33587354 28358314 15876760 4817127 104797 -951867
40258 -951867 -1313550 454554 5415854 10695349 13393035 13466357 11039918 5879654 971568
$$ packed form
40314A1655827n65809O046056M816800j972644K95034J0349671J0018980m387549
40306C6256366j4072856q647755j472465l416862l955904O636305J6065138R464551
40298C6856518m900639q625656r88432M876133N337536P015439R260648M288912
40290E3120459o291884j0906068n281504K088014L317285k05457l933249o137827
40282B5769769o061638l094963O69670K040819J043044l55908k258753n153042
40274A2598998o415640l470299J429119M067120L884010K918338K040811J952672
40266A9005129M118492O639783L823950n229040j2481554j1059633m712330j056664
40258i51867l61683J768104M961300N279495K697686P3322k426439n160264m908086
$$ plain form
40249 971568 912847 4882147 6997174 5437405 4700231 6541897 6031388 317447 -5607163
40240 -5607163 -6268917 -2391605 4072773 14361897 26764526 33347813 30176740 24697231
40232 24697231 24826910 26193169 19719713 7721870 1422398 3885864 6536550 4015059
40224 4015059 2290812 7782097 16172890 18161340 12297722 6313413 6531022 10139357
40216 10139357 9607208 3282373 -1449890 2018216 8625909 6429127 -6443248 -16507392
40208 -16507392 -11539299 3117741 12003581 9491121 3695933 2105178 2867574 1884801
40200 1884801 -211070 -2321733 -7463504 -17459379 -27021527 -28873518 -23213721 -17188217
40192 -17188217 -14970008 -12661965 -5088697 5145722 9602574 5736385 2381046 8967424
$$ packed form
40249I71568n8721L969300K115027j559769p37174J841666n10509n713941n924610
40240e607163o61754L877312O464378J0289124J2402629O583287l171073n479509
40232B4697231J29679J366259o473456j1997843o299472K463466K650686k521491
40224D015059j724247N491285Q390793J988450n863618n984309K17609L608335
40216A0139357n32149o324835m732263L468106O607693k196782j2872375j0064144
40208a6507392M968093J4657040Q885840k512460n795188j590755P62396r82773
40200A884801k095871k110663n141771r995875r562148j851991N659797O025504
40192a7188217K218209K308043P573268J0234419M456852l866189l355339O586378
$$ plain form
40184 8967424 21296371 24978251 14380333 785686 -2776504 1756048 3036492 -2150558
40176 -2150558 -5912897 -2191965 5879630 11903876 12402253 6703956 -2548262 -8409847
40168 -8409847 -6050488 -440800 -255093 -4269035 -3275571 3456403 5367318 -1536174
40160 -1536174 -6267005 -300261 7520130 4681294 -4823113 -7224627 -421359 5488011
40152 5488011 6404536 8158661 11834197 9798329 196370 -7403226 -6577617 -3331949
40144 -3331949 -4305644 -5765147 -2224888 2832156 3988909 4286317 8607691 12601653
40136 12601653 9004621 888554 -2329469 664758 3449429 4506009 7774501 11257608
40128 11257608 7438096 -3356967 -11575588 -12863309 -12552230 -12954255 -8754272 40243
$$ packed form
40184H967424J2328947L681880j0597918j3594647l562190M532552J280444n187050
40176b150558l762339L720932Q071595O024246M98377n698297r252218n861585
40168h409847K359359N609688J85707m013942R93464O731974J910915o903492
40160a536174m730831N966744P820391k838836r504407k401514O803268N909370
40152E488011R16525J754125L675536k035868r601959p599596Q25609L245668
40144c331949r73695j459503L540259N057044J156753K97408M321374L993962
40136A2601653l597032q116067l218023K994227K784671J056580L268492L483107
40128A1257608l819512j0795063q218621j287721L11079m02025M199983Q794515
$$ plain form
40120 40243 3647065 -1314607 -3476748 5497089 15904282 14812121 6327716 3216017
40112 3216017 5836461 4695377 -1295273 -5125170 -6942866 -12480178 -17783915 -12927635
40104 -12927635 -1737968 192182 -9234469 -13214967 -2194315 11904819 16618696 17534997
40096 17534997 23524823 27851815 19809193 5095576 -1905401 116746 880310 -2423588
40088 -2423588 -2670980 2228865 5713269 4353571 1923117 1099033 788571 1628049 4993685
40079 4993685 7249152 4136179 -499236 -257500 1492782 -3340653 -11309878 -10159250
40071 -10159250 632467 6804828 1612961 -3019264 4274795 16076277 17827437 8910573
40063 8910573 720649 -551910 1873083 4956435 8959578 11752509 9189954 2524305
$$ packed form
40120D0243L606822m961672k162141Q973837J0407193j092161q484405l111699
40112C216017K620444j141084n990650l829897j817696n537312n303737M856280
40104a2927635J1189667J930150r426651l980498J1020652J4099134M713877R16301
40096A7534997N989826M326992q042622j4713617p000977K022147P63564l303898
40088b423588k47392M899845L484404j359698k430454q24084l10462Q39478L365636
40079D993685K255467l112973m635415K41736J750282m833435p969225J150628
40071a0159250J0791717O172361n191867m632225P294059J1801482J751160q916864
40063H910573q189924j272559K424993L083352M003143K792931k562555o665649
$$ plain form
40055 2524305 -1165228 2193949 8734946 11764295 8713237 2498971 -1461184 617426
40047 617426 7587489 13866532 14270314 8145038 -1229337 -9553925 -13605768 -13018329 -10758154
40038 -10758154 -9471572 -7482001 -2038263 3844412 3601558 -2514881 -5933537 -1856568
40030 -1856568 3618131 3113032 -1422184 -3639351 -2678059 -1017139 2298382 7476300
40022 7476300 7339392 -4141137 -18430107 -19504536 -5587666 7683886 9008237 4727445
40014 4727445 4546830 5425746 -171215 -8444540 -9572132 -4595262 -3470273 -6831650
40006 -6831650 -3350294 11092173 23716854 21593271 9214181 629788 365467 2089922
39998 2089922 2602006 6033645 13485388 17824527 12445544 -215086 -11635735 -15014867
$$ packed form
40055B524305l689533L359177O540997L029349l051058o214266l960155K078610
40047F17426O970063O279043M03782o125276r374375q324588m051843N87439K260175
40038a0758154J286582J989571N443738N882675k42854o116439l418656M076969
40030a856568N474699n05099m535216k217167R61292J660920L315521N177918
40022G476300j36908j1480529j4288970j074429J3916870J3271552J324351m280792
40014D727445j80615Q78916n596961q273325j127592M976870J124989l361377
40006f831650L481356J4442467J2624681k123583j2379090q584393k64321J724455
39998B089922N12084L431639P451743M339139n378983j2660630j1420649l379132
$$ plain form
39990 -15014867 -9369228 -272528 3164343 -2620285 -9120135 -4702921 8897798 16783269
39982 16783269 10406210 -1373907 -5780519 -2830427 -1276271 -4095603 -6947840 -7651729
39974 -7651729 -8695099 -11597000 -15160148 -17788066 -16582125 -7663984 6559377 14802273
39966 14802273 9430413 -2022480 -6380289 -2334353 1241770 1026900 1303461 1762283
39958 1762283 -3391273 -12658611 -16278854 -11363702 -6466934 -7191259 -8693682 -7329284
39950 -7329284 -7967453 -12737447 -13237651 -2926756 10853307 16107630 11291910 3724825
39942 3724825 -1054732 -1343502 3162136 8781704 8645160 2616094 103336 6563209
39934 6563209 14672601 16285392 14671046 15525321 14598908 6614254 -528216 4989059
$$ packed form
39990a5014867N645639R096700L436871n784628o499850M417214J3600719P885471
39982A6783269o377059j1780117m406612K950092J554156k819332k852237p03889
39974g651729j043370k901901l563148k627918J205941Q918141J4223361Q242896
39966A4802273n371860j1452893m357809M045936L576123k14870K76561M58822
39958A762283n153556r267338l620243M915152M896768p24325j502423J364398
39950g329284o38169m769994n00204J0310895J3780063N254323m815720p567085
39942C724825m779557k88770M505638N619568j36544o029066k512758O459873
39934F563209Q109392J612791j614346Q54275r26413p984654p142470N517275
$$ plain form
39926 4989059 19108903 25697214 18871893 8364811 2872507 924525 -541741 -674102
39918 -674102 -226744 -2003584 -3351353 2010363 12578994 19341551 19555660 19820717 22512803
39909 22512803 20338923 9488328 -2034563 -5902139 -4832862 -5402124 -6827339 -4796131
39901 -4796131 -936499 -355936 -3054350 -4821233 -4606100 -5069875 -7085358 -8605479 -8505342
39892 -8505342 -8089819 -9060415 -11858985 -15192171 -16441987 -14272216 -10998079 -9894273
39884 -9894273 -10557669 -10394697 -9809437 -10889977 -11543889 -7591323 -1361781 -653445 -6870283
39875 -6870283 -11939426 -10735446 -8766654 -11935848 -15804373 -12734340 -4732080 -653607
39867 -653607 -3185777 -6824468 -8105452 -10031625 -14755402 -18242369 -15864542 -9767454
$$ packed form
39926D989059J4119844O588311o825321j0507082n492304j947982j466266j32361
39918f74102M47358j776840j347769N361716J0568631O762557K14109K65057K692086
39909B2512803k173880j0850595j1522891l867576J069277n69262j425215K031208
39901d796131L859632N80563k698414j766883K15133m63775k015483j520121J00137
39892h505342M15523r70596k798570l333186j249816K169771L274137J103806
39884i894273o63396J62972N85260j080540o53912L952566O229542P08336o216838
39875f870283n069143J203980J968792l169194l868525L070033Q002260M078473
39867f53607k532170l638691j280984j926173m723777l486967K377827O097088
$$ plain form
39859 -9767454 -6548049 -8379453 -10046007 -6376018 74414 2824720 2100662 5170336
39851 5170336 13419717 16576757 6954619 -6397988 -8050617 2381002 10714481 9045527
39843 9045527 3224295 -1645498 -8645823 -16977953 -16785040 -5087436 4966562 1965746
39835 1965746 -5927461 -3291653 9212799 16650474 11006262 -1249290 -10633374 -13405354
39827 -13405354 -10316174 -5502498 -5265040 -10647299 -13907259 -9130045 -1541657 1712865
39819 1712865 3515059 8790663 11556915 4331330 -4681452 -1123509 10748647 11644063
39811 11644063 -2872268 -15472170 -15212518 -13062661 -19499734 -24478913 -14638631 2422591
39803 2422591 8090763 -190075 -7619726 -4555828 3442197 7516392 6368823 4168062
$$ packed form
39859i767454L219405j831404j666554L669989O450432K750306p24058L069674
39851E170336Q249381L157040r622138j3352607j652629J0431619Q333479j668954
39843I045527n821232m869793p000325q332130J92913J1697604J0053998l000816
39835A965746p893207K635808J2504452P437675n644212j2255552r384084k771980
39827a3405354L089180M813676K37458n382259l259960M777214P588388L254522
39819A712865J802194N275604K766252p225585r012782L557943J1872156Q95416
39811A1644063j4516331j2599902K59652K149857o437073m979179R840282J7061222
39803B422591N668172q280838p429651L063898P998025M074195j147569k200761
$$ plain form
39795 4168062 5105076 10273419 15093874 12377343 2915698 -1916707 4762589 13310820
39787 13310820 10519003 25972 -2814902 5272112 10946098 5813557 -1181327 491148
39779 491148 5957211 3561394 -6378082 -12444912 -9510387 -5058697 -6373719 -9438538
39771 -9438538 -5787216 3789852 9172946 4881774 -1912751 -1402539 4746892 5992490
39763 5992490 -1296507 -8683185 -8763464 -5412896 -5297757 -6115371 -1959505 4123508 3595668
39754 3595668 -2730590 -4304982 2613130 8107720 3220509 -6642943 -9677914 -3660867
39746 -3660867 3345014 5294017 3911431 2650570 1246393 -1838825 -5566045 -7597974
39738 -7597974 -7666488 -7301705 -6550471 -3217817 3213925 8411070 7131751 778088 -2725566
$$ packed form
39795D168062R37014N168343M820455k716531r461645m832405O679296Q548231
39787A3310820k791817j0493031k840874Q087014N673986n132541o994884J672475
39779D91148N466063k395817r939476o066830K934525M451690j315022l064819
39771i438538L651322R577068N383094m291172o794525N10212O149431J245598
39763E992490p288997p386678q0279L350568J15139q17614M155866O083013n27840
39754C595668o326258j574392O918112N494590m887211r863452l034971O017047
39746c660867P005881J949003j382586j260861j404177l085218l727220k031929
39738g597974o8514L64783P51234L332654O431742N197145j279319o353663l503654
$$ plain form
39729 -2725566 1195837 7623319 9330449 6422323 3601141 1090488 -4318490 -10577096
39721 -10577096 -11234588 -5779035 -744669 1576510 6654511 15888002 20223267 12682255
39713 12682255 294813 -5241699 -4219425 -6552054 -14472770 -17229537 -5201957 16836627
39705 16836627 33331196 32100502 14538283 -5634645 -14133059 -8950311 -528741 2073109
39697 2073109 1261454 3793803 8643179 8910724 3246843 -2303159 -3455455 -2042047
39689 -2042047 -1090801 -1509429 -3705532 -6890956 -7480190 -4506585 -5189709 -16395637 -30584008
39680 -30584008 -30873572 -13338881 5677979 9671011 327606 -10510603 -17855494 -22882547
39672 -22882547 -22538975 -12610651 1031361 6098579 76796 -6499104 -4983042 1356493
$$ packed form
39729b725566L921403O427482J707130k908126k821182k510653n408978o258606
39721a0577096o57492N455553N034366K321179N078001R233491M335265p541012
39713A2682255j2387442n536512J022274k332629p920716k756767J2027580K2038584
39705A6836627J6494569j230694j7562219k0172928q498414N182748Q421570K601850
39697B073109q11655K532349M849376K67545n663881n550002j152296J413408
39689b042047R51246m18628k196103l185424n89234K973605o83124j1205928j4188371
39680c0584008k89564J7534691J9016860L993032r343405j0838209p344891n027053
39672b2882547L43572R928324J3642012N067218o021783o575900J516062O339535
$$ plain form
39664 1356493 5046646 4303210 619921 -6853727 -17811788 -25568889 -22800933 -11975434
39656 -11975434 -3990994 -5261784 -10871897 -12517958 -9003479 -5302472 -4191307 -3889363
39648 -3889363 -3422998 -5025194 -9304069 -12097327 -9421459 -3314502 305223 -1676667
39640 -1676667 -7160681 -11409051 -10218731 -3296023 2987208 -131953 -12567881 -21915959
39632 -21915959 -16945504 -1934811 8940310 9217650 4310521 -444066 -6129750 -13201424
39624 -13201424 -17349292 -16001695 -11812345 -6631902 1029742 9771511 14031501 12219208
39616 12219208 8664536 4968322 -1329093 -6397352 -505547 14657504 21460547 9387652
39608 9387652 -8088096 -11990670 -3878061 936417 -1500815 -2279965 1048880 1322104
$$ packed form
39664A356493L690153p43436l683289p473648j0958061p757101K767956J0825499
39656a1975434P984440j270790n610113j646061L514479L701007J111165L01944
39648c889363M66365j602196m278875k793258K675868O106957L619725j981890
39640a676667n484014m248370J190320O922708O283231l119161j2435928r348078
39632b1915959M970455J5010693J0875121K77340m907129m754587n685684p071674
39624a3201424m147868J347597M189350N180443P661644Q741769M259990j812293
39616A2219208l554672l696214o297415n068259N891805J5163051O803043j2072895
39608I387652j7475748l902574Q112609M814478k437232p79150L328845K73224
$$ plain form
39600 1322104 -2587907 -3411323 -403926 -1533304 -7895145 -10070392 -3812527 3900977
39592 3900977 8555404 14400164 22009371 23318571 16182263 10882363 13406670 14400834
39584 14400834 5277821 -5581899 -5238237 3664515 8620641 7246284 7764259 12740415
39576 12740415 15790199 14085712 12266656 12678713 12029863 9847655 10813367 15235047
39568 15235047 15528199 7425357 -1399401 -315616 9693339 16745971 13245337 5029552
39560 5029552 2722309 7408204 10064307 5161662 -1108117 298544 8904677 16725588
39552 16725588 19062088 16380168 8491749 -3837468 -12563830 -8608313 3730883 9387662
39544 9387662 3194998 -2853844 1524582 9686493 9951142 3282653 -1155328 -1003975
$$ packed form
39600A322104l910011q23416L007397j129378o361841k175247O257865P713504
39592C900977M654427N844760P609207J309200p136308n299900K524307R94164
39584A4400834r123013j0859720L43662Q902752M956126j374357N17975M976156
39576A2740415L049784j704487j819056M12057o48850k182208R65712M421680
39568A5235047K93152q102842q824758J083785J0008955P052632l500634q215785
39560E029552k307243M685895K656103m902645o269779J406661Q606133P820911
39552A6725588K336500k681920p888419j2329217q726362L955517J2339196N656779
39544I387662o192664o048842M378426Q161911K64649o668489m437981J51353
$$ plain form
39536 -1003975 -226650 1471155 7487047 14896245 16036612 8842492 -1556067 -9790627
39528 -9790627 -12707993 -8513845 -637134 1600616 -5653165 -12724624 -8701124 2136011
39520 2136011 6353959 578943 -6571022 -9428843 -9907365 -8159727 -1661927 5454081
39512 5454081 5317436 1238844 6507280 23282814 35079713 27835877 8556434 -5348284
39504 -5348284 -7361349 -3994142 -2210947 -3928733 -8812115 -13748498 -11921540 -468169
39496 -468169 11798491 11664040 -2391334 -16901208 -18418758 -8244092 586427 -755026
39488 -755026 -7485158 -8992197 -3243069 910261 -4102201 -15258845 -24257278 -27160620
39480 -27160620 -24854429 -18935398 -12710931 -11753637 -16716534 -19528617 -13981164 -5766144
$$ packed form
39536a003975P77325J697805O015892P409198J140367p194120j0398559q234560
39528i790627k917366M194148P876711K237750p253781p071459M023500J0837135
39520B136011M217948n775016p149965k857821m78522J747638O497800P116008
39512E454081j36645m078592N268436J6775534J1796899p243836j9279443j3904718
39504e348284k013065L367207J783195j717786m883382m936383J826958J1453371
39496d68169J2266660j34451j4055374j4509874j517550J0174666Q830519j341453
39488g55026o730132j507039N749128M153330n012462j1156644q998433k903342
39480b7160620K306191N919031O224467R57294m962897k812083N547453Q215020
$$ plain form
39472 -5766144 -3355052 -3645049 1975461 10817860 11963339 5254952 2475165 7782831
39464 7782831 11666944 8225835 3969589 3743583 2180568 -3123724 -3664080 4819110
39456 4819110 11584858 7026443 -818434 1205871 10443428 13374055 5945068 -3462152
39448 -3462152 -7570956 -6098714 -1810250 162168 -6025136 -16961110 -18317984 -3818917
39440 -3818917 11486235 10134666 -2240500 -6175328 1674734 6366432 1528760 -1072582
39432 -1072582 6905498 16302804 15716979 8213667 4696615 9473034 18472326 24414933
39424 24414933 20185312 5410605 -7697319 -4830623 11197741 22406023 19820278
39417 19820278 13095757 11430532 9622025 1903108 -4329312 -1167055 4476695 2297460
$$ packed form
39472e766144K411092k89997N620510Q842399J145479o708387k779787N307666
39464G782831L884113l441109m256246k26006j563015n304292n40356Q483190
39456D819110O765748m558415p844877K024305R237557K930627p428987r407220
39448c462152m108804J472242M288464J972418o187304j0935974j356874J4499067
39440c818917J5305152j351569j2375166l934828P850062M691698m837672k601342
39432a072582P978080R397306n85825p503312l517052M776419Q999292N942607
39424B4414933m229621j4774707j3107924K866696J6028364J1208282k585745
39417A9820278o724521j665225j808507p718917o232420L162257N643750k179235
$$ plain form
39409 2297460 -3117238 -456282 7985927 9876157 3324853 -1736718 -1507901 -2595876
39401 -2595876 -7528760 -10342831 -9130587 -9432366 -11345394 -6589388 5800655 13364053
39393 13364053 7698960 -2624909 -5631212 -2980265 -3044484 -4976995 -2156458 3436228
39385 3436228 3359182 -2522324 -5510307 -2453493 708656 1366946 4974235 13360322 18280133
39376 18280133 12796769 1705418 -5791012 -7869889 -8138904 -7237355 -3887011 -843311
39368 -843311 -2254181 -6801848 -9883916 -10945046 -12172813 -11539190 -4847291 5149625
39360 5149625 9361781 4084102 -4302665 -8744133 -9518474 -9561892 -7713080 -1968629 4147856
39351 4147856 4392639 -1737768 -7606288 -7030508 -891765 4442485 4040193 -1072218 -6361796
$$ packed form
39409B297460n414698K660956Q442209J890230o551304n061571K28817j087975
39401b595876m932884k814071J212244l01779j913028M756006J2390043P563398
39393A3364053n665093j0323869l006303K650947o4219j932511K820537N592686
39385C436228p7046n881506k987983L056814L162149O58290L607289Q386087M919811
39376A8280133n483364j1091351p496430k078877k69015R01549L350344L043700
39368h43311j410870m547667l082068j061130j227767O33623O691899R996916
39360E149625M212156n277679q386767m441468p74341m3418J848812N744451O116485
39351D147856K44783o130407n868520N75780O138743N334250m02292n112411n289578
$$ plain form
39342 -6361796 -9622748 -11835793 -12151717 -7139160 1496734 4180239 -4087913 -12594696
39334 -12594696 -6647324 10654134 20168390 12053518 -2895873 -11487622 -14586423 -17362622
39326 -17362622 -15807709 -5627599 4577479 3824250 -2906911 -1702807 7853761 12367362
39318 12367362 6057194 -2656731 -7559526 -12527789 -18956204 -19953361 -13998329 -11302375
39310 -11302375 -17495630 -22166943 -14302097 145239 8024879 8837469 11285461 14944233
39302 14944233 10711433 -776782 -5867925 2719230 14452837 15038905 4057858 -7532277
39294 -7532277 -11610364 -8463929 -2416060 1834901 602828 -5877339 -12590045 -14735452
39286 -14735452 -11939204 -5388118 5179601 17065744 21354200 11968627 -3018032 -7747350
$$ packed form
39342f361796l260952k213045l15924N012557Q635894K683505q268152q506783
39334a2594696N947372J7301458R514256q114872j4949391q591749l098801k776199
39326a7362622J554913J0180110J0205078p53229o731161J204104R556568M513601
39318A2367362o310168q713925m902795m968263o428415r97157N955032K695954
39310a1302375o193255m671313P864846J4447336P879640Q12590K447992L658772
39302A4944233m232800j1488215n091143Q587155J1733607N86068j0981047j1590135
39294g532277m078087L146435O047869M250961j232073o480167o712706k145407
39286a4735452K796248O551086J0567719J1886143M288456r385573j4986659m729318
$$ plain form
39278 -7747350 1660456 11365809 7775663 -5538863 -14508467 -12368171 -3393944 6980082
39270 6980082 16627528 22494548 20997406 14307165 9229188 7909307 5785683 440944
39262 440944 -3964585 -3516907 69046 3192656 3890348 422763 -6351502 -7902795 4643887
39253 4643887 24316554 30807988 16359800 -1952600 -5828908 -856488 -3982572 -14411788
39245 -14411788 -15312498 -1920759 10723398 11072417 6259474 7922141 15154749 18960343
39237 18960343 15153789 6466710 -1956082 -4681359 803354 10033296 15996890 18358639
39229 18358639 21320351 22776034 15939299 3398060 -2125626 4561727 13474812 14894505
39221 14894505 11994268 11331113 10732152 5216532 -2812678 -7724541 -8757125 -6845152
$$ packed form
39278g747350R407806R705353l590146j3314526q969604K140296Q974227J0374026
39270F980082R647446N867020j497142o690241n077977j319881k123624n344739
39262D40944m405529M47678L585953L123610O97692l467585o774265j551293J2546682
39253D643887J9672667O491434j4448188j8312400l876308M972420l126084j0429216
39245a4411788r00710J3391739J2644157L49019m812943J662667P232608L805594
39237A8960343l806554q687079q422792k725277N484713R229942N963594K361749
39229A8358639K961712J455683o836735j2541239n523686O687353Q913085J419693
39221A4894505k900237o63155n98961n515620q029210m911863j032584J911973
$$ plain form
39213 -6845152 44922 11187546 19019221 17872859 11065984 3775318 -3550114 -8860199
39205 -8860199 -5438629 6327065 13621322 7799504 -2420223 -5007528 -2385501 -2399359
39197 -2399359 -1163053 8711080 19844142 18556675 7950121 3687859 7735563 5660575
39189 5660575 -7360266 -16510172 -9823211 4572698 11821643 9177650 3598476 -163982
39181 -163982 -1696821 -1859718 -2834439 -5799846 -6399698 505879 10424666 12222762 3253636
39172 3253636 -7322842 -11779167 -11056950 -7963032 -3963789 -3923702 -11830313 -19834163
39164 -19834163 -14946462 420101 9234748 5143228 484848 2835909 2106481 -8158540
39156 -8158540 -14842024 -6340827 5532010 3387796 -7356962 -7957461 3556218 12125388
$$ packed form
39213f845152O890074J1142624P831675j146362o806875p290666p325432n310085
39205h860199L421570J1765694P294257n821818j0219727k587305K622027j3858
39197b399359J236306R874133J1133062j287467j0606554m262262M047704k074988
39189E660575j3020841r149906O686961J4395909P248945k643993n579174l762458
39181a63982j532839j62897r74721k965407n99852O905577R918787J798096q969126
39172C253636j0576478m456325P22217L093918L999243M0087p906611q003850
39164a9834163M887701J5366563Q814647m091520m658380K351061p29428j0265021
39156h158540o683484Q501197J1872837k144214j0744758o00499J1513679Q569170
$$ plain form
39148 12125388 11095597 7993209 6423201 1171669 -7497757 -11731302 -10717802 -12095440
39140 -12095440 -16079860 -13315418 -2547001 4053625 -1191950 -11090624 -17051917 -20562199
39132 -20562199 -24124130 -22592817 -13006855 -3898557 -4554114 -11196100 -13323620 -9262071
39124 -9262071 -6270570 -7795948 -9177127 -6045912 -875488 176336 -5772458 -14643641
39116 -14643641 -17827612 -10269939 2854209 10447665 7894176 1937635 1482028 7089206
39108 7089206 12213059 11958149 7500056 3222024 1883773 2572160 2805076 2168206 1980273
39099 1980273 1047807 -3840553 -10575121 -10822045 -2280348 4231286 -895914 -9660740
39091 -9660740 -6787559 6123537 11711301 3152573 -6611110 -6706711 -3329709 -4232719
$$ packed form
39148A2125388j029791l102388j570008n251532q669426m233545J013500j377638
39140a2095440l984420K764442J0768417O600626n245575r898674n961293l510282
39132b0562199l561931J531313R585962R108298o55557o641986k127520M061549
39124i262071K991501j525378j381179L131215N170424J051824n948794q871183
39116a4643641l183971P557673J3124148P593456k553489n956541m55607N607178
39108G089206N123853k54910m458093m278032j338251O88387K32916o36870j87933
39099A980273r32466m888360o734568k46924Q541697O511634n127200q764826
39091i660740K873181J2911096N587764q558728r763683r5601L377002r03010
$$ plain form
39083 -4232719 -3453174 5251734 11786869 2996429 -14620291 -22232264 -15322449 -7006382
39075 -7006382 -5599467 -4748631 1511108 8289342 10060056 9853505 11258081 10123470
39067 10123470 1959151 -8696485 -14059516 -14279994 -15567738 -19157649 -18955656 -10740147
39059 -10740147 1210441 8879357 9608765 7969063 8527208 9011341 3519603 -7507463
39051 -7507463 -14609379 -9579270 4293024 16148295 20024337 19142118 18723364 19260038
39043 19260038 17575415 11228371 1255795 -7374161 -8943006 -3164376 3545954 6203848
39035 6203848 8001075 14088470 21476452 22325986 16117026 10319008 8502610 6667017
39027 6667017 3561823 4987969 12614480 17202477 10862922 -184693 -4114172 -704375
$$ packed form
39083d232719P79545Q704908O535135q790440j7616720p611973O909815Q316067
39075g006382J406915Q50836O259739O778234J770714k06551J404576j134611
39067A0123470q164319j0655636n363031k20478j287744l589911K01993Q215509
39059a0740147J1950588P668916P29408j639702N58145M84133n491738j1027066
39051g507463p101916N030109J3872294J1855271L876042q82219m18754N36674
39043A9260038j684623o347044r972576q629956j568845N778630O710330K657894
39035F203848J797227O087395P387982Q49534o208960n798018j816398j835593
39027F667017l105194J426146P626511M587997o339555j1047615l929479L409797
$$ plain form
39019 -704375 -300451 -7043779 -12873128 -9733386 190503 9233062 12984567 11217639
39011 11217639 5590702 153868 -374867 3090789 3229710 -3793446 -11153075 -9465957
39003 -9465957 491888 9517103 13135031 15526166 19236748 18838253 9387761 -4289781
38995 -4289781 -12503059 -11707507 -5600616 1608385 6930426 5960336 -3858287 -16917184
38987 -16917184 -22901973 -17991519 -7557524 2434789 10169059 13463965 8924345 -964464
38979 -964464 -7638059 -8133221 -9631851 -16453810 -20212397 -11691596 3292558 10429821
38971 10429821 6301106 742495 916660 3350007 2864159 164931 -2103527 -3723930
38963 -3723930 -4945196 -5918589 -9125703 -16302774 -22662567 -21355306 -14206455 -9958031
$$ packed form
39019g04375M03924o743328n829349L139742R923889R042559L751505j766928
39011A1217639n626937n436834n28735L465656J38921p023156p359629J687118
39003i465957R957845R025215L617928K391135L710582l98495r450492j3677542
38995d289781q213278P95552O106891P209001N322041r70090r818623j3058897
38987a6917184n984789M910454J0433995R992313P734270L294906m539620r888809
38979i64464o673595m95162j498630o821959l758587Q520801J4984154P137263
38971A0429821m128715n558611J74165K433347m85848k699228k268458j620403
38963c723930j221266r73393l207114p177071o359793J307261P148851M248424
$$ plain form
38955 -9958031 -10948114 -10940137 -8207926 -9732973 -17350620 -20448947 -10485965 5683383 15850937
38946 15850937 18670642 20088564 19803950 13188765 3635909 701240 5443885 8151937
38938 8151937 3118367 -2994428 -1284193 7441673 15120971 16491543 12653605 7022052
38930 7022052 1132130 -5716106 -13625689 -19171642 -17052702 -6532514 5494138 10750347
38922 10750347 7875839 1968448 -2568172 -5466059 -8162107 -11503367 -15323659 -17555089
38914 -17555089 -14978031 -7736530 -1359363 -808119 -4248257 -6405195 -5847141 -4325638
38906 -4325638 -1339775 4376565 9276006 8127115 3044060 2070670 6944946 9499416
38898 9499416 3919129 -3780966 -4167555 1823134 4047209 -2929078 -12640591 -14793314
$$ packed form
38955i958031r90083P977K732211j525047p617647l098327R962982J6169348J0167554
38946A5850937K819705J417922k84614o615185r552856k934669M742645K708052
38938H151937n033570o112795J710235Q725866P679298J370572l837938n631553
38930G022052n889922o848236p909583n545953K118940J0520188J2026652N256209
38922A0750347k874508n907391m536620k897887k696048l341260l820292k231430
38914a7555089K577058P241501O377167N51244l440138k156938N58054J521503
38906d325638K985863N716340M899441j148891n083055r73390M874276K554470
38898I499416n580287p700095l86589N990689K224075o976287r711513k152723
$$ plain form
38890 -14793314 -7120036 3165140 8516280 8968880 9647751 12232107 12517018 7116593
38882 7116593 -1365332 -8420293 -13321357 -16887942 -16818899 -10750893 -2226343 2313967
38874 2313967 1994567 1365688 2116540 1127015 -2564286 -5284430 -5170202 -5350694 -8151012
38865 -8151012 -11093635 -11238433 -9016050 -5644766 -1573343 566375 -2760827 -9150430
38857 -9150430 -11263960 -8449457 -9950767 -20363091 -28970679 -22734222 -5334055 7211838
38849 7211838 7972455 5096427 5667362 5130244 -1947983 -9541722 -7002858 5778918
38841 5778918 17655796 19553445 12642006 3489751 -3186890 -5406495 -2562060 3052180
38833 3052180 5810057 1924042 -5395495 -9362085 -8446173 -8126107 -12311034 -16833486
$$ packed form
38890a4793314P673278J0285176N351140M52600O78871K584356K84911n400425
38882G116593q481925p054961m901064l566585O9043O068006Q524550M540310
38874B313967l19400o28879P50852r89525l691301k720144J14228j80492k800318
38865h151012k942623j44798K222383L371284M071423K139718l327202o389603
38857i150430k113530K814503j501310j0412324q607588O236457J7400167J2545893
38849G211838P60617k876028N70935n37118p078227p593739K538864J2781776
38841E778918J1876878J897649o911439r152255o676641k219605K844435N614240
38833C052180K757877l886015p319537l966590R15912L20066m184927m522452
$$ plain form
38825 -16833486 -15014253 -7065432 746253 4932508 7218427 8191854 5203860 -690824
38817 -690824 -1897307 6118515 16046303 15800622 3227979 -11542877 -18102334 -15116929
38809 -15116929 -7383091 1102613 8688352 14356282 17689916 19213757 19031367 16300915
38801 16300915 11060253 5092254 139690 -3125471 -3917678 -1733215 910152 -640707
38793 -640707 -6825201 -11008376 -6762684 3470100 11110008 12011057 9556766 7136046
38785 7136046 3382943 -2703459 -7426021 -7762419 -7073532 -9777861 -12891911 -9262984
38777 -9262984 1774397 13285605 19851300 20898049 14947705 -212964 -18262230 -24664254
38769 -24664254 -13618957 1927734 5782870 -826769 -3708661 2569440 8960124 7813786
$$ packed form
38825a6833486J819233P948821P811685M186255K285919R73427k987994n894684
38817f90824j206483Q015822R927788k45681j2572643j4770856o559457K985405
38809a5116929P733838Q485704P585739N667930L333634J523841j82390k730452
38801A6300915n240662n967999m952564l265161p92207K184463K643367j550859
38793f40707o184494m183175M245692J0232784P639908R01049k454291k420720
38785G136046l753103o086402m722562l36398O88887k704329l114050L628927
38777i262984J1037381J1511208O565695J046749n950344j5160669j8049266o402024
38769b4664254J1045297J5546691L855136o609639k881892O278101O390684j146338
$$ plain form
38761 7813786 2559207 -1818040 -7024244 -13827615 -15338528 -7117969 1874010 -1017479
38753 -1017479 -13704236 -20962802 -15235246 -6005651 -4557088 -8074116 -6438966 834789
38745 834789 4704257 2390638 1912700 7146606 8763819 -1057261 -12176766 -7679310
38737 -7679310 10505280 21205455 12081907 -5287971 -14863120 -17717873 -23062710 -28258906
38729 -28258906 -23428184 -11133424 -5408803 -11397432 -19916074 -23537303 -24714927 -25218694
38721 -25218694 -20811805 -11573237 -5802404 -7476248 -10129035 -9310783 -10485622 -16984595
38713 -16984595 -20474190 -13127199 -918362 5371090 5310080 4699364 3117542 -2591049
38705 -2591049 -7407269 -3391605 6544565 11645590 8550596 2693963 -3816380 -13561651
$$ packed form
38761G813786n254579m377247n206204o803371j510913Q220559Q991979k891489
38753a017479j2686757p258566N727556R229595J448563l517028J635150P273755
38745H34789L869468k313619m77938N233906J617213r821080j1119505M497456
38737g679310J8184590J0700175r123548j7369878r575149k854753n344837n196196
38729b8258906M830722J2294760N724621n988629q518642l621229j177624n03767
38721b5218694M406889R238568N770833j673844k652787Q18252j174839o498973
38713a6984595l489595P346991J2208837O289452o1010o10716j581822n708591
38705b591049m816220M015664R936170N101025l094994n856633o510343r745271
$$ plain form
38697 -13561651 -22885391 -22300396 -11216305 -1713472 -2894955 -9683544 -11734039 -6442528
38689 -6442528 1520065 7713944 10304601 9208041 6455731 4215994 1032478 -5615083
38681 -5615083 -12469125 -12667530 -6625917 -3591988 -8758128 -15601436 -15916818 -11261459
38673 -11261459 -8151249 -6955941 -3295803 2264856 3828641 -872884 -7755053 -13164826
38665 -13164826 -17214426 -18759899 -13397617 -807365 10181121 9867146 -141554 -8585513
38657 -8585513 -8783686 -5449342 -5030606 -5441417 -1009703 6840355 11664960 12611026 14223897
38648 14223897 16166356 13152302 6747982 5957532 11426700 10826877 -1797627 -13139791
38640 -13139791 -9074423 2688094 3342583 -8621345 -16059998 -9235916 2589709 7928897
$$ packed form
38697a3561651r323740N84995J1084091R502833j181483o788589k050495N291511
38689f442528P962593O193879K590657j096560k752310k239737l183516o647561
38681e615083o854042j98405O041613L033929n166140o843308l15382M655359
38673a1261459L110210J195308L660138N560659J563785m701525o882169n409773
38665a3164826m049600j545473N362282J2590252J0988486l13975j0008700q443959
38657h585513j98173L334344M18736m10811M431714P850058M824605R46066J612871
38648A4223897J942459l014054o404320p90450N469168n99823j2624504j1342164
38640a3139791M065368J1762517O54489j1963928p438653O824082J1825625N339188
$$ plain form
38632 7928897 7084770 4753114 875054 -5088730 -10243448 -13780391 -18111250 -21033781
38624 -21033781 -16420320 -6535570 -2748932 -8418034 -11983157 -4205326 8146058 14013671
38616 14013671 13328413 11132160 6459712 -1137554 -2583404 9070926 23248303 22314453
38608 22314453 5131161 -12375587 -18571746 -16161720 -12163539 -10068646 -12160174 -18052353
38600 -18052353 -19989351 -10589639 3739641 8530905 2014047 -2041762 4502732 12670982
38592 12670982 11745504 4569984 -283531 -1901509 -3597233 -3896960 -657695 1397678
38584 1397678 -3286856 -11307327 -14766606 -11961210 -5803260 4128301 18268030 28672180
38576 28672180 25213787 10733852 -9774 1055474 6322732 5480357 -277648 -2236553
$$ packed form
38632G928897q44127k331656l878060n963784n154718l536943m330859k922531
38624b1033781M613461R884750L786638n669102l565123P777831J2351384N867613
38616A4013671o85258k196253m672448p597266j445850J1654330J4177377r33850
38608B2314453j7183292j7506748o196159K410026L998181K094893k091528n892179
38600a8052353j936998R399712J4329280M791264o516858m055809O544494Q168250
38592A2670982r25478p175520m853515j617978j695724k99727L239265K055373
38584A397678m684534q020471l459279K805396O157950R931561J4139729J0404150
38576B8672180l458393j4479935j0743626J065248N267258q42375n758005j958905
$$ plain form
38568 -2236553 3002089 10423874 13810018 11598709 6476278 1809702 -1508473 -4663332
38560 -4663332 -6458426 -1788292 11026075 23412430 24284096 14742974 6701273 5046764
38552 5046764 1325963 -9671144 -17834385 -12144584 1087512 7204430 5335706 6937242
38544 6937242 13996113 14899229 5121270 -3436081 -1222872 3753495 -208776 -9365563
38536 -9365563 -11524691 -5899080 -3126470 -7970103 -13511441 -12429510 -4538301 7216333
38528 7216333 19389192 25682401 20649282 8398618 584560 2722710 8153720 8156917
38520 8156917 2672921 -1884454 -806057 5793888 14093312 18308314 14913285 7310176
38512 7310176 3031105 4761439 7838395 7973760 6730681 6824137 6668909 3694171 88812
$$ packed form
38568b236553N238642P421785L386144k211309n122431m666576l318175l154859
38560d663332j795094M670134J2814367J2386355Q71666r541122q041701j654509
38552E046764l720801j0997107q163241N689801J3232096O116918j868724J601536
38544F937242P058871R03116r777959q557351K213209M976367l962271r156787
38536i365563k159128N625611K772610m843633n541338J081931P891209J1754634
38528G216333J2172859O293209n033119j2250664p814058K138150N431010L197
38520H156917n483996m557375J078397O599945Q299424M215002l395029p603109
38512G310176m279071J730334L076956J35365j243079R3456j55228k974738l605359
$$ plain form
38503 88812 895126 7258935 14405438 16305810 11553884 5260981 4615381 10771595 16402364
38494 16402364 14561359 8417270 6752375 10196052 9316380 -888745 -11570529 -10779746
38486 -10779746 453153 9036874 5494989 -6393420 -15748323 -16224528 -9794026 -1513332
38478 -1513332 5841973 10705730 9525241 126867 -11261227 -13266604 -3910297 4483190
38470 4483190 1665586 -5248835 -2522953 8992393 16043807 14067997 11280179 10886394
38462 10886394 5696546 -4522009 -7077977 2552568 8639832 -2169322 -18006502 -18030540
38454 -18030540 -3682147 4229757 -3621563 -14884026 -17143978 -13491160 -11573064 -10266255
38446 -10266255 -5066919 1633809 3609121 103962 -3575840 -3004699 871430 3097168
$$ packed form
38503H8812Q06314O363809P146503J900372m751926o292903o45600O156214N630769
38494A6402364j841005o144089j664895L443677q79672j0205125j0681784P90783
38486a0779746J1232899Q583721l541885j1888409r354903m76205O430502Q280694
38478a513332P355305M863757j180489r398374j1388094k005377R356307Q393487
38470D483190k817604o914421K725882J1515346P051414j975810k787818l93785
38462A0886394n189848j0218555k555968R630545O087264j0809154j5837180k4038
38454a8030540J4348393P911904p851320j1262463k259952L652818J918096J306809
38446a0266255N199336O700728J975312l505159l679802N71141L876129K225738
$$ plain form
38438 3097168 -259300 -7147312 -10558029 -6742713 -504599 1101018 -1782568 -3112590
38430 -3112590 -43524 4327403 6728677 7666459 9366420 12695753 15835988 14815148
38422 14815148 7887345 300845 -439441 3884335 2740789 -6890871 -13773584 -9403361
38414 -9403361 -2782662 -7431548 -20905750 -29899685 -30155490 -27518794 -23647596 -15900550
38406 -15900550 -8520161 -7573832 -6299326 6743554 24743196 27460158 12166352 -687720
38398 -687720 831459 3757498 -3992223 -12015509 -7143037 2641473 2865102 -2261448
38390 -2261448 147997 6316739 2297742 -9828218 -13897473 -5909490 1943326 3680474
38382 3680474 6121960 10522193 7369685 -4254568 -10011195 -2040671 7781701 6677755
$$ packed form
38438C097168l356468o888012l410717L815316O238114J605617k883586j330022
38430c112590L069066M370927K401274R37782J699961L329333L140235j020840
38422A4815148o927803p586500p40286M323776j143546r631660o882713M370223
38414i403361O620699m648886j3474202q993935k55805K636696L871198P747046
38406a5900550P380389R46329J274506J3042880J7999642K716962j5293806j2854072
38398f87720J519179K926039p749721q023286M872472R784510K23629n126550
38390b261448K409445O168742m018997j2125960m069255P987983P852816J737148
38382C680474K441486M400233l152508j1624253n756627P970524R822372j103946
$$ plain form
38374 6677755 -386449 -2943456 -3967668 -11366608 -18667889 -11682320 7615212 20009053
38366 20009053 14440233 1432952 -3814653 -932767 575513 -1981607 -2644469 1172379
38358 1172379 4240530 2499550 -620207 -588860 239697 -3683540 -11410444 -15179393 -10533434
38349 -10533434 -2092350 2898155 2935509 1166287 -518199 -1585467 703878 8749670
38341 8749670 18013982 18856263 7896357 -6308751 -12247487 -7521791 1025308 6485513
38333 6485513 6991817 3354189 -3071418 -9302589 -11748831 -10334105 -8875511 -9719080
38325 -9719080 -10696347 -9156121 -5842865 -2127648 3067352 9230541 10369568 1915123
38317 1915123 -9507888 -11181508 -972828 8721624 7462633 -195993 -4096158 -4020910
$$ packed form
38374F677755p064204k557007j024212p398940p301281O985569J9297532J2393841
38366B0009053n568820j3007281n247605K881886J508280k557120o62862L816848
38358A172379L068151j740980l119757L1347Q28557l923237p726904l768949M645959
38349a0533434Q441084M990505L7354j769222j684486j067268K289345Q045792
38341H749670R264312Q42281j0959906j4205108n938736M725696Q547099N460205
38333F485513N06304l637628o425607o231171k446242J414726J458594q43569
38325i719080r77267J540226L313256L715217N195000O163189J139027q454445
38317A915123j1423011j673620J0208680R694452j258991p658626l900165P5248
$$ plain form
38309 -4020910 -6876756 -12687298 -14151416 -9337086 -4505295 -2937646 -602108 4218442
38301 4218442 6366190 3546669 2046371 6352531 10419309 7081815 385023 -317451
38293 -317451 5349879 9550810 8937496 7336107 6758004 5205148 3969422 7516065 13712892
38284 13712892 13512909 4752086 -2354305 50139 4597843 -666969 -13666517 -20731293
38276 -20731293 -16390157 -10213876 -11425326 -15650879 -12590507 -948219 11135134 17515599
38268 17515599 18880572 16760144 9853211 -758931 -7663323 -3629204 8763092 18130457
38260 18130457 16284552 6948617 586725 1936079 5777260 5568456 2472041 2154205
38252 2154205 4844656 4559033 -977201 -6132614 -6787848 -7794614 -14236261 -19769550
$$ packed form
38309d020910k855846n810542j464118M814330M831791J567649K335538M820550
38301D218442K147748k819521j500298M306160M066778l337494o696792p02474
38293c17451N667330M200931o13314j601389n78103j552856j235726L546643O196827
38284A3712892j99983q760823p106391K404444M547704n264812j2999548p064776
38276b0731293M341136O176281j211450m225553L060372J1642288J2083353O380465
38268A7515599J364973k120428o906933j0612142o904392M034119J2392296R367365
38260A8130457j845905r335935o361892J349354L841181k08804l096415l17836
38252B154205K690451k85623n536234n155413o55234j006766o441647n533289
$$ plain form
38244 -19769550 -13350793 3467731 16343888 17218196 13402461 13203555 12854332 6206751
38236 6206751 -826255 2459647 13320417 16948024 7086699 -5093118 -6500609 1084802
38228 1084802 4922139 -2325384 -15116246 -22517469 -19750816 -11556798 -4920807 -341169
38220 -341169 6664021 15717188 19167869 12823579 3441976 57452 2790794 6778786
38212 6778786 11699444 18173661 19359948 8375098 -7468481 -12805035 -5584905 454458
38204 454458 -2895810 -8107968 -7964922 -7802708 -12871162 -15630073 -7753472 3601419
38196 3601419 4508721 -5606076 -14636003 -15747916 -13345727 -12243580 -11497726 -9858268
38188 -9858268 -8535203 -6824112 -2051207 4296053 6119681 213777 -9857314 -18018583
$$ packed form
38244a9769550O418757J6818524J2876157Q74308l815735j98906l49223o647581
38236F206751p033006L285902J0860770L627607r861325j2179817j407491P585411
38228A084802L837337p247523j2790862p401223K766653Q194018O635991M579638
38220c41169P005190R053167L450681o344290r381603l384524K733342L987992
38212F778786M920658O474217J186287j0984850j5843579n336554P220130O039363
38204D54458l350268n212158J43046J62214n068454k758911P876601J1354891
38196C601419R07302j0114797r029927j111913K402189J102147P45854J639458
38188i858268J323065J711091M772905O347260J823628n905904j0071091q161269
$$ plain form
38180 -18018583 -20263484 -15625480 -7014451 -841819 -1504292 -6056138 -7663858 -3771686
38172 -3771686 2154463 5399238 3091800 -5084762 -14807458 -17970980 -10824742 304892
38164 304892 6259535 5902220 4404130 3578649 1334948 -836238 1579134 7427682 9512228
38155 9512228 4427430 -4083617 -12689735 -21601222 -28057186 -25346270 -13164393 -2027755
38147 -2027755 -1459953 -8650555 -14017835 -13247309 -8276179 -1166887 5938157 8235820
38139 8235820 3466143 -2214911 -1595482 1301623 -4391269 -18127697 -24109937 -11515805
$$ packed form
38180a8018583k244901M638004Q611029O172632o62473m551846j607720L892172
38172c771686N926149L244775k307438q176562r722696l163522P146238J1129634
38164C04892N954643l57315j498090q25481k243701k171186K415372N848548K084546
38155I512228n084798q511047q606118q911487o455964K710916J2181877J1136638
38147b027755N67802p190602n367280P70526M971130P109292P105044K297663
38139H235820m769677n681054O19429K897105n692892j3736428n982240J2594132
$$ [...]
##END NTUPLES=NMR SPECTRUM
##END=
