##TITLE=31Pdec_SR_Pro_Gly-oil
 CDCl3, 24 sc
 10.3.2022
##JCAMPDX= 6.0         $$ Bruker NMR JCAMP-DX V2.0
##DATA TYPE= NMR SPECTRUM
##DATA CLASS= NTUPLES
##ORIGIN= UXNMR, Bruker Analytische Messtechnik GmbH
##OWNER= root
$$ XWIN-NMR		Version 3.5
$$ Thu Mar 10 12:28:41 2022 Russian Standard Time (UT+4h)  she@DPX200
##.OBSERVE FREQUENCY= 81.013821
##.OBSERVE NUCLEUS= ^31P
##.ACQUISITION MODE= SIMULTANEOUS
##.ACQUISITION SCHEME= undefined
##.AVERAGES= 24
##.DIGITISER RES= 16
##SPECTROMETER/DATA SYSTEM= spect
##.PULSE SEQUENCE= zgpg30
##.SOLVENT NAME= CDCl3
##.SHIFT REFERENCE= (INTERNAL, CDCl3, 0, 248.564)
##AUDIT TRAIL= $$ (NUMBER, WHEN, WHO, WHERE, WHAT)
$$ ##TITLE= Audit trail, XWIN-NMR		Version 3.5
$$ ##JCAMPDX= 5.01
$$ ##ORIGIN= Bruker BioSpin GmbH
$$ ##OWNER= she
$$ F:/spectra/data/she/nmr/P31/1/pdata/1/auditp.txt
$$ ##AUDIT TRAIL=  $$ (NUMBER, WHEN, WHO, WHERE, WHAT)
(   1,<2022-03-10 12:27:27.81 +0400>,<she>,<DPX200>,
      <created by zg, POWCHK disabled, PULCHK disabled
       configuration hash MD5:
       00 E9 B6 7A A2 85 ED C7 34 08 36 98 17 FE 4E 26
       data hash MD5: 32K
       92 74 E4 C7 D0 5E 29 56 84 84 70 C8 23 44 5E BF>)
(   2,<2022-03-10 12:27:32.20 +0400>,<she>,<DPX200>,
      <Start of raw data processing
       efp BC_mod = 2 LB = 1 FT_mod = 6 PKNL = 1 PHC0 = -9182.884 PHC1 = 118.0745 SI = 64K 
       data hash MD5: 64K
       11 8E 1D 04 76 41 DA D8 C1 9D D6 02 A8 38 B1 95>)
(   3,<2022-03-10 12:27:49.96 +0400>,<she>,<DPX200>,
      <pk PHC0 = 14.26297 PHC1 = -50.8 
       data hash MD5: 64K
       09 48 F6 BF 12 24 81 C4 96 9A FA A2 B9 01 C3 FB>)
(   4,<2022-03-10 12:27:59.85 +0400>,<she>,<DPX200>,
      <abs ABSG = 5 
       data hash MD5: 64K
       F6 E8 8B 76 1B 9A D9 A6 AA F9 FC 77 DE D9 2D 3F>)
$$ ##END=
$$ 
$$ hash MD5
$$ 3D 55 48 6D D6 47 6A FD 52 1A 4F F1 0D B1 9C AE
##$RELAX= 
##$RELAX= 
##$RELAX= 
##$RELAX= 
##$RELAX= 
##$RELAX= 
##$RELAX= 
##$RELAX= 
$$ Bruker specific parameters
$$ --------------------------
##$DU= <F:/spectra>
##$EXPNO= 1
##$NAME= <P31>
##$PROCNO= 1
##$TYPE= <nmr>
##$USER= <she>
##$AMP= (0..31)
100 100 100 100 100 100 100 100 100 100 100 100 100 100 100 100 100 100 
100 100 100 100 100 100 100 100 100 100 100 100 100 100 
##$AQSEQ= 0
##$AQ_mod= 1
##$AUNM= <au_zg>
##$AUTOPOS= <>
##$BF1= 81.014009
##$BF2= 200.13
##$BF3= 200.13
##$BF4= 200.13
##$BF5= 200.13
##$BF6= 200.13
##$BF7= 200.13
##$BF8= 200.13
##$BYTORDA= 1
##$CFDGTYP= 0
##$CFRGTYP= 5
##$CHEMSTR= <none>
##$CNST= (0..31)
1 1 145 1 1 1 1 1 1 1 1 1 1 1 1 1 1 1 1 1 1 1 1 1 1 1 1 1 1 1 1 1 
##$CPDPRG= <waltz16>
##$CPDPRG1= <>
##$CPDPRG2= <waltz16>
##$CPDPRG3= <>
##$CPDPRG4= <mlev>
##$CPDPRG5= <mlev>
##$CPDPRG6= <mlev>
##$CPDPRG7= <mlev>
##$CPDPRG8= <mlev>
##$CPDPRGB= <>
##$CPDPRGT= <>
##$D= (0..31)
0 1 0 0 0 0 0 0 0 0 0 0.03 2e-05 3e-06 0 0 0 0 0 0 0 0 0 0 0 0 0 0 0 0 
0 0 
##$DATE= 1646900847
##$DBL= (0..7)
120 120 120 11 120 120 24 19 
##$DBP= (0..7)
150 150 150 150 150 150 150 150 
##$DBP07= 0
##$DBPNAM0= <>
##$DBPNAM1= <>
$$ [...]
##$SUBNAM3= <"">
##$SUBNAM4= <"">
##$SUBNAM5= <"">
##$SUBNAM6= <"">
##$SUBNAM7= <"">
##$SUBNAM8= <"">
##$SUBNAM9= <"">
##$SW= 501.771253377433
##$SWIBOX= (0..15)
0 1 3 0 0 0 0 0 0 0 0 0 0 0 0 0 
##$SW_h= 40650.406504065
##$TD= 32768
##$TD0= 1
##$TE= 0
##$TE2= 300
##$TE3= 300
##$TEG= 300
##$TL= (0..7)
0 120 53 12 22 120 120 120 
##$TP= (0..7)
150 150 150 150 150 150 150 150 
##$TP07= 0
##$TPNAME0= <>
##$TPNAME1= <>
##$TPNAME2= <>
##$TPNAME3= <>
##$TPNAME4= <>
##$TPNAME5= <>
##$TPNAME6= <>
##$TPNAME7= <>
##$TPOAL= (0..7)
0.5 0.5 0.5 0.5 0.5 0.5 0.5 0.5 
##$TPOFFS= (0..7)
0 0 0 0 0 0 0 0 
##$TUNHIN= 0
##$TUNHOUT= 0
##$TUNXOUT= 0
##$USERA1= <user>
##$USERA2= <user>
##$USERA3= <user>
##$USERA4= <user>
##$USERA5= <user>
##$V9= 5
##$VALIST= <valist>
##$VCLIST= <CCCCCCCCCCCCCCC>
##$VD= 0
##$VDLIST= <DDDDDDDDDDDDDDD>
##$VPLIST= <PPPPPPPPPPPPPPP>
##$VTLIST= <TTTTTTTTTTTTTTT>
##$WBST= 1024
##$WBSW= 4
##$XGAIN= (0..3)
0 0 0 0 
##$XL= 0
##$YL= 0
##$YMAX_a= 3229
##$YMIN_a= -3518
##$ZGOPTNS= <>
##$ZL1= 120
##$ZL2= 120
##$ZL3= 120
##$ZL4= 120
##$ABSF1= 248.5645
##$ABSF2= -253.2056
##$ABSG= 5
##$ABSL= 3
##$ALPHA= 0
##$AQORDER= 0
##$ASSFAC= 0
##$ASSFACI= 0
##$ASSFACX= 0
##$ASSWID= 0
##$AUNMP= <proc_1d>
##$AZFE= 0.1
##$AZFW= 0.5
##$BCFW= 0
##$BC_mod= 2
##$BYTORDP= 0
##$COROFFS= 0
##$CY= -3
##$DATMOD= 1
##$DC= 0
##$DFILT= <>
##$DTYPP= 0
##$F1P= 0
##$F2P= 0
##$FCOR= 1
##$FTSIZE= 65536
##$FT_mod= 6
##$GAMMA= 0
##$GB= 0
##$INTBC= 1
##$INTSCL= 5.30512e-09
##$ISEN= 30
##$LB= 1
##$LEV0= 0
##$LPBIN= 0
##$MAXI= 10000
##$MC2= 0
##$MEAN= 0
##$ME_mod= 0
##$MI= 50
##$NCOEF= 0
##$NC_proc= -8
##$NLEV= 6
##$NOISF1= 182.463
##$NOISF2= 159.3651
##$NSP= 0
##$NTH_PI= 0
##$NZP= 0
##$OFFSET= 248.5645
##$PC= 4
##$PHC0= -9168.621
##$PHC1= 67.27451
##$PH_mod= 1
##$PKNL= yes
##$PPARMOD= 0
##$PSCAL= 0
##$PSIGN= 0
##$REVERSE= no
##$SF= 81.014009
##$SI= 65536
##$SIGF1= 159.3651
##$SIGF2= -187.1042
##$SINO= 113.3802
##$SIOLD= 16384
##$SREGLST= <1H.CDCl3>
##$SSB= 0
##$STSI= 65536
##$STSR= 0
##$SW_p= 40650.406504065
##$SYMM= 0
##$S_DEV= 0
##$TDeff= 32768
##$TDoff= 0
##$TI= <>
##$TILT= no
##$TM1= 0
##$TM2= 0
##$TOPLEV= 0
##$USERP1= <user>
##$USERP2= <user>
##$USERP3= <user>
##$USERP4= <user>
##$USERP5= <user>
##$WDW= 1
##$XDIM= 65536
##$YMAX_p= 450958918
##$YMIN_p= -28058473
$$ End of Bruker specific parameters
$$ ---------------------------------
##NTUPLES= NMR SPECTRUM
##VAR_NAME=  FREQUENCY,     SPECTRUM/REAL,   SPECTRUM/IMAG
##SYMBOL=    X,             R,               I
##VAR_TYPE=  INDEPENDENT,   DEPENDENT,       DEPENDENT
##VAR_FORM=  AFFN,          ASDF,            ASDF
##VAR_DIM=   65536,         65536,           65536
##UNITS=     HZ,            ARBITRARY UNITS, ARBITRARY UNITS
##FACTOR=    0.620285442955139, 1,           1
##FIRST=     20137.2065510759, 0,            0
##LAST=      -20513.1999529892, 0,           0
##MIN=       -20513.1999529892, -28058473,   0
##MAX=       20137.2065510759, 450958918,    0
$$ Real data points
##PAGE= N=1
##DATA TABLE= (X++(R..R)), XYDATA
$$ [...]
42838A674091K505270M00727j703497j366141j155382k686259k763982M59085
$$ 1674091 4179361 4580088 2876591 1510450 355068 -2331191 -5095173 -4636088
42830d636088L073015J665850q88320o69874P14196J46376l75449K523465N998856
$$ -4636088 -1563073 102777 -785543 -1455417 -741221 -594845 -970294 1553171 7552027
42821G552027M228635j795393m869161k513728l39399k290881m128684r21868
$$ 7552027 11780662 9985269 5116108 2602380 2262981 -27900 -4156584 -5078452
42813e078452M166999M518755M44589j604352P04326K615547O03199k253586j921173
$$ -5078452 -911453 3607302 4051891 2447539 3151865 5767412 6370611 4117025 2195852
42804B195852K61388N72180j145149k386353k389011j890172n36538J720008K541708
$$ 2195852 2457240 3029420 1884271 -502082 -2891093 -4781265 -5317803 -3597795 -1056087
42795a056087M74380j534977k79380J810219J57230l708052l455205K261631P239935
$$ -1056087 -581707 -2116684 -2396064 -585845 -428615 -4136667 -7591872 -5330241 1909694
42786A909694O230681Q75070m235341o583768n459689j565393J585243O54484
$$ 1909694 8140375 9015445 4780104 -1803664 -7263353 -8828746 -7243503 -6589019
42778f589019j864563k15581N198919P208425K746065k399172k790986n17853
$$ -6589019 -8453582 -8669163 -3470244 3738181 6484246 4085074 1294088 776235
42770G76235P69459K058736M134876L240319k087000n676917k295327L338214
$$ 776235 1545694 3604430 7739306 10979625 8892625 3215708 920381 4258595
42762D258595L423519j260868m093590l261913j857411n22079J912280L013220
$$ 4258595 7682114 6421246 2327656 -934257 -2791668 -3313747 -1401467 1611753
42754A611753J33022k953403j031923K934651J930860k963813m058940l3022K576048
$$ 1611753 1744775 -1208628 -2240551 694100 2624960 -338853 -4397793 -4430815 -1854767
42745a854767J376655J295145L725082K760503l800768q790598o216416r9743
$$ -1854767 -478112 817033 4542115 7302618 3501850 -5288748 -11505164 -11604907
42737a1604907K625297J859277J519571K107991J605679J38516q14769j019563
$$ -11604907 -8979610 -7120333 -5600762 -3492771 -1887092 -1748576 -2563345 -3582908
42729c582908k27709K252353M373147K251197l003108m568647K58944M810712
$$ -3582908 -3810617 -1558264 2814883 5066080 2062972 -2505675 -2246731 2563981
42721B563981K496124l200615m148732M07586L753942J985126j703756k906799
$$ 2563981 5060105 1859490 -2289242 -1881656 1872286 3857412 2153656 -753143
42713g53143j266083R79289K244875K321343J804453J446448J243100M31558j185374
$$ -753143 -2019226 -1039937 1204938 3526281 5330734 6777182 8020282 8451840 7266466
42704G266466k867381m124716m862747m369711k161384K71005J008032P08377
$$ 7266466 4399085 274369 -4588378 -8958089 -11119473 -10848468 -9840436 -9132059
42696i132059J109606J246310o76985k237813O84777N805335N533388j556305
$$ -9132059 -8022453 -6776143 -7453128 -9690941 -9006164 -3200829 2332559 776254
42688G76254p097830m599961J516148L602007J903954J620744L108503K340041
$$ 776254 -6321576 -10921537 -9405389 -5803382 -3899428 -2278684 829819 3169860
42680C169860j002712k787899j276326Q73035J433021R16642O0452j108603j669972
$$ 3169860 2167148 -620751 -1897077 -1024042 408979 1325621 1386073 277470 -1392502
42671a392502n43086J252339J701399P35222p2775J60666J329599K723671K210832
$$ -1392502 -1935588 -683249 1018150 1753372 1680597 1841263 3170862 5894533 8105365
42662H105365k157563p689975p943921j273188N365483N228416O02031j981255
$$ 8105365 5947802 -1742173 -9686094 -10959282 -5593799 -365383 236648 -1744607
42654a744607j387209p41071k06366J826147K796557p89955n425095m145005K126658
$$ -1744607 -3131816 -3872887 -4079253 -2253106 543451 -246504 -5671599 -9816604 -7689946
42645g689946N127302K010588r06933P30529K751283O75934k760218k913940k79841
$$ -7689946 -2562644 -552056 -1458989 -728460 2022823 2698757 -61461 -2975401 -3255242
42636c255242K167087L567174L165492q81545o338496o192334J464445Q065906
$$ -3255242 -1088155 2479019 5644511 4762966 -1575530 -7767864 -6303419 1762487
42628A762487N407622k626403o123868l041122Q29989K773227M920529O279415
$$ 1762487 7170109 4543706 -1580162 -4621284 -3791295 -1018068 3902461 10181876
42620A0181876K678179m059969n898152n95613L955186J556047l218178l199989
$$ 10181876 12860055 8800086 2901934 2306321 6261507 7817554 4599376 1399387
42612A399387J26047L99660k712876l906464j593574L43487k2212N8310K169997
$$ 1399387 1525434 1925094 -787782 -4694246 -6287820 -5944333 -5966545 -5908235 -3738238
42603c738238L596554K031134p31280j951392j546802o25899O79748K006121J957541
$$ -3738238 -141684 1889450 1158170 -793222 -2340024 -2965923 -2286175 -280054 1677487
42594A677487M29217n32224P8389M50982q46592k241394j758490r6585R98834
$$ 1677487 2106704 1574480 1652869 2103851 1257259 -984135 -2742625 -2839210 -1840376
42585a840376J361154J309296J73156j775476k304720p35074J72779j058849j104946
$$ -1840376 -479222 830074 1003230 -772246 -3076966 -3812040 -3639261 -4698110 -5803056
42576e803056K605966N791836K889949k919365k709631M481805Q553382K320092
$$ -5803056 -3197090 2594746 5484695 2565330 -144301 4337504 12890886 15210978
42568A5210978p647511r511040j699161N947123N269607j268647n515147l632456
$$ 15210978 7563467 -1947573 -3646734 2300389 7569996 6301349 786202 -2846254
42560b846254J049501L480754K605610R60808J91819o04856j803864j469268J185818
$$ -2846254 -1796753 1684001 4289611 5250419 5442238 4837382 3033518 1564250 2750068
42551B750068K960293O67338l517833m635457k131090k64878j395695l152259
$$ 2750068 5710361 6377699 2859866 -1775591 -3906681 -4171559 -5567254 -8719513
42543h719513k873171p90606J990814M705226N413577K607847q44359k27334L308636
$$ -8719513 -11592684 -12383290 -10392476 -5687250 -273673 2334174 1489815 1262481 4571117
42534D571117L112221k658607p018803m197149J690239L001552n78518l097288
$$ 4571117 7683338 5024731 -1994072 -6191221 -4500982 -1499430 -2077948 -5175236
42526e175236j443186J963542L924774L357988O56882k156663k016545J347628
$$ -5175236 -6618422 -4654880 -730106 2627882 3284764 1128101 -888444 459184
42518D59184L995714L026993O61644k3708j58214j846149l172459j410594J454204
$$ 459184 4454898 7481891 8143535 8119827 7961613 6115464 2943005 1532411 2986615
42509B986615J728990L46906P04472K072927J044385j764085k476901p50726M1279
$$ 2986615 4715605 5062511 5766983 7839910 8884295 7120210 4643309 3892583 3933862
42500C933862r03267j046348K3659k9757j210923r17930Q83185J464457N87415
$$ 3933862 3030595 1984247 2007906 1978149 767226 -150704 732481 2196938 2784353
42491B784353N87755J027344r19022m228452m358609q69191J517508R02298Q12159
$$ 2784353 3372108 4399452 3480430 -748022 -5106631 -5975822 -4458314 -3556016 -2743857
42482b743857K866388L529928J050759q28557L25350J211807p37317k297226n85598
$$ -2743857 122531 3652459 4703218 3874661 4200011 5411818 4674501 2377275 1791677
42473A791677J168141n85734k890599j202252K662141L560600J078929j230042
$$ 1791677 2959818 2374084 -516515 -1718767 943374 4503974 5582903 4352861
42465D352861k100973k425052j324633J762464L223812k67521n026233m545585
$$ 4352861 2251888 -173164 -1497797 264667 3488479 3220958 -1805275 -6350860
42457f350860N90535L656402K276528R36366K277826K966512M51579k402331k559440
$$ -6350860 -5760325 -2103923 172605 1108971 3386797 6353309 6804888 4402557 1843117
42448A843117j518471j385890p41305J793861L585334J733676j819567k857799
$$ 1843117 324646 -1061244 -1802549 -8688 3576646 5310322 3490755 632956
42440F32956p95116J364036J558787J94378j616268k650321j591972J109815K624106
$$ 632956 -162160 1201876 2760663 2955041 1338773 -1311548 -2903520 -1793705 830401
42431H30401J215685j149326j912245j660845k013149k040929m76882N86446j196719
$$ 830401 2046086 896760 -1015485 -2676330 -4689479 -6730408 -7207290 -6620844 -7817563
42422g817563l164303r67925L539128M009482k55556k655903J47611K956266J125345
$$ -7817563 -10981866 -11949791 -8410663 -4401181 -4656737 -7312640 -7165029 -4208763 -3083418
42413c083418j640128k10374K792817J894128j162099l66106L764558M863838
$$ -3083418 -4723546 -4933920 -2141103 -246975 -1409074 -1775180 1989378 6853216
42405F853216J635587l86002J112427J706453r32845k562547l80789J573104k72467
$$ 6853216 8488803 8102801 9215228 10921681 9988836 7426289 7045500 8618604 8346137
42396H346137k503672j008018J484254L37306k659171k518867K80442J013825
$$ 8346137 5842465 4834447 6318701 6656007 3996836 1477969 1758411 2772236
42388B772236j136269k437333j328647j04975o9189M8918P50805J002997P21564
$$ 2772236 1635967 -801366 -2130013 -2234988 -2304177 -2255259 -1504454 -501457 220107
42379B20107N63148L9164q74484m9843K934582L748980o62094n465561l911766
$$ 220107 783255 822419 -52065 -101908 2832674 6581654 5919560 453999 -3457767
42370c457767J854372L628884O5675j883908P40955K409132k69222k391269r5949
$$ -3457767 -1603395 2025489 2091164 207256 948211 3357343 3088121 696852 600903
42361F00903J950508j092931m921450k846097K724959L890954j48193k314802
$$ 600903 2551411 1458480 -3462970 -6309067 -3584108 306846 158653 -2156149
42353b156149R70209N004596M644359J014123j796431k368383j757662o45472
$$ -2156149 -1185940 3818656 8463015 9477138 7680707 5312324 3554662 2909190
42345B909190P48149J454553N00944j576771l011589k528799n25295J412115K211618
$$ 2909190 3657339 5111892 5612836 4036065 1024476 -1504323 -2029618 -617503 1594115
42336A594115K288934K283297J457631j111758m084664m853166l301539k075319
$$ 1594115 3883049 6166346 7623977 6512219 2427555 -2425611 -5727150 -7802469
42328g802469k284671j652952J485563M788475M689768J033628k886249l744074
$$ -7802469 -10087140 -11740092 -10254529 -5466054 -776286 257342 -2628907 -6372981
42320f372981n79975M505499P093721M145434j793733m634222k453948o2402j644344
$$ -6372981 -6952956 -2447457 4646264 8791698 6997965 2363743 -90205 -152607 -1796951
42311a796951m327149k812582K185960M835245K531044j114697j922833r8080
$$ -1796951 -6124100 -8936682 -6750722 -1915477 615567 -499130 -2421963 -2520043
42303b520043J564418J778845J486221J627542J474047m57069l697649n000135
$$ -2520043 -955625 823220 2309441 3936983 5411030 4953961 1256312 -3743823
42295c743823k056692K450611L574869J169013K07342K653611L823977M7703m718525
$$ -3743823 -5800515 -3349904 224965 1393978 1601320 4254931 8078908 8126611 3408086
42286C408086m791391j471604J30486R7045K351368N665169M074853k717779o943897
$$ 3408086 -1383305 -2854909 -2724423 -2627378 -276010 5389159 9464012 6746233 -197664
42277a97664l697699J996249K985910j82199j920098m11862J311893J089230k46428
$$ -197664 -3895363 -1899114 1086796 904597 -1015501 -1427363 -115470 973760 727332
42268G27332j637557k844100k920264q02958K388192M035683L233315J526534
$$ 727332 -910225 -3754325 -6674589 -7477547 -5089355 -1053672 2179643 3706177
42260C706177N13487L43057M31169R5847j342534l593639m764851l256027j44905
$$ 3706177 4219664 4562721 4993890 5089737 3747203 153564 -4611287 -7867314 -8012219
42251h012219J836739J572865K81347p77243j406156j302078m540J482926J299041
$$ -8012219 -6175480 -4602615 -4321268 -5098511 -6504667 -7806745 -7811285 -6328359 -5029318
42242e029318j08860K03573L161772N340949L510302m88426k427671j709343j013062
$$ -5029318 -5138178 -4934605 -1772833 3568116 7078418 6589992 4162321 2452978 1439916
42233A439916r75495J97793J834438Q28483k005076j280368M075203O855947J762150
$$ 1439916 464421 662214 2496652 3325135 1320059 39691 4114894 10970841 12732991
42224A2732991n078932m059571L166934N592254n88347o470494m426018P35717
$$ 12732991 7654059 3594488 6761422 12353676 11765329 5294835 868817 1604534
42216A604534L89233m258421m877256N39730M953012L276942o76888q91399J946751
$$ 1604534 1993767 -2264654 -7141910 -6602180 -1649168 1627774 950886 59487 2006238
42207B006238K342628j242997l892698j280362L901754N251648J194584l273858
$$ 2006238 4348866 3105869 -786829 -2067191 1834563 7086211 8280795 5006937
42199E006937l938901k580135k396039k016190J283002M927847L741235j370964
$$ 5006937 1068036 -1512099 -3908138 -5924328 -4641326 286521 4027756 2656792
42191B656792l892541j657290J41927k077402m688904l509974k32752J886176
$$ 2656792 -1235749 -2893039 -2751112 -4828514 -9517418 -13027392 -13260144 -11373968
42183a1373968L435819N226079M284956q65716n209441l752223M49736J300487
$$ -11373968 -7938149 -2712070 1572886 707170 -4502271 -8254494 -7804758 -6504271
42175f504271m11463N73267L875823L938223M6839k161842k25364J465326l35834
$$ -6504271 -6915734 -6342467 -2466644 1471579 1518418 -643424 -868788 596538 260704
42166B60704k436747r86368K369767L395672J028939k225280l303234q26111L273490
$$ 260704 -2176043 -3162411 -792644 2603028 3631967 1406687 -1896547 -2722658 550832
42157E50832M292491j333n164020n113965p25998J741902N14852J65211K608665
$$ 550832 4843323 4841990 -322030 -5435995 -6161993 -4420091 -3905239 -3740028 -1131363
42148a131363L369674j95932l533895k169478J087871J367786k48435L26920K466266
$$ -1131363 2238311 2042379 -1491516 -3660994 -2573123 -1205337 -1453772 -1126852 1339414
42139A339414K181416n05614j438156O79493K216325L50540k965651m051422j921752
$$ 1339414 3520830 3015216 1577060 2256553 4472878 4823418 1857767 -2193655 -4115407
42130d115407J503269L876222M045056K148973q95129l752889m736643k614798
$$ -4115407 -2612138 1264084 5309140 7458113 6562984 2810095 -1926548 -4541346
42122d541346J502124M056783K774401k24739j378601p86094j072195k021985
$$ -4541346 -3039222 1017561 3791962 3567223 2188622 1402528 330333 -1691652
42114a691652r21622J675626J863227p29866j622168O94647J579593j484010l402590
$$ -1691652 -2613274 -937648 925579 195713 -1426455 -731808 847785 -636225 -4038815
42105d038815L27675M989653L182115l296091n747082j462126L175757K965081
$$ -4038815 -3711140 1278513 4460628 1164537 -4582545 -6044671 -2868914 96167
42097I6167M96111L64734K070500J920263j016620l800224l372859J14676L463201
$$ 96167 592278 957012 3027512 4947775 3931155 130931 -3241928 -3127252 335949
42088C35949L807378J876559O15911M21121j295785m528363m819953j73369M296130
$$ 335949 4143327 6019886 6635797 7056918 5761133 1232770 -3587183 -3760552 535578
42079E35578L367914j91446m43494J831897J286171j855226k094878J108394K036525
$$ 535578 3903492 3712046 3268552 5100449 6386620 4531394 2436516 3544910 5581435
42070E581435r49144k229152J065648L856733J972364j126365j392278j159718
$$ 5581435 4632291 2403139 3468787 7325520 9297884 8171519 6779241 5619523
42062E619523l207489m102588m90306L221266J436126k431539j111606L839293
$$ 5619523 2412034 -1690554 -2180860 1040406 2476532 44993 -1066613 2772680
42054B772680M068182j568952m824779j494796K100537j44483m510123l970415
$$ 2772680 6840862 5271910 447131 -1047665 1052872 908389 -3601734 -7572149
42046g572149J076467M474415L420204M82152j618556k475363k141181q08478
$$ -7572149 -6495682 -2021267 1398937 1881089 262533 -2212830 -4354011 -5162489
42038e162489j125q21292j315675J258605N519980O513886K100342l755627n565520
$$ -5162489 -5163614 -5984906 -7300581 -6041976 -521996 5991890 8092232 4336605 -1228915
42029a228915k549346J255819K126298K84647j375481q18606J369720L006381
$$ -1228915 -3778261 -2522442 -396144 -111497 -1486978 -2305584 -935864 2070517
42021B070517K425366j36556k612889k686134r5303K494435J847134k109565n693002
$$ 2070517 4495883 4359327 1746438 -939696 -1034999 1459436 3306570 1197005 -4495997
42012d495997n279104j081184L417254M955638K821341j105540l579452k443600
$$ -4495997 -9775101 -10856285 -7439031 -2483393 337948 -767592 -4347044 -6790644
42004f790644Q75105K527841J172894l7763J656740L930411K776581j063617l191648
$$ -6790644 -5915539 -3387698 -2214804 -2252567 -595827 3334584 6111165 5047548 1855900
41995A855900k207279p19466L3389J417235K653533N60812l998200n120084n86471
$$ 1855900 -351379 -1070845 -1037456 379779 3033312 3594124 -404076 -5524160 -6110631
41986f110631L668279K151343j792692j538890K595657M794673K915037j5867
$$ -6110631 -2442352 -291009 -2083701 -3622591 -1026934 3767739 6682776 6666909
41978F666909j924491l162550k781886M54862L601889K253956j939332k692905
$$ 6666909 4742418 1579868 -1202018 -747156 2854733 5108689 3169357 476452
41970D76452J072695L183104j11487m545052m830204j889062L57904R40060R96468
$$ 476452 1549147 4732251 4620764 75712 -4754492 -6643554 -6285650 -5345590 -4349122
41961d349122P11252M01934J400467L082866K492718n66314k132629n61612K73750
$$ -4349122 -3637870 -3235936 -1835469 1247397 3740115 3173801 1041172 479560 753310
41952G53310k161311l983717j435135K163703J850173n12019J83194L235057L766374
$$ 753310 -1408001 -5391718 -6826853 -4663150 -2812977 -3324996 -3141802 93255 3859629
41943C859629J405084J04452M44064o23873k760442k244888P09192J748522K12301
$$ 3859629 5264713 5369165 5813229 5189356 2428914 184026 893218 2641740 2854041
41934B854041k6204J341407r3399m293041m590487J389734O193042L364482k578506
$$ 2854041 2827837 4169244 4075845 -217196 -4807683 -3417949 2775093 6139575 3561069
41925C561069l395763P67374L491821K500764P09360o61881k784029m215014k073959
$$ 3561069 165306 932680 4424501 6925265 7634625 6972744 4188715 -26299 -2100258
41916b100258J834536K245181j542936m287359k503719J279024L272240L078825
$$ -2100258 -265722 1979459 436523 -3850836 -6354555 -5075531 -1803291 1275534
41908A275534K004991N40379o78545m56796Q61898J392521O44155j49623q51704
$$ 1275534 3280525 3820904 3142359 2685563 3547461 4939982 5584137 5434514 4582810
41899D582810k236454k853784l84841L162445K728612j564705l091612J128261
$$ 4582810 2346356 -507428 -892269 2270176 4998788 3434083 342471 1470732
41891A470732M677145J291656m758396m862994N30511K963154m22738k949754
$$ 1470732 6147877 7439533 2681137 -2181857 -1651346 1311808 889070 -2060684
41883b060684R0997L898129K347507k325096l625795p06269J795293J795753J765550
$$ -2060684 -1969687 1928442 4275949 1950853 -1674942 -2381211 -585918 1209835 2975385
41874B975385K956334K925298J18992l061211l754718k461870j359183q41785
$$ 2975385 5931719 8857017 8976009 5914798 2160080 -301790 -1660973 -2502758
41866b502758M4543J010070P35832n89095r91085M84550K123293J707681m56471
$$ -2502758 -2458215 -1448145 -712313 -1301408 -2292493 -1807943 315350 2023031 1566560
41857A566560j945267j452370j84081M20215Q07052J821072K362830P53051j947297
$$ 1566560 -378707 -1831077 -2015158 -1594943 -787891 1033181 3396011 4149062 2201765
41848B201765k525628j06140K253685J668792p52778j803274n68802Q11060J98104
$$ 2201765 -323863 -430003 1823682 3492474 2739696 936422 367620 1178680 1376784
41839A376784k018827l373862k015355P43422J369795r98047k091548J774356
$$ 1376784 -642043 -4015905 -6031260 -5287838 -3918043 -4916090 -7007638 -5233282
41831e233282O597108M617231l873255q956411m416414L448939N346423J881645
$$ -5233282 1363826 5981057 2107802 -6848609 -11265023 -7816084 -2469661 -588016
41823e88016J40345J529833J318960j655097l261526j917025n44873j87015J214148
$$ -588016 -447671 1082162 2401122 746025 -2515501 -4432526 -4977399 -5164414 -3950266
41814c950266K964290J772888j213299j024557K014787J788544k707795m512544
$$ -3950266 -985976 786912 -426387 -1450944 563843 2352387 -355408 -4867952
41806d867952m00884L164593R84685k127420k57654L122421J595149k845288l451785
$$ -4867952 -5268836 -2104243 -1119558 -3246978 -3504632 -382211 1212938 -1632350 -5084135
41797e084135Q2414K357393J586654N48931J52622r19949j689803m00367J050211
$$ -5084135 -5001721 -2644328 -1057674 -508743 -356121 -1276070 -2965873 -3366240 -2316029
41788b316029J52641q50735J153281L341438R76806l840216m845312j465830J494969
$$ -2316029 -2163388 -3014123 -1860842 1480596 2457402 -1382814 -6228126 -7693956 -6198987
41779f198987K543435L826202M005266j73435n314657l931510L081299N953293
$$ -6198987 -3655552 170650 4175916 4002481 -1312176 -5243686 -2162387 3790906
41771C790906O98262m727181k943166K317857L499228M77004j444295k96053J320069
$$ 3790906 4489168 -238013 -3181179 -863322 2635906 3112910 1668615 1372562 2692631
41762B692631J107777q14386k853184k868597l19988J877124Q47947j157978R5214
$$ 2692631 3800408 2986022 132838 -2735759 -3055747 -1178623 -330676 -1488654 -1393440
41753a393440L058483K247610j785257k237460K229526M100968p51973n635481
$$ -1393440 1665043 3912653 2127396 -110064 2119462 6220430 5468457 -167024
41745a67024l482022K290515M017352J260981r12314p61263j50841O46300K090301
$$ -167024 -3649046 -1358531 2658821 3919802 3007488 2246225 2095384 2741684 4831985
41736D831985K040423r93053l778581k712341M65182K129008K605255L320524
$$ 4831985 6872408 5879355 2100774 -611567 -146385 1982623 4587878 7908402
41728G908402J959337l115739o974363m071548K116906L151885j752831m930188
$$ 7908402 9867739 6752000 -222363 -4293911 -2177005 974880 -777951 -5708139
41720e708139k135602K314160L571504K551802J785494P43479j459539k878427
$$ -5708139 -7843741 -5529581 -1958077 593725 2379219 3122698 1663159 -1215268
41712a215268j582802R23357J794815P25645j93982M43976J658043J241009j457084
$$ -1215268 -2798070 -1874713 -79898 645747 451765 895741 2553784 3794793 2337709
41703B337709m011682l446701m99670R95500j25003m94410J899219L760295J852837
$$ 2337709 -1673973 -5120674 -5620344 -4624844 -4749847 -5244257 -3345038 415257 2268094
41694B268094j142763p41833J958809K204765o84647k818202k313798j318001
$$ 2268094 1125331 383498 2342307 4547072 3862425 1044223 -1269575 -2587576
41686b587576j333325j063111L63119J657156J705006J004234M04349L08934P16596
$$ -2587576 -3920901 -4984012 -4620893 -2963737 -1258731 -254497 149852 458786 1175382
41677A175382O28839j064983k758700j106571L143211M416058O88721k318729
$$ 1175382 1804221 739238 -2019462 -3126033 17178 4433236 5121957 2803228
41669B803228k11506K178616r95385n412741l019228L569473M101885k638354
$$ 2803228 2591722 4770338 3774953 -1637788 -4657016 -1087543 3014342 375988
41661C75988o630800k687303K315621J889146m93573M60829K823246K796636K042984
$$ 375988 -6254812 -8942115 -6626494 -4737348 -5230921 -4770092 -1946846 849790 2892774
41652B892774L131382L403548j84971m724061n717104l692422j319863J545298
$$ 2892774 6024156 9427704 9242733 4518672 -1198432 -4890854 -6210717 -4665419
41644d665419M647875M121469j282810n317573k447314L130917L984415J068684
$$ -4665419 -17544 4103925 2821115 -2496458 -4943772 -1812855 2171560 3240244
41636C240244M78887J826007k92105m653636l904121K338536N180584L74022m750555
$$ 3240244 3719131 5545138 5253033 599397 -3304724 -966188 4214396 4588418 -162137
41627a62137l040783J832221K673343K55663J78939K563107K604548n77323k680473
$$ -162137 -3202920 -1370699 1302644 1558307 1737246 4300353 6904901 6327578 3647105
41618C647105j439476P31699J652615J942829J919872L65381k340544l543140
$$ 3647105 2207629 2939328 4591943 6534772 8454644 8820025 6479481 2936341
41610B936341k209477m57258K9810J44232O60015N08318n61225o14842J010706
$$ 2936341 726864 269606 299416 443648 1103663 1611981 1050756 435914 1446620
41601A446620J715861k61046k341632j427175R50128J115955o16555o41019J659205
$$ 1446620 3162481 2901435 559803 -867372 82756 1198711 582156 -58863 1600342
41592A600342K815227R93742j335428j725718j054550p60676j53266J224937J420067
$$ 1600342 4415569 5409311 4073883 2348165 1293615 532939 379673 1604610 3024677
41583C024677r35351l492019k951792K69267K730597K561503J129033N32618J282265
$$ 3024677 2089326 -1402693 -4354485 -4085218 -1354621 1206882 2335915 2868533 4150798
41574D150798K366401K433659J058534o73649j496474j911710l282213m843396
$$ 4150798 6517199 8950858 10009392 9335743 7839269 5927559 2645346 -2198050
41566b198050m021945n97855K147838K015037R47792J389319K188127J033475
$$ -2198050 -6219995 -6817850 -4670012 -2654975 -1707183 -317864 1870263 2903738
41558B903738j097652j321401N11565J817576J374461N25389M35278N53168n3536
$$ 2903738 1806086 484685 996250 2813826 4188287 4713676 5148954 5702122 5648586
41549E648586j446817k749904k409391L95562L590638L342787q99912m532560
$$ 5648586 4201769 1451865 -957526 -561964 3028674 6371461 5471549 938989
41541I38989l340643Q52451K835118R02056j837122k212395l84007J194317M30524
$$ 938989 -2401654 -1549203 1285915 2187971 350849 -1861546 -2245553 -1051236 -620712
41532f20712k209005l339382k66749M372777M797232L18729k882265q64527K136354
$$ -620712 -2829717 -6169099 -6435848 -2063071 2734161 3052890 170625 -693902 1442452
41523A442452J143881j194928J95988L412410K883957o53843j676435J45952L2568
$$ 1442452 2586333 1391405 1587393 4999803 7883760 7229917 5553482 5699434 5732002
41514E732002k221018j605379K011904K258854k500608m901399m4162O133506
$$ 5732002 3510984 1905605 3917509 6176363 3675755 -1225644 -1269806 4863700
41506D863700N687442K42865k541445l65824J985417N66621l055178m727481k400443
$$ 4863700 10551142 10794007 8252562 7886738 9872155 10438776 7383598 2656117 255674
41497B55674J828128L325174k4396m306879l983387K39470K251457j35229k118845
$$ 255674 2083802 5408976 5384580 1077701 -2905686 -2666216 -414759 -549988 -2668833
41488b668833j01159K764945K521898O17507m1875n57304k700809m121477k157126
$$ -2668833 -2769992 -5047 2516851 3134358 3092483 2535179 -165630 -4287107 -6444233
41479f444233Q50525J395460R64156K617615M141660J306347l649713m111668
$$ -6444233 -5593708 -4198248 -3234092 -616477 3525183 4831530 1181817 -2929851
41471b929851L61747K872169R4303k631614m20197L076324J926501k021835j962898
$$ -2929851 -2568104 304065 398368 -2233246 -2653443 422881 2349382 327547 -1635351
41462a635351K613374M460864l38980n920815n005098O37463L479557J590219
$$ -1635351 978023 5438887 5099907 -820908 -5826006 -5188543 -1708986 -118767
41454a18767J25844J593160J839535j602085l889594o50529L926850L381061m32312
$$ -118767 7077 1600237 3439772 1837687 -2051907 -2702436 1224414 4605475 4173163
41445D173163p00874K616373K916166j459245m363424k244931N37238j16309j533843
$$ 4173163 3472289 6088662 9004828 7545583 3182159 937228 1474466 1358157 -175686
41436a75686l9473K470881K291697j9448j497148j346009l25110J274517K362992
$$ -175686 -215159 2255722 4547419 4527971 3030823 1684814 1359704 2634221 4997213
41427D997213J118900j483516j971282J4394R42927n8503M48688K987745K915118
$$ 4997213 6116113 4632597 2661315 2675709 3618636 3560133 4008821 6996566 9911684
41418I911684j077140l263491m96726J676995j284971m213752j131658L499108
$$ 9911684 8834544 5571053 5074327 6751322 5466351 1252599 120941 3620049
41410C620049K013017k887552k602148K352714L282312j558128m216588q45041
$$ 3620049 5633066 2745514 143366 2496080 5778392 4220264 3676 -841365
41402h41365K358232L69655k579033q90969L391066M592211J620722k131905l635999
$$ -841365 1516867 1886522 -692511 -1583480 1807586 6399797 8020519 5888614 2252615
41393B252615j950858J736653L830668J513830k523659k722830Q83867K126264
$$ 2252615 301757 2038410 5869078 7382908 4859249 2136419 3020286 5146550
41385E146550j490816m426554k056373J723981R99206k483490k389998J912266
$$ 5146550 3655734 -770820 -2827193 -1103212 -104006 -2587496 -4977494 -3065228
41377c065228M570443K370451r48118p84494J916764K517668r97515n367602n461260
$$ -3065228 1505215 3875666 2927548 2143054 4059818 6577486 5579971 212369 -5248891
41368e248891R258O268086O950256J349600m332502m307226p5575K345727P83851
$$ -5248891 -5239633 1028453 7978709 9328309 4995807 688581 613006 2958733 3742584
41359C742584j021162O9174J854722Q31965j848713k130377L17879J334305j207290
$$ 3742584 2721422 2790596 4645318 5477283 3628570 1498193 1816072 3150377 1943087
41350A943087l950525l182301k03493J401899J284162J348347J228166o29617
$$ 1943087 -2007438 -5189739 -5393232 -3991333 -2707171 -1358824 -130658 -760275
41342g60275k375678n05678L637025M522988Q14795k306651j331027M60218o07808
$$ -760275 -3135953 -3641631 -4606 4518382 5333177 3026526 1695499 2155717 1547909
41333A547909k083924O6318M122274N016060J843906j758637l249505l007134
$$ 1547909 -536015 -469697 3652577 8668637 10512543 8753906 5504401 2497267
41325B497267j757991m8949O27815m59928j388250k73099J466622J421812K14009
$$ 2497267 739276 690327 1318142 858214 -530036 -803135 663487 2085299 2299308
41316B299308J65943J398607K120581J377008q17356l973885n614658k518977
$$ 2299308 2465251 3863858 5984439 7361447 6544091 2570206 -3044452 -5563429
41308e563429L662982O010960J438651l991942l666200J01018J235451J90419
$$ -5563429 -1900447 4110513 5549164 1557222 -2108978 -2007960 -772509 -582090
41300e82090J340204L425345J539541l017702l991256q08299R75627O999O33058
$$ -582090 758114 4183459 5723000 2705298 -1285958 -2094257 -1118630 -1111631 -478573
41291d78573L026737J549540m369729p098486k601942L041766L675263J836801
$$ -478573 2548164 4097704 -272025 -7370511 -9972453 -6930687 -3255424 -1418623
41283a418623K083824K752355P40164j558876q54354N03154p37537j946478M28139
$$ -1418623 665201 3417556 4157720 2598844 1744490 2247644 1510107 -436371 -8232
41274h232L070577O89742m069027l789925J752944M817683J476106l022816k729837
$$ -8232 3062345 3752087 -316940 -4106865 -2353921 2463762 3939868 917052 -1812785
41265a812785J021958L169688K264760P71874L81389K44516p49834k095474k426705
$$ -1812785 -790827 2378861 4643621 5415495 5796884 6041400 5291566 3196092 769387
41256G69387j323556J54573P68838M28265l39694j505471k760332k361648R02863
$$ 769387 -554169 -399596 369242 797507 457813 -1047658 -3807990 -6169638 -5266775
41247e266775M747477N253518K231939k70545K31498J572785J129063k44629p08446
$$ -5266775 -519298 4734220 6966159 6695614 6927112 8499897 9628960 9384331 8675885
41238H675885q42877j782803k422116j416670J9194J45906k81689J96133P09362
$$ 8675885 7833008 6050205 3628089 2211419 2230613 2376519 2094830 2290963 3000325
41229C000325k35429j584398j375801l04625n22221j792646j910922l75688J192349
$$ 3000325 2764896 1180498 -195303 -499928 -1022149 -2814795 -4725717 -5101405 -3909056
41220c909056J894557K228268K283494J669530Q84438N92138J36454j056056j549367
$$ -3909056 -2014499 213769 2497263 4166793 5051231 5643369 5779823 4723767 3174400
41211C174400Q274J817406J103291j243470j744570L8129Q11490q55051k200144
$$ 3174400 3182674 5000080 6103371 4859901 3115331 3153460 3964950 3109899 909755
41202I09755j113402L78542q6560j065982j83880J203377K6536l044344m104010
$$ 909755 -203647 174895 88335 -977647 -1161527 41850 68386 -2975958 -7079968
41193g079968j785697J145338K434867K970973L584433K794364K2135j919581
$$ -7079968 -8865665 -7720327 -5285460 -2314487 1269946 4064310 4086445 2166864
41185B166864o19713J738808J327159j591143l296776k048138N62532K907607
$$ 2166864 1547151 3285959 4613118 3021975 -274801 -2322939 -1760407 1147200
41177A147200M290048L287877o25553m102107l263686m7724J41543k528323k200590
$$ 1147200 5437248 8725125 8099572 3997465 733779 686055 827598 -1700725 -3901315
41168c901315K241729M261465O55332k417187O8635L012082L15080l627793j262389
$$ -3901315 -1659586 2601879 3257211 840024 908659 3920741 4235821 608028 -654361
41159f54361M171834L232847l688168o676356k384519J856456J677649J910702
$$ -654361 3517473 6750320 3062152 -3614204 -5998723 -4142267 -2464618 -553916
41151e53916N341871N976768k62602o816141n888329k33000J915684q97977l357359
$$ -553916 4787955 10764723 10502121 3685980 -2202349 -2435349 -519665 -1417642 -4775001
41142d775001k548719m50895J055093J993092J883403Q355k189845k144317O46048
$$ -4775001 -7323720 -7774615 -6719522 -4726430 -2843027 -2834672 -5024517 -7168834 -6522786
41133f522786M231272O050328M300183m00460l952850k431645K160671L439032
$$ -6522786 -2291514 3758814 8058997 7658537 3705687 1274042 3434713 6873745
41125F873745o66166m910008m416831r80483J003027P08177j95754j056165j414057
$$ 6873745 6207579 1297571 -3119260 -4099743 -3096716 -2388539 -2584293 -3640458 -5054515
41116e054515l0350K270534K168745r37967k961968j232699J413492J801030J417161
$$ -5054515 -5084865 -2814331 -645586 -1583553 -4545521 -5778220 -4364728 -2563698 -1146537
41107a146537K513958L337850J528381j258396k305431k161979k201230j389221
$$ -1146537 1367421 4705271 6233652 4975256 2669825 507846 -1693384 -3082605
41099c082605O55060J222238p28975j442399J472484M007130K082021j264505
$$ -3082605 -2427545 -1205307 -1934282 -3376681 -1904197 2102933 4184954 2920449
41091B920449r79179J426201J017321j740748k279376k12198M96047j126902j669512
$$ 2920449 1941270 3367471 4384792 2644044 364668 152470 648517 -478385 -2147897
41082b147897O84530L631549M289328J846137k486603n493626l987027O22284
$$ -2147897 -1463367 2168182 6457510 8303647 5817044 323418 -3663609 -3041325
41074c041325K920757J225337J69140K358543L451947L27702k478820r07040P82029
$$ -3041325 -120568 1104769 1273909 3632452 7084399 7412101 4933281 4026241 4808270
41065D808270j874986m280002j027722L001103Q87411k793080M29734O516049
$$ 4808270 2933284 -1346718 -2374440 626663 1514074 -1279006 -849272 5666777
41057E666777M855421k337902k873084L699410M548509l745396q332238j698144
$$ 5666777 10522198 8184296 5311212 9010622 13559131 9813735 1481497 -216647
41049b16647N947489M169055j935596l299835j933665l324756m021970J185271
$$ -216647 5730842 9899897 7964301 4664466 2730801 -593955 -4615925 -3430654
41041c430654P289624N972180r11371n049707m199316j701135J640683N714439
$$ -3430654 3858970 9831150 8919779 3870072 -329244 -2030379 -389696 5324743
41033E324743N721035j323186q248487n970421K476723O003013J771794k454638
$$ 5324743 11045778 9722592 1474105 -4496316 -2019593 3983420 5755214 3300576
41025C300576j648941N04469j4914j642908j793415r14057p0615P21158Q75891
$$ 3300576 1651635 2156104 2141190 498282 -1295133 -2209190 -2279805 -1558647 -682756
41016f82756l8915l26345J159365J900597j70044j773046Q80377M819220M561317
$$ -682756 -721671 -1048016 111349 2011946 1841902 68856 949233 5768453 10329770
41007A0329770J423951R21518K564404J010049l286538m214952j561342k253608
$$ 10329770 11753721 12675239 15239643 16249692 12963154 8748202 7186860 4933252
40999D933252p491766q854961k008923N053255M107693p87404q62071L281478
$$ 4933252 -2558514 -11413475 -13422398 -8369143 -4261450 -5048854 -5910925 -2629447
40991b629447M178833N05406j627093O06556K884951J547283j215001j910324
$$ -2629447 1549386 2054792 427699 1034255 3919206 5466489 4251488 2341164
40983B341164p47671J06711M4973j41063N7039N15358N41104p91020k937453l232835
$$ 2341164 1593493 1700204 1745177 1604114 1661153 2176511 2717615 1926595 -1010858 -4243693
40973d243693j54920L499409L689367J127358N91816L487966M931853O14130o270480
$$ -4243693 -4398613 -899204 2790163 3917521 4509337 7997303 12929156 13543286 7272806
40964G272806q314105l046763M152203O294059J844571m647398p320887m049781
$$ 7272806 -1041299 -4088062 64141 6358200 8202771 3555373 -3765514 -7815295
40956g815295K004630N458877M009118N01232r64128O6141J134464J383749K149432
$$ -7815295 -5810665 -351788 3657330 4158562 3194434 3260575 4395039 5778788 7928220
40947G928220L084479J661955j952443l486711q87614J528660o08129m236156
$$ 7928220 11012699 12674654 10722211 7235500 6347886 7876546 7268417 3032261
40939C032261l239211J399374K483083k092476n750204l190441K146869M139574
$$ 3032261 -206950 1192424 3675507 1583031 -4167173 -7357614 -5210745 -1071171
40931a071171K386150K14352j398018k874556k421039J077559L888438J870718
$$ -1071171 1314979 1529331 131313 -2743243 -5164282 -4086723 -198285 1672433
40923A672433k380522k560564J861941M895596K897570j232609l480447l265368
$$ 1672433 -708089 -3268653 -1406712 3488884 6386454 5153845 1673398 -1591970
40915a591970j430873J486756L519725K383338j02629O06735M196677M518721
$$ -1591970 -3022843 -1536087 1983638 4366976 4264347 4871082 9067759 13586480
40907A3586480r84273o178731m793619M35576K392158o9301k232480j797070q86714
$$ 13586480 12602207 6423476 1629857 2065433 4457591 4388290 2155810 358740 -527974
40898e27974n39370Q37588K908233K576712o76339k857484r65758K707355L879107
$$ -527974 -1067344 -229756 2678477 5255189 4578850 1721366 755608 3462963 7342070
40889G342070J582558j657380l235032k533990p99282P9441m47121p26380O94489
$$ 7342070 8924628 7267248 4032216 1498226 698944 778385 331264 -395116 299373
40880B99373K347846J729508n41666j414246k73705L55364m20418k91283J612251
$$ 299373 2647219 4376727 3835061 2420815 2147110 2502474 2082056 1790773 3403024
40871C403024K526287Q47657p46099r9453K14902k373790m763030k531974K205398
$$ 3403024 5929311 6776968 6030869 5931416 6146318 3772528 -990502 -3522476 -1317078
40862a317078L351446M15133q26488K121453M635482K873194l27601j015596o76976
$$ -1317078 2034368 2449501 1623013 3744466 8379948 11253142 10925541 9909945 9232969
40853I232969k523448m903955l928718n38852P84226l64105K62370L814818N535741
$$ 9232969 6709521 1805566 -2123152 -2662004 -1877778 -2241883 -1979513 1835305 7371046
40844G371046K074640k809127l384569J64979K879298K256495K92837r70836j753524
$$ 7371046 9445686 6636559 3251990 3416969 6296267 8552762 8845599 7874763 6121239
40835F121239j933731j77861K642664K648409j641177n636342l936598K116237
$$ 6121239 4187508 4009647 6652311 9300720 7659543 2023201 -1913397 202840
40827B02840N886071M058250O6019j590694q15259k12683q97028k016564k406576
$$ 202840 6088911 10147161 10213180 8622486 7807227 7594544 6697516 4680952 2274376
40818B274376j089054J927663M097770K150638k882469n388171k298045K434010
$$ 2274376 1185322 3112985 7210755 9361393 6478924 1090753 -1207292 1226718
40810A226718L460017J176383n47101r28865j683766j964611M30894L751850L967295
$$ 1226718 4686735 5863118 5316017 4387152 2703386 738775 1169669 4921519 8888814
40801H888814J536041O79688J672034K49875m016085n497261j489132K731290
$$ 8888814 10424855 11104543 12776577 13026452 9010367 3513106 2023974 4755264
40793D755264J845569j674722k365234k03291R26081J60909k09063K59596j65266
$$ 4755264 6600833 4926111 2560877 2357586 3283667 3444576 3235513 3495109 3329843
40784C329843j587997k265330j695584r15591l26471L78363J001553J507404K616695
$$ 3329843 1741846 -523484 -2219068 -3134659 -3461130 -3082767 -2081214 -573810 2042885
40775B042885M081666M115129K055251n54944k722031m774804n266262j643513
$$ 2042885 6124551 10239680 12294931 11739987 9017956 4243152 -1023110 -2666623
40767b666623L796151M124649k151729o793963l014995M214695N891470K489917
$$ -2666623 1129528 5254177 3102448 -3691515 -6706510 -2491815 3399655 5889572
40759E889572J326363L470112K885715k096334n848146n075945k994814j990874
$$ 5889572 7215935 10686047 13571762 11475428 5627282 551337 -2443477 -4434351
40751d434351O2912L504441M210140P61706k089229r85697P73190k69034j386686
$$ -4434351 -4371439 -866998 3343142 4104848 2015619 1029922 1803112 1534078 147392
40742A47392J086634M562875L959982j54400k682792j693055M3564O50309J673616
$$ 147392 1234026 5796901 9756883 9602483 6919691 5226636 5270200 5920509 7594125
40733G594125M216469N951270L821959j668027o396026o883003l877377r64755
$$ 7594125 11810594 17761864 21583823 19915796 13519770 6636767 2759390 1794635
40725A794635J2191M06564J265452J134057p18723j702396K23056K413770J306113
$$ 1794635 1806826 2213390 3478842 4612899 3894176 2191780 2414836 4828606 6134719
40716F134719j598224k164111m98988p2496j004238k50716J774373J329043j178751
$$ 6134719 4536495 2372384 1873396 1800900 796662 545946 2320319 3649362 2470611
40707B470611o80940L634628N563562J249604m541410n511692k398866j48823
$$ 2470611 1789671 5424299 10987861 12237465 7696055 2184363 -214503 -363326
40699c63326k89721m94529P33758K615123L792948L213633Q88606j177456j071375
$$ -363326 -653047 -1147576 -413818 2201305 5994253 9207886 10096492 8919036 7847661
40690G847661k15273j296477l190411k487403q007J2196k140157j335536L078272
$$ 7847661 7632388 6335911 3145500 658097 650090 662286 -1477871 -2813407 264865
40681B64865M985617J507691k034935j126478J148176J062788R09822K997156
$$ 264865 5250482 6758173 4723238 3596760 4744936 5807724 6717546 9714702
40673I714702L738728L35902k764747j157622J546736N68865r32708J840186N227108
$$ 9714702 13453430 13789332 11024585 9866963 11413699 11982564 11049856 12890042 18117150
40664A8117150L189074p27251J462021P548389P303207r89263p438049n673104
$$ 18117150 21306224 20578973 22040994 29589383 36892590 35903327 28465278 22792174
40656B2792174r18879N1288j850433k802338k728608k730412j515462J391597
$$ 22792174 21873295 21924583 20074150 17271812 14543204 11812792 10297330 11688927
40648A1688927L098892J481939j399102k481541j425054L56293J465285N01003
$$ 11688927 14787819 16269758 14870656 12389115 10964061 11320354 12785639 13286642
40640A3286642k605202m906100l464781P1463J676687J118119J378773K539752
$$ 13286642 10681440 5775340 2310559 2382022 4058709 5176828 6555601 9095353
40632I095353J691799r98780j878916j57095R07610O7992k12834Q18985P26365
$$ 9095353 10787152 9788372 7909456 7752361 8659971 8727963 8515129 9334114 10060479
40623A0060479q77290j198365K17479M37512j011101j084441N73104O12115j217336
$$ 10060479 9183189 7984824 8202303 8639815 7628714 6544273 7117377 7729492 6512156
40614F512156r99496J588032J776063j334135k185453J131006K426961j805858
$$ 6512156 5512660 7100692 8876755 7542620 5357167 6488173 8915134 7109276
40606G109276n310416k389387K188491J568589j418676M2147M423444N007086
$$ 7109276 1798860 -590527 1597964 3166553 1747877 1790024 6213468 11220554
40598A1220554J759518J67150O11555j135819m101052k854546J874288L078745
$$ 11220554 12980072 13147222 13758777 12622958 8521906 5667360 7541648 10620393
40590A0620393p90350l193978p68884J549714j64377k498913j788238m07315j278277
$$ 10620393 9830043 6636065 5867181 7416895 7252518 4753605 2965367 2558052 1279775
40581A279775k143557k59204K277912K666858K331695L137433L075199M74695
$$ 1279775 -863782 -1122986 1154926 3821784 6153479 9290912 12366111 12840806
40573A2840806j698166q05812K56683j660170l368941m34143M319784M540692
$$ 12840806 11142640 10336828 10593511 8933341 5564400 5130257 9450041 13990733
40565A3990733N32328j756465q91870j328287m333181n278585j837872J997815
$$ 13990733 14523061 12766596 11874726 10546439 6213258 934673 -903199 1094616
40557A094616K788845K495184L340456L364177Q67608j411694o70150J206892
$$ 1094616 3883461 6378645 9719101 13083278 13950886 12539192 11869042 13075934
40549A3075934J148348j84284o43555n55443q67447n62333N56352L1863k511941
$$ 13075934 14224282 14039998 13396443 12841000 11973553 11411220 11967572 11999435 9487494
40540I487494k833643J149844M362891K151749j288928O42244N444190N184033
$$ 9487494 6653851 7803695 12166586 14318335 13029407 13671651 19115841 24299874
40532B4299874j29122k482906O64597K657728m47234l483944j518478K494169
$$ 24299874 24170752 21687846 22352443 25010171 24562937 21078993 19560515 22054684
40524B2054684M093334M216150M497645K301777l374654o757329l121123K569733
$$ 22054684 26148018 30364168 34861813 37163590 33788936 27031607 23910484 26480217
40516B6480217K212495l314058o043350l098561M96232Q65053J65828J135877
$$ 26480217 28692712 25378654 19335304 16236743 16732975 17598028 17763856 18899733
40508A8899733K386487J525239o60694j478262O1854K314730K862316R86530j400335
$$ 18899733 21286220 22811459 22150765 20672503 20734357 23049087 25911403 26897933 25497598
40499B5497598j958168j019128o72456p92595Q94637M152242N615231M297893
$$ 25497598 23539430 22520302 21847846 21055251 21949888 26102130 31717361 36015254
40491C6015254L303147L945044L201022P1932j030117K355085N360218L331334
$$ 36015254 39318401 43263445 46464467 46536399 45506282 47861367 53221585 56552919
40483E6552919k43572J01834K294894J149643j304089J236350Q025810J1876319
$$ 56552919 56309347 56411181 58706075 59855718 58551629 59787979 67813789 79690108
40475G9690108J0665517R877417J3229294J8447267K3039309K6711078K6873155
$$ 79690108 90355625 100233042 113462336 131909603 154948912 181659990 208533145
40468B08533145J9191646M754226r467202j8916880k4505847k6829344k4346821
$$ 208533145 227724791 232479017 223011815 204094935 179589088 152759744 128412923
40461A28412923j8749068j4999574j3874641j1181039o389753m667526p491982
$$ 128412923 109663855 94664281 80789640 69608601 63218848 58551322 51059340
40454E1059340q887887n130358j136298k146258n230318m778918j449843J82716
$$ 51059340 42171453 37041095 35904797 33758539 28528221 23749303 22299460 22482176
40446B2482176q78149k197784k538906j912551J22770K485831K110868j113038
$$ 22482176 21604027 19406243 16867337 14954786 15077556 17563387 19674255 18561217
40438A8561217k666513k05137K226221R68190p73830J451587N146985M560564
$$ 18561217 15894704 15689567 17915788 18883978 18110148 19561735 24708720 29269284
40430B9269284N7926k523146p28961J943631K039451J4135j948307k272022k01407
$$ 29269284 29327210 26804064 26075103 28018734 30058185 30072320 28124013 25851991 25650584
40421B5650584L326411N420597M378525K183423J432041J214310r51725m288306
$$ 25650584 28976995 34397592 38776117 40959540 42391581 43605891 42654166 38365860
40413C8365860n297306k933496l54401q78058l808223n116618k307467J646137
$$ 38365860 33068554 30135058 29780657 28902599 25094376 19977758 17670291 19316428
40405A9316428J042644m334806o723322m60856Q057625P724162p14100m667414
$$ 19316428 20359072 16024266 9300944 8840088 16897713 24621875 23907775 19240361
40397A9240361J536421P869081M164289m517780o555721j219691K480168O30829
$$ 19240361 20776782 28645863 32810152 28292372 21736651 20516960 22997128 23627957
40389B3627957j946193j703356r88538j944663k877242k046600n0639K098405
$$ 23627957 21681764 19978408 18989870 17045207 14167965 12121365 12070726 14169131
40381A4169131L330737J839155j854416l051622R56497N138884L141818k576250
$$ 14169131 17499868 19339023 17484607 14432985 15389482 20528366 23670184 21093934
40373B1093934m055404m7603K830608J176759q50238L25993K440522K605528J625201
$$ 21093934 17038530 16990927 19821535 20998294 20148056 20474049 22914571 25520099 27145300
40364B7145300O61105r79922k550345j572476J133289J356767j581709l247857
$$ 27145300 27806405 26826483 24276138 22703662 23836951 25193718 23612009 20364152
40356B0364152j566569o8375r58996j012244J941913M278013K915628J071069
$$ 20364152 18797583 18729208 17770212 16757968 18699881 22977894 25893522 26964591
40348B6964591K329725L730525R88482l205942l075844N80942J928294J29158
$$ 26964591 29294316 33024841 34013323 30807381 27731537 28312479 30240773 30369931
40340C0369931M15152M690485Q098270O919497L846404K530032K117693Q87746
$$ 30369931 30785083 35475568 43573838 50493335 54339739 56869771 58987464 59875210
40332E9875210Q24777L892652P050366O334292L866930M936729Q832510R042167
$$ 59875210 60699987 64592639 71643005 77977297 81844227 86780956 95613466 104655633
40324A04655633L691816p76902M15266K722529k0348m850187l913588K893101
$$ 104655633 108347449 107570547 107985813 110708342 110687994 105837807 101924219 104817320
40316A04817320P698978P165837O941654J1044861J4256187R866328m24891r654326
$$ 104817320 112516298 119682135 126623789 137668650 151924837 161791165 161366274 151711948
40308A51711948j4593154j6262851j4825440r911868m172151j024516O2941J474881
$$ 151711948 137118794 120855943 106030503 96118635 91946484 90921968 90984909 92459790
40300I2459790K287383L37340k038655l21795M596106P297826O730181P852177
$$ 92459790 94747173 95084513 93045858 92724063 97320169 104617995 111348176 119200353
40292A19200353J2795386J6683936J5581014J3382483J6218091K3453337K9269049
$$ 119200353 131995739 148679675 164260689 177643172 193861263 217314600 246583649
40285B46583649L1506461L3911392L9009632M2489027L6995439K0463318j107756
$$ 246583649 278090110 312001502 351011134 393500161 430495600 450958918 449851162
40278D49851162j9350242l0649693l6630386l9141356l7941091l3712279k9617732
$$ 449851162 430500920 399851227 363220841 324079485 286138394 252426115 222808383
40271B22808383k7454914k5050948k0400272j5841363j4415145j4180062j0761380
$$ 222808383 195353469 170302521 149902249 134060886 119645741 105465679 94704299
40264I4704299m609556j014646k766141o900418r256115q677124o134642k974357
$$ 94704299 90094743 89080097 86313956 79413538 70157423 61480299 55345657 52371300
40256E2371300p34679o5398L22622J298330R22947k308753n262231l813497J09152
$$ 52371300 51636621 51571223 51893845 53192175 54115122 51806369 46544138 42730641 42839793
40247D2839793N97303l004361m834343j689994K439583L292233K256103K181728
$$ 42839793 43437096 40432735 35598392 33908398 36347981 39640214 41896317 44078045
40239D4078045K095419k8468k921757m220161m057759l255160r80418K507074
$$ 44078045 46173464 46144996 43223239 39003078 34945319 31690159 30709741 33216815
40231C3216815L945982J688759n92640J010842M222070L872981N6040j975892
$$ 33216815 37162797 38851556 38258916 39269758 43491828 47364809 47420849 45444957
40223D5444957K86807L497101M069612K935898K814411L517869K616796j81800
$$ 45444957 45731764 49228865 53298477 56234375 59048786 62566655 65183451 65001651
40215F5001651j760467M91718M732502O380267L863542N81618j02921N09952n16270
$$ 65001651 63241184 63732902 68465404 74845671 78709213 79290831 79187910 79697862 79181592
40206G9181592k242569j633295K04114j053783n193756o362881k037309K178415
$$ 79181592 76939023 75305728 75509842 74456059 69262303 62899422 60862113 63040528
40198F3040528M77212m664081o554720l866390j176909j626042l764736n114904
$$ 63040528 63517740 58853659 52298939 48432549 47255640 45629598 41864862 36749958
40190C6749958m815334k855408j36480O93248k315860o770829p594592l152033
$$ 36749958 31934624 29079216 28942736 29635984 27320124 20549295 12954703 9802670
40182I802670K388358L741256K60548l678836l515997M47395L040276K44877n111631
$$ 9802670 12191028 15932284 16192832 12513996 8997999 9445394 12485670 12730547 7618916
40173G618916o129300q88204M563113M273780R2281k108823j105620m73285j491566
$$ 7618916 1489616 601412 5164525 9438305 9530586 7421763 6316143 5842858 4351292
40164D351292j312444J321221L397145K454908K90659m58926m28015j459099k626191
$$ 4351292 3038848 4360069 7757214 10212122 10502781 10043855 9615840 8156741 5530550
40155E530550j581699J047153J825798n36205k962303k050947J307196L202791
$$ 5530550 3948851 4996004 6821802 6285597 3323294 1272347 2579543 5782334
40147E782334J925204j95746n38345K42112j38121j732780k298858p41225J373663
$$ 5782334 7707538 7511792 6973447 7215559 7077438 5344658 3045800 2304575 3678238
40138C678238J966223N77077j718682l026818j479441K624944N574716L626809
$$ 3678238 5644461 6221538 4502856 1476038 -3403 2621541 8196257 11823066
40130A1823066j890909n430301l968617j96057K098478K661706K853569K252193
$$ 11823066 9932157 4501856 533239 337182 2435660 5097366 7950935 10203128
40122A0203128K45289j333565p40979o60k230793n914269n775151n9133O246772
$$ 10203128 10448417 9114852 8373873 8373213 6142420 228151 -5547000 -5606133 640639
40113F40639P032931K059075l165105l669068j10620K465441O81168l050783l650652
$$ 640639 7673570 9732645 6567540 2898472 2787852 5253293 5934461 2883678 -766974
40104g66974k94069K352492R28292j541760k47396L833453N077217J510068k258563
$$ -766974 -1061043 1291449 2219741 677981 430585 4264038 9341255 10851323 8592760
40095H592760j662894J574914K187989j458931n465068n353099j104012L352589
$$ 8592760 6929866 8504780 10692769 9233838 3768770 -1584329 -2688341 664248
40087F64248M789252L735764K655261K258901J298497k81419m83183J411592L007178
$$ 664248 5453500 9189264 11844525 14103426 15401923 15120504 14637321 16048913 19056091
40078A9056091K227871N66115L44846N28703j307902l952594l675216m42251J307771
$$ 19056091 21283962 21850077 22194923 22723626 21415724 17463130 13787914 13345663 14653434
40069A4653434o90490l196646k956600j774219k815318m824392m267352j493878
$$ 14653434 13962944 10766298 7809698 6035479 3220161 -1604231 -5871583 -7365461
40061g365461o1294m15822P85928M112951N059114J053245l281826k199717K279482
$$ -7365461 -7426755 -7842577 -7056649 -2943698 2115416 3168661 -113165 -2312882 -33400
40052c3400K836621k177766n770407k308067M081467N132706o3359m106997j724334
$$ -33400 2803221 625455 -5144952 -7453019 -3371552 1761154 1697795 -2409202 -4133536
40043d133536L400468M256875j25154m207551l727178n51729R76399r5927j205606
$$ -4133536 -733068 3523807 3398653 -808898 -4536076 -5087805 -4111406 -4207333 -5412939
40034e412939p05826K19504K19094q4507J98470L02986n91477j243345l2731K149588
$$ -5412939 -6118765 -5899261 -5680167 -5764674 -5566204 -5263218 -5854695 -7098040 -7130771 -4981183
40024d981183L025449K227019R70679p02474l084096l862614m56942M344624M230070
$$ -4981183 -1955734 271285 1241964 539490 -2544606 -6407220 -6864162 -2519538 1710532
40015A710532j376809n246224k712040J241847K42418k829255n17995O482923
$$ 1710532 333723 -4912501 -7624541 -6382694 -6140276 -8969531 -9487526 -3004603
40007c004603R348422M043209l098645m841708k129062l66158j045045j288256
$$ -3004603 6343819 10387028 7288383 2446675 317613 -48545 -1093590 -2381846
39999b381846L75565J630463j01741l684672m837806j040491M583270O171763
$$ -2381846 -2006281 -375818 -477559 -4162231 -9000037 -10040528 -5457258 714505
39991G14505K520204j219029q96489J136599J014345o8580Q02569J760359n55413
$$ 714505 3234709 2015680 1119191 2255790 3270135 3201555 4004124 5764483 5209070
39982E209070l601882k292938J557870J426254k431692k736732K079340M347136
$$ 5209070 1607188 -685750 872120 2298374 -133318 -2870050 -790710 3556426
39974C556426r8589m604574k507458K449566L084868j5321j382544j03470P24349
$$ 3556426 3457837 -1146737 -3654195 -1204629 1880239 1864918 482374 378904 1103253
39965A103253O30226J285217J875197P82329l58347M99412J423896Q8280j118152
$$ 1103253 1733479 3018696 4893893 5676222 5317875 5817287 7241183 7329463 6211311
39956F211311P88667K942845P29689l719382m030078K96435K986665M59484l730254
$$ 6211311 6999978 9942823 10672512 6953130 2923052 3219487 6206152 6665636 2935382
39947B935382m802322k297168J134122K644279O94581k948651l437202J259382
$$ 2935382 -1866940 -4164108 -3029986 -385707 308874 -2639777 -6076979 -4817597
39939d817597O128552N332451R51887k81137K176343K179635k345944n628830
$$ -4817597 1310955 6643406 7595293 7314156 9490499 11670134 9324190 3695360
39931C695360l460803K74964L38585j932887k104579k12510K40001j266318j657928
$$ 3695360 234557 509521 848106 -1084781 -3189360 -3401870 -3161869 -4428187 -6086115
39922f086115L81949K370050J965062K50855j87452R72619J509768N5238j646132
$$ -6086115 -5704166 -3334116 -1369054 -1118199 -1305651 -333032 1176736 1231974 -414158
39913d14158j146541P30361O49834k016869l541195j256862J967423J722308j301741
$$ -414158 -1560699 -830338 -180504 -2197373 -5738568 -6995430 -5028007 -3305699 -4607440
39904d607440k480005l34070J622224O75790j139803o76266J340251J493795j058396
$$ -4607440 -7087445 -7421515 -5799291 -5123501 -6263304 -6939570 -5599319 -4105524 -5163920
39895e163920k917736q78434L246676M230449K79511m019073l689311k87119Q41402
$$ -5163920 -8081656 -8960090 -5713414 -1482965 -1203454 -5222527 -8911838 -9198957 -8357555
39886h357555r26051p24245L548945P494528O723885K508320j463492l619222
$$ -8357555 -9283606 -10007851 -6458906 1035622 7759507 10267827 8804335 5185113
39878E185113l325682J22995M274033M005082j175207m947280l076138M45810
$$ 5185113 1859431 1982426 6256459 10261541 9086334 4139054 1062916 1508726
39870A508726L83913j915754k689227k274372j695951J566657P505601Q957776
$$ 1508726 1892639 -23115 -2712342 -4986714 -6682665 -5116008 2389593 11347369
39862A1347369J374186p702232q148115k046050R64886o68109o82602J636214
$$ 11347369 12721555 5019323 -3128792 -5174842 -4209956 -4878065 -5560667 -3924453
39854c924453P25645l083780k876801K162948M701019J768416j337696j624896
$$ -3924453 -3198808 -6282588 -9159389 -6996441 -2295422 -527006 -1864702 -3489598
39846c489598k125388k845176O59892O504340N950019j875376o263881j580628
$$ -3489598 -5614986 -8460162 -7800270 -1295930 4654089 2778713 -3485168 -5065796
39838e065796L651005J320836l340649j984741K976458M131577J200571j745997
$$ -5065796 -1414791 -93955 -3434604 -5419345 -2442887 1688690 2889261 1143264
39830A143264m555407p542364o110359J759259Q167826N186067k390436l814096
$$ 1143264 -3412143 -10954507 -17064866 -15305607 -7137781 -1951714 -4342150 -8156246
39822h156246J733496N629174L533809o06509k691347k363546L8617L336959L861340
$$ -8156246 -6422750 -793576 2740233 2133724 -557623 -2921169 -2882552 454407 4315747
39813D315747K47978k581249n23785K158120l41480m914254m515615k17538J313765
$$ 4315747 4563725 1982476 1458691 3616811 3275331 -1638923 -6154538 -6372076 -5058311
39804e058311j61937O96898L450202K238957k603006m117745r12361P84902r50185
$$ -5058311 -5220248 -4523350 -1073148 1165809 -1437197 -5554942 -6467303 -5682401 -6632586
39795f632586m63724L754592M685745j023536o002885l463808K368599L818347
$$ -6632586 -7096310 -3341718 1344027 320491 -5682394 -9146202 -6777603 -2959256
39787b959256J207030j93242N89016R94729J048406K125557K516771K57197j925641
$$ -2959256 -1752226 -1945468 -1356452 -361723 686683 2812240 5329011 5586208 3660567
39778C660567k45670L241275K967289j654374n192794l928435l96487Q87484o88369
$$ 3660567 3414897 6656172 9623461 7969087 2776293 -1152142 -1548629 -661145 -1349514
39769a349514j803106Q9665L220365L306980p75335m581116l517692N70814J931550
$$ -1349514 -3152620 -3062955 157410 3464390 2689055 -1892061 -5409753 -4838939 -2907389
39760b907389m95367j951421j31584J150671q06196k289840M93268M329741L766281
$$ -2907389 -3402756 -5354177 -5485761 -4335090 -5141286 -7431126 -6937858 -2608117 1158164
39751A158164k06461k168348r33480n603k83753J228797M753291N823445K266516
$$ 1158164 951703 -1216645 -2150125 -2155728 -2439481 -1210684 3542607 9366052 11632568
39742A1632568j739552j620887J119710J678077j221132m534750n480670l902422
$$ 11632568 9893016 8272129 9391839 11069916 9848784 5314034 -166636 -4069058
39734d069058q47267K396122L919018K363484q53050k283981m31256K136965J718885
$$ -4069058 -4916325 -2520203 1398815 3762299 2909249 625268 194012 2330977 4049862
39725D049862k012451n443317m978256r04336K978716L294713L43444k534811
$$ 4049862 2037411 -3405906 -8384162 -9288498 -6309782 -3015069 -2671625 -5206436
39717e206436k526614j1922K251764K193028L32585j240116j290347m74038j02334
$$ -5206436 -7733050 -7744972 -5493208 -3300180 -2967595 -4207711 -5498058 -5972096 -6074430
39708f074430m37079o82620m38291k47035k38990P30716L138744M606249K204275
$$ -6074430 -6511509 -7194129 -7632420 -7879455 -8118445 -7387729 -4248985 357264 2561539
39699B561539k382342l107219K439366P905454N482311k776739o558224j210546
$$ 2561539 179197 -2928022 -488656 7416798 12899109 10122370 3564146 2353600
39691B353600N796885N537836m80627m251490l239311j784886k299563k170150
$$ 2353600 8150485 13688321 13207694 8956204 5716893 3932007 1632444 -537706
39683e37706Q211J427773K82549j046458m47622M03194m69337j811856j654573
$$ -537706 -529495 898278 1180827 134369 -313253 89941 -379396 -2191252 -3845825
39674c845825m07825Q58329K389355L720050K556092j628439n269302m754979
$$ -3845825 -4253650 -3395321 -1005966 2714084 5270176 3641737 -1627565 -6382544
39666f382544j035629K074635K514493R61109r88491j752221n61393J183924J156478
$$ -6382544 -7418173 -5343538 -2829045 -1867936 -2856427 -4608648 -5170041 -3986117 -2829639
39657b829639l32686m66693J501445L017486K733196K363691K361232L02225l700664
$$ -2829639 -3162325 -3629018 -2127573 889913 3623109 5986800 8348032 8650257 4949593
39648D949593m817144p58377L153054J217415l849672m996932j151628K489444
$$ 4949593 132449 -625928 2527126 3744541 -105131 -5102063 -6253691 -3764247
39640c764247K970952K409733K580656K059172l13060k968993l689526j960866
$$ -3764247 -793295 1616438 4197094 6256266 5943206 2974213 -715313 -2676179
39632b676179P63916J867528L5777j973897k2028M338727M123603k546628p700795
$$ -2676179 -1912263 -44735 -8958 -1982855 -2004883 2333844 6457447 3910819 -3789976
39623c789976m630441J658406K414877j083509r71290L005858L411176j280039
$$ -3789976 -8420417 -6762011 -4347134 -5430643 -6401933 -3396075 15101 -1264938
39615a264938l792114n47975K877152K088509P06729K444799M208730K441569
$$ -1264938 -5057052 -5605027 -2727875 -639366 67363 2512162 6720892 9162461
39607I162461j54207N7385R15846j087801l842574l004334N73405K287793Q51214
$$ 9162461 9008254 9065639 9981485 8893684 5051110 2046776 2620181 4907974 5759188
39598E759188q07009o48435K82228K78025j056221k832444l471738k197483m37364
$$ 5759188 4952179 4303744 4585972 4863997 3807776 975332 -2496406 -4693889 -5131253
39589e131253L0240K43796K422599N180706M458242J1420l505851l385810k183253
$$ -5131253 -5101013 -4857217 -2434618 2746088 7204330 7215750 3709899 324089 -1859164
39580a859164k241704j696037J240711M288732M625629K903749R85995q91375
$$ -1859164 -4100868 -5796905 -4556194 -267462 4358167 7261916 8247911 7356536
39572G356536k318161j883807m87525j284525l944046l761853O47103M053971
$$ 7356536 5038375 3154568 2667043 1382518 -2561528 -6323381 -5676278 -1622307
39564a622307K620980k31298l22484L88872j326839l319855k260095K2011N23940
$$ -1622307 998673 767375 444891 833763 -493076 -3812931 -6073026 -6051015 -5527075
39555e527075R55200L167533L482884q16391l988001N0974N875828L419381n397846
$$ -5527075 -4571875 -1404342 2078542 1262151 -2725850 -2674876 3200952 6620333 1222487
39546A222487q379705j472304N951685O157450K414931k16053k946047o653337
$$ 1222487 -7157218 -8629522 -2677837 3479613 5894544 5678491 2732444 -3920893
39538c920893o458127M6658O209607N259835L64745j246366N62741R39534m27894
$$ -3920893 -10379020 -10332362 -4122755 1137080 1501825 255459 818200 1757734 1329840
39529A329840K56048K875755L154982m2202l195720l842608k794008r79468J171959
$$ 1329840 1585888 4461643 7616625 7574423 4378703 536095 -2257913 -3237381 -2065422
39520b065422J668951q55104l238566j199503L356957L995888m55969l579311
$$ -2065422 -396471 -1251575 -4490141 -5689644 -2332687 1663201 1207232 -2372079
39512b372079r60250L287616L064118r67712l483281k466027n36937K34450O23089
$$ -2372079 -3332329 -44713 3019405 2051693 -1431588 -3897615 -4434552 -4200102 -3577013
39503c577013J517672K166923J650690J04745j647962k322943o53709K742877
$$ -3577013 -2059341 107582 1758272 1863017 215055 -2107888 -2761597 -18720
39495a8720M843462L514933N29928q23065k07940K39357q4802m6844q5975j696941
$$ -18720 4824742 8339675 8869603 8046538 7838598 8077955 7993153 7946309 7860334 6163393
39485F163393l273438j109669L800397M782604j319047p995030o897430P50499
$$ 6163393 2889955 1780286 5580683 10363287 9044240 1049210 -5848220 -5097721
39477e097721N954311M043095o33229k486040j687777j189627j094488M20290
$$ -5097721 856590 4899685 4266456 1780416 92639 -1096988 -2191476 -1771186
39469a771186K836199L478244J487057q35909r85084P40708J736279L49206j774645
$$ -1771186 1065013 4543257 6030314 5194405 4209321 4950029 6686308 7035514 5260869
39460E260869j439407J625434L463493O22588m947807p976870o203328k106801
$$ 5260869 3821462 5446896 8910389 9532977 4585170 -3391700 -9595028 -11701829
39452a1701829J280138L248380L833024K615319L87885n58301N91173J742517
$$ -11701829 -10421691 -7173311 -3340287 -724968 -337083 -895384 -304211 1438306
39444A438306P76472j583876k797748j294347K088657M316363K392328k739123
$$ 1438306 2214778 630902 -2166846 -3461193 -1372536 2943827 5336155 2597032
39436B597032n636540k629120K593047L715854R73185j5859J809527J437998k305692
$$ 2597032 -3039508 -5668628 -3075581 640273 1613458 1597599 3407126 4845124 2539432
39427B539432l493385L83205K608885j892665o952104m437687K457489M592023
$$ 2539432 -953953 -570748 2038137 145472 -6806632 -11244319 -8786830 -4194807
39419d194807J564274N93641K827471J986441k995114m991743q40132L486168
$$ -4194807 -2630533 -2036892 790579 2777020 -218094 -5209837 -6049969 -2563801
39411b563801L483240K565281L295365J407923m942734q320748k770829N059319
$$ -2563801 919439 3484720 6780085 8188008 3245274 -5075474 -7846303 -2786984
39403b786984M962297j307322l570347N66666L583802J514625q61828L0176Q40271
$$ -2786984 2175313 867991 -2702356 -2135690 1448112 2962737 2100909 2131085 2971356
39394B971356j063121k291236l54798Q34606k193354n466566l434022K013107
$$ 2971356 1908235 -383001 -737799 96807 -2096547 -7563113 -10997135 -8984028
39386h984028M563338L014608J672957K541429L025996J380637q03852k272359
$$ -8984028 -4420690 -1406082 266875 2808304 5834300 7214937 6411085 4138726
39378D138726l691199m420551k003738L133675O090781L392686j839498l472938
$$ 4138726 447527 -3973024 -5976762 -2843087 3247694 6640380 4800882 1327944
39370A327944P8154M373889M658729J001654k709928l615247k535501j709660
$$ 1327944 1406098 5779987 10438716 11440370 8730442 5115195 2579694 870034
39362H70034j165665P85054L532401L550505m41838m345530l773420k82480J360943
$$ 870034 -295631 489423 4021824 7572329 7130491 2784961 -988459 -1270939 90004
39353I0004O13505Q96257K459406J465931k520413m055347J29691N461298N802977
$$ 90004 703509 1599766 4059172 5525103 3004690 -1050657 -920966 4540332 10343309
39344A0343309J612934k245910l663121l869793l341073j644206J34640P47701
$$ 10343309 11956243 9710333 6047212 2177419 -1163654 -2807860 -2673220 -1925519
39336a925519J261065K759979L311360Q96011k377285k987767j410305p00700
$$ -1925519 -664454 2095525 5406885 6302896 3925611 937844 -472461 -1173161
39328a173161j111040n08535R67661J232034N00146P65948J600008Q26466j110172
$$ -1173161 -2284201 -2792736 -1825075 -593041 -92895 673053 2273061 3099527 1989355
39319A989355j764083j127229j138133j486799m69550Q13284P0982j212130J28152
$$ 1989355 225272 -901957 -2040090 -3526889 -3996439 -3183155 -3112173 -4324303 -4196151
39310d196151K560588J583621k395137m197549k124044K72598R87705J493889
$$ -4196151 -1635563 -51942 -2447079 -6644628 -8768672 -8496074 -7508369 -6014480
39302f014480J498438r08667l127853j62271N704051O155276K15920l074707Q03040
$$ -6014480 -4516042 -5424709 -8552562 -8714833 -3010782 3144494 3360414 285707 1088747
39293A088747M470896J495003k964874k040671P90386j069256m756403l064346
$$ 1088747 5559643 7054646 4089772 2049101 2839487 1770231 -2986172 -6050518
39285f050518K303326L234190j222167l673350m07038L901286M291933J574040
$$ -6050518 -3747192 -513002 -1735169 -5408519 -5815557 -1914271 2377662 3951702
39277C951702r26886j720442j321713j229782k466047l269673o26577L987331
$$ 3951702 3024816 1304374 -17339 -1247121 -3713168 -6982841 -7609418 -3622087
39269c622087M694797M4716l617582j754040J482941J288022K95064J649688J186990
$$ -3622087 1072710 1117426 -2500156 -4254196 -2771255 -1483233 -1188169 461519 1648509
39260A648509m293735p605856j365850P607010O951723j567460m909128J87328
$$ 1648509 -2645226 -10251082 -11616932 -4009922 2941801 1374341 -3534787 -3347459
39252c347459L554362o4000l535311j644366N25628j190280k246524Q31360L083289
$$ -3347459 206903 142903 -3392408 -5036774 -4511146 -5701426 -7947950 -7116590 -4033301
39243d033301M12481k488037m83017L195765L218988P47898m73063o48872q62521
$$ -4033301 -3620820 -6108857 -6591874 -3396109 -177121 570777 97714 -551158 -1413679
39234a413679O16328L490043L016105j905223m522025m31315M139304J535790
$$ -1413679 -797351 2692692 5708797 3803574 -718451 -1149766 2989538 4525328
39226D525328n075538o634534j616395L261845L411182N44086k019313k561435
$$ 4525328 -550210 -7184744 -8801139 -5539294 -2128112 -1584026 -3603339 -6164774
39218f164774p69843J458447J070363j094833j38355M395906N322501j345121
$$ -6164774 -6934617 -5476170 -4405807 -5500640 -5638995 -1243089 4079412 2734291
39210B734291q033920n722818K148525M871695O01626k474321q6402K847547K015103
$$ 2734291 -5299629 -11022447 -8873922 -4002227 -3400601 -5874922 -5961324 -3113777 -1098674
39201a098674j68795q87597j708816l411307k474403K697472O895818M575077
$$ -1098674 -1267469 -2155066 -3863882 -7275189 -9749592 -7052120 -156302 4418775
39193D418775j734857m443532j118912K762014J753051k406458l776279o19467
$$ 4418775 2683918 -1759614 -2878526 -116512 1636539 -769919 -4546198 -5165665
39185e165665K480069J604032p07669J79624L022908K210742k818542n516594
$$ -5165665 -2685596 -1081564 -1789233 -1609609 1413299 3624041 805499 -4711095
39177d711095j842400L327878L299413r96687l369626j466729J353167J865313
$$ -4711095 -6553495 -3225617 73796 -922891 -4292517 -5759246 -4406079 -2540766
39169b540766M58389p40882j85748K126451M068705L082988q4041j692764n59941
$$ -2540766 -2082377 -2823259 -3009007 -882556 3186149 6269137 6185096 4492332 3932391
39160C932391J12433j450147k231800q3061J819358N19979j134611J83401J502209
$$ 3932391 4044824 2594677 362877 279816 2099174 2619153 1484542 1667943 3170152
39151C170152j496272o136041o552862l353018j791355j969651Q02281O157543
$$ 3170152 1673880 -4462161 -11015023 -14368041 -16159396 -18129047 -17326766 -11169223
39143a1169223P740913L560249m71446J50695K404458K029854J03261k95362O23207
$$ -11169223 -3428310 131939 -339507 -188812 2215646 4245500 4348761 4053399 4676606
39134D676606R81011O84314K80660p45159k192889k350693q64847J58783n99334
$$ 4676606 5657617 6341931 6622591 5877432 3684543 1333850 469003 627786 28452
39125B8452j822012j960182r35936R66808K955819K644824r75956l757937p81547
$$ 28452 -1793560 -3753742 -4689678 -3722870 -767051 1877773 901817 -2856120 -3637667
39116c637667N042922N108216k160578p468429l577010L985387M989776j081253
$$ -3637667 1405255 6513471 4352893 -3115536 -6692546 -2707159 2282617 1201364
39108A201364n559641l379890J509479L542828K471755J165762O16387k18443
$$ 1201364 -4358277 -7738167 -6228688 -2685860 -214105 951657 1568044 1349601
39100A349601j525492j915524m43737J723191K270717N11563j503717j614360
$$ 1349601 -175891 -2091415 -2535152 -811961 1458756 1970319 466602 -1147758
39092a147758n49975n10768j338570q62551Q03402O88273k050920l839669j617608
$$ -1147758 -1697733 -2208501 -3547071 -4409622 -3606220 -2917947 -4968867 -8808536 -10426144
39083a0426144K529521M290114K748622M61512n49162k51279P35409J350303l0634
$$ -10426144 -7896623 -3606509 -857887 -396375 -945537 -1196816 -461407 888896 858262
39074H58262l298800n023617k085731L354847N500534J996324l265364n322122
$$ 858262 -2440538 -7464155 -9549886 -6195039 -694505 1301819 -1963545 -7285667
39066g285667l695895j273131K34330J233270J687275N97584j397052j422164
$$ -7285667 -10981562 -12254693 -12020363 -10787093 -9099818 -8502234 -9899286 -11321450
39058a1321450J884951N574704N567531J918983j493190k313789j947969j966706
$$ -11321450 -9436499 -3861795 1705736 3624719 2131529 -182260 -2130229 -4096935
39050d096935j428440N25851K147139J645114K96800L36160J303875J244486K42538
$$ -4096935 -5525375 -4999524 -2852385 -1207271 -910471 -574311 729564 1974050 2216588
39041B216588r6772L13551L29055j8058j40545q63851k854984m274913l210809
$$ 2216588 2119816 2433367 2762422 2744364 2603819 1739968 -1115016 -5389929 -8600738
39032h600738j129987k94103O62646L996555P125415N397199J37308k431464q30831
$$ -8600738 -9730725 -10024828 -9362182 -5365627 1759788 7156987 7294295 4862831 4032000
39023D032000p8754k279225k860919N74339K958194L27142k781262r31133K579900
$$ 4032000 3953246 1674021 -1186898 -612559 2345635 2672777 -108485 -1039618 1540282
39014A540282J362672k722171k627551J404341J771008l471750o395620j162280
$$ 1540282 2902954 180783 -2446768 -1042427 728581 -2743169 -9138789 -10301069
39006a0301069O901373Q832290L721005k071939m118646l299114j627064M70334
$$ -10301069 -3399696 5432594 9153599 7081660 2963014 -336100 -1963164 -1492830
38998a492830K501449L030397J534474o69600j988802j933599r34137j4582n36484
$$ -1492830 1008619 4039016 5573490 4903890 2915088 981489 47352 32770 -503714
38989e03714k752705m457939k806686J755137M986698L711082k0471j603579m3210
$$ -503714 -3256419 -7714358 -10521044 -8765907 -3779209 -68127 -88598 -1692177 -1735387
38980a735387J183493k63950k103824j311656J032062J722896P43707R14980K492854
$$ -1735387 -551894 -815844 -2919668 -4231324 -3199262 -1476366 -732659 182321 2675175
38971B675175K078275j805219n439777m641331n24164K188283J300382j136321
$$ 2675175 4753450 2948231 -2491546 -7132877 -7657041 -5468758 -4168376 -5304697
38963e304697k584692k673223j817859K31283L166742N054023M168971J400718
$$ -5304697 -7889389 -10562612 -12380471 -12149188 -8982446 -3928423 240548 1641266
38955A641266n00438p6099J404482J831824P09155p00683r44873M54347K648441
$$ 1641266 1140828 1064729 2469211 4301035 5010190 4309507 3364634 3818981 6467422
38946F467422L560933J343596k994715n464820l589196j66265K06302k115046
$$ 6467422 10028355 11371951 8377236 2912416 -676780 -843045 -636743 -2751789
38938b751789k289075J295994M248003L075318L60296k94320k52994k077166l353770
$$ -2751789 -5040864 -3744870 503133 3578451 3938747 3644427 3391433 1314267 -2039503
38929b039503m07431M013182L642623j290723l896739j188873J964553J363043
$$ -2039503 -2446934 1566248 5208871 3918148 21409 -1167464 797089 2160132
38921B160132n33552k90631N88897l53134j283891M02652K740616K199243l60275
$$ 2160132 1626580 1335949 1924846 1571712 287821 690473 3431089 5630332 5270057
38912E270057j310364j24563P11523M69165O58491J265109M07411k019585l559891
$$ 5270057 3959693 3835130 4546653 5015818 5674309 6939418 7346829 5327244 1767353
38903A767353k726164j004554o24436j806895k712228j428873J839590M341526
$$ 1767353 -958811 -1963365 -2587801 -4394696 -7106924 -8535797 -6696207 -2354681
38895b354681L533944N11488j071978j2515R57326j85825j499603n25722J673624
$$ -2354681 1179263 1690751 618773 606258 1563584 1377759 -121844 -647566 1026058
38886A026058K605981K198530J622996M02523j934933l161732j175324J779055
$$ 1026058 3632039 5830569 7453565 7856088 5921155 2759423 1584099 3363154
38878C363154J818844m86760j195078J14965m30347l862960n566990k301925K179422
$$ 3363154 5181998 4695238 3500160 3615125 3184778 -678182 -6245172 -8547097 -6367675
38869f367675K514057j15091q9065L447876M829429N65010m850378n102628r18109
$$ -6367675 -3853618 -3968709 -4057774 -609898 4219531 4784541 -65837 -5168465 -6086574
38860f086574J762965J009020Q22810L216808M200624Q58366k549144p75232L469711
$$ -6086574 -4323609 -3314589 -2491779 725029 4925653 5784019 3234875 2459643 5929354
38851E929354L163518j993870n102266k805107L79230K15353j241137q86424j13791
$$ 5929354 9092872 7099002 1996736 -808371 -429141 -213788 -1454925 -2341349 -2455140
38842b455140j000504j582687M36019K809009K216842j62658r83609k52223j34360
$$ -2455140 -3455644 -5038331 -4602312 -1793303 423539 260881 -722728 -974951 -1109311
38833a109311k81345J148508L175761K952705K62723k389554l336715k573169
$$ -1109311 -1390656 -242148 2933613 5886318 6149041 3759487 422772 -2150397
38825b150397m85618J458357P85307k133462k800967J129679N018582L282620
$$ -2150397 -2636015 -1177658 -392351 -2525813 -5326780 -4197101 821481 4104101
38817D104101k153109m779887k974288o33578L89955J970641L949698L282029
$$ 4104101 1950992 -2828895 -5803183 -6436761 -6046806 -4076165 -126467 3155562
38809C155562N8171j568485k11044L90625k009233m183942k845731J92629J382029
$$ 3155562 3213733 1645248 1434204 1824829 -184404 -4368346 -7214077 -7021448 -5639419
38800e639419P06565N70058J785321L233000L793259K810450K19070k600639l749080
$$ -5639419 -4932854 -4362796 -2577475 655525 4448784 7259234 7478304 4877665 1128585
38791A128585l259292k741540k416625j037800J000433J479433o6975j450835
$$ 1128585 -2130707 -4872247 -7288872 -8326672 -7326239 -5846806 -5913781 -7364616
38783g364616j132342L19105K251298M208912M206801P34430l221519k864711
$$ -7364616 -8496958 -8177853 -5926555 -1717643 2489158 3223588 2069 -2862642
38775b862642Q18406J475066k806682n901530l078630J625889K270155M70972
$$ -2862642 -2044236 -569170 -3375852 -9277382 -12356012 -10730123 -8459968 -7988996
38767g988996J825856N972924P048492L035749j682333l534785l962652m877951
$$ -7988996 -6163140 -190216 6858276 9894025 8211692 4676907 714255 -4163696
38759d163696m648883j395614K766861L981559J932154K10191J324622L243232
$$ -4163696 -8812579 -10208193 -7441332 -3459773 -1527619 -1317428 7194 3250426
38751C250426K117794k163597m964775k537548K672424M686094J646180k047479
$$ 3250426 5368220 3204623 -1760152 -4297700 -1625276 3060818 4706998 2659519
38743B659519k005026O96459K147849J194436k94231j169890k046877l071954
$$ 2659519 654493 1350952 3498801 4693237 4399006 3229116 1182239 -1889715
38735a889715l184602j823670L02938K267443L471164L265461J340813j332084
$$ -1889715 -5074317 -6897987 -6595049 -4327606 -856442 2409019 3749832 2417748
38727B417748k833039j817621J393759M759459N503646K375516k453053m957717
$$ 2417748 -415291 -2232912 -839153 3920306 9423952 11799468 9346415 4388698
38719D388698l572802p44367O52067Q09452J432332K299920J722863l19060j906176
$$ 4388698 815896 71529 723596 1533048 2965380 5265300 6988163 6669103 4762927
38710D762927k003554j478565j080282l90854O01640O91304p13453k251004k279359
$$ 4762927 2759373 1280808 200526 -190328 411312 1102616 389163 -1861841 -4141200
38701d141200r67029L74176J120239J185838o222k450185l950224k124226J661544
$$ -4141200 -5108229 -4734053 -3613814 -2427976 -2434198 -4884383 -8834607 -10958833 -9297289
38692i297289L125814R21224j360039r80339l96890k214521l108782J389857P763375
$$ -9297289 -6171475 -5250251 -6610290 -7590629 -7987519 -10202040 -13310822 -11920965 -4157590
38683d157590P487793j41868n675154k835874K826946L193606p20556k463205
$$ -4157590 3330203 3188335 -2486819 -5322693 -2495747 697859 -22697 -2485902
38675b485902p87775M41269o9549l86875m54514j445770j563509J392267M767433
$$ -2485902 -3273677 -2832408 -2901957 -3288832 -3743346 -5189116 -6752625 -5360358 -592925
38666e92925M431953J704488N82826K50414k275558m240577q30211M585047M001078
$$ -592925 3839028 5543516 6126342 6376756 4101198 -139379 -969590 3615457 7616535
38657G616535j528872k788816J762714L099816k120065m994336m3560M527206
$$ 7616535 6087663 3298847 5061561 8161377 6041312 1046976 1003416 5530622
38649E530622O40382o014399o111068j669185k2461k70270K411706M948196J562277
$$ 5530622 6171004 156605 -5954463 -7623648 -7646109 -7916379 -5504673 -556477 1005800
38640A005800l525281j808957L770509K508352n418349p980481o58671O556174
$$ 1005800 -2519481 -4328438 -557929 1950423 -3467926 -11448407 -12107078 -5550904
38632e550904N381789M48497j119519p17767k122527l125301p40783K014714J642943
$$ -5550904 -169115 279382 -840137 -1557904 -3680431 -6805732 -7546515 -5531801 -3888858
38623c888858P32318K272576K881750r76620m829578k471458L035150L426936
$$ -3888858 -3156540 -883964 1997786 1021166 -3808412 -6279870 -3244720 182216
38615A82216j421924l272477R98346M382118R74661m974664n859353j636372J437089
$$ 182216 -1239708 -4512185 -3513839 868279 1842940 -3131724 -8991077 -10627449 -9190360
38606i190360L61154j672629j329058O20437K138672L237686M238336L481671
$$ -9190360 -8829206 -10501835 -11830893 -11210456 -9071784 -5834098 -1595762 1885909
38598A885909j0524l116402j762245K590016L745257o06519n141229m483192q18503
$$ 1885909 1875385 -1241017 -3003262 -413246 3332011 2725492 -2415737 -6898929 -7717432
38589g717432K62473j322407r93515J947044K949090K47487j743042L42070L192589
$$ -7717432 -7454959 -8777366 -9770881 -7823837 -4874747 -4627260 -6370302 -6028232 -2835643
38580b835643K140402j646810l513259k252227l47808R46855K258456K777887
$$ -2835643 -695241 -2342051 -5855310 -8107537 -8455345 -7508490 -5250034 -2472147
38572b472147J015208j102889L02913M344980M894947n22091n605307l329342
$$ -2472147 -1456939 -2559828 -2256915 2088065 6983012 6460921 855614 -2473728
38564b473728L801827P012718L563672m22931k85295N89628k023045n069301l179546
$$ -2473728 1328099 8340817 11904489 11481558 11196263 11785891 9762846 4693545 1513999
38555A513999J815845L274187J54859k108565j177517q33186k762098k788314
$$ 1513999 3329844 6604031 6758890 4650325 3472808 2639622 -122476 -2910790
38547b910790J047138L410052K8982m324018k685151L164863N608309K622935
$$ -2910790 -1863652 1546400 1575382 -2748636 -5433787 -2268924 3339385 5962320
38539E962320p69286j372944j182313j675866j170990P57914J526600k3744j676929
$$ 5962320 5193034 3820090 2637777 961911 -209079 548835 2075435 2051691 374762
38530C74762j811641j483010j271337P6236K291882K512988m24300l474413l109488
$$ 374762 -1436879 -2919889 -4191226 -4114990 -1823108 689880 265580 -3208833 -6318321
38521f318321M91575M249464N347325K960324j149656l406551j857799J146748
$$ -6318321 -5826746 -1577282 3770043 6730367 5580711 2174160 316361 1463109
38513A463109J847528M5891j523763j830239j940918j546832N23653K519690J307348
$$ 1463109 3310637 3356528 1832765 2526 -1938392 -3485224 -2961571 -441881 865467
38504H65467j908097k423602M82662K182317L91621j195870M76867K672796J703322
$$ 865467 -1042630 -3466232 -2983570 -801253 -409632 -1605502 -1128635 1544161 3247483
38495C247483j340320l267673l507187k663469J9274L918577N115459J543309
$$ 3247483 1907163 -1360510 -4867697 -7531166 -7511892 -3593315 1522144 3065453
38487C065453k665154k523610K72479P0781l681507n270587j095318N018091O680663
$$ 3065453 400299 -2123311 -1850832 -1780051 -5461558 -10732145 -11827463 -6809372 -128709
38478a28709K715642j928862k353154P94929K903122J855555M76586J210043J501016
$$ -128709 2586933 658071 -1695083 -900154 2002968 3858523 4335109 5545152 7046168
38469G046168j646263m923548k542569L798796N810744Q37513m035609l146007
$$ 7046168 5399905 476357 -2066212 1732584 7543328 8380841 4345232 1199225
38461A199225l58398j145914l125240j252804K456143K206633j507034k897287
$$ 1199225 840827 -305087 -3430327 -4683131 -2226988 -20355 -1527389 -4424676
38453d424676n40768J383390J212340J992742M557645M919359R06396l685186
$$ -4424676 -4965444 -3582054 -2369714 -376972 4180673 9100032 10006428 6321242
38445F321242m452859k273685j012656j831740k477667j072823J428909K564581
$$ 6321242 1868383 -405302 -1417958 -3249698 -5727365 -6800188 -5371279 -2806698
38437b806698J403016j36772M00131K557833L410439J733322m69059j347655j449011
$$ -2806698 -1403682 -1540454 -1140323 1417510 4827949 6561271 6092212 4744557 3295546
38428C295546j425452o45774K93462p36513l035299k511027J565945L764681N52402
$$ 3295546 1870094 1224320 1517782 781269 -2254030 -4765057 -3199112 565569 1117971
38419A117971l370804k147878J878298K352554p02381j914889j5990J152070J93186
$$ 1117971 -2252833 -4400711 -2522413 -169859 -872240 -2787129 -2803119 -1651049 -1457863
38410a457863l75077M9902m84730j448181o08820N33944j023729k617758J099637
$$ -1457863 -1832940 -1783038 -2267768 -3715949 -4324769 -3790825 -4814554 -7432312 -6332675
38401f332675P687177Q188127P53474n598693l985810J498219L777752K278662
$$ -6332675 1354502 9542629 10296103 4697410 711600 2209819 5987571 8266233
38393H266233L7445j956302k870569o01238L260531L093106j690141l831137M45138
$$ 8266233 8303678 6347376 3476807 2875569 6136100 9229206 7539065 3707928 4153066
38384D153066M346624J184907m648165n180412j452870J81429m86483O08437K049653
$$ 4153066 8499690 9684597 5036432 -143980 -1596850 -1415421 -1901904 -1293467 756186
38375G56186o74024m962798l625216K746491N772458K419906j187976o74377R12540
$$ 756186 82162 -4880636 -8505852 -5759361 13097 2433003 1245027 570650 1483190
38366A483190Q56875J541547L769394L212018j786221n625637l841041k67226
$$ 1483190 2340065 3881612 7651006 10863024 9076803 3451166 -389875 -657101
38358f57101l25530k226164j029009K353978K782100n68057l241133k324852N48653
$$ -657101 -982631 -3208795 -4237804 -1883826 898274 330217 -2910916 -5235768 -4687115
38349d687115K693404L005911J378318j291556k734012j531898P85174J961780
$$ -4687115 -1993711 1012200 2390518 1098962 -1635050 -3166948 -2381774 -419994
38341d19994K171852K655345K723238J027338j354112k168958j540867j359759
$$ -419994 1751858 4407203 7130441 8157779 6803667 4634709 3093842 1734083
38333A734083j840732j605945n88007Q9615O01399J783949K519747J056283j273573
$$ 1734083 -106649 -1712594 -2300601 -2210986 -1609587 174362 2694109 3750392 2476819
38324B476819j194671J329994K564873M49913k680559l910770l215079j842814
$$ 2476819 1282148 2612142 5177015 5626928 2946369 -964401 -4179480 -6022294
38316f022294k04713J050123O30280q86712o91824K092876M296154L031061k9934
$$ -6022294 -6227007 -5176884 -4546604 -5433316 -6125140 -4032264 263890 3294951 3265017
38307C265017j286942k64579Q08394J048033J459336K137357J840483L00493j360234
$$ 3265017 1978075 1713496 2521890 3569923 5029259 7166616 9007099 9307592 7947358
38298G947358k563721l712698m676597m475449k536312P53871M206922N739083
$$ 7947358 5383637 1670939 -3005658 -7481107 -10017419 -9263548 -5056626 682457
38290F82457L676031l08510j578357J555246M220506R66134n836610q125715k869463
$$ 682457 4358488 4049978 2471621 4026867 8247373 9213507 3376897 -4748818 -7618281
38281g618281L896899N226130J525194j717063j534371J17194J39441j967204
$$ -7618281 -3721382 1504748 3029942 1312879 -221492 -104298 35143 -1932061
38273a932061l932254l277810k08048K324368K221442P88356J6759q00882k575250
$$ -1932061 -5864315 -9142125 -9350173 -7025805 -4804363 -4016007 -3999248 -4800130 -7375380
38264g375380k606626J570302N668310K850658m853404p146369l89558O034042
$$ -7375380 -9982006 -8411704 -2743394 107264 -4746140 -11892509 -12282067 -6248025
38256f248025L545567k799998k923158K589293M810855J192265k046615j335507
$$ -6248025 -2702458 -5502456 -8425614 -5836321 -1025466 166799 -1879816 -3215323
38248c215323M8324M8578J138000L376554K390952k415446m990056k009348J505837
$$ -3215323 -3166999 -3118421 -1980421 1396133 3787085 1371639 -3618417 -5627765 -4121928
38239d121928O52067j408014K81138L398491K396120j779520l123349j30218K662995
$$ -4121928 -3469861 -4877875 -4596737 -1198246 1197874 -581646 -3704995 -3835213 -1172218
38230a172218K341979Q97802K50145p12907k498811k683901L60071M113055M601075
$$ -1172218 1169761 2067563 2317708 1604801 -894010 -3577911 -3217840 895215 5496290
38221E496290J105964l282441m965621k908363P85982K858752J984860r9602j015147
$$ 5496290 6602254 3319813 -1645808 -4554171 -3768189 -909437 1075423 975821 -39326
38212c9326o03546k86789l28693L82081J790686J869170o58319l919750m528873
$$ -39326 -642872 -929661 -1258354 -876273 914413 2783583 2125264 -1794486 -6323359
38203f323359j462973K643680M457986L537587K064229J331296K27856k011127
$$ -6323359 -7786332 -5142652 -684666 2852921 4917150 6248446 6476302 4465175
38195D465175l447237j877800J493692L262560K152592k41087k400583l691221
$$ 4465175 1017938 -859862 633830 3896390 6048982 5807895 3407312 -283909
38187b83909k769544J072424M765015L839507r43865l532432r01205K807002K917532
$$ -283909 -3053453 -1981029 2783986 6623493 5679628 2147196 1245991 4052993 6970525
38178F970525O78012m09149p27899k421069m065342k631691Q40344K368071J032147
$$ 6970525 7648537 7239388 6511489 4090420 25078 -2606613 -1766269 601802 1633949
38169A633949l79654j78455O37561J152179J362335P54793p32185j251476J81710
$$ 1633949 1254295 1075840 1713401 2865580 4227915 4982708 4250523 2999047 3180757
38160C180757R37486j361627l990190k924404J04740J95202k023813j061257L752390
$$ 3180757 4118243 2756616 -1233574 -4157978 -4053238 -3858036 -5881849 -6943106 -3190716
38151c190716O454469M042029Q20417L10901l00391l430231n146922j625597L312541
$$ -3190716 3263753 7305782 8126199 8437100 8136709 4706478 -440444 -2066041 1246500
38142A246500L433743m69658k611443j373697k31816p54387o55583J185392K830429
$$ 1246500 4680243 4210585 1599142 225445 -6371 -760758 -1416341 -230949 2599480
38133B599480K968255K451604J644504l47572l377962n903623o771350n102907
$$ 2599480 5567735 8019339 9663843 9316271 5938309 34686 -6736664 -11839571
38125a1839571J01001O990064R554695M205277l545990m799438M97098L467340
$$ -11839571 -11738570 -4748506 4806189 9011466 5465476 666038 1163136 4630476
38117D630476m10025m851969k785949L350739O177171L703826k98791l085055
$$ 4630476 4220451 -631518 -3417467 -66728 6110443 9814269 9515478 6430423
38109F430423m514044l862979o12410K446859J920566p00686r40613J456264K243569
$$ 6430423 1916379 -1946600 -2559010 -112151 1808415 1107729 167116 1623380 3866949
38100C866949J00377j085362Q06093K113744k94239l108910j682883J917409J607664
$$ 3866949 3967326 2881964 3688057 5801801 5507562 2398652 715769 2633178 4240842
38091D240842k952799n152003j232066L742747K927546k574224n267397j449458
$$ 4240842 1288043 -3863960 -5096026 -1353279 1574267 -999957 -6267354 -7716812
38083g716812M299124N538494J602623l045184m769148l448053m61875K846294
$$ -7716812 -3417688 2120806 3723429 678245 -4090903 -7538956 -8000831 -5154537
38075e154537M547021K934453p16798k412013k29912K800902K609818n37777k992757
$$ -5154537 -607516 2326937 1610139 -801874 -1031786 1769116 4378934 3841157 848400
38066H48400l026905k234255j915309j283850L6400P01166K21351L32109J979910
$$ 848400 -2178505 -4412760 -6328069 -7611919 -7575519 -6874353 -6653002 -6320893 -4340983
38057d340983L044228J263983k056292l547706k079303M54216J954669J875528
$$ -4340983 -1296755 -32772 -2089064 -5636770 -7716073 -7261857 -5307188 -3431660
38049c431660P11589n20961o57232L78569J238856J146998J079282J574281J050498
$$ -3431660 -2720071 -3241032 -3898264 -3519695 -2280839 -1133841 -54559 1519722 2570220
38040B570220j458662l527253k344916O61044J781840R09959J291874L303722
$$ 2570220 1111558 -2415695 -4760611 -4099567 -2317727 -1407768 -115894 3187828
38032C187828L158927p22488m444029m252989j761391m45808l1773J827599M398762
$$ 3187828 6346755 5624267 1180238 -3072751 -4834142 -5279950 -5311723 -3484124 914638
38023I14638M539984J655839j641896l498304m242364l980009j951541J206154
$$ 914638 5454622 7110461 5468565 1970261 -2272103 -6252112 -8203653 -6997499
38015f997499L247875L129410J909305L99853j743953l876137l805858q97223
$$ -6997499 -3749624 -620214 1289091 1688944 -55009 -3931146 -7737004 -8634227
38007h634227K163993K478638N54831q37530l87400J000757K389630L508992L328940
$$ -8634227 -6470234 -3991596 -3436765 -4274295 -4661695 -3660938 -1271308 2237684 5566624
37998E566624M13883m156942o202520k931814K808811N172226K321098j521756
$$ 5566624 5980507 1823565 -4378955 -7310769 -4501958 670268 2991366 1469610
37990A469610j883844M19387J404911k60655k281654k736343k105225j173052
$$ 1469610 -414234 5153 1410064 1149409 -1132245 -3868588 -5973813 -7146865
37982g146865L42792K178733K768966J454645J2128O79309L327629N275009L630323
$$ -7146865 -6804073 -4625340 -1856374 -401729 -389601 289708 3617337 8892346 12522669
37973A2522669j796183p193589p509481k163111L346185L946533J432962P88071
$$ 12522669 10726486 3532897 -3976584 -6139695 -2793510 1153023 2585985 3374056
37965C374056J864900M27352k978300k508815K590237M617737r93993p291430
$$ 3374056 5238956 5666308 2688008 179193 2769430 7387167 6393174 -898256
37957h98256n495890J882111N282406K211430j216486j459281j617117l452175
$$ -898256 -6394146 -4512035 770371 2981801 1765315 306034 -1311083 -4763258
37949d763258l300569J064701N528976N358273J754129p46781n41978L99550K51689
$$ -4763258 -8063827 -6999126 -1470150 3888123 5642252 4895471 4353493 4753043 5004732
37940E004732q38799j730715j653215r77642p14383p35878K73245J893380J311632
$$ 5004732 4165933 2435218 782003 -195639 -910022 -1645900 -1372655 520725 1832357
37931A832357j951329l483263j08419M101058L201648j404146l441538j837265
$$ 1832357 -118972 -3602235 -3710654 390404 3592052 2187906 -1253632 -3090897
37923c090897q47748q91856J939519O340216N339161j667402n918726k951404
$$ -3090897 -3938645 -4830501 -2890982 3449234 8788395 7120993 1202267 -1749137
37915a749137O7594k881199n610508m52545P402398P435716R34620j411434K925076
$$ -1749137 -1681543 -4562742 -10173250 -10625795 -3223397 4212319 5146939 3735505 6660581
37906F660581N189464N43622m786812m650043j748107q01845p80211O67117J249071
$$ 6660581 11850045 12393667 7606855 2956812 1208705 406860 -373351 293766 1542837
37897A542837j523898m445801l149762N73509J762206M45700Q95286L555365L769012
$$ 1542837 18939 -4426862 -7576624 -7003115 -5240909 -4795209 -3899923 -344558 3424454
37888C424454l13748l768076j727354L324638M907779J507305j937574j567805
$$ 3424454 3110706 -657370 -2384724 939914 5847693 7354998 5417424 3849619
37880C849619M09770J44823j759347j995542m17354J44690o34775M4018K457809
$$ 3849619 4259389 4404212 2644865 649323 231969 376659 -258116 -214098 2243711
37871B243711K819185m75705l368873k144250P00190N89739j911937k565160l22741
$$ 2243711 5062896 4587191 1218318 -925932 -225742 363997 -1547940 -4113100 -4435841
37862d435841J906100K414929K180220J542973l44689k547887k680443q20496
$$ -4435841 -2529741 -114812 2065408 3608381 3263692 715805 -1964638 -2785134
37854b785134J83737j062253k852146l379725k621662r25924J474769L184003
$$ -2785134 -2601397 -3663650 -6515796 -9895521 -12517183 -13443107 -11968338 -8784335
37846h784335K626259P49864K13550J574226K721235K178088M69309j617654l375374
$$ -8784335 -6158076 -5408212 -5194662 -3620436 -899201 1278887 1748196 130542 -3244832
37837c244832l122799J1471L456206L761280J655260Q54050J974590J943445k60575
$$ -3244832 -6367631 -6356160 -2899954 861326 2516586 3370636 5345226 7288671 7028096
37828G028096k046036k252946k735532l465949j429868L188589N078843J515374
$$ 7028096 4982060 2729114 -6418 -3472367 -4902235 -1713646 3365197 4880571
37820D880571k841734k925077n38649P9499k98894J206269K641450J94478l735690
$$ 4880571 2038837 -886240 -1424889 -1345390 -1644284 -438015 2203435 2397913 -1337777
37811a337777k949072K195584M295380L44574l426010j490658K407150J777372
$$ -1337777 -4286849 -2091265 2204115 2548689 -877321 -2367979 39171 1816543
37803A816543k102221k739071P21941K267782r52146l951146k080032J389211
$$ 1816543 -285678 -3024749 -2302808 -35026 -987172 -4938318 -7018350 -5629139
37795e629139O13455l114604k921664L081515Q604902P973642L223369k67691
$$ -5629139 -5015684 -8130288 -11051952 -7970437 634465 8608107 11831476 11563785
37787A1563785j184519j615454k027701j369266n27902j281684k535295j636716
$$ 11563785 10379266 8763812 6736111 5366845 4838943 3557259 1021964 -614752
37779f14752R58471K232825J511340P46467O2800k333968n234032m396199Q21704
$$ -614752 343719 2576544 4087884 4834351 4897151 2563183 -2670849 -7067048 -6245344
37770f245344N264994M745424J170084j452515k321341k331271q72287K305536
$$ -6245344 -980350 3765074 4935158 3482643 1161302 -1169969 -2042256 263280
37762B63280M704564L987404J231160j439227l903824n815236m443402J106905
$$ 263280 4967844 8955248 10186408 8747181 4843357 -971879 -5415281 -4308376
37754d308376N995377M840379n38238l423801j602976N13395n21405k388658j503498
$$ -4308376 1687001 6527380 5989142 2565341 962365 1475760 954355 -1434303 -2937801
37745b937801J496281L206157K107222l56008j975168j533092O26712K671144
$$ -2937801 -1441520 1764637 3871859 3515851 1540683 7591 634303 3305447
37737C305447K716039R41564n26845m13142J7569j031840k926235l055018m95599
$$ 3305447 6021486 6963050 6436205 6023063 6040632 5008792 2082557 -972461 -1468060
37728a468060K089248J605869r46212j381117J506928L442208P82107l308974
$$ -1468060 621188 2227057 1280845 -100272 1406656 4848864 5630971 2321997
37720B321997k977517J258115K912870m90750l619689j946152J176006L00130
$$ 2321997 -655520 602595 3515465 3024715 -594974 -2541126 -1365120 -1064990
37712a064990l256684l716779R7793L402429K793011M03719q1212J676708L082075
$$ -1064990 -4321674 -8038453 -7940660 -4538231 -1745220 -1341501 -1422713 253995 3336070
37703C336070K211862k8303j079574o9571O60792j078742l250004k123263J266303
$$ 3336070 5547932 5519629 4440055 4370484 5031276 3952534 702530 -1420733 -154430
$$ [...]
##END NTUPLES=NMR SPECTRUM
##END=
