##TITLE=31Pdec_SR_PH-Asp_X
 D2O, 24 sc
 20.2.2026
##JCAMPDX= 6.0         $$ Bruker NMR JCAMP-DX V2.0
##DATA TYPE= NMR SPECTRUM
##DATA CLASS= NTUPLES
##ORIGIN= UXNMR, Bruker Analytische Messtechnik GmbH
##OWNER= root
$$ XWIN-NMR		Version 3.5
$$ Fri Feb 20 14:13:28 2026 Russian Standard Time (UT+4h)  she@DPX200
##.OBSERVE FREQUENCY= 81.013821
##.OBSERVE NUCLEUS= ^31P
##.ACQUISITION MODE= SIMULTANEOUS
##.ACQUISITION SCHEME= undefined
##.AVERAGES= 24
##.DIGITISER RES= 17
##SPECTROMETER/DATA SYSTEM= spect
##.PULSE SEQUENCE= zgpg30
##.SOLVENT NAME= DMSO
##.SHIFT REFERENCE= (INTERNAL, DMSO, 0, 198.062)
##AUDIT TRAIL= $$ (NUMBER, WHEN, WHO, WHERE, WHAT)
$$ ##TITLE= Audit trail, XWIN-NMR		Version 3.5
$$ ##JCAMPDX= 5.01
$$ ##ORIGIN= Bruker BioSpin GmbH
$$ ##OWNER= she
$$ F:/spectra/data/she/nmr/P31/2/pdata/1/auditp.txt
$$ ##AUDIT TRAIL=  $$ (NUMBER, WHEN, WHO, WHERE, WHAT)
(   1,<2026-02-20 14:12:13.28 +0400>,<she>,<DPX200>,
      <created by zg, POWCHK disabled, PULCHK disabled
       configuration hash MD5:
       00 E9 B6 7A A2 85 ED C7 34 08 36 98 17 FE 4E 26
       data hash MD5: 32K
       5B C4 8A 52 20 19 DF E0 54 A8 75 5E FC 1C 27 52>)
(   2,<2026-02-20 14:12:16.17 +0400>,<she>,<DPX200>,
      <Start of raw data processing
       efp BC_mod = 2 LB = 1.5 FT_mod = 6 PKNL = 1 PHC0 = 1413.544 PHC1 = 4.500681 SI = 64K 
       data hash MD5: 64K
       40 15 DA 2F AD 43 75 9C 55 C8 DD CB 8A C4 A7 0D>)
(   3,<2026-02-20 14:12:33.25 +0400>,<she>,<DPX200>,
      <pk PHC0 = 12.75408 PHC1 = -40.8 
       data hash MD5: 64K
       69 11 AC 45 55 3B 39 91 6C FA 8E 99 C5 56 0C 5B>)
(   4,<2026-02-20 14:12:51.85 +0400>,<she>,<DPX200>,
      <abs ABSG = 5 
       data hash MD5: 64K
       9F FD 4B 8E CC 0C 6C 4A 3B 5B 84 87 38 2B A3 64>)
$$ ##END=
$$ 
$$ hash MD5
$$ 27 FD 27 C6 68 35 1B 72 91 D2 4B E6 AA A3 07 47
##$RELAX= 
##$RELAX= 
##$RELAX= 
##$RELAX= 
##$RELAX= 
##$RELAX= 
##$RELAX= 
##$RELAX= 
$$ Bruker specific parameters
$$ --------------------------
##$DU= <F:/spectra>
##$EXPNO= 2
##$NAME= <P31>
##$PROCNO= 1
##$TYPE= <nmr>
##$USER= <she>
##$AMP= (0..31)
100 100 100 100 100 100 100 100 100 100 100 100 100 100 100 100 100 100 
100 100 100 100 100 100 100 100 100 100 100 100 100 100 
##$AQSEQ= 0
##$AQ_mod= 1
##$AUNM= <au_zg>
##$AUTOPOS= <>
##$BF1= 81.014009
##$BF2= 200.13
##$BF3= 200.13
##$BF4= 200.13
##$BF5= 200.13
##$BF6= 200.13
##$BF7= 200.13
##$BF8= 200.13
##$BYTORDA= 1
##$CFDGTYP= 0
##$CFRGTYP= 5
##$CHEMSTR= <none>
##$CNST= (0..31)
1 1 145 1 1 1 1 1 1 1 1 1 1 1 1 1 1 1 1 1 1 1 1 1 1 1 1 1 1 1 1 1 
##$CPDPRG= <waltz16>
##$CPDPRG1= <>
##$CPDPRG2= <waltz16>
##$CPDPRG3= <>
##$CPDPRG4= <mlev>
##$CPDPRG5= <mlev>
##$CPDPRG6= <mlev>
##$CPDPRG7= <mlev>
##$CPDPRG8= <mlev>
##$CPDPRGB= <>
##$CPDPRGT= <>
##$D= (0..31)
0 1 0 0 0 0 0 0 0 0.06 0 0.03 2e-05 3e-06 0 0 0.0002 0 0 0 0 0 0 0 0 0 
0 0 0 0 0 0 
##$DATE= 1771582332
##$DBL= (0..7)
120 120 120 11 120 120 24 19 
##$DBP= (0..7)
150 150 150 150 150 150 150 150 
##$DBP07= 0
##$DBPNAM0= <>
##$DBPNAM1= <>
$$ [...]
##$SUBNAM3= <"">
##$SUBNAM4= <"">
##$SUBNAM5= <"">
##$SUBNAM6= <"">
##$SUBNAM7= <"">
##$SUBNAM8= <"">
##$SUBNAM9= <"">
##$SW= 400.765351723535
##$SWIBOX= (0..15)
0 1 3 0 0 0 0 0 0 0 0 0 0 0 0 0 
##$SW_h= 32467.5324675325
##$TD= 32768
##$TD0= 1
##$TE= 0
##$TE2= 300
##$TE3= 300
##$TEG= 300
##$TL= (0..7)
0 120 53 12 22 120 120 120 
##$TP= (0..7)
150 150 150 150 150 150 150 150 
##$TP07= 0
##$TPNAME0= <>
##$TPNAME1= <>
##$TPNAME2= <>
##$TPNAME3= <>
##$TPNAME4= <>
##$TPNAME5= <>
##$TPNAME6= <>
##$TPNAME7= <>
##$TPOAL= (0..7)
0.5 0.5 0.5 0.5 0.5 0.5 0.5 0.5 
##$TPOFFS= (0..7)
0 0 0 0 0 0 0 0 
##$TUNHIN= 0
##$TUNHOUT= 0
##$TUNXOUT= 0
##$USERA1= <user>
##$USERA2= <user>
##$USERA3= <user>
##$USERA4= <user>
##$USERA5= <user>
##$V9= 5
##$VALIST= <valist>
##$VCLIST= <CCCCCCCCCCCCCCC>
##$VD= 0
##$VDLIST= <DDDDDDDDDDDDDDD>
##$VPLIST= <PPPPPPPPPPPPPPP>
##$VTLIST= <TTTTTTTTTTTTTTT>
##$WBST= 1024
##$WBSW= 4
##$XGAIN= (0..3)
0 0 0 0 
##$XL= 0
##$YL= 0
##$YMAX_a= 7719
##$YMIN_a= -9170
##$ZGOPTNS= <>
##$ZL1= 120
##$ZL2= 120
##$ZL3= 120
##$ZL4= 120
##$ABSF1= 198.0616
##$ABSF2= -202.7028
##$ABSG= 5
##$ABSL= 3
##$ALPHA= 0
##$AQORDER= 0
##$ASSFAC= 0
##$ASSFACI= 0
##$ASSFACX= 0
##$ASSWID= 0
##$AUNMP= <proc_1d>
##$AZFE= 0.1
##$AZFW= 0.5
##$BCFW= 0
##$BC_mod= 2
##$BYTORDP= 0
##$COROFFS= 0
##$CY= -3
##$DATMOD= 1
##$DC= 0
##$DFILT= <>
##$DTYPP= 0
##$F1P= 0
##$F2P= 0
##$FCOR= 1
##$FTSIZE= 65536
##$FT_mod= 6
##$GAMMA= 0
##$GB= 0
##$INTBC= 1
##$INTSCL= 9.790993e-09
##$ISEN= 30
##$LB= 1.5
##$LEV0= 0
##$LPBIN= 0
##$MAXI= 10000
##$MC2= 0
##$MEAN= 0
##$ME_mod= 0
##$MI= 50
##$NCOEF= 0
##$NC_proc= -5
##$NLEV= 6
##$NOISF1= 182.463
##$NOISF2= 159.3651
##$NSP= 0
##$NTH_PI= 0
##$NZP= 0
##$OFFSET= 198.0616
##$PC= 4
##$PHC0= 1426.298
##$PHC1= -36.29932
##$PH_mod= 1
##$PKNL= yes
##$PPARMOD= 0
##$PSCAL= 0
##$PSIGN= 0
##$REVERSE= no
##$SF= 81.0140089999434
##$SI= 65536
##$SIGF1= 159.3651
##$SIGF2= -187.1042
##$SINO= 113.3802
##$SIOLD= 16384
##$SREGLST= <1H.CDCl3>
##$SSB= 0
##$STSI= 65536
##$STSR= 0
##$SW_p= 32467.5324675325
##$SYMM= 0
##$S_DEV= 0
##$TDeff= 32768
##$TDoff= 0
##$TI= <>
##$TILT= no
##$TM1= 0
##$TM2= 0
##$TOPLEV= 0
##$USERP1= <user>
##$USERP2= <user>
##$USERP3= <user>
##$USERP4= <user>
##$USERP5= <user>
##$WDW= 1
##$XDIM= 65536
##$YMAX_p= 304609470
##$YMIN_p= -4936913
$$ End of Bruker specific parameters
$$ ---------------------------------
##NTUPLES= NMR SPECTRUM
##VAR_NAME=  FREQUENCY,     SPECTRUM/REAL,   SPECTRUM/IMAG
##SYMBOL=    X,             R,               I
##VAR_TYPE=  INDEPENDENT,   DEPENDENT,       DEPENDENT
##VAR_FORM=  AFFN,          ASDF,            ASDF
##VAR_DIM=   65536,         65536,           65536
##UNITS=     HZ,            ARBITRARY UNITS, ARBITRARY UNITS
##FACTOR=    0.49542278885378, 1,            1
##FIRST=     16045.7642231865, 0,            0
##LAST=      -16421.768244346, 0,            0
##MIN=       -16421.768244346, -4936913,     0
##MAX=       16045.7642231865, 304609470,    0
$$ Real data points
##PAGE= N=1
##DATA TABLE= (X++(R..R)), XYDATA
$$ [...]
$$ plain form
41469 -214752 -221452 -134757 -120388 -311448 -588120 -740845 -721000 -594345 -381968 -110061
41459 -110061 101401 184491 267513 485402 724594 766865 636265 570063 646043 672984 505050
41448 505050 254047 91581 13117 -74058 -155903 -150409 -71876 -21640 -35955 -50248 -26234
41437 -26234 -40051 -204942 -523428 -839735 -958279 -821630 -553486 -306027 -101061 123807
41427 123807 342642 415693 270969 33790 -99152 -86444 -63895 -127868 -177707 -51110
41417 -51110 223621 437004 491114 538808 714600 855329 696994 290582 -36689 -153523
41407 -153523 -272140 -518441 -649311 -423425 -28749 149763 52167 -64462 -71028 -88948
41397 -88948 -187370 -269786 -313118 -442638 -671463 -797371 -685286 -479273 -413539 -541580
$$ packed form
41469b14752o700Q6695J4369j91060k76672j52725J9845J26655K12377K71907
41459a10061K11462Q3090Q3022K17889K39192M2271j30600o6202P5980K6941j67934
41448E05050k51003j62466p8464q7175q1845N494P8533N0236j4315j4293K4014
41437b6234j3817j64891l18486l16307j18544J36649K68144K47459K04966K24868
41427A23807K18835P3051j44724k37179j32942J2708K2549o3973m9839J26597
41417e1110K74731K13383N4110M7694J75792J40729j58335m06412l27271j16834
41407a53523j18617k46301j30870K25886L94676J78512r7596j16629o566j7920
41397h8948r8422q2416m3332j29520k28825j25908J12085K06013O5734j28041
$$ plain form
41387 -541580 -742996 -879846 -871717 -729076 -577585 -551748 -630398 -681379 -666446 -658113 -667414
41376 -667414 -650780 -693567 -945879 -1322710 -1522547 -1436159 -1274789 -1172614 -965102 -573202
41366 -573202 -312192 -488103 -875317 -961822 -633640 -270439 -172980 -223286 -181440 -45558
41356 -45558 18513 -63362 -209017 -284631 -204126 8244 222230 328238 358538 412834 486122
41345 486122 468101 308411 89535 -71506 -125384 -101266 -73022 -95908 -137440 -120086 -62537
41334 -62537 -75068 -151198 -105416 154217 423774 448654 270463 136385 144981 195062 223247
41323 223247 253649 240326 109397 -38791 -24862 77616 -28383 -410361 -728975 -661436
41313 -661436 -318495 -86100 -190867 -562675 -1001784 -1321756 -1402462 -1254528 -1026745 -881437
$$ packed form
41387e41580k01416j36850Q129J42641J51491K5837p8650n0981J4933Q333r301
41376f67414J6634m2787k52312l76831j99837Q6388J61370J02175K07512L91900
41366e73202K61010j75911l87214q6505L28182L63201R7459n0306M1846J35882
41356d5558O4071q1875j45655p5614Q0505K12370K13986J06008L0300N4296P3288
41345D86122j8021j59690k18876j61041n3878K4118K8244k2886m1532J7354N7549
41334f2537j2531p6130M5782K59633K69557K4880j78191j34078Q596N0081K8185
41323B23247L0402j3323j30929j48188J3929J02478j05999l81978l18614O7539
41313f61436L42941K32395j04767l71808m39109l19972q0706J47934K27783J45308
$$ plain form
41303 -881437 -879946 -998918 -1178885 -1331420 -1389010 -1376011 -1342744 -1232532 -949200 -568229
41293 -568229 -313048 -273821 -314666 -310058 -278433 -203612 43192 445117 711557 627583 384873
41282 384873 330888 493700 602265 514602 366493 301219 300286 331251 443651 618618 688812
41271 688812 533637 256214 55063 -22551 -103524 -291457 -528741 -671982 -664311 -600228
41261 -600228 -616291 -742013 -887382 -960030 -943207 -863872 -754041 -657755 -605051 -559564 -463846
41250 -463846 -342326 -257489 -156933 84096 415401 581023 447901 206853 96426 72479
41240 72479 -55859 -281319 -421165 -413680 -348707 -233342 16942 331348 475305 365044
41230 365044 187923 124484 136673 127860 127810 183416 218169 159088 93194 133943 206757 138574
$$ packed form
41303h81437J491j18972j79967j52535n7590J2999L3267J10212K83332L80971
41293e68229K55181L9227m0845M608L1625P4821K46804M01925K66440q3974k42710
41282C84873n3985J62812J08565q7663j48109o5274r33L0965J12400J74967P0194
41271F88812j55175k77423k01151p7614q0973j87933k37284j43241P671O4083
41261f00228j6063j25722j45369p2648J6823P9335J09831R6286N2704M5487R5718
41250d63846J21520Q4837J00556K41029L31305J65622j33122k41048j10427k3947
41240G2479j28338k25460j39846P485O4973J15365K50284L14406J43957j10261
41230C65044j77121o3439J2189q813n0N5606L4753n9081o5894M0749P2814o8183
$$ plain form
41218 138574 -61505 -166108 -9375 291134 443811 287224 -38269 -231792 -154091 24630
41208 24630 50862 -85444 -170705 -103182 -38134 -132506 -311235 -420146 -480317 -607695 -752372
41197 -752372 -730181 -526983 -382170 -482017 -689485 -692403 -378418 27935 206825 66167
41187 66167 -204716 -373827 -392768 -352020 -282788 -123734 117746 317588 413731 494935 596899
41176 596899 544889 193604 -252714 -407859 -212215 -32329 -150041 -364144 -283804 119876
41166 119876 481505 516533 314534 129687 62873 43310 909 -66408 -146040 -225831 -263502
41155 -263502 -217200 -120909 -81681 -177304 -370624 -534151 -559163 -453680 -345275 -374833 -567476
41144 -567476 -804070 -918375 -816288 -518290 -128197 230896 496270 711199 957362 1216041
$$ packed form
41218A38574k00079j04603J56733L00509J52677j56587l25493j93523P7701J78721
41208B4630K6232j36306q5261O7523O5048r4372j78729j08911o0171j27378j44677
41197g52372K2191K03198J44813r9847k07468k918L13985M06353J78890j40658
41187F6167k70883j69111j8941M0748O9232J59054K41480J99842R6143Q1204J01964
41176E96899n2010l51285m46318j55145J95644J79886j17712k14103Q0340M03680
41166A19876L61629L5028k01999j84847o6814j9563m2401o7317p9632p9791l7671
41155b63502M6302R6291L9228r5623j93320j63527k5012J05483J08405k9558j92643
41144e67476k36594j14305J02087K97998L90093L59093K65374K14929K46163K58679
$$ plain form
41134 1216041 1344085 1235782 966743 712528 556662 458065 384991 372900 427705 469111
41124 469111 423673 309453 180349 47397 -88213 -177340 -168456 -84327 5676 75280 160230
41113 160230 298405 471389 579709 477875 112422 -343653 -595191 -539779 -384098 -344156
41103 -344156 -337734 -145521 195838 395739 316647 143732 68214 26651 -95669 -199040
41093 -199040 -131174 8687 -13086 -184385 -245912 -102893 4901 -154947 -493920 -766302
41083 -766302 -882936 -893958 -790393 -538681 -252863 -108696 -78038 49944 332929 543401
41073 543401 464966 176403 -68833 -128666 -21908 193880 436714 561333 478131 299637
41063 299637 229444 309639 408695 452186 507502 603179 615906 425538 90505 -207410 -333882
$$ packed form
41134A216041J28044j08303k69039k54215j55866r8597p3074j2091N4805M1406
41124D69111m5438j14220j29104j32952j35610q9127Q884Q4129R0003O9604Q4950
41113A60230J38175J72984J08320j01834l65453m56075k51538N5412J55681L9942
41103c44156O422J92213L41359J99901p9092j72915p5518m1563j22320j03371
41093a99040O7866J39861k1773j71299o1527J43019J07794j59848l38973k72382
41083g66302j16634j1022J03565K51712K85818J44167L0658J27982K82985K10472
41073E43401p8435k88563k45236n9833J06758K15788K42834J24619q3202j78494
41063B99637p0193Q0195R9056M3491N5316R5677J2727j90368l35033k97915j26472
$$ plain form
41052 -333882 -279606 -145154 -85760 -182806 -325487 -312368 -119320 36945 -33738 -271553
41042 -271553 -487320 -584651 -545461 -311173 140335 637238 903017 828243 553927 288503
41032 288503 143484 141584 258651 407982 464705 373196 218059 163903 306875 555812
41022 555812 675487 524970 260270 187520 375614 556584 495741 298297 194304 170891
41012 170891 54870 -119492 -101963 190841 517952 618194 502420 360782 310505 317796
41002 317796 282174 140219 -61923 -199210 -235056 -309719 -547487 -829243 -913634 -751682
40992 -751682 -512337 -327530 -205317 -168981 -248719 -323759 -214254 30658 171292 140073
40982 140073 106547 132650 67135 -113729 -177480 -8760 188362 251759 322706 513298 618816
$$ packed form
41052c33882N4276J34452N9394r7046j42681J3119J93048J56265p0683k37815
41042b71553k15767r7331L9190K34288M51508M96903K65779p4774k74316k65424
41032B88503j45019j900J17067J49331N6723r1509j55137n4156J42972K48937
41022E55812J19675j50517k64700p2750J88094J80970o0843j97444j03993k3413
41012A70891j16021j74362J7529K92804L27111J00242j15774j41638n0277P291
41002C17796l5622j41955k02142j37287l5846p4663k37768k81756q4391J61952
40992g51682K39345J84807J22213L6336p9738p5040J09505K44912J40634l1219
40982A40073l3526K6103o5515j80864o3751J68720J97122O3397P0947J90592J05518
$$ plain form
40971 618816 464848 268627 298323 402451 280023 36047 13860 177032 139001 -194676
40961 -194676 -475673 -483170 -426585 -534418 -695899 -696915 -536861 -335789 -156303 -72485 -199310
40950 -199310 -492001 -700739 -675886 -556585 -525433 -541024 -455163 -253105 -41060 91822
40940 91822 98526 -18851 -149884 -160987 -103055 -166535 -362793 -455491 -310478 -94252 12604
40929 12604 70281 165014 167412 -41984 -281714 -296209 -165905 -190674 -408254 -523426 -344317
40918 -344317 -35894 138553 134115 81949 62929 31348 -89067 -296442 -488630 -550761 -478864
40907 -478864 -379466 -328412 -302875 -284181 -315160 -384030 -377734 -263077 -190892 -269813 -345247
40896 -345247 -192822 136891 370800 385279 329676 368030 476478 541702 518925 432031 306790
$$ packed form
40971F18816j53968j96221K9696J04128j22428k43976k2187J63172l8031l33677
40961a94676k80997p497N6585j07833j61481j016J60054K01072J79486Q3818j26825
40950a99310k92691k08738K4853J19301L1152j5591Q5861K02058K12045J32882
40940I1822O704j17377j31033j1103N7932o3480j96258r2698J45013K16226J06856
40929A2604N7677R4733K398k09396k39730j4495J30304k4769k17580j15172J79109
40918c44317L08423J74447m438n2166j9020l1581j20415k07375j92188o2131P1897
40907d78864R9398N1054K5537J8694l0979o8870O296J14657P2185p8921p5434
40896c45247J52425L29713K33909J4479n5603L8354J08448O5224k2777q6894j25241
$$ plain form
40885 306790 146988 -66753 -340628 -587054 -646453 -470116 -206497 -13409 113059 203942
40875 203942 154132 -108026 -403343 -502099 -468952 -539368 -701213 -705904 -494871 -285526 -177939
40864 -177939 -14384 253688 392805 266052 87523 69495 79341 -74254 -230550 -82661
40854 -82661 329353 651565 687389 548475 358741 94591 -230831 -458867 -464310 -315923
40844 -315923 -197219 -246567 -477581 -765478 -920450 -858300 -675460 -496703 -336320 -203884
40834 -203884 -213214 -408584 -590286 -538886 -348319 -292706 -399411 -422720 -243830 -11013
40824 -11013 166460 366728 592785 657939 512878 429012 616620 859987 812633 523875
40814 523875 360901 446699 486342 226292 -157749 -286493 -62833 229533 288484 129329
$$ packed form
40885C06790j59802k13741k73875k46426n9399J76337K63619J93088J26468R0883
40875B03942m9810k62158k95317r8756L3147p0416j61845m691K11033K09345J07587
40864a77939J63555K68072J39117j26753j78529j8028R846j53595j56296J47889
40854h2661M12014L22212L5824j38914j89734k64150l25422k28036n443J48387
40844c15923J18704m9348k31014k87897j54972O2150J82840J78757J60383J32436
40834b03884r330j95370j81702N1400J90567N5613j06705k3309J78890K32817
40824a1013J77473K00268K26057O5154j45061q3866J87608K43367m7354k88758
40814E23875j62974Q5798L9643k60050l84041j28744K23660K92366N8951j59155
$$ plain form
40804 129329 5494 58242 159906 142277 58844 73458 149302 60126 -260361 -596150 -763920
40793 -763920 -833026 -879741 -736975 -242579 388287 724284 626571 361068 212258 220213
40783 220213 324881 526038 790435 961993 883749 543675 74839 -303348 -374040 -110985
40773 -110985 222879 336353 273955 321532 541213 667039 549608 419949 526918 751683
40763 751683 829563 777355 813399 956009 1002272 886996 787901 828788 904157 878600 781867
40752 781867 703477 617986 423071 92195 -279361 -549362 -625913 -530436 -375945 -253352
40742 -253352 -155366 -46480 40283 43690 -30709 -129851 -224199 -287807 -276206 -224737 -291253
40731 -291253 -560659 -869282 -992079 -960472 -994411 -1128690 -1136052 -878696 -522507 -290565
$$ packed form
40804A29329j23835N2748J01664j7629q3433J4614P5844q9176l20487l35789j67770
40793g63920o9106m6715J42766M94396O30866L35997r7713k65503j48810P955
40783B20213J04668K01157K64397J71558p8244l40074m68836l78187p0692K63055
40773a10985L33864J13474o2398M7577K19681J25826j17431j29659J06969K24765
40763G51683P7880n2208L6044J42610M6263j15276r9095M0887P5369k5557r6733
40752G81867p8390q5491j94915l30876l71556k70001p6551R5477J54491J22593
40742b53352R7986J08886Q6763L407p4399r9142r4348o3608J1601N1469o6516
40731b91253k69406l08623j22797L1607l3939j34279p362K57356L56189K31942
$$ plain form
40721 -290565 -175862 -40359 123521 185324 74241 -130698 -279448 -254428 -43097 232885
40711 232885 402741 400110 288708 134002 -55043 -233988 -293320 -187630 -5248 147845
40701 147845 247826 294263 262015 175944 126443 136634 117769 34865 7205 144861 376930
40690 376930 543408 580737 525882 415764 275689 141523 22437 -84781 -106213 52344
40680 52344 295128 353841 137742 -92680 -54749 199482 423461 522066 547906 483989 279925
40669 279925 26104 -147579 -283007 -468874 -579045 -413104 -61279 162966 153896 84780
40659 84780 34746 -127523 -408734 -567554 -480504 -357077 -409353 -542900 -573848 -546300 -610116
40648 -610116 -738209 -785768 -718647 -588883 -387238 -111382 106492 124690 -22522 -216921
$$ packed form
40721b90565J14703J35503J63880O1803j11083k04939j48750K5020K11331K75982
40711B32885J69856k631j11402j54706j89045j78945n9332J05690J82382J53093
40701A47845R9981M6437l2248q6071m9501J0191j8865q2904k7660J37656K32069
40690C76930J66478L7329n4855j10118j40075j34166j19086j07218k1432J58557
40680E2344K42784N8713k16099k30422L7931K54231K23979R8605K5840o3917k04064
40669B79925k53821j73683j35428j85867j10171J65941L51825K24245r070o9116
40659H4780n0034j62269k81211j58820Q7050J23427n2276j33547l0948K7548o3816
40648f10116j28093m7559O7121J29764K01645K75856K17874J8198j47212j94399
$$ plain form
40638 -216921 -437222 -675292 -779780 -610166 -291352 -88321 -52290 -17161 57963 -1983
40628 -1983 -266391 -512461 -496073 -259689 -29011 95690 196270 332575 431092 413692
40618 413692 352724 419623 666491 900402 841608 434922 -47914 -273873 -187185 -19697
40608 -19697 14687 -48637 -19079 188116 438462 526387 418679 321022 463516 826894 1144148
40597 1144148 1188598 984142 699405 440780 239258 145869 186622 246888 154046 -88770
40587 -88770 -267374 -214805 -22412 83621 33754 -2715 152849 427274 536493 323299
40577 323299 -4165 -84285 136858 299496 88416 -314904 -416328 -19131 536651 794243
40567 794243 674780 439739 286234 170471 21181 -68760 15322 176800 190752 30807
$$ packed form
40638b16921k20301k38070j04488J69614L18814K03031L6031L5129P5124n9946
40628a983k64408k46070J6388K36384K30678J24701J00580J36305R8517j7400
40618D13692o0968O6899K46868K33911n8794m06686m82836k25959Q6688J67488
40608a9697L4384o3324K9558K07195K50346Q7925j07708r7657J42494L63378L17254
40597A144148M4450k04456k84737k58625k01522r3389M0753O0266r2842k42816
40587h8770j78604N2569J92393J06033m9867l6469J55564K74425J09219k13194
40577C23299l27464q0120K21143J62638k11080m03320j01424L97197N55782K57592
40567G94243j19463k35041j53505j15763j49290q9941Q4082J61478J3952j59945
$$ plain form
40557 30807 -49255 141571 427601 469966 223944 -1268 32859 198862 230357 92282
40547 92282 -26518 -8287 58981 21896 -170231 -425151 -561676 -438251 -107899 184474
40537 184474 230810 54736 -172221 -335003 -410408 -380016 -242226 -81826 -12446 -62762
40527 -62762 -197625 -395435 -598495 -656317 -472168 -175312 5240 23833 26559 95030 157585
40516 157585 170639 206286 299174 354809 280291 90973 -155622 -402208 -527826 -400649
40506 -400649 -75215 209341 329100 435954 695056 993784 1088343 964527 855094 897128
40496 897128 943766 774966 373549 -92489 -477699 -730557 -787808 -559408 -115542 218728
40486 218728 145058 -218424 -410131 -174764 213545 302724 -5198 -439564 -745133 -853729
$$ packed form
40557C0807q0062J90826K86030M2365k46022k25212L4127J66003L1495j38075
40547I2282j18800J8231O7268l7085j92127k54920j36525J23425L30352K92373
40537A84474M6336j76074k26957j62782p5405L0392J37790J60400O9380n0316
40527f2762j34863j97810k03060n7822J84149K96856J80552J8593K726O8471O2555
40516A57585J3054L5647R2888N5635p4518j89318k46595k46586j25618J27177
40506d00649L25434K84556J19759J06854K59102K98728R4559j23816j09433M2034
40496H97128M6638j68800m01417m66038l85210k52858n7251K28400M43866L34270
40486B18728p3670l63482j91707K35367L88309Q9179l07922m34366l05569j08596
$$ plain form
40476 -853729 -761463 -508480 -272017 -224910 -275992 -181715 70081 248138 279912 361382 570884
40465 570884 685104 543153 310649 180881 78754 -99328 -202818 -79656 94044 69823
40455 69823 -37256 76394 379969 520853 337688 23304 -242342 -498998 -782906 -989791
40445 -989791 -1063756 -1084511 -1067409 -893870 -546299 -217424 -76060 -88016 -150702 -220528 -212420
40434 -212420 24203 480688 899722 1068255 1076162 1135044 1256627 1282189 1155255 992946
40424 992946 910495 906745 912329 849185 655648 345448 44315 -97553 -36903 144109 326694
40413 326694 438103 482575 519518 583456 619044 538211 336200 93217 -117334 -237010
40403 -237010 -176658 93769 415318 571544 574159 621183 718913 596595 147340 -285188
$$ packed form
40476h53729R2266K52983K36463M7107n1082R4277K51796J78057L1774Q1470K09502
40465E70884J14220j41951k32504j29768j02127j78082j03490J23162J73700k4221
40455F9823j07079J13650L03575J40884j83165l14384k65646k56656k83908k06885
40445i89791p3965k0755J7102J73539L47571L28875J41364j1956o2686o9826Q108
40434b12420K36623M56485M19034J68533P907N8882J21583K5562j26934j62309
40424I92946q2451l750N584o3144j93537l10200l01133j41868O0650J81012J82585
40413C26694J11409M4472L6943O3938L5588q0833k02011k42983k10551j19676
40403b37010O0352K70427L21549J56226K615M7024R7730j22318m49255m32528
$$ plain form
40393 -285188 -307200 1961 246265 279077 287522 348149 263919 -53036 -340827 -321871 -80452
40382 -80452 90586 88751 57731 130507 298443 494366 648573 682797 583509 461297 406390
40371 406390 313859 18631 -391851 -595121 -439993 -166525 -99852 -264223 -457881 -594509
40361 -594509 -749691 -905525 -893239 -659351 -402213 -329457 -405175 -449735 -383681 -244442
40351 -244442 -44047 235233 527431 696410 677195 529352 362095 269814 299278 391521
40341 391521 395019 238318 54015 14632 74413 14639 -252969 -569554 -744112 -756135 -694482
40330 -694482 -601785 -445150 -182030 175684 519839 691794 649867 550917 552807 589037 497223
40319 497223 314226 216072 183082 13381 -270916 -344291 -56695 295518 392203 323883
$$ packed form
40393b85188k2012L09161K44304L2812Q445O0627q4230l16955k87791J8956K41419
40382h0452J71038j835l1020P2776J67936J95923J54207L4224r9288j22212n4907
40371D06390r2531k95228m10482k03270J55128K73468O6673j64371j93658j36628
40361e94509j55182j55834J2286K33888K57138P2756p5718m4560O6054J39239
40351b44442K00395K79280K92198J68979j9215j47843j67257r2281K9464R2243
40341C91521L498j56701j84303l9383N9781n9774k67608l16585j74558j2023O1653
40330f94482R2697J56635K63120L57714L44155J71955m1927r8950J890L6230r1814
40319D97223j82997r8154l2990j69701k84297p3375K87596L52213R6685o8320
$$ plain form
40309 323883 333853 361759 200890 -41943 -51948 165908 258584 74375 -116397 -64076 109526
40298 109526 167022 103110 38395 -33430 -172796 -299438 -276840 -116554 66278 232140
40288 232140 394912 480170 375833 114855 -126017 -214680 -157953 -33944 58842 8088
40278 8088 -216943 -454453 -465989 -227734 -5271 -46044 -261760 -329700 -94321 249388
40268 249388 410946 340359 221144 196344 234533 260163 270274 266956 202787 90282 62271
40257 62271 198390 365733 371423 223616 95409 68620 78333 92892 160686 257313 277362
40246 277362 235519 292226 490988 640967 575210 371902 187622 19450 -199623 -390822
40236 -390822 -415061 -300959 -201777 -171318 -159250 -178171 -263275 -283172 -35509 412120 706326
$$ packed form
40309C23883R970K7906j60869k42833j0005K17856R2676j84209j90772N2321J73602
40298A09526N7496o3912o4715p1825j39366j26642K2598J60286J82832J65862
40288B32140J62772Q5258j04337k60978k40872q8663N6727J24009R2786n0754
40278H088k25031k37510j1536K38255K22463m0773k15716o7940K35379L43709
40268B49388J61558p0587j19215k4800L8189K5630J0111l318o4169j12505k8011
40257F2271J36119J67343N690j47807j28207k6789R713J4559O7794R6627K0049
40246B77362m1843N6707J98762J49979o5757k03308j84280j68172k19073j91199
40236c90822k4239J14102R9182L0459J2068j8921q5104j9897K47663M47629K94206
$$ plain form
40225 706326 654244 498739 581147 865688 1008726 847557 604385 557860 667560 629378
40215 629378 245479 -341758 -774758 -801553 -484063 -118651 47764 33128 53582 253077
40205 253077 533363 669502 556748 293126 34695 -149941 -243766 -177962 123727 586233
40195 586233 962503 1040668 843065 569940 368570 217022 29990 -199056 -411421 -592788
40185 -592788 -783241 -959601 -984257 -748751 -348075 -29428 51753 -39519 -151767 -223517
40175 -223517 -267150 -256517 -136078 82888 319679 498760 558906 440468 180943 -6762
40165 -6762 94710 425986 666433 579789 242665 -109125 -344749 -486447 -599604 -716002
40155 -716002 -798981 -739824 -473388 -126706 72678 88886 129838 322121 499420 455495
$$ packed form
40225G06326n2082j55505Q2408K84541J43038j61169k43172m6525J09700l8182
40215F29378l83899n87237m33000k6795L17490L65412J66415j4636K0454J99495
40205B53077K80286J36139j12754k63622k58431j84636r3825O5804L01689M62506
40195E86233L76270P8165j97603k73125k01370j51548j87032k29046k12365j81367
40185e92788j90453j76360k4656K35506M00676L18647Q1181r1272j12248p1750
40175b23517m3633J0633J20439K18966K36791J79081O0146j18438k59525j87705
40165f762J01472L31276K40447q6644l37124l51790k35624j41698j13157j16398
40155g16002q2979N9157K66436L46682J99384J6208M0952J92283J77299m3925
$$ plain form
40145 455495 256285 109575 38146 -92309 -282744 -380556 -352911 -358649 -490132 -614357
40135 -614357 -546816 -266650 95382 385215 504985 460406 370752 364572 445913 511323 472945
40124 472945 301885 13510 -284688 -400341 -255160 -23307 82554 101596 216729 418019
40114 418019 503957 388650 161293 -140690 -535205 -871937 -938357 -843179 -929548 -1193470
40104 -1193470 -1189633 -721487 -216291 -95997 -149301 42346 355564 335294 -9722 -195137
40094 -195137 -37047 100394 -48876 -226143 -76641 349040 748235 948973 926866 671720
40084 671720 268186 -43245 -84220 70624 228287 286579 239763 136815 109070 256455
40074 256455 429022 336765 -28438 -331121 -384502 -419402 -654564 -885756 -808105 -524658
$$ packed form
40145D55495j99210j46710p1429j30455j90435r7812K7645n738j31483j24225
40135f14357O7541K80166L62032K89833J19770m4579q9654o180Q1341O5410l8378
40124D72945j71060k88375k98198j15653J45181K31853J05861J9042J15133K01290
40114D18019Q5938j15307k27357l01983l94515l36732o6420R5178q6369k63922
40104a193470L837M68146N05196J20294n3304J91647L13218k0270l45016j85415
40094a95137J58090J37441j49270j77267J49502M25681L99195K00738k2107k55146
40084F71720m03534l11431m0975J54844J57663N8292m6816j02948k7745J47385
40074B56455J72567r2257l65203l02683n3381l4900k35162k31192P7651K83447
$$ plain form
40064 -524658 -374872 -401234 -362910 -205766 -140350 -253272 -386961 -446889 -516190 -604658 -577216
40053 -577216 -410927 -249751 -124812 94683 371741 432904 197230 -13723 76499 276557
40043 276557 212295 -146963 -522119 -749780 -886177 -964889 -939525 -855714 -829325 -833862 -725394
40032 -725394 -508828 -376030 -422214 -499739 -429798 -222412 -13024 105528 113641 16336 -158781
40021 -158781 -350564 -479094 -453652 -214460 154118 407118 366368 143690 5776 39239
40011 39239 105727 114714 142035 239671 327292 357197 414504 549919 659241 633416 501156
40000 501156 339607 187175 118436 213071 336188 172382 -334812 -782990 -790022 -497559
39990 -497559 -316564 -327468 -284689 -129603 -95186 -272428 -448093 -474571 -472468 -533354 -527632
$$ packed form
40064e24658J49786k6362L8324J57144O5416j12922j33689n9928o9301q8468K7442
40053e77216J66289J61176J24939K19495K77058O1163k35674k10953R0222K00058
40043B76557o4262l59258l75156k27661j36397p8712K5364Q3811K6389m537J08468
40032g25394K16566J32798m6184p7525O9941K07386K09388J18552Q113r7305j75117
40021a58781j91783j28530K5442K39192L68578K53000m0750k22678j37914L3463
40011C9239O6488Q987K7321R7636Q7621K9905N7307J35415J09322k5825j32260
40000E01156j61549j52432o8739R4635J23117j63806n07194m48178p032K92463
39990d97559J80995j0904M2779J55086L4417j77242j75665k6478K103o0886N722
$$ plain form
39979 -527632 -379585 -257305 -285398 -311315 -183299 -45235 -100881 -262386 -308512 -260654
39969 -260654 -319738 -514318 -679716 -729574 -694807 -543881 -230824 98166 211562 120439
39959 120439 60750 135524 221188 255567 349365 530639 624302 501451 249529 -5451 -249218
39948 -249218 -455353 -526674 -488134 -526689 -681124 -698444 -404894 -50143 -36621 -400256
39938 -400256 -781559 -855412 -602469 -214650 76689 116897 -45945 -166689 -75528 101229
39928 101229 137196 43727 11395 65077 18052 -211141 -457313 -546980 -498631 -414838 -332447
39917 -332447 -263381 -256986 -335227 -448542 -539638 -567518 -465467 -206805 69486 157155 58816
39906 58816 7974 142613 314928 332912 248631 262078 430913 617011 670822 558702 349031
$$ packed form
39979e27632J48047J22280k8093k5917J28016J38064n5646j61505m6126M7858
39969b60654n9084j94580j65398m9858L4767J50926L13057L28990J13396r1123
39959A20439n9689P4774Q5664L4379R3798J81274R3663j22851k51922k54980k43767
39948b49218k06135p1321L8540l8555j54435j7320K93550L54751J3522l63635
39938d00256l81303p3853K52943L87819K91339M0208j62842j20744R1161J76757
39928A01229L5967r3469l2332N3682m7025k29193k46172q9667M8349Q3793Q2391
39917c32447O9066O395p8241j13315r1096k7880J02051K58662K76291Q7669r8339
39906E8816n0842J34639J72315J7984q4281J3447J68835J86098N3811j12120k09671
$$ plain form
39895 349031 161378 88682 98244 55299 -103993 -291930 -408342 -461213 -482487 -441627 -342208
39884 -342208 -288990 -334950 -371605 -316507 -296700 -453203 -646538 -592855 -277598 -1554 24381
39873 24381 -76447 -81791 27867 110947 80674 -30941 -145824 -195847 -167664 -138796 -198489
39862 -198489 -308784 -345140 -298147 -289114 -319161 -173895 267730 743220 822741 399319 -186592
39851 -186592 -519544 -484081 -254923 -42362 75540 124237 120918 30101 -158784 -343200
39841 -343200 -381311 -282725 -230447 -335351 -455775 -382691 -144396 28872 30030 -2070 80058
39830 80058 229137 314515 306815 249161 151963 44806 55132 277457 580784 690602 492859
39819 492859 154688 -86527 -160470 -150593 -135796 -122885 -94545 -55931 -37102 -73870 -170562
$$ packed form
39895C49031j87653p2696R562m2945j59292j87937j16412n2871k1274M0860R9419
39884c42208N3218m5960l6655N5098J9807j56503j93335N3683L15257K76044K5935
39873B4381j00828n344J09658Q3080l0273j11615j14883n0023K8183K8868n9693
39862a98489j10295l6356M6993R033l0047J45266M41625M75490P9521m23422n85911
39851a86592l32952L5463K29158K12561J17902M8697l319r0817j88885j84416
39841c43200l8111R8586N2278j04904j20424P3084K38295J73268J158l2100Q2128
39830H0058J49079Q5378p700n7654r7198j07157J0326K22325L03327J09818j97743
39819D92859l38171k41215p3943R877J4797J2911K8340L8614J8829l6768r6692
$$ plain form
39808 -170562 -275672 -330442 -344450 -365561 -367441 -257882 -44949 104054 63345 -65303 -86237
39797 -86237 19299 96278 70441 37788 68378 78728 -17480 -156899 -233433 -268539 -359703
39786 -359703 -520502 -684175 -817429 -909998 -880512 -626718 -189053 231296 443799 404445
39776 404445 203543 6874 -10941 200710 473778 562514 417175 229417 177581 235106
39766 235106 281723 284540 271623 221363 112995 46318 172757 485377 769774 806824 587155
39755 587155 312066 213017 365925 636477 788130 666844 307035 -118412 -429302 -542027
39745 -542027 -509831 -480635 -560421 -693540 -732208 -637105 -517163 -432071 -284034 -16909 188563
39734 188563 99030 -230526 -488900 -500662 -410163 -416099 -489790 -469805 -312666 -108021 86464
$$ packed form
39808a70562j05110n4770j4008k1111j880J09559K12933J49003m0709j28648k0934
39797h6237J05536P6979k5837l2653L0590J0350r6208j39419p6534l5106r1164
39786c59703j60799j63673j33254r2569K9486K53794M37665M20349K12503l9354
39776D04445k00902j96669j7815K11651K73068Q8736j45339j87758n1836N7525
39766B35106M6617K817j2917n0260j08368o6677J26439L12620K84397L7050k19669
39755E87155k75089r9049J52908K70552J51653j21286l59809m25447l10890j12725
39745e42027L2196K9196p9786j33119l8668R5103J19942Q5092J48037K67125K05472
39734A88563q9533l29556k58374j1762R0499n936p3691J9985J57139K04645J94485
$$ plain form
39723 86464 285538 475560 591423 602518 547167 485441 474480 557908 697570 743613 577677
39712 577677 285328 82161 53777 75283 18280 -82257 -138098 -177599 -292915 -480028
39702 -480028 -652547 -785682 -921053 -1024332 -968176 -715555 -426782 -296446 -326183 -342236
39692 -342236 -230944 -83193 -73241 -230618 -382786 -343033 -130816 43730 30417 -81148
39682 -81148 -90958 40508 148035 96638 -41223 -96692 -13433 131688 263898 373965 460323
39671 460323 488796 428593 290468 125259 4617 -18775 38232 103846 142766 191944 274227
39660 274227 340424 353391 358042 384732 354645 195636 -4203 -93299 -66819 -34068 -14822
39649 -14822 47891 86956 -45852 -280470 -303165 42481 512013 762463 741292 617718
$$ packed form
39723H6464J99074J90022J15863J1095n5351o1726j0961Q3428J39662M6043j65936
39712E77677k92349k03167k8384K1506n7003j00537n5841l9501j15316j87113
39702d80028j72519j33135j35371j03279N6156K52621K88773J30336k9737j6053
39692c42236J11292J47751R952j57377j52168L9753K12217J74546j3313j11565
39682h1148r810J31466J07527n1397j37861n5469Q3259J45121J32210J10067Q6358
39671D60323K8473o0203j38125j65209j20642k3392N7007O5614L8920M9178Q2283
39660B74227O6197J2967M651K6690l0087j59009j99839q9096K6480L2751J9246
39649a4822O2713L9065j32808k34618k2695L45646M69532K50450k1171j23574
$$ plain form
39639 617718 478433 292242 77102 -99976 -232566 -321371 -293479 -153042 -111043 -328709
39629 -328709 -600828 -572696 -257742 -41385 -124495 -267173 -200042 457 134463 227316
39619 227316 403386 584303 597896 502702 526404 696767 788475 677669 525499 516754 591111
39608 591111 560588 379170 163638 12120 -72644 -108467 -101957 -102315 -186376 -346264 -460547
39597 -460547 -430851 -297748 -163485 -50547 74243 167319 125079 -48210 -213192 -289512
39587 -289512 -356864 -479387 -550712 -441178 -201531 31298 246714 495206 677406 632105
39577 632105 431551 346685 464165 564716 469099 280314 150504 24094 -190247 -359789
39567 -359789 -287502 -55441 28779 -168120 -439653 -510414 -347886 -158592 -143066 -289836
$$ packed form
39639F17718j39285j86191k15140j77078j32590q8805K7892J40437M1999k17666
39629c28709k72119K8132L14954K16357q3110j42678O7131K00499J34006R2853
39619B27316J76070J80917J3593r5194K3702J70363R1708j10806j52170q745P4357
39608E91111l0523j81418k15532j51518q4764l5823O510l58q4061j59888j14283
39597d60547K9696J33103J34263J12938J24790R3076m2240j73289j64982p6320
39587b89512o7352j22523p1325J09534K39647K32829K15416K48492J82200m5301
39577F32105k00554q4866J17480J00551r5617j88785j29810j26410k14341j69542
39567c59789P2287K32061Q4220j96899k71533p0761J62528J89294J5526j46770
$$ plain form
39557 -289836 -399777 -320246 -126430 5002 66128 200151 402237 460231 293066 123055
39547 123055 140238 199724 80042 -129808 -173792 -31127 121948 259978 487995 712628
39537 712628 686521 420729 226009 259902 334464 282245 211834 237858 233906 76950 -70077
39526 -70077 36676 362596 649538 736340 647279 448936 196492 -29769 -178939 -281684
39516 -281684 -354437 -334189 -214502 -145397 -257003 -453178 -511211 -331411 15763 406775
39506 406775 707659 793058 680167 585799 695461 909665 955579 715007 308931 -100573
39496 -100573 -434447 -636386 -655302 -536864 -429868 -453072 -599044 -763097 -817656 -693886
39486 -693886 -468180 -345257 -473709 -774770 -996677 -931123 -578439 -168051 -19447 -257310
$$ packed form
39557b89836j09941P9531J93816J31432O1126J34023K02086N7994j67165j70011
39547A23055J7183N9486j19682k09850m3984J42665J53075J38030K28017K24633
39537G12628k6107k65792j94720L3893P4562n2219p0411K6024l952j56956j47027
39526g0077J06753L25920K86942Q6802q9061j98343k52444k26261j49170j02745
39516b81684p2753K0248J19687O9105j11606j96175n8033J79800L47174L91012
39506D06775L00884Q5399j12891r4368J09662K14204M5914k40572m06076m09504
39496a00573l33874k01939j8916J18438J06996k3204j45972j64053n4559J23770
39486f93886K25706J22923j28452l01061k21907O5554L52684M10388J48604k37863
$$ plain form
39476 -257310 -615547 -664523 -311329 80310 172242 66863 67468 203544 252634 136068 18320
39465 18320 30750 122980 189109 160079 -426 -211070 -244911 -5741 229248 108015 -287093
39454 -287093 -523478 -417939 -233966 -220981 -285500 -255191 -175590 -154556 -139656 -47039 62216
39443 62216 109716 155516 272190 392126 401424 257570 -56665 -505948 -852897 -793415 -384874
39432 -384874 -77873 -137073 -301894 -251988 -110871 -154049 -276185 -174575 104199 266260
39422 266260 337022 630339 1120920 1334134 1018072 522802 298378 343815 391973 360105
39412 360105 331086 281826 126656 -67924 -161801 -180001 -263338 -411686 -463037 -329316 -103718
39401 -103718 85122 215548 345583 512986 677074 730732 594761 327665 94396 -7817
$$ packed form
39476b57310l58237m8976L53194L91639R1932j05379O05J36076M9090j16566j17748
39465A8320J2430R2230O6129k9030j60505k10644l3841K39170K34989j21233l95108
39454b87093k36385J05539J83973J2985o4519L0309P9601K1034J4900R2617J09255
39443F2216M7500M5800J16674J19936R298j43854l14235m49283l46949N9482M08541
39432c84874L07001n9200j64821M9906J41117m3178j22136J01610K78774J62061
39422B66260P0762K93317M90581K13214l16062m95270k24424M5437M8158l1868
39412C60105k9019m9260j55170j94580r3877j8200q3337j48348n1351J33721K25598
39401a03718J88840J30426J30035J67403J64088N3658j35971k67096k33269j02213
$$ plain form
39391 -7817 -36269 -88222 -182736 -298602 -423139 -483635 -334821 67085 546760 879713 1017705
39380 1017705 1032027 916979 622847 244459 -24579 -149904 -281325 -459171 -483870 -207933
39370 -207933 181548 339475 148943 -221030 -581066 -859543 -993405 -900510 -644440 -460061
39360 -460061 -486219 -578945 -514831 -290457 -81720 16768 42563 2602 -144544 -337028 -431156
39349 -431156 -417804 -438817 -527897 -526820 -358985 -187412 -137899 -38961 333494 851828 1124867
39338 1124867 976980 636978 434191 472524 626476 707872 596762 324734 67841 -14245
39328 -14245 75235 243415 450612 665271 775146 726212 674697 775960 872615 663113
39318 663113 180290 -190186 -219026 -63171 97898 323382 633697 788278 614614 331715
$$ packed form
39391g817k8452n1953r4514j15866j24537o0496J48814M01906M79675L32953J37992
39380A017705J4322j15048k94132l78388k69038j25325j31421j77846k4699K75937
39370b07933L89481J57927j90532l69973l60036k78477j33862R2895K56070J84379
39360d60061k6158r2726O4114K24374K08737R8488K5795l9961j47146j92484r4128
39349d31156J3352k1013q9080J077J67835J71573M9513R8938L72455N18334K73039
39338A124867j47887l40002k02787L8333J53952Q1396j11110k72028k56893q2086
39328a4245Q9480J68180K07197K14659J09875m8934n1515J01263R6655k09502
39318F63113m82823l70476k8840J55855J61069K25484L10315J54581j73664k82899
$$ plain form
39308 331715 251390 328053 310947 209540 262182 490528 621221 485480 222190 26406
39298 26406 -67486 -84198 -7360 123909 193037 176521 195769 319501 449789 484692 462404
39287 462404 451224 416996 312337 208087 218939 349639 508981 635773 727956 780004
39277 780004 771566 702471 577103 375666 111816 -92213 -79577 149721 385624 423475
39267 423475 309268 275266 417670 559405 513649 359797 292594 284154 144841 -80344
39257 -80344 -76456 253782 540650 414657 22247 -201022 -129637 -3808 35794 110526 270860
39246 270860 341559 229582 119922 190665 328219 313672 159708 77154 179366 377659
39236 377659 536375 604545 598043 544390 471860 423625 463322 634104 878967 1043494 1023682
$$ packed form
39308C31715q0325P6663j7106j01407N2642K28346J30693j35741k63290j95784
39298B6406r3892j6712P6838J31269O9128j6516J9248J23732J30288L4903k2288
39287D62404j1180l4228j04659j04250J0852J30700J59342J26792R2183N2048
39277G80004q438o9095j25368k01437k63850k04029J2636K29298K35903L7851
39267D23475j14207l4002J42404J41735m5756j53852o7203q440j39313k25185
39257h0344L888L30238K86868j25993l92410k23269P1385J25829L9602P4732J60334
39246B70860P0699j11977j09660P0743J37554j4547j53964q2554J02212J98293
39236C77659J58716O8170o502n3653p2530m8235L9697J70782K44863J64527j9812
$$ plain form
39225 1023682 875181 709416 549611 390907 309756 346995 358366 197991 5807 53484
39215 53484 303115 411321 242459 84845 215174 502608 630180 510736 296269 132628
39205 132628 71707 87478 49772 -153319 -357985 -219331 282981 698045 679607 433433
39195 433433 305085 211652 -100939 -448044 -372272 133099 563663 615596 505453 477969
39185 477969 438900 269436 113406 86991 13325 -259350 -517630 -478134 -256168 -219073
39175 -219073 -459337 -708062 -738499 -585465 -353550 -62311 240071 410416 383893 296569
39165 296569 317889 431684 493358 462477 454003 545804 651618 648097 530469 340386 35150
39154 35150 -390869 -703820 -608812 -190534 92972 6403 -132871 45905 381314 435088
$$ packed form
39225A023682j48501j65765j59805j58704q1151L7239J1371j60375j92184M7677
39215E3484K49631J08206j68862j57614J30329K87434J27572j19444k14467j63641
39205A32628o0921J5771l7706k03091k04666J38654N02312M15064j8438k46174
39195D33433j28348r3433l12591l47105P5772N05371M30564N1933j10143k7484
39185D77969l9069j69464j56030k6415p3666k72675k58280L9496K21966L7095
39175b19073k40264k48725l0437J53034K31915K91239L02382J70345k6523q7324
39165B96569K1320J13795O1674l0881q474R1801J05814l521j17628j90083l05236
39154C5150m26019l12951R5008M18278K83506q6569j39274J78776L35409N3774
$$ plain form
39144 435088 166978 -57366 -69054 -69001 -163569 -159909 43252 242613 286833 309064 410492
39133 410492 440916 321304 260118 369497 370674 19423 -434670 -593904 -508717 -517778 -650794
39122 -650794 -638898 -435927 -266057 -160626 85115 415562 426590 -42637 -595752 -785693
39112 -785693 -650410 -505648 -441039 -300493 -27376 233034 339082 287107 156998 31112
39102 31112 -54661 -139172 -279469 -450522 -573775 -638916 -685914 -684410 -590573 -510817 -594046
39091 -594046 -740609 -678487 -401547 -235032 -312803 -299161 105136 634136 779526 484996
39081 484996 146726 -5718 -140347 -407061 -659753 -731842 -709637 -743790 -771431 -613730
39071 -613730 -249218 159164 452331 587914 615369 619461 654221 686777 645185 534977 437723
$$ packed form
39144D35088k68110k24344j1688N3r4568L660K03161J99361M4220K2231J01428
39133D10492L0424j19612o1186J09379J177l51251m54093j59234Q5187r061j33016
39122f50794J1896K02971J69870J05431K45741L30447J1028m69227n53115j89941
39112g85693J35283J44762O4609J40546K73117K60410J06048n1975j30109j25886
39102C1112q5773q4511j40297j71053j23253o5141m6998J504R3837P9756q3229
39091e94046j46563O2122K76940J66515p7771J3642M04297N29000J45390k94530
39081D84996l38270j52444j34629k66714k52692p2089K2205l4153k7641J57701
39071f13730L64512M08382K93167J35583K7455M092L4760L2556m1592j10208r7254
$$ plain form
39060 437723 381372 305996 184561 72688 -3759 -102088 -246219 -363131 -405496 -432708 -485332
39049 -485332 -480624 -336327 -112508 74175 190973 235515 153800 -28892 -98595 100238
39039 100238 354333 282992 -117697 -404143 -272715 38970 137372 38627 45042 176090
39029 176090 106897 -262897 -525034 -267060 347348 768141 738430 522592 464223 581418
39019 581418 701803 780925 884976 962098 858368 572217 311380 228385 233906 167638 46182
39008 46182 7273 69603 108881 74454 71694 169644 264624 247320 207070 315576 543778
38997 543778 663627 565799 426750 468599 657952 768382 689962 539132 456538 423106
38987 423106 336854 186765 61160 12297 -8481 -72737 -183518 -278565 -290617 -187679 15140
$$ packed form
39060D37723n6351p5376j21435j11873p6447r8329j44131j16912m2365k7212n2624
39049d85332M708J44297K23819J86683J16798M4542q1715j82692o9703J98833
39039A00238K54095p1341m00689k86446J31428L11685R8402r8745O415J31048
39029A76090o9193l69794k62137K57974O14408M20793k9711k15838n8369J17195
39019E81418J20385P9122J04051P7122j03730k86151k60837q2995N521o6268j21456
39008D6182l8909O2330L9278l4427k760R7950R4980j7304m0250J08506K28202
38997E43778J19849r7828j39049M1849J89353J10430p8420j50830q2594l3432
38987D23106q6252j50089j25605m8863k0778o4256j10781r5047j2052J02938K02819
$$ plain form
38976 15140 251677 423904 460680 375804 262497 220438 281011 396050 493039 538896 548112
38965 548112 533968 479173 383358 316984 359874 469567 494302 386047 329666 538415 943673
38954 943673 1228502 1193405 950472 706573 516173 358719 300309 383097 446549 286999
38944 286999 -22749 -187168 -78418 135086 290318 430493 603599 683212 568480 404581
38934 404581 400857 527664 589582 531783 475574 483512 483890 433251 384659 373007 376118 406643
38922 406643 502478 608146 613648 547510 586188 812139 1085748 1218601 1162170 971134 709327
38911 709327 477067 410435 525690 628159 492836 113782 -302721 -567502 -663553 -691268
38901 -691268 -721035 -712838 -574997 -309553 -65157 16463 -20643 -16162 74623 145695 141325
$$ packed form
38976A5140K36537J72227L6776q4876j13307m2059O0573J15039R6989M5857R216
38965E48112j4144n4795r5815o6374M2890J09693K4735j08255n6381K08749M05258
38954I43673K84829l5097k42933k43899j90400j57454n8410Q2788O3452j59550
38944B86999l09748j64419J08750K13504J55232J40175J73106P9613j14732j63899
38934D04581l724J26807O1918n7799n6209P938L78n0639m8592j1652L111L0525
38922D06643R5835J05668N502o6138L8678K25951K73609J32853n6431j91036k61807
38911G09327k32260o6632J15255J02469j35323l79054m16503k64781r6051k7715
38901f91268k9767Q197J37841K65444K44396Q1620l7106M481R0785P1072m370
$$ plain form
38890 141325 129989 126868 18992 -221564 -404696 -356634 -171494 -57654 -22252 94120
38880 94120 310296 436828 334680 78759 -168240 -304023 -275872 -68826 220528 402545
38870 402545 368504 193084 28161 -37717 9358 141199 274904 308930 241998 194358 241358
38859 241358 286105 189872 -3894 -82171 85300 388951 618723 706304 763512 893081
38849 893081 1030593 1013903 783624 470465 274835 275392 358302 332335 128817 -112483 -196974
38838 -196974 -120509 -73627 -144500 -135524 171093 639671 890608 783972 559913 442929
38828 442929 368078 236652 176027 295452 382495 161232 -248716 -456980 -353393 -213741
38818 -213741 -234994 -286510 -212565 -86247 -16044 50530 155166 173053 30592 -87953 31328
$$ packed form
38890A41325j1336l121j07876k40556j83132M8062J85140J13840L5402J16372
38880I4120K16176J26532j02148k55921k46999j35783K8151K07046K89354J82017
38870D02545l4041j75420j64923o5878M7075J31841J33705L4026o6932m7640M7000
38859B41358M4747r6233j93766p8277J67471L03651K29772Q7581N7208J29569
38849H93081J37512j6690k30279l13159j95630N57Q2910k5967k03518k41300q4491
38838a96974P6465M6882p0873Q976L06617M68578K50937j06636k24059j16984
38828D42929p4851j31426o0625J19425Q7043k21263m09948k08264J03587J39652
38818b13741k1253n1516P3945J26318P0203O6574J04636J7887j42461j18545J19281
$$ plain form
38807 31328 311574 501981 535384 563696 673866 759990 696963 514560 371280 405779 583295
38796 583295 661289 412487 -48828 -300805 -97954 311029 505694 395411 185394 -33239
38786 -33239 -355380 -744542 -960420 -897826 -753812 -725301 -729292 -576223 -283614 -50342
38776 -50342 11519 -25505 -58708 -106260 -275647 -599180 -917518 -989025 -770819 -509392 -431948
38765 -431948 -431829 -254958 57732 190191 41394 -114421 -84267 -65612 -267971 -488505
38755 -488505 -397735 -93294 1783 -246813 -519501 -526799 -342015 -155495 17109 214687
38745 214687 332433 247156 27168 -145169 -183084 -103142 90803 387963 677340 800100
38735 800100 697739 453817 220931 136857 229022 342027 260491 -1933 -133815 127273
$$ packed form
38807C1328K80246J90407L3403K8312J10170Q6124o3027j82403j43280L4499J77516
38796E83295P7994k48802m61315k51977K02851M08983J94665j10283k10017k18633
38786c3239l22141l89162k15878O2594J44014K8511l991J53069K92609K33272
38776e0342O1861l7024l3203m7552j69387l23533l18338p1507K18206K61427P7444
38765d31948J19J76871L12690J32459j48797j55815L0154J8655k02359k20534
38755d88505R0770L04441R5077k48596k72688p298J84784J86520J72604J97578
38745B14687J17746q5277k19988j72337l7915P9942J93945K97160K89377J22760
38735H00100j02361k43922k32886q4074R2165J13005q1536k62424j31882K61088
$$ plain form
38725 127273 656687 1095399 1271854 1287219 1213976 951630 471545 16557 -115929 73834
38715 73834 286416 257219 -6196 -316481 -535302 -656600 -709307 -659508 -455433 -152776
38705 -152776 70301 76599 -65457 -132652 22298 318962 537925 534197 346632 120124
38695 120124 -40196 -119510 -129542 -66485 28316 33973 -116697 -285413 -242298 29902 275407
38684 275407 288799 178039 187747 366096 565719 702725 819475 900352 821156 543177
38674 543177 225685 80201 189304 478056 760255 812732 545947 144169 -81710 -24820
38664 -24820 132731 175259 60562 -141351 -341368 -405244 -218070 112665 264296 39155
38654 39155 -400978 -733109 -792837 -612529 -287781 62185 315645 460339 593563 723333
$$ packed form
38725A27273N29414M38712J76455J5365p3243k62346m80085m54988j32486J89763
38715G3834K12582k9197k63415l10285k18821j21298n2707M9799K04075L02657
38705a52776K23077O298j42056o7195J54950K96664K18963l728j87565k26508
38695A20124j60320p9314j0032O3057R4801N657j50670j68716M3115K72200K45505
38684B75407J3392j10760R708J78349J99623J37006J16750Q0877p9196k77979
38674E43177l17492j45484J09103K88752K82199N2477k66785m01778k25879N6890
38664b4820J57551M2528j14697k01913k00017o3876J87174L30735J51631k25141
38654C9155m40133l32131n9728J80308L24748L49966K53460J44694J33224J29770
$$ plain form
38644 723333 711596 525693 371134 410332 514901 491565 390098 351207 300182 80949
38634 80949 -209410 -334033 -309586 -369237 -549424 -634102 -532561 -394532 -293023 -111238
38624 -111238 155190 291666 208067 116796 196197 321821 330846 336199 539910 884355 1123446
38613 1123446 1150525 1055574 919357 730006 484620 253645 150264 266537 561069 796736
38603 796736 741506 479088 338106 440754 543819 448455 311390 335660 385060 208361
38593 208361 -102426 -213574 -51847 113095 96921 25453 74949 231690 398198 538963
38583 538963 613636 521866 238674 -83056 -236731 -139993 145507 495820 782278 917753
38573 917753 908427 840015 788648 758017 701807 589579 456230 384101 401925 413951 305175
$$ packed form
38644G23333j1737j85903j54559L9198J04569k3336j01467l8891n1025k19233
38634H0949k90359j24623K4447n9651j80187q4678J01541J38029J01509J81785
38624a11238K66428J36476q3599r1271P9401J25624R025N353K03711L44445K39091
38613A123446K7079r4951j36217j89351k45386k30975j03381J16273K94532K35667
38603G96736n5230k62418j40982J02648J03065r5364j37065K4270M9400j76699
38593B08361l10787j11148J61727J64942j6174p1468M9496J56741J66508J40765
38583E38963P4673r1770k83192l21730j53675R6738K85500L50313K86458J35475
38573I17753r326o8412n1367l0631n6210j12228j33349p2129J7824J2026j08776
$$ plain form
38562 305175 117916 16387 53673 108379 105967 148995 327191 541091 644920 644584 620153
38551 620153 571986 490780 457561 503968 491429 328098 203978 377977 783258 1067265
38541 1067265 1003881 673581 267223 -83637 -296217 -361263 -390739 -478031 -529285 -401659
38531 -401659 -166317 -30659 -31273 -31819 -13668 -111581 -313709 -363346 -59906 496316 1021349
38520 1021349 1286829 1242391 1053515 1004897 1195238 1358340 1187446 791134 570736 672536
38510 672536 872615 1025455 1267091 1654082 1943445 1943816 1830421 1883326 2097892 2259493
38500 2259493 2246706 2062208 1693958 1149972 568995 154371 29778 196450 520579 738773
38490 738773 655141 396367 286024 405916 509781 456661 448877 668115 941861 1018045
$$ packed form
38562C05175j87259j01529L7286N4706k412M3028J78196K13900J03829l36k4431
38551F20153m8167q1206l3219M6407j2539j63331j24120J73999M05281K84007
38541A067265o3384l30300m06358l50860k12580o5046k9476q7292n1254J27626
38531d01659K35342J35658o14n46J8151r7913k02128m9637L03440N56222N25033
38520A021349K65480m4438j88876m8618J90341J63102j70894l96312k20398J01800
38510F72536K00079J52840K41636L86991K89363L71j13395N2905K14566J61601
38500B259493j2787j84498l68250n43986n80977m14624j24593J66672L24129K18194
38490G38773q3632k58774j10343J19892J03865n3120p784K19238K73746P6184
$$ plain form
38480 1018045 962829 1003373 1122621 1113748 968884 921662 1085499 1278748 1279201 1110446 996393
38469 996393 1086266 1276407 1325302 1154819 973207 1014988 1231592 1392032 1430441 1482245
38459 1482245 1599605 1677844 1684149 1711534 1769892 1770823 1745583 1803341 1855159 1711450 1501703
38448 1501703 1616725 2123494 2619232 2809928 2849220 2944158 3040895 3112212 3340411 3757314
38438 3757314 4085098 4181222 4256499 4437788 4573253 4714563 5258256 6277764 7256772 7867658
38428 7867658 8469837 9445414 10653703 11991727 13818205 16305341 19118954 22329325
38420 22329325 26781642 32889819 40140604 48752081 60703482 78125526 102333537 135821171
38412 135821171 181922771 237397276 285801358 304609470 283401200 233574237 177981162
$$ packed form
38480A018045n5216M0544J19248q873j44864m7222J63837J93249M53j68755j14053
38469I96393Q9873J90141M8895j70483j81612M1781K16604J60440L8409N1804
38459A482245J17360P8239O305K7385N8358R31k5240N7758N1818j43709k09747
38448A501703J15022N06769M95738J90696L9292R4938R6737P1317K28199M16903
38438C757314L27784R6124P5277J81289J35465J41310N43693J019508R79008O10886
38428G867658O02179R75577J208289J338024J826478K487136K813613L210371
38420B2329325M452317O108177P250785Q611477J1951401J7422044K4208011L3487634
38412A35821171M6101600N5474505M8404082J8808112k1208270m9826963n5593075
$$ plain form
38405 177981162 132719183 100452884 77385133 60759888 49232114 40860264 33870930
38398 33870930 28037369 23714666 20465399 17628487 15263589 13561326 12072181 10365232
38390 10365232 8833283 8068772 7896221 7669613 7157335 6589461 6143558 5838711 5669297
38381 5669297 5491192 5047266 4377673 3894207 3808816 3832915 3672084 3438510 3318113 3214999
38371 3214999 3014657 2843025 2774204 2620979 2300792 2071005 2106762 2182021 2081901 1998494
38361 1998494 2166705 2405781 2397420 2170407 1940268 1693573 1319684 979489 946868 1177377
38351 1177377 1372585 1407561 1407045 1457871 1504081 1487841 1395853 1224053 1048017 1023085 1170651
38340 1170651 1304117 1309284 1315872 1423379 1470439 1295061 1019150 823465 631037 297698
$$ packed form
38405A77981162m5261979l2266299k3067751j6625245j1527774q371850o989334
38398C3870930n833561m322703l249267k836912k364898j702263j489145j706949
38390A0365232j531949p64511j72551k26608n12278n67874m45903l04847j69414
38381E669297j78105m43926o69593m83466q5391K4099j60831k33574j20397j03114
38371C214999k00342j71632o8821j53225l20187k29787L5757P5259j00120q3407
38361A998494J68211K39076q361k27013k30139k46695l73889l40195l2621K30509
38351A177377J95208L4976n16N0826M6210j6240r1988j71800j76036k4932J47566
38340A170651J33466N167O588J07507M7060j75378k75911j95685j92428l33339
$$ plain form
38330 297698 -45718 -150564 -38250 62047 78714 126732 246196 379788 558068 860115
38320 860115 1229458 1538825 1774294 1956559 1977952 1747895 1411719 1189480 1080650 956226
38310 956226 834265 802841 775479 617667 436617 442014 585223 651120 644613 734598 849637
38299 849637 724250 386086 209225 378618 646184 743558 709012 654621 532105 336772
38289 336772 265431 423670 583972 482533 204531 43734 95918 209801 256682 240260
38279 240260 185070 103949 70544 177675 406222 626936 736849 732043 661078 570859 498083
38268 498083 468013 480324 494324 443658 314515 214323 266157 390475 336566 51234 -144541
38257 -144541 39671 409803 526904 335257 209260 355436 536043 511384 417682 498545
$$ packed form
38330B97698l43416j04846J12314J00297J6667M8018J19464J33592J78280L02047
38320H60115L69343L09367K35469J82265K1393k30057l36176k22239j08830j24424
38310I56226j21961l1424k7362j57812j81050N397J43209O5897o507Q9985J15039
38299H49637j25387l38164j76861J69393K67566R7374l4546n4391j22516j95333
38289C36772p1341J58239J60302j01439k78002j60797N2184J13883M6881j6422
38279B40260n5190q1121l3405J07131K28547K20714J09913m806p0965r0219p2776
38268D98083l0070J2311J4000n0666j29143j00192N1834J24318n3909k85332j95775
38257a44541J84212L70132J17101j91647j25997J46176J80607k4659r3702Q0863
$$ plain form
38247 498545 733786 974196 1220918 1504944 1662054 1516411 1189654 964252 896674 799191
38237 799191 564088 282822 56929 -109618 -222602 -264947 -252791 -189834 2505 356346
38227 356346 693578 771181 590043 390229 328915 334596 311148 306582 391592 499752 497432
38216 497432 356945 193440 158451 314043 568613 736327 713293 584982 499986 469776
38206 469776 392445 261438 225148 399230 711675 985763 1116066 1121263 1072495 1013719 934340
38195 934340 801717 624583 465094 368173 313565 268107 233800 198624 111700 -12349 -38226
38184 -38226 119940 322992 349337 201671 115724 232769 408227 417434 243863 73536
38174 73536 64258 198954 340719 375499 296434 163718 1279 -214156 -439988 -534885 -432123
$$ packed form
38247D98545K35241K40410K46722K84026J57110j45643l26757k25402o7578r7483
38237G99191k35103k81266k25893j66547j12984m2345J2156O2957J92339L53841
38227C56346L37232P7603j81138j99814o1314N681k3448m566Q5010J08160k320
38216D97432j40487j63505l4989J55592K54570J67714k3034j28311q4996l0210
38206D69776p7331j31007l6290J74082L12445K74088J30303N197m8768n8776p9379
38195I34340j32623j77134j59489r6921n4608m5458l4307l5176q6924j24049k5877
38184c8226J58166K03052K6345j47666q5947J17045J75458R207j73571j70327
38174G3536r278J34696J41765L4780p9065j32716j62439k15435k25832r4897J02762
$$ plain form
38163 -432123 -278397 -273803 -416030 -542089 -583840 -602479 -580555 -404660 -120186 16520
38153 16520 -117688 -278232 -134124 317444 781005 1031664 1078634 993605 765180 385261
38143 385261 -29171 -289043 -300048 -152270 -29705 -9969 31198 262115 651760 971427
38133 971427 1055097 959682 835574 754801 728635 774328 862306 882771 761585 541091 280845
38122 280845 -12555 -273005 -338716 -176785 -18210 -82055 -262307 -301786 -203061 -212302 -409913
38111 -409913 -583738 -565592 -458878 -434166 -496276 -574407 -677640 -818687 -902325 -832606 -662011
38100 -662011 -525668 -481497 -492362 -503458 -469587 -371356 -262331 -230832 -273948 -303367 -314493
38089 -314493 -413112 -593411 -639494 -391014 1986 253585 300991 321105 429295 538479
$$ packed form
38163d32123J53726M594j42227j26059m1751j8639K1924J75895K84474J36706
38153A6520j34208j60544J44108M51568M63561K50659M6970q5029k28425l79919
38143C85261m14432k59872j1005J47778J22565J9736M1167K30917L89645L19667
38133I71427Q3670r5415j24108q0773k6166M5693Q7978K0465j21186k20494k60246
38122B80845k93400k60450o5711J61931J58575o3845j80252l9479R8725r241j97611
38111d09913j73825J8146J06714K4712o2110p8131j03233j41047q3638O9719J70595
38100f62011J36343M4171j0865j1096L3871R8231J09025L1499m3116k9419j1126
38089c14493r8619j80299m6083K48480L93000K51599M7406K0114J08190J09184
$$ plain form
38079 538479 528277 404472 252932 150190 158474 304420 502999 578887 436755 176854
38069 176854 -18805 -102936 -201598 -405853 -583252 -506430 -189050 48451 -31365 -248659
38059 -248659 -270741 -138651 -226805 -630213 -925983 -738958 -276369 -24758 -102886 -228046
38049 -228046 -205343 -105591 15365 240252 572277 853035 974029 966220 838093 547645
38039 547645 193630 5648 49246 136461 114833 44586 -3890 -106427 -294702 -404128
38029 -404128 -291721 -68945 47680 9564 -79846 -141474 -143387 -58325 59378 59799 -91689
38018 -91689 -185082 -2519 385882 697538 738391 513286 136803 -219217 -376390 -310902
38008 -310902 -215205 -275063 -453212 -603461 -684960 -712584 -618166 -365916 -121262 -84087 -198115
$$ packed form
38079E38479j0202j23805j51540j02742Q284J45946J98579P5888j42132k59901
38069A76854j95659q4131r8662k04255j77399P6822L17380K37501p9816k17294
38059b48659k2082J32090q8154m03408k95770J87025M62589K51611p8128j25160
38049b28046K2703R9752J20956K24887L32025K80758J20994p809j28127k90448
38039E47645l54015j87982M3598Q7215k1628p0247m8476j02537j88275j09426
38029d04128J12407K22776J16625l8116q9410o1628j913Q5062J17703M21j51488
38018i1689r3393J82563L88401L11656M0853k25105l76483l56020j57173O5488
38008c10902R5697n9858j78149j50249q1499k7624R4418K52250K44654L7175j14028
$$ plain form
37997 -198115 -231512 -109873 38172 138264 249811 382151 441902 400289 343493 331803
37987 331803 354632 415577 502727 509292 381825 313143 538913 931608 1065109 754447 293095
37976 293095 63551 130172 314665 459807 494538 419825 349817 415889 554502 566576 438194
37965 438194 365290 384202 271375 -43690 -278383 -238822 -170407 -363481 -653484 -679020
37955 -679020 -462018 -326738 -337398 -238834 46920 267701 258861 163247 120582 49653 -110718
37944 -110718 -216577 -155587 -48358 -25414 11216 202500 453406 548195 449388 289426
37934 289426 132598 -66176 -296909 -460394 -502257 -454702 -353530 -234363 -193506 -304858
37924 -304858 -460622 -450368 -261173 -152986 -313449 -544113 -471774 -53075 330564 367488
$$ packed form
37997a98115l3397J21639J48045J00092J11547J32340N9751m1613n6796j1690
37987C31803K2829O0945Q7150O565j27467o8682K25770L92695J33501l10662m61352
37976B93095k29544O6621J84493J45142L4731p4713p0008O6072J38613J2074j28382
37965D38194p2904J8912j12827l15065k34693L9561O8415j93074k90003k5536
37955f79020K17002J35280j0660R8564K85754K20781q840r5614m2665p0929j60371
37944a10718j05859O0990J07229K2944L6630J91284K50906R4789r8807j59962
37934B89426j56828j98774k30733j63485m1863M7555J01172J19167M0857j11352
37924c04858j55764J0254J89195J08187j60463k30664P2339M18699L83639L6924
$$ plain form
37914 367488 242502 388556 884821 1335069 1395176 1203557 1124916 1212229 1163778 792764
37904 792764 304215 20378 1809 77310 142754 254779 437805 554193 446899 145833
37894 145833 -150764 -291838 -308608 -320562 -365561 -377097 -302589 -172405 -40568 82795
37884 82795 211660 338957 433187 442187 299672 4254 -284297 -329341 -77858 231514
37874 231514 311853 135056 -86305 -172445 -125060 -33640 41305 69536 26005 -92620 -257484
37863 -257484 -414755 -482799 -384527 -133746 151908 377112 552492 695188 737116 638848
37853 638848 509703 467694 437894 253633 -77866 -382797 -567690 -667280 -650808 -399365
37843 -399365 69237 537892 813504 854081 654170 227596 -230675 -413590 -263851 -53961
$$ packed form
37914C67488j24986J46054M96265M50248O0107j91619p8641Q7313m8451l71014
37904G92764m88549k83837j8569P5501O5444J12025J83026J16388j07294l01066
37894A45833k96597j41074j6770j1954m4999j1536P4508J30184J31837J23363
37884H2795J28865J27297R4230R000j42515k95418k88551m5044K51483L09372
37874B31514Q0339j76797k21361q6140M7385R1420P4945K8231m3531j18625j64864
37863b57484j57271o8044R8272K50781K85654K25204J75380J42696M1928r8268
37853F38848j29145m2009k9800j84261l31499l04931j84893r9590J6472K51443
37843c99365M68602M68655K75612M0577j99911m26574m58271j82915J49739K09890
$$ plain form
37833 -53961 21317 82540 218033 185659 -226929 -750541 -925049 -744049 -618658 -714224
37823 -714224 -723580 -391743 93632 413553 538541 621748 680209 625577 494336 426289 461826
37812 461826 517271 517204 430387 241819 17943 -71824 52318 221412 214088 80486 92533
37801 92533 360195 667108 738000 525805 167656 -205753 -508988 -651355 -588523 -403778
37791 -403778 -243002 -172644 -158401 -154310 -140615 -97885 -29755 -5269 -87900 -209233 -209983 -54211
37779 -54211 80327 6757 -218385 -332193 -152515 229502 543800 580203 335520 -20953
37769 -20953 -305321 -470752 -614889 -822245 -1016910 -1019709 -754976 -352472 -25806 118460
37759 118460 147466 225403 478430 871024 1181744 1163068 788836 311889 20192 -33561
$$ packed form
37833e3961P5278O1223J35493l2374m12588n23612j74508J81000J25391r5566
37823g14224r356L31837M85375L19921J24988Q3207N8461n4632j31241o8047L5537
37812D61826N5445o7q6817j88568k23876q9767J24142J69094p324j33602J2047
37801I2533K67662L06913P0892k12195l58149l73409l03235j42367O2832J84745
37791d03778J60776P0358J4243M091J3695M2730O8130K4486q2631j21333p50J55772
37779e4211J34538p3570k25142j13808J79678L82017L14298L6403k44683l56473
37769b0953k84368j65431j44137k07356j94665k799K64733M02504L26666J44266
37759A18460K9006P7937K53027L92594L10720j8676l74232m76947k91697n3753
$$ plain form
37749 -33561 4116 51376 194638 496973 824699 979489 954948 928565 983001 969485 737595
37738 737595 407087 268540 435650 738930 981559 1142766 1251040 1214298 943332 564107
37728 564107 320240 274337 269251 197128 139642 190796 296407 358823 380856 409840 439498
37717 439498 464423 534290 640243 634744 402751 59155 -159267 -162171 -36406 147529 387542
37706 387542 600767 605998 344454 2853 -182564 -179066 -136088 -168546 -253988 -327021 -388740
37695 -388740 -487619 -622242 -701795 -628478 -423420 -238863 -209993 -310101 -388806 -332566 -136786
37684 -136786 152904 475478 713241 720848 481068 186900 76589 181502 304835 271715
37674 271715 136646 82551 148869 161279 -26026 -298672 -391396 -204178 98648 313638
$$ packed form
37749c3561L7677M7260J43262L02335L27726J54790k4541k6383N4436j3516k31890
37738G37595l30508j38547J67110L03280K42629J61207J08274l6742k70966l79225
37728E64107k43867m5903n086p2123n7486N1154J05611O2416K2033K8984K9658
37717D39498K4925O9867J05953n499k31993l43596k18422k904J25765J83935K40013
37706C87542K13225N231k61544l41601j85417L498M2978l2458q5442p3033o1719
37695c88740r8879j34623p9553P3317K05058J84557K8870j00108p8705N6240J95780
37684a36786K89690L22574K37763P607k39780k94168j10311J04913J23333l3120
37674B71715j35069n4095O6318J2410j87305k72646r2724J87218L02826K14990
$$ plain form
37664 313638 403036 426923 400381 334350 331791 486278 699935 742913 523006 193566 -39142
37653 -39142 -124921 -141224 -132238 -46685 180592 516843 805667 879212 728131 522558 407741
37642 407741 324278 120561 -195536 -445116 -517024 -484834 -455864 -429090 -353036 -213275 -10917
37631 -10917 233738 406085 363525 159809 60773 216566 451566 530306 497279 538976 606006
37620 606006 454680 70233 -226803 -185494 93704 402061 724005 1101124 1372429 1327033
37610 1327033 1063391 933155 1088194 1291058 1247938 952585 597788 303002 80579 -35828
37600 -35828 -15779 44480 -6937 -155718 -201579 -15406 271243 386574 171802 -307789
37590 -307789 -824023 -1120192 -1076410 -818898 -608158 -548784 -471348 -192190 170387 287457
$$ packed form
37664C13638Q9398K3887k6542o6031k559J54487K13657M2978k19907l29440k32708
37653c9142q5779j6303Q986Q5553K27277L36251K88824P3545j51081k05573j14817
37642D07741q3463k03717l16097k49580p1908L2190K8970K6774P6054J39761K02358
37631a0917K44655J72347m2560k03716r9036J55793K35000P8740l3027M1697O7030
37620F06006j51326l84447k97036M1309K79198L08357L21944L77119K71305m5396
37610A327033k63642j30236J55039K02864m3120k95353l54797k94786k22423j16407
37600c5828K0049O0259n1417j48781m5861J86173K86649J15331k14772m79591
37590c07789n16234k96169M3782K57512K10740N9374P7436K79158L62577J17070
$$ plain form
37580 287457 42824 -278236 -321317 -106125 -1204 -245346 -623331 -723009 -452489 -139278
37570 -139278 -79067 -157483 -67945 214188 410232 375179 298526 379190 530303 579058 587053
37559 587053 746787 1051625 1299590 1413363 1585334 2109505 3181530 4764768 6437585
37550 6437585 7441084 7196532 5888623 4347979 3263547 2655030 2152551 1559863 996616
37541 996616 653206 583425 669791 692352 508651 228410 104634 209271 372565 496459
37531 496459 700947 1020762 1193510 993525 613677 432499 493032 504444 330311 181120
37521 181120 274962 553966 821049 960164 931873 728411 449841 295102 359082 513765
37511 513765 561830 427472 145910 -220015 -560034 -708370 -582098 -301149 -80372 -9239
$$ packed form
37580B87457k44633l21060m3081K15192J04921k44142l77985r9678K70520L13211
37570a39278O0211p8416Q9538K82133J96044l5053p6653Q0664J51113M8755P995
37559E87053J59734L04838K47965J13773J71971N24171J072025J583238J672817
37550F437585J003499k44552j307909j540644j084432o08517n02479n92688n63247
37541I96616l43410o9781Q6366K2561j83701k80241j23776J04637J63294J23894
37531D96459K04488L19815J72748j99985l79848j81178O0533J1412j74133j49191
37521A81120R3842K79004K67083J39115k8291k03462k78570j54739O3980J54683
37511E13765M8065j34358k81562l65925l40019j48336J26272K80949K20777P1133
$$ plain form
37501 -9239 1016 62864 171677 244744 267002 341167 550059 790202 829572 572940 192222
37490 192222 -77813 -196259 -265084 -300724 -229346 -97916 -93745 -270257 -392528 -183860
37480 -183860 327420 806502 943687 727644 396982 172928 68710 -40146 -198245 -295014
37470 -295014 -222122 -16346 218085 443753 649504 759701 727111 663072 704100 763643
37460 763643 602736 184050 -215238 -319975 -158634 24438 48920 -81606 -243061 -293669
37450 -293669 -172204 53387 267591 421056 488822 371112 -1571 -472121 -754163 -761407
37440 -761407 -658900 -551597 -347033 -13936 265144 358098 390873 493125 513788 230884
37430 230884 -265742 -638215 -692715 -519215 -301200 -168407 -178484 -261600 -233340 -29626
$$ packed form
37501i239J0255O1848J08813P3067K2258P4165K08892K40143L9370k56632l80718
37490A92222k70035j18446o8825l5640P1378J31430M171j76512j22271K08668
37480a83860N11280M79082J37185k16043l30662k24054j04218j08856j58099r6769
37470b95014P2892K05776K34431K25668K05751J10197l2590o4039M1028N9543
37460G63643j60907m18686l99288j04737J61341J83072K4482j30526j61455n0608
37450b93669J21465K25591K14204J53465O7766j17710l72683m70550k82042p244
37440g61407J02507J07303K04564L33097K79080R2954L2775J02252K0663k82904
37430B30884m96626l72473n4500J73500K18015J32793j0077q3116K8260K03714
$$ plain form
37420 -29626 143524 76650 -116384 -161664 -36415 51917 56843 156430 395139 561504 516789
37409 516789 385033 297430 188606 -242 -126570 -41949 169299 324503 394916 454095
37399 454095 477790 379282 193148 66434 82109 194489 310904 360530 335882 339695 514553
37388 514553 836715 1063644 996357 716337 438799 211711 -73438 -415181 -645319 -680358
37378 -680358 -672131 -810364 -1054087 -1155559 -940081 -506097 -127196 29618 53529 135358
37368 135358 308985 429106 389226 237336 44401 -195060 -436655 -497370 -256957 122056
37358 122056 346681 341190 279803 273432 204688 -54148 -396076 -568809 -457961 -195303 5047
37347 5047 73500 144496 391794 797939 1123413 1154957 953517 775552 758726 783822 671917
$$ packed form
37420b9626J73150o6874j93034m5280J25249Q8332M926R9587K38709J66365m4715
37409E16789j31756q7603j08824j88848j26328Q4621K11248J55204P0413N9179
37399D54095K3695r8508j86134j26714J5675J12380J16415M9626k4648L813J74858
37388E14553L22162K26929o7287k80020k77538k27088k85149l41743k30138l5039
37378f80358Q227j38233k43723j01472K15478M33984L78901J56814K3911Q1829
37368A35358J73627J20121l9880j51890j92935k39461k41595o0715K40413L79013
37358A22056K24625n491o1387o371o8744k58836l41928j72733J10848K62658K00350
37347E047O8453P0996K47298M06145L25474L1544k01440j77965j6826K5096j11905
$$ plain form
37336 671917 422820 196778 120234 175837 251862 242488 116216 -63121 -181313 -171050 -67850
37325 -67850 45505 134424 217347 279398 240389 61647 -140457 -171124 22602 280342 433387
37314 433387 502729 590285 648411 539816 323394 267066 491006 785532 914342 922911 958867
37303 958867 941318 679369 260127 32611 164881 445853 590922 540327 375880 149708
37293 149708 -67558 -128654 32792 270593 381370 329989 227582 166892 182549 296236
37283 296236 483442 646529 718653 737933 728481 593215 262132 -113131 -282506 -213169
37273 -213169 -124801 -169266 -212146 -26099 369811 666474 567705 94019 -429796 -671979
37263 -671979 -559746 -262816 20810 198882 247419 161624 -12313 -174293 -251272 -240524
$$ packed form
37336F71917k49097k26042p6544N5603P6025r374j26272j79337j18192J0263J03200
37325f7850J13355Q8919Q2923O2051l9009j78742k02104l0667J93726K57740J53045
37314D33387O9342Q7556N8126j08595k16422n6328K23940K94526J28810Q569L5956
37303I58867j7549k61949m19242k27516J32270K80972J45069n0595j64447k26172
37293A49708k17266o1096J61446K37801J10777n1381j02407o0690J5657J13687
37283B96236J87206J63087P2124J9280r452j35266l31083l75263j69375O9337
37273b13169Q8368m4465m2880J86047L95910K96663r8769m73686n23815k42183
37263f71979J12233K96930K83626J78072M8537q5795j73937j61980p6979J0748
$$ plain form
37253 -240524 -167719 -82476 -100464 -322186 -655870 -846379 -765327 -563855 -447693 -419613
37243 -419613 -363633 -269564 -215035 -198351 -151583 -83375 -74815 -165307 -344539 -587861 -787705
37232 -787705 -757838 -469963 -184852 -146918 -236802 -165703 56989 145317 17858 -59187 114031
37221 114031 394292 551206 559533 499412 377634 206770 95716 112655 186619 246414 306309
37210 306309 329902 206251 -21180 -115205 6703 89607 -101204 -425853 -587745 -537785
37200 -537785 -427086 -309088 -154237 -49551 -110247 -261054 -351724 -416558 -564089 -681848
37190 -681848 -543097 -184231 107073 187902 183277 203348 202543 153308 106051 32795 -143411
37179 -143411 -320079 -270717 13528 289614 426197 524490 600114 464655 86703 -217057
$$ packed form
37253b40524P2805Q5243j7988k21722l33684j90509Q1052K01472J16162K8080
37243d19613N5980R4069N4529J6684M6768O8208Q560r0492j79232k43322j99844
37232g87705K9867K87875K85111L7934q9884P1099K22692Q8328j27459p7045J73218
37221A14031K80261J56914Q327o0121j21778j70864j11054J6939P3964N9795N9895
37210C06309K3593j23651k27431r4025J21908Q2904j90811l24649j61892M9960
37200e37785J10699J17998J54851J04686o0696j50807r0670o4834j47531j17759
37190f81848J38751L58866K91304Q0829m625K0071q05m9235m7257p3256j76206
37179a43411j76668M9362K84245K76086J36583R8293P5624j35459l77952l03760
$$ plain form
37169 -217057 -172880 79708 212468 116109 -102633 -330244 -439131 -260927 185640 580809
37159 580809 645599 464909 263755 48796 -245840 -432993 -274496 58282 116372 -202776
37149 -202776 -510472 -487907 -276039 -171222 -203357 -200112 -76586 123496 341992 500142
37139 500142 479639 257041 -7681 -128480 -83484 28869 140877 229919 262548 240008
37129 240008 254641 393734 602818 722808 651701 415327 107232 -174684 -346934 -364315
37119 -364315 -244872 -52779 138910 265190 287514 227197 157007 129353 128845 117958 106491
37108 106491 137924 206735 223852 101246 -119736 -267171 -230037 -141403 -269098 -673639
37098 -673639 -1073689 -1153094 -929865 -687338 -584582 -507996 -327382 -119333 -32432 -42254
$$ packed form
37169b17057M4177K52588J32760r6359k18742k27611j08887J78204M46567L95169
37159E80809O4790j80690k01154k14959k94636j87153J58497L32778N8090l19148
37149b02776l07696K2565K11868J04817l2135L245J23526K00082K18496J58150
37139E00142k0503k22598k64722j20799M4996J12353J12008Q9042L2629k2540
37129B40008J4633J39093K09084J19990p1107k36374l08095k81916j72250j7381
37119c64315J19443J92093J91689J26280K2324o0317p0190k7654n08j0887j1467
37108A06491L1433O8811J7117j22606k20982j47435L7134Q8634j27695m04541
37098f73639m00050p9405K23229K42527J02756P6586J80614K08049Q6901r822
$$ plain form
37088 -42254 29882 287039 638989 913586 1027069 1024754 970726 829257 511327 61074
37078 61074 -292628 -374179 -294772 -302138 -417207 -406640 -162043 92552 103736 -49788 -79654
37067 -79654 106566 313061 358686 300845 309257 437165 589973 655641 602176 473101 331112
37056 331112 206328 88149 -36869 -157918 -262553 -358399 -445538 -493718 -480527 -427901
37046 -427901 -365212 -286497 -192271 -143340 -203904 -340963 -453215 -504560 -548683 -594406 -536994
37035 -536994 -302232 -3594 152143 112869 30495 32400 51626 -34052 -185693 -263001 -260600
37024 -260600 -319007 -478229 -586600 -531576 -415025 -389627 -453688 -546035 -710545 -969938
37014 -969938 -1139689 -1023355 -756927 -676108 -804335 -766043 -334947 195060 390674 234917
$$ packed form
37088d2254P2136K57157L51950K74597J13483k315n4028j41469l17930m50253
37078F1074l53702q1551P9407p366j15069J0567K44597K54595J1184j53524k9866
37067g9654J86220K06495M5625n7841Q412J27908J52808O5668n3465j29075j41989
37056C31112j24784j18179j25018j21049j04635r5846q7139m8180J3191N2626
37046d27901O2689P8715R4226M8931o0564j37059j12252n1345m4123m5723N7412
37035e36994K34762K98638J55737l9274q2374J905J9226q5678j51641p7308K401
37024b60600n8407j59222j08371N5024J16551K5398o4061r2347j64510k59393
37014i69938j69751J16334K66428Q0819j28227L8292M31096N30007J95614j55757
$$ plain form
37004 234917 58777 45366 72993 11847 -84080 -129788 -156993 -219442 -271077 -221710 -49013
36993 -49013 191811 416334 540422 515995 372793 199920 74800 25599 46061 115548
36983 115548 217055 351545 500998 573270 471881 270880 215646 436791 729867 752479
36973 752479 411755 -66808 -429727 -610398 -651472 -574877 -405274 -224225 -117459 -106150
36963 -106150 -161566 -236181 -257649 -156395 57542 279418 394428 353610 178185 -53251
36953 -53251 -221913 -242441 -141497 -14594 103379 265680 493196 681114 664678 371887
36943 371887 -80673 -434265 -482720 -275568 -76462 -45605 -28130 222000 663884 998038
36933 998038 1080544 1100115 1242232 1355015 1138510 596470 106196 3418 217079 380510
$$ packed form
37004B34917j76140j3411K7627o1146r5927m5708k7205o2449n1635M9367J72697
36993d9013K40824K24523J24088k4427j43202j72873j25120m9201K0462O9487
36983A15548J01507J34490J49453P2272j01389k01001n5234K21145K93076K2612
36973G52479l40724m78563l62919j80671m1074P6595J69603J81049J06766J1309
36963a06150n5416p4615k1468J01254K13937K21876J15010m0818j75425k31436
36953e3251j68662k0528J00944J26903J17973J62301K27516J87918j6436k92791
36943C71887m52560l53592m8455K07152J99106L0857J7475K50130M41884L34154
36933I98038Q2506J9571J42117J12783k16505n42040m90274j02778K13661J63431
$$ plain form
36923 380510 242008 -108992 -408388 -522105 -519624 -489123 -412827 -284290 -231704 -385119
36913 -385119 -663218 -830565 -765451 -560352 -373479 -308386 -417333 -649182 -778087 -579752
36903 -579752 -144214 172855 197967 141472 226155 331464 224100 -27152 -152818 -117166
36893 -117166 -147014 -320400 -418724 -279208 -49901 55174 74648 193026 419955 553387
36883 553387 430087 86410 -307003 -564030 -560894 -315816 -9482 161156 173726 161307
36873 161307 198587 201320 80654 -98606 -210990 -267145 -385684 -556692 -569735 -274455
36863 -274455 160039 372387 195927 -178683 -448138 -511454 -487125 -489636 -484480 -363701 -100643
36852 -100643 200667 392709 401847 260281 46511 -163954 -284989 -234392 -37721 127443
$$ packed form
36923C80510j38502l51000k99396j13717K481L0501P6296J28537N2586j53415
36913c85119k78099j67347O5114K05099J86873O5093j08947k31849j28905J98335
36903e79752M35538L17069K5112n6495Q4683J05309j07364k51252j25666L5652
36893a17166k9848j73386r8324J39516K29307J05075J9474J18378K26929J33432
36883E53387j23300l43677l93413k57027L136K45078L06334J70638J2570j2419
36873A61307L7280K733j20666j79260j12384n6155j18539j71008j3043K95280
36863b74455M34494K12348j76460l74610k69455o3316K4329k511N156J20779K63058
36852a00643L01310J92042R138j41566k13770k10465j21035N0597J96671J65164
$$ plain form
36842 127443 99118 -61936 -143798 -77470 -32745 -165845 -395306 -529075 -525672 -511543 -588518
36831 -588518 -731725 -852784 -879603 -797751 -673224 -583138 -468355 -161664 319132 623109
36821 623109 420392 -137376 -542213 -537163 -365406 -336995 -392099 -276325 23520 257911
36811 257911 260387 97760 -113066 -339794 -546123 -633402 -556115 -401190 -287815 -258089
36801 -258089 -303502 -409489 -519661 -545766 -487249 -463254 -543476 -626468 -592416 -500005 -481035
36790 -481035 -485838 -327047 2239 248703 215912 -11022 -264279 -534766 -839003 -1001954
36780 -1001954 -831611 -447999 -176684 -122839 -113403 -82863 -203751 -510581 -696863 -518688
36770 -518688 -175046 -9537 -4626 97890 273245 198495 -203496 -563979 -556822 -305553
$$ packed form
36842A27443k8325j61054q1862O6328M4725j33100k29461j33769L403J4129p6975
36831e88518j43207j21059k6819Q1852J24527R0086J14783L06691M80796L03977
36821F23109k02717n57768m04837N050J71757K8411n5104J15774K99845K34391
36811B57911K476j62627k10826k26728k06329q7279P7287J54925J13375K9726
36801b58089m5413j05987j10172k6105N8517K3995q0222q2992L4052R2411J8970
36790d81035m803J58791L29286K46464l2791k26934k53257k70487l04237j62951
36780a001954J70343L83612K71315N3845R436L0540j20888l06830j86282J78175
36770e18688L43642J65509M911J02516J75355p4750m01991l60483P157K51269
$$ plain form
36760 -305553 -109728 5176 208132 472932 561164 386856 159951 97112 151107 124877
36750 124877 -41071 -201807 -204057 -73792 14796 -62244 -233653 -301487 -147777 156095
36740 156095 445266 611041 622269 460433 129211 -261476 -501110 -435966 -118898 232141
36730 232141 437549 499841 525628 528521 382742 21488 -372984 -486469 -206975 237355
36720 237355 523097 549608 446947 330435 172574 -66386 -294832 -363989 -249456 -80521
36710 -80521 16845 49114 102618 203442 277916 249144 133728 22537 -18464 -7007 -4628
36699 -4628 -33014 -42990 30498 194940 398188 589679 745946 826988 762091 527504 205667
36688 205667 -87987 -312764 -482462 -580171 -588969 -584103 -667996 -796711 -799566 -614577 -378022
$$ packed form
36760c05553J95825J14904K02956K64800Q8232j74308k26905o2839N3995k6230
36750A24877j65948j60736k250J30265Q8588p7040j71409o7834J53710L03872
36740A56095K89171J65775J1228j61836l31222l90687k39634O5144L17068L51039
36730B32141K05408O2292K5787K893j45779l61254l94472j13485K79494M44330
36720B37355K85742K6511j02661j16512j57861k38960k28446o9157J14533J68935
36710h0521R7366L2269N3504J00824P4474k8772j15416j11191m1001J1457K379
36699d628k8386r976P3488J64442K03248J91491J56267Q1042o4897k34587l21837
36688B05667k93654k24777j69698r7709q798M866q3893j28715k855J84989K36555
$$ plain form
36677 -378022 -222466 -127365 -59763 -105796 -305854 -481053 -420701 -175741 27408 115184
36667 115184 197754 297639 292330 167782 91610 134845 127737 -65686 -295530 -319739 -137569
36656 -137569 46725 126229 182275 288806 379509 345269 170016 -68256 -279219 -416979
36646 -416979 -483166 -495436 -466176 -426747 -440734 -529278 -598968 -538728 -400850 -375750 -538374
36635 -538374 -720747 -711827 -511224 -310357 -272364 -382467 -463818 -313136 97947 525426
36625 525426 663589 497865 316825 308977 318816 134654 -154394 -305980 -317872 -409909 -634165
36614 -634165 -764647 -642132 -416579 -323272 -356484 -305140 -49287 297270 531832 572517
36604 572517 498782 418813 357035 315378 389334 678979 1043928 1108074 652310 -84063 -636819
$$ packed form
36677c78022J55556R5101O7602m6033k00058j75199O0352K44960K03149Q7776
36667A15184Q2570R9885n309j24548p6172M3235p108j93423k29844k4209J82170
36656a37569J84294P9504N6046J06531R0703l4240j75253k38272k10963j37760
36646d16979o6187j2270K9260L9429j3987q8544o9690O0240J37878K5100j62624
36635e38374j82373Q920K00603K00867L7993j10103q1351J50682M11083M27479
36625E25426J38163j65724j81040p848R839j84162k89048j51586j1892r2037k24256
36614f34165j30482J22515K25553R3307l3212N1344K55853L46557K34562M0685
36604E72517p3735p9969o1778m1657P3956K89645L64949O4146m55764p36373n52756
$$ plain form
36593 -636819 -784122 -641448 -384997 -99181 128115 200262 162688 177897 284179 334649
36583 334649 233937 73815 -39599 -134033 -255234 -354158 -397064 -448250 -523886 -501587 -323082
36572 -323082 -165014 -226688 -427519 -508791 -399076 -282140 -289169 -309152 -179549 66096
36562 66096 244092 249172 144112 38376 -45306 -150150 -267804 -312768 -250910 -194423 -270261
36551 -270261 -404503 -362212 -48719 340852 550709 543273 447325 323063 134657 -79093
36541 -79093 -173469 -73882 127411 293098 381674 437298 511135 622598 733677 732661 509283
36530 509283 89109 -354136 -658647 -809946 -891813 -956657 -993699 -983758 -917404 -771163 -533666
36519 -533666 -270378 -102777 -79736 -104142 -42816 105931 221898 243443 247392 298364 312183
$$ packed form
36593f36819j47303J42674K56451K85816K27296P2147l7574J5209J06282N0470
36583C34649j00712j60122j13414r4434j21201r8924m2906n1186p5636K2299J78505
36572c23082J58068o1674k00831q1272J09715J16936p029j9983J29603K45645
36562F6096J77996N080j05060j05736q3682j04844j17654m4964O1858N6487p5838
36551b70261j34242M2291L13493L89571K09857p436r5948j24262j88406k13750
36541g9093r4376R9587K01293J65687Q8576N5624P3837J11463J11079j016k23378
36530E09283m20174m43245l04511j51299q1867o4844l7042R941O6354J46241K37497
36519e33666K63288J67601K3041k4406O1326J48747J15967K1545L949N0972J3819
$$ plain form
36508 312183 181834 -15807 -89614 -9058 51882 -5682 -44660 81393 275549 327321 212835
36497 212835 94808 60319 32194 -52308 -136842 -162289 -154502 -146817 -139906 -193550 -414560 -745424
36485 -745424 -888136 -604514 -46102 371676 420840 247145 97645 32994 -4803 7401
36475 7401 131437 288725 315663 213156 163966 239863 270898 132704 -6129 62749 202598
36464 202598 89808 -258596 -436145 -219855 114474 235761 233732 363085 533030 443322
36454 443322 137581 214 166104 326744 245259 96777 94202 112913 -11559 -77475
36444 -77475 205730 674570 852451 615160 341722 338065 454401 421391 270510 190060
36434 190060 163828 24510 -215556 -333551 -204733 34188 169134 134797 11994 -112968
$$ packed form
36508C12183j30349j97641p3807Q0556O0940n7564l8978J26053J94156N1772j14486
36497B12835j18027l4489k8125q4502q4534k5447P787P685O911n3644k21010l30864
36485g45424j42712K83622N58412M17778M9164j73695j49500o4651l7797J2204
36475G401J24036J57288K6938j02507m9190P5897L1035j38194j38833O8878J39849
36464B02598j12790l48404j77549K16290L34329J21287k029J29353J69945q9708
36454D43322l05741j37367J65890J60640q1485j48482k575J8711j24472o5916
36444g7475K83205M68840J77881k37291k73438l657J16336l3010j50881q0450
36434A90060k6232j39318k40066j17995J28818K38921J34946l4337j22803j24962
$$ plain form
36424 -112968 -225785 -350610 -472063 -497712 -325854 23778 377723 550155 502443 335347
36414 335347 156983 5550 -120567 -210797 -224477 -109367 135693 400878 524541 462606
36404 462606 355724 370816 512538 647004 666894 563943 381144 174089 -14402 -217417
36394 -217417 -531272 -942042 -1221654 -1135327 -730736 -287236 -1410 126887 130074 10918
36384 10918 -125483 -101561 86125 246891 308580 423596 630277 659654 310363 -179237
36374 -179237 -407497 -317183 -141631 29036 278063 513677 477258 154354 -166151 -343258
36364 -343258 -571667 -976855 -1333269 -1395934 -1259912 -1157319 -1111138 -1039683 -1009076 -1084530
36354 -1084530 -1071198 -734287 -221687 46255 -88748 -377822 -574773 -700896 -815428 -797191
$$ packed form
36424a12968j12817j24825j21453k5649J71858L49632L53945J72432m7712j67096
36414C35347j78364j51433j26117r0230j3680J15110K45060K65185J23663o1935
36404D62606j06882J5092J41722J34466J9890j02951j82799k07055j88491k03015
36394b17417l13855m10770k79612Q6327M04591M43500K85826J28297L187j19156
36384A0918j36401K3922J87686J60766O1689J15016K06681K9377l49291m89600
36374a79237k28260R0314J75552J70667K49027K35614l6419l22904l20505j77107
36364c43258k28409m05188l56414o2665J36022J02593M6181P1455L0607p5454
36354a084530J3332L36911N12600K67942j35003k89074j96951j26123j14532J8237
$$ plain form
36344 -797191 -536544 -175717 32866 29952 -33905 -37574 -16009 -47626 -105654 -65367 148263
36333 148263 436838 586515 473673 178453 -128838 -340162 -396973 -247446 37502 195175
36323 195175 30423 -272153 -316957 -15607 284805 279071 94581 54373 224874 400871
36313 400871 436600 380825 316660 252720 190085 163350 186317 240686 317513 392590 385685 245944
36301 245944 66668 6638 89630 184488 204221 226343 375337 660905 972464 1174261
36291 1174261 1177352 983035 696411 450048 287128 170762 120630 245727 575193 933513
36281 933513 1090830 1015267 881612 832479 829142 769700 662774 603111 613208 596506 465479
36270 465479 267062 148634 209086 394773 540858 520911 363077 207785 146157 135883
$$ packed form
36344g97191K60647L60827K08583k914o3857l669K1565l1617n8028M0287K13630
36333A48263K88575J49677j12842k95220l07291k11324n6811J49527K84948J57673
36323A95175j64752l02576m4804L01350L00412n734j84490m0208J70501J75997
36313D00871L5729n5775o4165o3940o2635k6735K2967N4369P6827P5077o905j39741
36301B45944j79276o0030Q2992R4858J9733K2122J48994K85568L11559K01797
36291A174261L091j94317k86624k46363j62920j16366n0132J25097L29466L58320
36281I33513J57317p5563j33655m9133l337n9442j06926n9663J0097j6702j31027
36270D65479j98417j18428O0452J85687J46085j9947j57834j55292o1628j0274
$$ plain form
36260 135883 109044 118173 288194 613325 886204 888562 622861 316001 208083 346541
36250 346541 554549 597544 430104 275884 382249 690046 872432 749137 503820 372411
36240 372411 283674 35866 -266793 -257943 163724 606838 611346 127926 -534381 -1063224
36230 -1063224 -1299323 -1201051 -870384 -551303 -412490 -347793 -140757 193745 389060 257424
36220 257424 -99095 -435852 -597809 -563651 -382710 -157713 -25973 -68431 -238561 -410944
36210 -410944 -491845 -478581 -436329 -423331 -421659 -351720 -176493 34076 174889 206262 140607
36199 140607 -13108 -207304 -308567 -221508 -53700 -18346 -142118 -211375 -77431 125707
36189 125707 189767 145194 194956 391326 574860 647092 702148 797150 771504 473375 69743
$$ packed form
36260A35883k6839R129J70021L25131K72879K358k65701l06860j07918J38458
36250C46541K08008M2995j67440j54220J06365L07797J82386j23295k45317j31409
36240C72411q8737k47808l02659Q850M21667M43114M508m83420o62307n28843
36230a063224k36099R8272L30667L19081J38813O4697K07036L34502J95315j31636
36220B57424l56519l36757j61957L4158J80941K24997J31740m2458j70130j72383
36210d10944q0901J3264M2252J2998J672O9939J75227K10569J40813L1373o5655
36199A40607j53715j94196j01263Q7059J67808L5354j23772o9257J33944K03138
36189A25707O4060m4573M9762J96370J83534P2232N5056R5002k5646k98129m03632
$$ plain form
36178 69743 -85500 105233 365733 429425 361207 375727 481304 494109 343463 161914
36168 161914 60489 -9556 -115472 -209380 -218426 -159845 -84455 -2426 48663 -36135 -276852
36157 -276852 -483512 -425400 -111907 208371 327955 263556 158825 104798 87286 43073
36147 43073 -64872 -191277 -224920 -106877 72721 154767 92809 -3432 -18572 33331 56708
36136 56708 17538 -9733 56207 178984 214213 62208 -216531 -477547 -647091 -721387 -648984
36125 -648984 -367072 10142 208468 108892 -86579 -135657 -78218 -111627 -255104 -355263
36115 -355263 -363208 -366636 -361256 -240719 -50899 -10183 -191063 -397640 -464996 -473081 -530837
36104 -530837 -551647 -423524 -230114 -88611 92689 443184 803819 857098 585739 338621
$$ packed form
36178F9743j55243J90733K60500O3692o8218J4520J05577J2805j50646j81549
36168A61914j01425p0045j05916r3908r046N8581P5390Q2029N1089q4798k40717
36157b76852k06660N8112L13493L20278J19584o4399j04731n4027j7512m4213
36147D3073j07945j26405l3643J18043J79598Q2046o1958r6241j5140N1903K3377
36136E6708l9170k7271O5940J22777L5229j52005k78739k61016j69544p4296P2403
36125f48984K81912L77214J98326r9576j95471m9078N7439l3409j43477j00159
36115c55263p945l428N380J20537J89820M0716j80880k06577o7356q085n7756
36104e30837k0810J28123J93410J41503J81300L50495L60635N3279k71359k47118
$$ plain form
36094 338621 369226 529204 534892 357674 191104 147261 163965 168767 169997 172690 139809 86665
36082 86665 106317 219919 280975 149124 -64791 -65284 268655 700371 898637 805822 632815
36071 632815 542744 489693 377106 225796 112861 41110 -46407 -172813 -310858 -422123
36061 -422123 -465479 -400453 -224095 12431 234014 360806 319942 116650 -104942 -166303
36051 -166303 -46258 114907 219497 311538 434057 509656 441669 242089 -13277 -264254
36041 -264254 -427573 -387078 -132567 167890 339883 386564 414824 457303 474213 463761 456006
36030 456006 442862 408564 380418 373341 356116 345607 431695 618380 763832 785495 770755
36019 770755 745254 531683 67078 -332577 -346794 -155097 -186139 -432966 -457440 -106464
$$ packed form
36094C38621L0605J59978N688j77218j66570m3843J6704M802J230K693l2881n3144
36082H6665J9652J13602O1056j31851k13915m93L33939M31716J98266r2815j73007
36071F32815r0071n3051j12587j51310j12935p1751q7517j26406j38045j11265
36061d22123m3356O5026J76358K36526K21583J26792m0864k03292k21592o1361
36051a66303J20045J61165J04590R2041J22519P5599o7987j99580k55366k50977
36041b64254j63319M0495K54511L00457J71993M6681K8260M2479J6910j0452p755
36030D56006j3144l4298k8146p077j7225j0509Q6088J86685J45452K1663j4740
36019G70755k5501k13571m64605l99655j4217J91697l1042k46827k4474L50976
$$ plain form
36009 -106464 237345 257251 109955 2685 -211189 -660659 -1022834 -910844 -498400 -299542
35999 -299542 -418861 -473041 -257483 -44442 -97431 -266141 -270998 -115315 21874 109298
35989 109298 222516 284630 110614 -275511 -561997 -477121 -113300 155947 71719 -241041
35979 -241041 -417427 -243317 140086 417552 406475 143079 -234302 -566599 -695960 -570322
35969 -570322 -345256 -247424 -299888 -309884 -178818 -79599 -215186 -507393 -672329 -562374
35959 -562374 -300345 -87106 -5330 -36177 -148974 -298894 -403705 -411459 -380667 -432051 -607913
35948 -607913 -811825 -902103 -829737 -677495 -578273 -603767 -716025 -801303 -745145 -499607 -117774
35937 -117774 253598 435386 326494 -4377 -350118 -528383 -520285 -429082 -329179 -222755
$$ packed form
36009a06464L43809J9906j47296j07270k13874m49470l62175J11990M12444J98858
35999b99542j19319n4180K15558K13041n2989j68710m857J55683J37189Q7424
35989A09298J13218O2114j74016l86125k86486Q4876L63821K69247q4228l12760
35979b41041j76386J74110L83403K77466j1077k63396l77381l32297j29361J25638
35969e70322K25066R7832n2464r996J31066R9219j35587k92207j64936J09955
35959e62374K62029K13239Q1776l0847j12797j49920j04811p754L0792n1384j75862
35948f07913k03912r0278P2366J52242R9222k5494j12258q5278N6158K45538L81833
35937a17774L71372J81788j08892l30871l45741j78265Q098R1203R9903J06424
$$ plain form
35927 -222755 -141525 -185609 -392873 -636879 -740026 -653615 -459046 -244505 -72794 -17426
35917 -17426 -99372 -205410 -201383 -124034 -124540 -220187 -262259 -177542 -68875 -21685 7602 29714
35905 29714 -54282 -241004 -324813 -179319 27603 93515 95496 207680 345333 286235 73956
35894 73956 -9989 133409 318796 410018 465264 506262 441801 310415 312218 473036 543959
35883 543959 380924 162448 60279 -35455 -240870 -390756 -317497 -206861 -337423 -606971
35873 -606971 -673315 -484702 -308644 -263235 -196095 -72597 -111288 -393674 -650130 -630303
35863 -630303 -457175 -408514 -520587 -617236 -608614 -554308 -499397 -434353 -395209 -455642 -609741
35852 -609741 -749005 -751793 -553137 -180266 220910 459352 473249 373760 255369 60170
$$ packed form
35927b22755Q1230m4084k07264k44006j03147Q6411J94569K14541J71711N5368
35917a7426q1946j06038M027P7349n06r5647m2072Q4717J08667M7190K9287K2112
35905B9714q3996j86722q3809J45494K06922O5912J981J12184J37653n9098k12279
35894G3956q3945J43398J85387R1222N5246M0998o4461j31386J803J60818P0923
35883E43959j63035k18476j02169r5734k05415j49886P3259J10636j30562k69548
35873f06971o6344J88613J76058M5409O7140J23498l8691k82386k56456J9827
35863f30303J73128M8661j12073r6649Q622N4306N4911O5044L9144o0433j54099
35852f09741j39264k788J98656L72871M01176K38442J3897r9489j18391j95199
$$ plain form
35842 60170 -262036 -556561 -605276 -447812 -385893 -610699 -947015 -1052228 -807465 -433005
35832 -433005 -230541 -261483 -295761 -75437 377461 739850 695122 245717 -301787 -637307
35822 -637307 -696763 -635182 -610351 -614396 -505117 -199603 172870 357456 245553 14576
35812 14576 -71151 22742 73598 -87817 -338197 -426926 -338576 -353672 -686514 -1162061 -1386943
35801 -1386943 -1219855 -918754 -775200 -763042 -678758 -500305 -396040 -420823 -435603 -366323
35791 -366323 -322748 -360689 -323790 -83874 202249 265188 73498 -161131 -271375 -253241
35781 -253241 -144300 11673 70320 -131581 -512179 -715265 -467794 106457 618010 797284
35771 797284 670222 406633 115849 -174711 -415978 -512455 -438578 -321646 -316535 -401002
$$ packed form
35842F0170l22206k94525m8715J57464O1919k24806l36316j05213K44763L74460
35832d33005K02464l0942l4278K20324M52898L62389m4728m49405n47504l35520
35822f37307n9456O1581K4831m045J09279L05514L72473J84586j11903k30977
35812A4576q5727R3893N0856j61415k50380q8729Q8350j5096l32842m75547k24882
35801a386943J67088L01101J43554J2158Q4284J78453J04265k4783j4780O9280
35791c66323M3575l7941L6899K39916K86123O2939j91690k34629j10244J8134
35781b53241J08941J55973N8647k01901l80598k03086K47471N74251N11553J79274
35771G97284j27062k63589k90784k90560k41267r6477P3877J16932N111q4467
$$ plain form
35761 -401002 -399959 -238754 -44482 69861 170912 324478 397744 251256 32854 23209
35751 23209 215687 320958 218142 116250 165206 181729 -49277 -409143 -607875 -578008
35741 -578008 -486224 -443417 -419254 -392367 -377885 -322911 -163027 11809 21269 -145550 -282958
35730 -282958 -229069 -59406 25230 -83838 -330197 -558269 -623059 -494084 -267157 -41828
35720 -41828 170507 352468 375797 137823 -231341 -476406 -552118 -671561 -951870 -1184750
35710 -1184750 -1093511 -704664 -309354 -112187 -70508 -70757 -107513 -214661 -311297 -236981 42937
35699 42937 345017 450172 354917 255463 270292 289688 172108 -22050 -135949 -186234 -334348
35688 -334348 -586380 -727856 -636131 -477263 -456632 -510031 -418179 -152407 83405 147083
$$ packed form
35761d01002J043J61205J94272J14343J01051J53566P3266j46488k18402r645
35751B3209J92478J05271j02816j01892M8956J6523k31006l59866j98732K9867
35741e78008R1784M2807K4163K6887J4482N4974J59884J74836R460j66819j37408
35730b82958N3889J69663Q4636j09068k46359k28072o4790J28975K26927K25329
35720d1828K12335J81961K3329k37974l69164k45065p5712j19443k80309k32880
35710a184750R1239L88847L95310J97167M1679k49l6756j07148r6636P4316K79918
35699D2937L02080J05155r5255r9454J4829J9396j17580j94158j13899n0285j48114
35688c34348k52032j41476R1725J58868K0631n3399R1852K65772K35812O3678
$$ plain form
35678 147083 126898 180860 343727 556267 776368 967327 1040286 915192 635519 350598
35668 350598 169254 73106 -20454 -157259 -324379 -478465 -559108 -515109 -370374 -234181
35658 -234181 -183159 -160519 -76231 20312 1815 -90624 -39564 216591 415613 310497 46347
35647 46347 -41005 60345 14129 -329557 -654004 -582439 -171622 183924 220076 169
35637 169 -272599 -457174 -511902 -480236 -457915 -490650 -509766 -430353 -280195 -166160 -153912
35626 -153912 -241495 -389150 -500156 -448488 -226815 238 95015 117170 166874 159483 -41181
35615 -41181 -318800 -382946 -185940 -33684 -189747 -558016 -874902 -1046625 -1135838 -1138739
35605 -1138739 -977075 -685891 -451486 -430064 -597237 -774986 -763370 -486085 -75774 208240
$$ packed form
35678A47083k0185N3962J62867K12540K20101J90959P2959j25094k79673k84921
35668C50598j81344r6148r3560j36805j67120j54086q0643M3999J44735J36193
35658b34181N1022K2640Q4288R6543j8497r2439N1060K56155J99022j05116k64150
35647D6347q7352J01350m6216l43686l24447P1565M10817L55546L6152k19907
35637A69k72768j84575n4728L1666K2321l2735j9116P9413J50158J14035J2248
35626a53912q7583j47655j11006N1668K21673K27053R4777K2155M9704p391k00664
35615d1181k77619o4146J97006J52256j56063l68269l16886j71723q9213k901
35605a138739J61664K91184K34405K1422j67173j77749J1616K77285M10311K84014
$$ plain form
35595 208240 206787 -7177 -242121 -369498 -353466 -199233 27125 193146 224508 187409
35585 187409 148584 36426 -201450 -377106 -241132 99885 208937 -112086 -497233 -457139
35575 -457139 10463 486241 705288 782534 864710 856602 630093 300564 103620 89901
35565 89901 102917 15175 -143927 -272460 -302595 -237160 -161326 -194528 -357564 -525004 -584939
35554 -584939 -583564 -602497 -563481 -325532 45795 302310 346451 357167 498320 665478 652475
35543 652475 450114 230180 102199 26199 -66192 -179683 -269033 -266653 -133248 49615
35533 49615 106695 -10284 -101414 43933 338129 488029 381484 201035 121604 79482
35523 79482 -64422 -284147 -454784 -564786 -696256 -820930 -784534 -547866 -316296 -312037
$$ packed form
35595B08240j453k13964k34944j27377J6032J54233K26358J66021L1362l7099
35585A87409l8825j12158k37876j75656J35974L41017J09052l21023l85147M0094
35575d57139M67602M75778K19047P7246Q2176q108k26509l29529j96944j3719
35565H9901J3016q7742j59102j28533l0135O5435P5834l3202j63036j67440n9935
35554e84939J375j8933L9016K37949L71327K56515M4141J0716J41153J67158j3003
35543F52475k02361k19934j27981p6000r2391j13491q9350K380J33405J82863
35533D9615N7080j16979r1130J45347K94196J49900j06545j80449p9431m2122
35523G9482j43904k19725j70637j10002j31470j24674L6396K36668K31570M259
$$ plain form
35513 -312037 -466164 -472284 -174053 225972 438865 467395 535798 674505 617772 224575
35503 224575 -203011 -242039 99019 378679 269370 -89601 -319053 -203558 197133 679366
35493 679366 1021698 1079562 882974 618693 446899 352253 209426 -36147 -281920 -343278
35483 -343278 -126378 227961 408494 242128 -71990 -164513 47583 251317 147391 -177032
35473 -177032 -401814 -383827 -253099 -154744 -69128 86203 304606 505468 631258 661816
35463 661816 562332 294793 -80715 -356794 -320395 14642 383147 549777 561393 622869
35453 622869 777454 864990 789705 648777 542310 426509 253105 108407 87281 139173
35443 139173 163305 155690 136506 45290 -128489 -209115 -33462 265389 391725 299496 248560
$$ packed form
35513c12037j54127o120K98231M00025K12893K8530O8403J38707n6733l93197
35503B24575m27586l9028L41058K79660j09309l58971k29452J15495M00691M82233
35493F79366L42332N7864j96588k64281j71794r4646j42827k45573k45773o1358
35483c43278K16900L54339J80533j66366l14118r2523K12096K03734j03926l24423
35473a77032k24782J7987J30728R8355Q5616J55331K18403K00862J25790L0558
35463F61816r9484k67539l75508k76079L6399L35037L68505J66630J1616O1476
35453F22869J54585Q7536p5285j40928j06467j15801j73404j44698k1126N1892
35443A39173K4132p615j9184r1216j73779q0626J75653K98851J26336r2229n0936
$$ plain form
35432 248560 399150 559886 457042 109960 -198097 -246932 -70735 127306 171925 68220
35422 68220 13297 205358 594242 890479 881520 658711 444969 283319 39623 -319772
35412 -319772 -620574 -691495 -553659 -333018 -91331 164408 391005 548504 683755 849254
35402 849254 961862 878664 617072 353355 171598 -22540 -264320 -383682 -244842 6609
35392 6609 128545 121721 169113 292504 319856 209126 158756 314677 566496 732516 775083
35381 775083 729937 588842 383073 252069 298736 469719 659341 805954 817810 591862
35371 591862 230415 39697 135658 242558 107746 -70718 63274 429442 577886 341724
35361 341724 70136 125053 443255 737227 884549 926822 846756 564370 113864 -322299
$$ packed form
35432B48560J50590J60736j02844l47082l08057m8835J76197J98041M4619j03705
35422F8220n4923J92061L88884K96237q959k22809k13742j61650k43696l59395
35412c19772l00802p0921J37836K20641K41687K55739K26597J57499J35251J65499
35402H49254J12608q3198k61592k63717j81757j94138k41780j19362J38840K51451
35392F609J21936o824M7392J23391K7352j10730n0370J55921K51819J66020M2567
35381G75083m5146j41095k05769j31004M6667J70983J89622J46613J1856k25948
35371E91862l61447j90718R5961J06900j34812j78464J33992L66168J48444k36162
35361C41724k71588N4917L18202K93972J47322M2273q0066k82386m50506m36163
$$ plain form
35351 -322299 -574219 -635572 -660989 -806252 -1030097 -1088220 -807637 -337951 -20523 -20201 -198639
35340 -198639 -338340 -359584 -306505 -248062 -226493 -215966 -130785 46709 194085 218377 224152
$$ packed form
35351c22299k51920o1353k5417j45263k23845n8123K80583M69686L17428L22j78438
35340a98639j39701k1244N3079N8443K1569J0527Q5181J77494J47376K4292N775
$$ [...]
##END NTUPLES=NMR SPECTRUM
##END=
