##TITLE=31Pdec_SR_IMG_3
 CDCl3, 24 sc
 15.11.2021
##JCAMPDX= 6.0         $$ Bruker NMR JCAMP-DX V2.0
##DATA TYPE= NMR SPECTRUM
##DATA CLASS= NTUPLES
##ORIGIN= UXNMR, Bruker Analytische Messtechnik GmbH
##OWNER= root
$$ XWIN-NMR		Version 3.5
$$ Mon Nov 15 13:04:29 2021 Russian Standard Time (UT+4h)  she@DPX200
##.OBSERVE FREQUENCY= 81.013821
##.OBSERVE NUCLEUS= ^31P
##.ACQUISITION MODE= SIMULTANEOUS
##.ACQUISITION SCHEME= undefined
##.AVERAGES= 124
##.DIGITISER RES= 16
##SPECTROMETER/DATA SYSTEM= spect
##.PULSE SEQUENCE= zgpg30
##.SOLVENT NAME= CDCl3
##.SHIFT REFERENCE= (INTERNAL, CDCl3, 0, 248.564)
##AUDIT TRAIL= $$ (NUMBER, WHEN, WHO, WHERE, WHAT)
$$ ##TITLE= Audit trail, XWIN-NMR		Version 3.5
$$ ##JCAMPDX= 5.01
$$ ##ORIGIN= Bruker BioSpin GmbH
$$ ##OWNER= she
$$ F:/spectra/data/she/nmr/P31/1/pdata/1/auditp.txt
$$ ##AUDIT TRAIL=  $$ (NUMBER, WHEN, WHO, WHERE, WHAT)
(   1,<2021-11-15 13:03:07.81 +0400>,<she>,<DPX200>,
      <continue with go, POWCHK disabled, PULCHK disabled
       configuration hash MD5:
       00 E9 B6 7A A2 85 ED C7 34 08 36 98 17 FE 4E 26
       data hash MD5: 32K
       7C 3C 89 0B 24 3A EE B7 02 42 FE 25 F8 0B 39 EF>)
(   2,<2021-11-15 13:03:26.23 +0400>,<she>,<DPX200>,
      <Start of raw data processing
       efp BC_mod = 2 LB = 1 FT_mod = 6 PKNL = 1 PHC0 = -9167.697 PHC1 = 56.66953 SI = 64K 
       data hash MD5: 64K
       C2 8B 14 96 2B D0 BC B0 CB C6 2B 15 FB 7B D9 F9>)
(   3,<2021-11-15 13:03:45.32 +0400>,<she>,<DPX200>,
      <pk PHC0 = -4.45739 PHC1 = 0 
       data hash MD5: 64K
       03 FC 51 D1 FB D9 3D 2E 63 09 D6 95 FD FA 2A 97>)
$$ ##END=
$$ 
$$ hash MD5
$$ 28 5C 12 06 FD 4C 24 67 9F B7 CC EE C5 61 85 CA
##$RELAX= 
##$RELAX= 
##$RELAX= 
##$RELAX= 
##$RELAX= 
##$RELAX= 
##$RELAX= 
##$RELAX= 
$$ Bruker specific parameters
$$ --------------------------
##$DU= <F:/spectra>
##$EXPNO= 1
##$NAME= <P31>
##$PROCNO= 1
##$TYPE= <nmr>
##$USER= <she>
##$AMP= (0..31)
100 100 100 100 100 100 100 100 100 100 100 100 100 100 100 100 100 100 
100 100 100 100 100 100 100 100 100 100 100 100 100 100 
##$AQSEQ= 0
##$AQ_mod= 1
##$AUNM= <au_zg>
##$AUTOPOS= <>
##$BF1= 81.014009
##$BF2= 200.13
##$BF3= 200.13
##$BF4= 200.13
##$BF5= 200.13
##$BF6= 200.13
##$BF7= 200.13
##$BF8= 200.13
##$BYTORDA= 1
##$CFDGTYP= 0
##$CFRGTYP= 5
##$CHEMSTR= <none>
##$CNST= (0..31)
1 1 145 1 1 1 1 1 1 1 1 1 1 1 1 1 1 1 1 1 1 1 1 1 1 1 1 1 1 1 1 1 
##$CPDPRG= <waltz16>
##$CPDPRG1= <>
##$CPDPRG2= <waltz16>
##$CPDPRG3= <>
##$CPDPRG4= <mlev>
##$CPDPRG5= <mlev>
##$CPDPRG6= <mlev>
##$CPDPRG7= <mlev>
##$CPDPRG8= <mlev>
##$CPDPRGB= <>
##$CPDPRGT= <>
##$D= (0..31)
0 1 0 0 0 0 0 0 0 0 0 0.03 2e-05 3e-06 0 0 0 0 0 0 0 0 0 0 0 0 0 0 0 0 
0 0 
##$DATE= 1636966806
##$DBL= (0..7)
120 120 120 11 120 120 24 19 
##$DBP= (0..7)
150 150 150 150 150 150 150 150 
##$DBP07= 0
##$DBPNAM0= <>
##$DBPNAM1= <>
##$DBPNAM2= <>
##$DBPNAM3= <>
##$DBPNAM4= <>
##$DBPNAM5= <>
##$DBPNAM6= <>
##$DBPNAM7= <>
##$DBPOAL= (0..7)
0.5 0.5 0.5 0.5 0.5 0.5 0.5 0.5 
##$DBPOFFS= (0..7)
$$ [...]
##$SUBNAM2= <"">
##$SUBNAM3= <"">
##$SUBNAM4= <"">
##$SUBNAM5= <"">
##$SUBNAM6= <"">
##$SUBNAM7= <"">
##$SUBNAM8= <"">
##$SUBNAM9= <"">
##$SW= 501.771253377433
##$SWIBOX= (0..15)
0 1 3 0 0 0 0 0 0 0 0 0 0 0 0 0 
##$SW_h= 40650.406504065
##$TD= 32768
##$TD0= 1
##$TE= 0
##$TE2= 300
##$TE3= 300
##$TEG= 300
##$TL= (0..7)
0 120 53 12 22 120 120 120 
##$TP= (0..7)
150 150 150 150 150 150 150 150 
##$TP07= 0
##$TPNAME0= <>
##$TPNAME1= <>
##$TPNAME2= <>
##$TPNAME3= <>
##$TPNAME4= <>
##$TPNAME5= <>
##$TPNAME6= <>
##$TPNAME7= <>
##$TPOAL= (0..7)
0.5 0.5 0.5 0.5 0.5 0.5 0.5 0.5 
##$TPOFFS= (0..7)
0 0 0 0 0 0 0 0 
##$TUNHIN= 0
##$TUNHOUT= 0
##$TUNXOUT= 0
##$USERA1= <user>
##$USERA2= <user>
##$USERA3= <user>
##$USERA4= <user>
##$USERA5= <user>
##$V9= 5
##$VALIST= <valist>
##$VCLIST= <CCCCCCCCCCCCCCC>
##$VD= 0
##$VDLIST= <DDDDDDDDDDDDDDD>
##$VPLIST= <PPPPPPPPPPPPPPP>
##$VTLIST= <TTTTTTTTTTTTTTT>
##$WBST= 1024
##$WBSW= 4
##$XGAIN= (0..3)
0 0 0 0 
##$XL= 0
##$YL= 0
##$YMAX_a= 4749
##$YMIN_a= -6975
##$ZGOPTNS= <>
##$ZL1= 120
##$ZL2= 120
##$ZL3= 120
##$ZL4= 120
##$ABSF1= 0
##$ABSF2= 0
##$ABSG= 0
##$ABSL= 0
##$ALPHA= 0
##$AQORDER= 0
##$ASSFAC= 0
##$ASSFACI= 0
##$ASSFACX= 0
##$ASSWID= 0
##$AUNMP= <proc_1d>
##$AZFE= 0.1
##$AZFW= 0.5
##$BCFW= 0
##$BC_mod= 2
##$BYTORDP= 0
##$COROFFS= 0
##$CY= -3
##$DATMOD= 1
##$DC= 0
##$DFILT= <>
##$DTYPP= 0
##$F1P= 0
##$F2P= 0
##$FCOR= 1
##$FTSIZE= 65536
##$FT_mod= 6
##$GAMMA= 0
##$GB= 0
##$INTBC= 1
##$INTSCL= 5.30512e-09
##$ISEN= 30
##$LB= 1
##$LEV0= 0
##$LPBIN= 0
##$MAXI= 10000
##$MC2= 0
##$MEAN= 0
##$ME_mod= 0
##$MI= 50
##$NCOEF= 0
##$NC_proc= -8
##$NLEV= 6
##$NOISF1= 182.463
##$NOISF2= 159.3651
##$NSP= 0
##$NTH_PI= 0
##$NZP= 0
##$OFFSET= 248.5645
##$PC= 4
##$PHC0= -9172.154
##$PHC1= 56.66953
##$PH_mod= 1
##$PKNL= yes
##$PPARMOD= 0
##$PSCAL= 0
##$PSIGN= 0
##$REVERSE= no
##$SF= 81.014009
##$SI= 65536
##$SIGF1= 159.3651
##$SIGF2= -187.1042
##$SINO= 113.3802
##$SIOLD= 16384
##$SREGLST= <1H.CDCl3>
##$SSB= 0
##$STSI= 65536
##$STSR= 0
##$SW_p= 40650.406504065
##$SYMM= 0
##$S_DEV= 0
##$TDeff= 32768
##$TDoff= 0
##$TI= <>
##$TILT= no
##$TM1= 0
##$TM2= 0
##$TOPLEV= 0
##$USERP1= <user>
##$USERP2= <user>
##$USERP3= <user>
##$USERP4= <user>
##$USERP5= <user>
##$WDW= 1
##$XDIM= 65536
##$YMAX_p= 385717182
##$YMIN_p= -170363661
$$ End of Bruker specific parameters
$$ ---------------------------------
##NTUPLES= NMR SPECTRUM
##VAR_NAME=  FREQUENCY,     SPECTRUM/REAL,   SPECTRUM/IMAG
##SYMBOL=    X,             R,               I
##VAR_TYPE=  INDEPENDENT,   DEPENDENT,       DEPENDENT
##VAR_FORM=  AFFN,          ASDF,            ASDF
##VAR_DIM=   65536,         65536,           65536
##UNITS=     HZ,            ARBITRARY UNITS, ARBITRARY UNITS
##FACTOR=    0.620285442955139, 1,           1
##FIRST=     20137.2065510759, 0,            0
##LAST=      -20513.1999529892, 0,           0
##MIN=       -20513.1999529892, -170363661,  0
##MAX=       20137.2065510759, 385717182,    0
$$ Real data points
##PAGE= N=1
##DATA TABLE= (X++(R..R)), XYDATA
$$ [...]
12898c743035J1887790j581414q799159m622854J610922L480960K315990j286137
12890g36937o965297q478575q49420Q905958J0037428L824896o68901k260937
12882B808215n865562r219138n909251J341799M797219N726828R170389R089741
12874A1940240k893850j6780476j3383577N006548J4863861O189249m529835k874066
12866b461906L150523J664631l196368l068848j331701l155494k414127O804555
12858d008735J5417539J0561508m643688j4725897j1147914Q01954R995163P971278
12850A0221208m846330j6433174j3786338j52917P794817L634579p92879L139583
12842a1221451O748977J580963m088457m40719N073801P81710p366624n020576
$$ y = [-3743035, 8144755, 6563341, -2235818, -6858672, -5247750, -1766790, 549200, -736937, -7702234, -16180809, -17030229, -8124271, 1913157, 5738053, 5069152, 2808215, -3057347, -12276485, -18185736, -16843937, -12046718, -6319890, 2850499, 11940240, 9046390, -7734086, -21117663, -16111115, -1247254, 4941995, 412160, -2461906, 688617, 2353248, -843120, -3911968, -5243669, -8399163, -10813290, -4008735, 11408804, 21970312, 17326624, 2600727, -8547187, -7745233, 2249930, 10221208, 5374878, -11058296, -24844634, -24997551, -17202734, -13568155, -14361034, -11221451, -4472474, -2891511, -6979968, -7420687, -2346886, -1565176, -8931800, -13952376]
12834a3952376O362344J2492074Q924641L398350j248389q701436j4923978j0304685
12826a7953455K178381P574813J453641l502762J199603O241614O07747r682331
12818a1882749r585367L627031J6297633J5040071K195304p233492l678969M398955
12810I178417J339154j2246754j7240935l369795J3090117J1820655j158370l957194
12802b544705O045098R928894M30873o605676j088506L911809l183621j0268556
12794c374390k371809J0460551Q019963o550454j1358493m56328R008719O037325
12786I415084L72717J240508J210350p125647j4047861p382428O098733R970295
12778b48249K810480k367868n07040O4174m294900n058789K249265Q058645L766176
$$ y = [-13952376, -7590032, 4902042, 13826683, 17225033, 15976644, 7275208, -7648770, -17953455, -15775074, -8200261, -6746620, -10249382, -9049779, -2808165, -2200418, -11882749, -21468116, -17841085, -1543452, 13496619, 15691923, 8458431, 4779462, 9178417, 10517571, -1729183, -18970118, -22339913, -9249796, 2570859, 1412489, -2544705, 3500393, 13429287, 13860160, 7254484, 6165978, 10077787, 6894166, -3374390, -5746199, 4714352, 12734315, 6183861, -5174632, -5630960, 3377759, 9415084, 9787801, 11028309, 12238659, 5113012, -8934849, -16317277, -10218544, -248249, 2562231, 194363, -312677, -248503, -4543403, -9602192, -7352927, 705718, 4471894]
12769D471894l930612m224595N00019O02084l273136k118720M334011O471259
12761B832204J879198R5511N910028R974096L462070p212024r359405j663321
12753E918357N944182O354288J352926m069022o590798n090515j709429q67696
12745A242293l060856k806508K416887N662942M598r350466j1309025m924426
12737b2124561O45042J272066J994943M856529M403961m37603j312394N598897
12729e103120J0485031M446963m872580m221826M023333N530718k772091q047704
12721e31276k583848M886707N074583K204345K652903J102315q561649j6932973
12713a2688893j0131956O600802J3593408N106038m188735l954696j344432k612992
$$ y = [4471894, 541282, -3683313, -3183294, -2581210, -5854346, -7973066, -3639055, 2832204, 4711402, 4806913, 10716941, 20691037, 24153107, 16941083, 7581678, 5918357, 11862539, 18216827, 19569753, 15500731, 8909933, 3819418, 2109989, 1242293, -1818563, -4625071, -2208184, 3454758, 3459356, -5891110, -17200135, -22124561, -21479519, -20207453, -18212510, -13355981, -8952020, -9389623, -10702017, -5103120, 5381911, 9828874, 4956294, 734468, 4757801, 10288519, 7516428, -531276, -3115124, 1771583, 6846166, 9050511, 11703414, 12805729, 4244080, -12688893, -22820849, -16220047, -2626639, 2479399, -1709336, -5664032, -7008464, -9621456]
12705i621456l8788J0600067J5827034M505317j0448577r785292J543561L002531
12697E584397p487434j1398956j506672P223574L813021k535535j117463L186217
12689d238851K203879p04422N70692K924526J363231j580399k692256m509038
12681f662638o997949l727423N493333J0059221N535467K088537N665427N424678
12673A6878653o302372j5947076q258709P817118J2377383M593243r10962n06037
12665I741241k631665o899088m405609K500817K152079m468601m352297L604757
12657d758366N980122j055153n537601j896446R92792n84902J798004Q774717
12649C713167P339847m911686j0215717J424813J3531627Q312446n833411r993537
$$ y = [-9621456, -9660244, 939823, 16766857, 21272174, 10823597, 1038305, 2581866, 5584397, -1903037, -13301993, -14808665, -7585091, -3772070, -6307605, -7425068, -4238851, -2034972, -2739394, -2168702, 755824, 2119055, 538656, -2153600, -6662638, -13660587, -17388010, -11894677, -1835456, 3700011, 5788548, 11453975, 16878653, 10576281, -5370795, -13629504, -5812386, 6564997, 11158240, 10247278, 9741241, 7109576, 210488, -4195121, -1694304, 457775, -4010826, -8363123, -4758366, 1221756, 166603, -5370998, -7267444, -6274652, -6859554, -5061550, 3713167, 11053014, 6141328, -4074389, -2649576, 10882051, 19194497, 13361086, 3367549]
12641C367549m423371k793424o542052n460911J354446M105648M470l532213k612652
12632a6532510k76977K671462P489703R392101K561680o987629o376733N012304
12624c046599J3304885R669420J319072j082525J960108K232023l777021j1037803
12616I541560j2498157p091406j431311j963633m823991R53925J6166722K4643560
12608B3497269J2602916j0217186k0511388j1109404J607432K058208m866779
12601f938932n092187K638123O294054l94787q059842m582389P356158J2711634
12593C931832M595463n349474l389284N557918N353336n076216q537746K707818
12585b06353J2295606M313056j0800160j1242738L605260J3873780Q962752j365969
$$ y = [3367549, -1055822, -3849246, -10391298, -15852209, -14497763, -10392115, -10387645, -13919858, -16532510, -16809487, -14138025, -6648322, 2743779, 5305459, -1682170, -8058903, -3046599, 10258286, 19927706, 21246778, 20164253, 22124361, 24356384, 20579363, 9541560, -2956597, -10048003, -11479314, -13442947, -18266938, -17313013, -1146291, 23497269, 36100185, 25882999, 5371611, -5737793, -4130361, -2072153, -6938932, -12031119, -9392996, -3098942, -3493729, -11553571, -16135960, -8779802, 3931832, 8527295, 3177821, -211463, 5346455, 10699791, 5623575, -2914171, -206353, 12089253, 16402309, 5602149, -5640589, -2035329, 11838451, 20801203, 19435234]
12577A9435234n977214n763350m800469k499262O08511Q31992r18285K25436K325791
12568C468384j639616q893396p595874L047138Q242457M36736p868296m095069
12560a4897536N039938O496002J612785l55583J58740k487002m429453J207287
12552g654822Q035642M137586o281979p001396L944782J0228011L231183n341886
12544C297121l972209J348326M85728l234877j214749M215691M781001Q93439
12536F599471j081700j133006k915971l077753L283332R230696L180084j0274539
12528C810614j2775597M19547J1225955N196075p018097p192276K496926N088069
12520A251216l511140r824047n338735K249258L992206K506797L859802P197175
$$ y = [19435234, 13458020, 7694670, 2894201, 394939, 1003450, 1835442, 917157, 1142593, 3468384, 1828768, -7064628, -14660502, -11613364, -3370907, -2934171, -10802467, -14897536, -9857598, -3361596, -1748811, -2104394, -1945654, -4432656, -8862109, -7654822, 380820, 4518406, -1763573, -8764969, -4820187, 5407824, 8639007, 3297121, -675088, 673238, 1158966, -2075911, -3290660, 925031, 5706032, 6599471, 5517771, 4384765, 1468794, -1608959, 1674373, 10905069, 14085153, 3810614, -8964983, -8545436, 2680519, 7876594, 858497, -6333779, -3836853, 1251216, -2259924, -12083971, -17422706, -15173448, -11181242, -8674445, -4814643, 2382532]
12512B382532R037526R296801P007125j157579j1323463j1050680K871505J3985974
12504B1049741O154186j2117020j7958706n937544O177552M504939l832002o080293
12496h039147k540916q50308j655313m00828K898491N309933P952561J2346220
12488A5020693J3434100N680813n968613j0857605p884796o229983r404944q848123
12480a5058458J423257J2310392J0566001j830333q951185k212082Q074191O950189
12472A1271972n054197j3236360q476662K187211O950938M255704R44453K84868
12464h72073l45524j563640j64921L755017N461599L755686L164753M454295Q33158
12455A8478350j0184519j8121014j1774148L887700J2804922Q381523m57391l978675
$$ y = [2382532, 11420058, 20716859, 27723984, 26566405, 15242942, 4192262, 7063767, 21049741, 27203927, 15086907, -2871799, -8809343, -2631791, 1873148, -1958854, -8039147, -10580063, -11430371, -13085684, -13486512, -10588021, -5278088, 2674473, 15020693, 28454793, 34135606, 28166993, 17309388, 9424592, 3194609, -6210335, -15058458, -13635201, -1324809, 9241192, 7410859, -1540326, -3752408, 4321783, 11271972, 6217775, -7018585, -15495247, -13308036, -6357098, -2101394, -1156941, -872073, -1217597, -2781237, -2946158, 808859, 6270458, 10026144, 13190897, 17645192, 18478350, 8293831, -9827183, -21601331, -17713631, -4908709, 3472814, 3015423, -963252]
12447i63252k796227j590850l39208K943779O512347P317531N438405K007101
12439A8529626l530245r922176j1737573n733250L047125O957408N752765N249688
12431H613368O906233N235636k787356j1183836j1562654l682276M079839M380700
12423c46j147072m214905M38568Q443735J0040345J396589j0013162j3272004
12415h328252o228547K670036M498020q35638n968901m593222K493639Q604314
12407g688551P831013J231271m105325l318236L59815O30324k490604k905034
12399a0455327J901473O858232O977313L871117J228168j390245n295879p198183
12391c503331l481469K181575K486109k635300n630609k705803J079433M13868
$$ y = [-963252, -3759479, -5350329, -5689537, -2745758, 3766589, 11084120, 16522525, 18529626, 14999381, 5077205, -6660368, -12393618, -9346493, -2389085, 3363680, 8613368, 15519601, 20755237, 17967881, 6784045, -4778609, -8460885, -4381046, -346, -1147418, -5362323, -4923755, 3519980, 13560325, 14956914, 4943752, -8328252, -14556799, -11886763, -7388743, -8224381, -14193282, -18786504, -16292865, -7688551, 142462, 1373733, -2731592, -6049828, -5690013, -5059689, -7550293, -10455327, -8553854, -1695622, 5281691, 9152808, 10380976, 8990731, 3694852, -3503331, -6984800, -4803225, -2317116, -4952416, -10583025, -13288828, -12209395, -11795527]
12383a1795527k567897k743788N88502M684256P929509R497655P681196K641351
12375A5915257j827958l142106l888427o861475q869170m653225M489706J1099988
12367B262590J0185346L478516m068807q029371n903855N83672N215658L676083
12359G399832p21459k239609j725327l945126p321122n007396K740687O497598
12351d321922J518543m851748m770723r25393Q52222K533037Q043122J1870331
12343I947469N156154q322791j3781357n115060O607029Q347504J149092m377471
12335c89431l035840R02297K023248K31268j287933q31857M11770N05141n75921
12326b047258j010326k28799l78467k677641l936234m61351N175373O143485J227903
$$ y = [-11795527, -14363424, -17107212, -16518710, -11834454, -3904945, 5592710, 13273906, 15915257, 14087299, 10945193, 7056766, 195291, -8673879, -13327104, -8837398, 2262590, 12447936, 15926452, 11857645, 3828274, -2075581, -1491909, 3723749, 7399832, 6678373, 4438764, 2713437, -1231689, -8552811, -13560207, -10819520, -4321922, -2803379, -7655127, -12425850, -13351243, -12499021, -9965984, -1922862, 9947469, 15103623, 6780832, -7000525, -12115585, -5508556, 2838948, 3988040, -389431, -3425271, -2522974, -499726, -268458, -1556391, -2388248, -1976478, -1471337, -2047258, -3057584, -3286383, -3664850, -6342491, -10278725, -10740076, -5564703, 578782, 1806685]
12317A806685k299257J351962P645386P148236k237448j2648135j5337684r142879
12309b3713134J31552O021092O231505K893330m44798j694551o15316J988442
12301i201878M050468K794154j650966m156313r7636P071712Q542594J676042
12293I028177o246660q032028m904331j403745J970683N212759L481454o003732
12285f897423j4785160j0957678L731137J4191243J1576791L426021L14158J433005
12277B032094L18316k393668j304435K651830L217773k28161j778932L57396R20967
12268C793180k520226m898835k688840j57705j195094j745560K172279M632427
12260b608374j970712j1886893j1051875J909789J1487913O631132m194991o679000
$$ y = [1806685, -492572, 859390, 8504776, 15653012, 13415564, 767429, -14570255, -23713134, -23581582, -17560490, -11328985, -8435655, -8880453, -10575004, -11190320, -9201878, -5151410, -2357256, -4008222, -8164535, -8262171, -1190459, 7352135, 9028177, 2781517, -5250511, -10154842, -11558587, -9587904, -4375145, -893691, -6897423, -21682583, -32640261, -28909124, -14717881, -3141090, 284931, 599089, 2032094, 2350410, -43258, -1347693, 1304137, 4521910, 4293749, 2514817, 2872213, 3793180, 1272954, -3625881, -6314721, -6472426, -7667520, -9413080, -7240801, -2608374, -4579086, -16465979, -27517854, -25608065, -14120152, -7489020, -11684011, -18363011]
12252a8363011o12359L813306L372099L452772N152477L273816k069670l329518
12244e310088J886557N847399K492611m088613p232742o042613k019715M460474
12236a0006730R525064O477555k769947o082681J316351P127238R5924j1144287
12228e461513j0725775j51514N509486K164136J53182L276704K055623p457062
12220a0636733j3529000n421863J0634671J9890945J5889280L333717q802477
12213A1358540j2902660q260380l462760n820216q540825K36656J5334745J7305963
12205E249063J800825j1063762n650737P332864J0182445M134272N04594q44020
12197A1645544n843056r123874k530859N947363K106924r353115r981752L022217
$$ y = [-18363011, -18975370, -15162064, -11789965, -8337193, -3184716, 89100, -1980570, -5310088, -3423531, 2423868, 4916479, 827866, -6404876, -12447489, -14467204, -10006730, -481666, 5995889, 3225942, -2856739, -1540388, 5586850, 5682774, -5461513, -16187288, -16338802, -10829316, -8665180, -8511998, -5235294, -3179671, -10636733, -24165733, -29587596, -18952925, 938020, 16827300, 20161017, 11358540, -1544120, -9804500, -13267260, -19087476, -27628301, -27391645, -12056900, 5249063, 7049888, -4013874, -9664611, -2331747, 7850698, 11984970, 12489564, 11645544, 5802488, -3321386, -5852245, 95118, 2202042, -7151073, -17132825, -14110608]
12189a4110608J2333333P420049k308935n498268l833011l194219l053073q47452
12181a3092184K715757O419852Q618371M918608m483435q216802K023218J4014625
12173A2918010R262927p068185j1528211R18546R306088J811481o317155j448628
12165G854873N418696P67998o714502l207116N002218M494806l27712K751166
12157A6040427R230263N962818l762729n883990j347671l601425j2701229j4353976
12149a0417512n357193J313193k99713p61840N161642R000000N265983J155724
12141E060284J814849O83304o573839j1421380n847360L691783N869389O99546
12133f023424l017065j195721K471187L593742J455559j479907j595450J623806
$$ y = [-14110608, -1777275, 5642774, 3333839, -2164429, -5997440, -9191659, -12244732, -13092184, -10376427, -3956575, 4661796, 9580404, 5096969, -3119833, -1096615, 12918010, 22180937, 15112752, 3584541, 4503087, 13809175, 15620656, 9303501, 7854873, 13273569, 14041567, 7327065, 4119949, 9122167, 13616973, 13289261, 16040427, 25270690, 31233508, 27470779, 21586789, 20239118, 16637693, 3936464, -10417512, -15774705, -14461512, -14761225, -15523065, -10361423, -1361423, 3904560, 5060284, 6875133, 7558437, 984598, -10436782, -16284142, -12592359, -6722970, -6023424, -9040489, -10236210, -7765023, -4171281, -2715722, -4195629, -5791079, -4167273]
12125d167273L218685m41807l713258J370732J0695504J1432869J666652n522391
12117A4539713k303566K156218j653956o883309k435911O491609M861022q152425
12109F619395j6226771r131565L410710O974568K484563J988678Q588143J1156145
12101A5863866J269883j2946189j6582140p235885L694068P650228P460838P633855
12093F808524O113633Q51524m019685n320811o590432r567543q075169P00803
12085a9099156P216621L081825m116049k590686M043779M096883j292749j931127
12077a0590659J217028j032006n557689q86779Q430423N029414j0066162j4170828
12069b7627258J163322J5306170J1529231J562072J447270M450483j907502r655768
$$ y = [-4167273, -948588, -1390395, -5103653, -3732921, 6962583, 18395452, 20062104, 14539713, 12236147, 14392365, 12738409, 5855100, 3419189, 9910798, 14771820, 6619395, -9607376, -18738941, -15328231, -8353663, -5869100, -3880422, 4707721, 15863866, 17133749, 4187560, -12394580, -19630465, -15936397, -8286169, -825331, 6808524, 12922157, 13773681, 9753996, 4433185, -2157247, -11724790, -19799959, -19099156, -11882535, -8800710, -12916759, -15507445, -11463666, -7366783, -8659532, -10590659, -9373631, -10405637, -15963326, -16850105, -8419682, -3390268, -13456430, -27627258, -26463936, -11157766, 371465, 1933537, 3380807, 7831290, 5923788, -3731980]
12061c731980m156372Q574393J1176651K956868k588232j500771n13106n2548
12053A0164903M307083P663992J790099q179906j0675743p162628o822419o923318
12045a5837937J258595J1134420Q095076l598146n115187M911396P652828k664931
12037E836114q667021j308041L866104m905381j3642412o254127Q171698J0906850
12029e996216K708831j954487J88346R78034j164910n91833K191547J836079j66906
12020a971515J347871L751456J672667p8724O744190J6348813J3796155k071779
12012C9539134j5482668j5917316r465161m522460l99660L764743K363828n282585
12004e402145q383899o77335O516982N90284j0134320o817963R800791J7713681
$$ y = [-3731980, -7888352, 686041, 11862692, 14819560, 12231328, 10730557, 10217451, 10164903, 14471986, 22135978, 23926077, 15746171, 5070428, -2092200, -8914619, -15837937, -14579342, -3444922, 4650154, 1052008, -4063179, 848217, 8501045, 5836114, -2830907, -4138948, -272844, -5178225, -18820637, -25074764, -16903066, -5996216, -3287385, -5241872, -5053526, -4075492, -5240402, -5832235, -3640688, -1804609, -1971515, -623644, 3127812, 4800479, 4721755, 11465945, 27814758, 41610913, 39539134, 24056466, 8139150, -1326011, -5848471, -6248131, -2483388, -119560, -5402145, -13786044, -14463379, -7946397, -7356113, -17490433, -24308396, -14507605, 3206076]
11996C206076N637442j0148471j0108211J277565O183969J724445M07414O101230
11988D281459P825329O9261p105501n155873o73505k464601o097387k969980L356041
11979h934757K940842l104515l948485L718549J1136511J0389219K684251o284471
11971H597144j1098027p566343K572400Q834506K847116q771652j1890688m479513
11963b0955057K010682J108376q43833K131575O263310O360167L579170J23001
11955b22609m689760q361663m352493P195566J5982545J4216798N491279l098805
11947B2160858r165955j1000948n343352M432743P400470j63386p751048n895299
11939e325917N00375K512671J578634L302859N285816K621552j462001k102479
$$ y = [3206076, 8843518, -1304953, -11413164, -10135599, -3951630, -2227185, -1819771, 4281459, 12106788, 12176049, 5070548, -85325, -758830, -3223431, -9320818, -12290798, -8934757, -5993915, -9098430, -13046915, -9328366, 1808145, 12197364, 14881615, 8597144, -2500883, -10067226, -7494826, 1339680, 4186796, -4584856, -16475544, -20955057, -18944375, -17835999, -18679832, -16548257, -10284947, -3924780, -345610, -222609, -4912369, -13274032, -17626525, -10430959, 5551586, 19768384, 25259663, 22160858, 12994903, 1993955, -3349397, 1083346, 8483816, 8320430, 569382, -5325917, -4825542, -2312871, -734237, 2568622, 7854438, 10475990, 9013989, 6911510]
11931F911510l178331q766901j1140125j971702J0064067R754559J61614j603202
11923B31489O756099Q301916l828280j2524741l068361J2340688J1388832o537912
11915A3059730k0792371j7679407m482407M607962N208970K272273O76411J112446
11907a6016393K055072K102856Q13108j213307k728138k504430j94266K793848
11899a4891650L892939K022134j006532k913065l447177k753556N52264O419785
11891a2124858J0362123P853755Q95642m235997n056042l865303j726738K052497
11883e844921M335692K1342p961141q566720K248341J3073798J0879710j459489
11875F726612r742535p703942k377199m95204L57375L309273L705070l410021
$$ y = [6911510, 3733179, -5033722, -16173847, -18145549, -8081482, 1673077, 1834691, 231489, 6987588, 15289504, 11461224, -1063517, -4131878, 8208810, 19597642, 13059730, -7732641, -25412048, -29894455, -25286493, -20077523, -17805250, -17128839, -16016393, -13961321, -11858465, -11045357, -12258664, -14986802, -17491232, -17685498, -14891650, -10998711, -8976577, -9983109, -12896174, -16343351, -19096907, -18544643, -12124858, -1762735, 6091020, 6986662, 2750665, -2305377, -6170680, -7897418, -5844921, -1509229, -1487887, -9449028, -18015748, -15767407, -2693609, 8186101, 6726612, -3015923, -10719865, -13097064, -13592268, -13234893, -9925620, -6220550, -9630571]
11867i630571j2265992j1819556j293365Q145997Q956418O476264Q028662R964807
11859F562664M181251o056906p790096K468037J1324158O219516o766279j1315986
11851a173641l061758O407457P299160L371009K278923K687083j310203p412124
11843I085906o364878L311246J0232813M439115q684192j5262849j0948492m499127
11835a8690458l475779m687504k212740K514646M815860N574456Q271902J0527619
11827B638002O959954p66242m880924k666507O13006M20628k203443m588094m356712
11818h830332J588069J1593923J4600528K682898j2401900j0534007O281885J2809909
11810A7790973k443749j8401589j3457398J571604K915378p450068q156921L611087
$$ y = [-9630571, -21896563, -33716119, -35009484, -26863487, -17907069, -11430805, -3402143, 6562664, 10743915, 4687009, -3103087, -635050, 10689108, 16908624, 10142345, -1173641, -4235399, 2172058, 9471218, 12842227, 15121150, 17808233, 16498030, 9085906, 2721028, 6032274, 16265087, 20704202, 12020010, -3242839, -14191331, -18690458, -22166237, -26853741, -29066481, -26551835, -21735975, -16161519, -7889617, 2638002, 9597956, 8831714, 3950790, 1284283, 1897289, 2317917, 114474, -4473620, -8830332, -7242263, 4351660, 18952188, 21635086, 9233186, -1300821, 4981064, 17790973, 15347224, -3054365, -16511763, -14940159, -12024781, -19474849, -27631770, -24020683]
11802b4020683Q650294O54373l105182O555962J3472517L849417r449681p855554
11794a1248537L032581M609002l320213l690040Q096565J5801032P556572o343516
11786A4493446q953118L9773O181295J234965o697466n435794M508669J0439495
11778A5811265M321073o257506q208559p42710M271381r0559o225524m220892
11770a342031L235282N308249j145178p840090o879808m6129N435353O137192
11762B862840M607017M083773L812544N57143o013439j1341421j0739697m961020
11754a7132260J077223M390747O219791Q540706J0977147J1427616P895363L29012
11746C3725345p424538r404988m546903K58255j327063n581375l826991M130925
$$ y = [-24020683, -15370389, -14716016, -17821198, -11265236, 2207281, 6056698, -3392983, -11248537, -8215956, -3606954, -6927167, -10617207, -2520642, 13280390, 20836962, 14493446, 5540328, 5580101, 11761396, 12996361, 6298895, 863101, 5371770, 15811265, 20132338, 13874832, 5666273, 4923563, 9194944, 9104385, 2878861, -1342031, 1893251, 7201500, 6056322, -1783768, -8663576, -8709705, -3274352, 2862840, 7469857, 11553630, 15366174, 15923317, 9909878, -1431543, -12171240, -17132260, -16055037, -11664290, -5444499, 3096207, 14073354, 25500970, 33396333, 33725345, 26300807, 16895819, 12348916, 12607171, 11280108, 5698733, 1871742, 6002667]
11738F002667R027017N283282k045313n434625l665096j55682J807212J65107
11730A0984569m285212o298615k121370L029839J417075l454322p22503Q248600
11722F798061Q265984n226691j4675450n228709J1095938J1852412l187313j3615513
11714c921281r206712r11826K61574j653752O39392M416102L706174K21273n39360
11705f988416J799494L912544M582022L935261Q76651m250193p814575p237397
11697a1184609l958521K75807N718355J0633129J0325154M127135j528155j768232
11689A2640063o08451m072695r738635r876781l160412L423093M240615R66633
11681f186570j809445k205650j030929K48107K81338r15243j149336J097399L529820
$$ y = [6002667, 15029684, 20312966, 18267653, 12833028, 9167932, 9012250, 10819462, 10984569, 6699357, 400742, -1720628, 1309211, 2726286, -728036, -1450539, 6798061, 15064045, 9837354, -4838096, -10066805, 1029133, 12881545, 9694232, -3921281, -13127993, -14039819, -13778245, -15431997, -14792605, -10376503, -6670329, -6449056, -6988416, -5188922, -1276378, 3305644, 7240905, 8117556, 3867363, -3947212, -11184609, -15143130, -14867323, -9148968, 1484161, 11809315, 15936450, 14408295, 12640063, 12031612, 7958917, -1779718, -11656499, -14816911, -11393818, -7153203, -6186570, -7996015, -10201665, -11232594, -10984487, -10703149, -11618392, -12767728, -11670329, -8140509]
11672h140509K866485K2737j535277j863953l725022n866652l868415R72416J606710
11663a9531480k318789r38865R790838J7113886Q011972q947027j2926776o45805
11655a0392046R135504M240277m014163j075253P868510Q374085L00313m512767
11647I924460k626266j328286k505015K71341O894718P210382k826492j2833078
11639B181764j1908016k358355O018699Q190343N233802k07490m580240m474004
11631a903497j178867J15571j817210k464042L73523L202868L716113L719371
11623C763830K715027k803513r935846q834306K550580J2177788R651940L21742
11615I607242m080146j410284K526267M394548L166965l582547j3450161j5654954
$$ y = [-8140509, -5274024, -5251287, -6786564, -8650517, -12375539, -18242191, -22110606, -21138190, -19531480, -21850269, -22789134, -12998296, 4115590, 12127562, 3180535, -9746241, -10392046, -1256542, 2983735, -1030428, -2105681, 5762829, 14136914, 14437227, 9924460, 7298194, 5969908, 3464893, 3736234, 10630952, 17841334, 15014842, 2181764, -9726252, -12084607, -6065908, 2124435, 7358237, 7150747, 2570507, -1903497, -3082364, -2966793, -4784003, -7248045, -6874522, -3671654, 44459, 3763830, 6478857, 3675344, -6260502, -15094808, -12544228, -366440, 9285500, 9607242, 5527096, 4116812, 6643079, 11037627, 14204592, 10622045, -2828116, -18483070]
11607a8483070m425839R453728J1395264K297797o073728r453016j1547537j0647557
11599c7483958j371777J1249740J4582913O722435j127340j987905l9543J038710
11591h416725L058364M357708j55131o496890l367770Q802719J4986672P946788
11583B0715735j183946k652495l119737r724463j3590018m463091R045077J0736266
11575E763328J225575n617564n691762o872017j0343714p378781L263467J0324549
11567a5326919P131151J120718R20641M443017N587326L906709J644369j626455
11559G800557n853133p969458p043613o252145o115837k413620N154618R541304
11551a3151327O632708J658788k85052j988450n176841k950059P925108J5084545
$$ y = [-18483070, -22908909, -13455181, -2059917, 237880, -5835848, -15288864, -26836401, -37483958, -38855735, -27605995, -13023082, -6300647, -7427987, -9415892, -9455435, -8416725, -5358361, -1000653, -1155784, -7652674, -11020444, -2217725, 12768947, 20715735, 19531789, 16879294, 13759557, 4035094, -9554924, -14018015, -4972938, 5763328, 6988903, 1371339, -4320423, -11192440, -21536154, -28914935, -25651468, -15326919, -8195768, -7075050, -6154409, -1711392, 3875934, 7782643, 9427012, 7800557, 1947424, -6022034, -13065647, -19317792, -25433629, -27847249, -22692631, -13151327, -6518619, -4859831, -5144883, -7133333, -12310174, -15260233, -7335125, 7749420]
11543G749420N644995j1205863j3649837Q49223J0889260K918928r721896q995539
11535a5521309J832453Q080302P813044R158466J0598366K986830r970987j1822550
11527C154615J610055J2649556N140619j3705973k3844929j7209315l125751O362848
11519b8968275Q315324P610581R475276J3238941J2105739J730604j0810940j2537788
11511A59462j335256R337118O813661n280514j2993043r027248J437621Q546899
11503b341300O835946r63119o161017k967559L763094M477458j052757l576781
11495a986035K28781K767307J12049n13661M607890O003565k718794j0298118
11487a797016m405403O101477L235342j0958002j6412637n497834P043234P796837
$$ y = [7749420, 13394415, 2188552, -11461285, -10612062, 277198, 3196126, -6525770, -15521309, -13688856, -5608554, 2204490, 11362956, 21961322, 24948152, 14977165, 3154615, 4764670, 17414226, 22554845, 8848872, -14996057, -32205372, -35331123, -28968275, -20652951, -13042370, -3567094, 9671847, 21777586, 23508190, 12697250, 159462, -1175794, 8161324, 14974985, 9694471, -3298572, -12325820, -10888199, -2341300, 4494646, 3531527, -2629490, -5597049, -1833955, 2643503, 1590746, -1986035, -1757254, 1010053, 1122102, 608441, 5216331, 11219896, 8501102, -1797016, -6202419, -100942, 3134400, -7823602, -24236239, -29734073, -22690839, -14894002]
11479a4894002J972190R60919N555646Q702324O078432j409633q933907r279253
11471a1247284l90923Q328709O317472k059286l012043N153522R691316M517889
11463A7299372j371840j251840j264974o191003q704507k752422M152177K872906
11455B787869k689166l488161L46361L183160M210284M252326m8132q541903j1554842
11446a1542204k901150P671856P194693q54055k642066M017005P570038J786661
11438A0300778n915291o880770j592174M760196Q740001Q265211K593008m753506
11430A5517453p981865n662014j824507k05030p92981j751138j674830n04055
11422d878967j00185k116532m241425k399012K090106L372038J106155J832440
$$ y = [-14894002, -12921812, -11960893, -6405247, 2297077, 8375509, 6965876, -1968031, -11247284, -11638207, -3309498, 3007974, 948688, -2063355, 3090167, 12781483, 17299372, 15927532, 14675692, 13410718, 7219715, -1484792, -4237214, -85037, 2787869, 98703, -3389458, -3043097, 140063, 4350347, 8602673, 8554541, 12638, -11542204, -14443354, -6771498, 423195, -430860, -3072926, 944079, 8514117, 10300778, 4385487, -2495283, -4087457, 672739, 9412740, 17677951, 20270959, 15517453, 7535588, 1873574, 49067, -155963, -948944, -2700082, -4374912, -4878967, -4979152, -7095684, -11337109, -13736121, -11646015, -8273977, -7167822, -5335382]
11414e335382O564355O555008j828794p855025k092508P107103N393709n192366
11406C316100r450734j778987P652426Q883150K599702n430902r969137o774308
11398a0952690K588223P722349J649700o303623k532578Q166554P979588n222727
11390C094796j2823407m393489O457630N171857j088457J683309R254994O801470
11382A4158703n019562j0134006k419982N591840L070558l636580k802628N075214
11374C883557J0086073P820160K928107n5439j766918l543515m315168m099320
11366A0937537n516819q562521q103937j265824N723322M080561n184531j1606283
11358a9498495q223012J670992J1197517J6350490J4203074L060538j1089251
$$ y = [-5335382, 1228973, 7783981, 5955187, -1899838, -3992346, 3114757, 8508466, 3316100, -6134634, -7913621, -261195, 8621955, 11221657, 5790755, -4178382, -10952690, -8364467, -642118, 1007582, -5296041, -7828619, 337935, 8317523, 3094796, -9728611, -14122100, -7664470, -2492613, -3581070, -1897761, 7357233, 14158703, 9139141, -994865, -3414847, 2176993, 5247551, 1610971, -1191657, 3883557, 13969630, 21789790, 24717897, 24662458, 22895540, 19352025, 15036857, 10937537, 5420718, -3141803, -11245740, -12511564, -6788242, -2707681, -7892212, -19498495, -27721507, -26050515, -14852998, 1497492, 15700566, 18761104, 7671853]
11351G671853j6014506p847652J863562J256315n153817m149569N602811J1678448
11343e092555O445748k870166n718669j911058J006892p20892l366863k318929
11335a4546492J380492K793658O51811M8311M611843Q800970M575909n004953
11327C311549p840661m84632O288647M297257l94950k35007K21040n408957j0792182
11318a1037896o730921J185426P48762n034689j835842J0580883J5079993L900730
11310F856446p741526l768198R377233J2878525J945685r615806r544436k151657
11302a763734J00531n180286p256068J101832J0625441P451474n192842r894988
11294a0008640j190535O264058K081681l466077Q43964O750812K580652l751556
$$ y = [7671853, -8342653, -16190305, -14326743, -13070428, -18224245, -22373814, -16771003, -5092555, 1353193, -1516973, -7235642, -9146700, -8139808, -8860700, -12227563, -14546492, -13166000, -10372342, -9720531, -9672220, -5060377, 3740593, 8316502, 3311549, -4529112, -5013744, 1274903, 5572160, 5177210, 4942203, 5163243, -245714, -11037896, -17768817, -16583391, -15834629, -20869318, -22705160, -12124277, 2955716, 6856446, -885080, -4653278, 4723955, 17602480, 19548165, 9932359, 387923, -1763734, -1663203, -6843489, -14099557, -12997725, -2372284, 5079190, -113652, -10008640, -11199175, -4935117, -2853436, -6319513, -5475549, 1275263, 3855915, 104359]
11286A04359J264826J0174824O068207o160068o458939N149340P768618m060797
11278A3850370j1200029l609866L506036j927902q460761l225753N860275N735951
11270E28321j61151j297322J738832K225238R258j973887m127964m955836n08253
11261h522764M786809P43915r097949p788220P185005J5491950M616437j0213197
11253b798014j0499067p43088M948010N249179M519182K634p347773o047863N129884
11244g586916P946906n150858j2262917L451021K1145506J2995696j0105177j6591977
11236f158716m588463J738114k398456J090089J3328754J3231997l320474j3663082
11228g40237o201972K586718p58113o451526l915627O75258J512369M827604J1118091
$$ y = [104359, 1369185, 11544009, 17612216, 11452148, 4993209, 10142549, 17911167, 13850370, 2650341, -959525, 2546511, 618609, -7842152, -11067905, -5207630, 528321, 367170, -930152, 808680, 3033918, 3043176, 1069289, -3058675, -8014511, -8522764, -3735955, -2992040, -12089989, -19878209, -12693204, 2798746, 7415183, -2798014, -13297081, -14040169, -9092159, -3842980, 676202, 678836, -6668937, -12716800, -7586916, 359990, -4790868, -17053785, -13602764, 7542742, 20538438, 10433261, -6158716, -10747179, -9009065, -11407521, -10317432, 3011322, 16243319, 12922845, -740237, -6942209, -4355491, -5113604, -11565130, -15480757, -14805499, -13293130, -8465526, 2652565]
11219B652565P650306p850909j6511257n997204R369011J1273874L581998L5393
11211D203777O26558k519124o939541m597917K311360M752970J190802k569661
11203c540776l352773j803905J468775M104907J941438l749672n556354j220569
11195a1708929K050992n50145l477804k33923O734441J0722602R018040L002109
11187A5557383l745777n960936k233584O15427k905335o163602r33536N709134
11179f0826J488676p503741m306127Q369223R555683m173498j0749523O34012
11171f746121J1341455N741354l365047j46237O018971L9478r546520n428204
11163b090871P500999J0562824J784659m812629m170325l484835m876841l691413
$$ y = [2652565, 10302871, 2451962, -14059295, -20056499, -10687488, 586386, 4168384, 4203777, 4830335, 2311211, -4628330, -9226247, -6914887, -2161917, -971115, -3540776, -6893549, -8697454, -7228679, -3123772, -1182334, -4932006, -10488360, -11708929, -9657937, -10208082, -13685886, -13919809, -7185368, 3537234, 12555274, 15557383, 11811606, 5850670, 3617086, 4232513, 1327178, -4836424, -5769960, -60826, 1427850, -6075891, -10382018, -2012795, 7542888, 3369390, -7380133, -6746121, 4595334, 10336688, 6971641, 6825404, 12844375, 12883853, 3337333, -2090871, 5410128, 15972952, 17757611, 12944982, 8774657, 5289822, 412981, -3278432]
11155c278432j111340k065379l595611K44525N815729N632607J858567J315527
11147D816193K783926J585719k02458l33973m337571j3742304j6841662o216214
11139c2488344N866271O393774L382170Q817627J3179622K054552j2799896q441646
11131a4035870R582750J4059501R08983n485372M687971J0998135Q9268j1164548
11123I640818n324493O995149O357199n409832j2100119p823941K44034N092094
11115b329091M594855K41561j829215L229130Q345477J622001j2623546j5219309
11107a3968137m66125J3288927J0144560k061369p643790n428234k662917L13563
11099h483522N416195P378052K603227j342016K261066O357705K038096m891473
$$ y = [-3278432, -4389772, -6455151, -10050762, -9806237, -3990508, 1642099, 3500666, 4816193, 7600119, 9185838, 8983380, 8649407, 4311836, -9430468, -26272130, -32488344, -26622073, -20228299, -16846129, -8028502, 5151120, 7205672, -5594224, -14035870, -4453120, 9606381, 10515364, 5029992, 9717963, 20716098, 20805366, 9640818, 4316325, 11311474, 17668673, 12258841, 158722, -7665219, -7421185, -2329091, 2265764, 2507325, 678110, 3907240, 12252717, 13874718, 1251172, -13968137, -14434262, -1145335, 8999225, 6937856, -705934, -6134168, -8797085, -8483522, -3067327, 4310725, 6913952, 5571936, 7833002, 14190707, 16228803, 11337330]
11091A1337330l281175M082800N307120q34001m470780k018126l70446l290940
11083F461782n379820k113211K890079L839145M67787k743797k178650J150066
11075B393381K764311P18226n72635L265378P551369L637452o486820j0631494
11067B639168m468682J755252L7859l163810J21711M781788K176088l896746l491727
11058c509099K550880M675629N80554k929258k702820k635307m266477m218754
11050a2454652k191042k359251m693032l004447M989713J2072267J0325715J724171
11042D409442m202794j971712L708758M250674j826023o992914m913457J167409
11034f370617M283745M344471N811055P270985L060307m802032p315110l249220
$$ y = [11337330, 8056155, 12138955, 17446075, 16612074, 12141294, 10123168, 9752722, 6461782, 1081962, -1031249, 1858830, 5697975, 6165762, 3421965, 1243315, 2393381, 5157692, 5875918, 5303283, 8568661, 16120030, 19757482, 13270662, 2639168, -1829514, -74262, -36403, -3200213, -3078502, 1703286, 3879374, -17372, -3509099, -958219, 3717410, 4297964, 1368706, -1334114, -3969421, -8235898, -12454652, -14645694, -17004945, -21697977, -24702424, -19712711, -7640444, 2685271, 4409442, 206648, -1765064, 1943694, 6194368, 4368345, -2624569, -7538026, -6370617, -2086872, 2257599, 8068654, 15339639, 18399946, 13597914, 6282804, 3033584]
11026C033584j579618n295210n403451K369939P816171K835353m128013k457948
11018b809193K414674k5201m806354M78511J1894309J2606715O5992q822301m075594
11009F921558K465039k884519j3765374j3607029k79579J0812813P086267o156946
11001i407770j3074285n674654P829412J2808325M721003o560169r333601l209677
10993b1901416L362778N279651N036399N755980N658554J496147n504658r669832
10985a0486397o887635J59185M213216K037212j432808o56576J665177n49798
10977a1938424n087288l683479L583314O743739K067351j368655K620252N948750
10969a114440o8257q735905p429386K875074R641100P080542R85710l185399o185465
$$ y = [3033584, 1453966, -3841244, -9244695, -6874756, 941415, 3776768, -351245, -2809193, -394519, -419720, -5226074, -4747563, 7146746, 19753461, 19819453, 10997152, 6921558, 9386597, 6502078, -7263296, -20870325, -21149904, -10337091, -3250824, -9407770, -22482055, -28156709, -20327297, -7518972, -2797969, -9358138, -18691739, -21901416, -18538638, -13258987, -8222588, -2466608, 3191946, 4688093, -816565, -10486397, -17374032, -17214847, -13001631, -10964419, -12397227, -13053803, -11388626, -11938424, -17025712, -20709191, -17125877, -10382138, -8314787, -9683442, -7063190, -1114440, -1182697, -9918602, -17347988, -14472914, -4831814, 2248728, 3234438, 49039, -6136426]
10960f136426q490524p268983j953805L524133N764566N128347L839801L778419
10952a814472M848075L755442j983850p330334l687570P246397J2337234N479046
10944A8849968k405964l59885N271486K291001o487094q162766r76726L934085
10936A1954105M61149n693511p914058n396537M89378O691339O734082j735893
10928E590054r682359o950112K690505P158604L726151j34040m53467O53958L049266
10919E648560O672104N078734n449983j4225306r145816K328175L151094n131001
10911a1073439n106950N738043J0271981J818874m613499N84070N852850J319585
10903D791515l499151P22249M665484j537764p994373j901885Q370623O540512
$$ y = [-6136426, -14626950, -21895933, -23849738, -20325605, -14561039, -9432692, -5592891, -1814472, 3033603, 6789045, 4805195, -2525139, -6212709, 1033688, 13370922, 18849968, 16444004, 16084119, 21355605, 23646606, 17159512, 8996746, 8020020, 11954105, 12415254, 6721743, -1192315, -6588852, -6099474, 591865, 7325947, 5590054, -4092305, -11042417, -8351912, -1193308, 2532843, 2398803, 1945336, 2599294, 5648560, 12320664, 17399398, 11949415, -2275891, -11421707, -9093532, -5942438, -11073439, -16180389, -10442346, -170365, 1648509, -2964990, -2380920, 3471930, 4791515, 1292364, 2014613, 6680097, 5142333, -2852040, -4753925, 3616698, 10157210]
10895A0157210l861905o235058N96395K044815n798241r713634k039372P422055
10887g427735P808445K251396l07532J144112J166765k609747p126186q260034
10879a3360516m459747K030575O427818N964085L308461L054798N125533M685922
10871A2776929q65540p433982q506685l240654J733775M89263l376814q62190
10863i285898Q093972J1294973J091699j1951861j1929994j67922O997263J938049
10855c919719n584848n354515J09443L618878L704065J566753k883457o404122
10847a5147522k544861P810878J3901746Q818936j215516o213810l989908K005411
10839C425354Q567022J1455987O008217n247659j2140773r071870j756388J887645
$$ y = [10157210, 6295305, 60247, 656642, 2701457, -3096784, -12810418, -14849790, -7427735, 380710, 2632106, 2324574, 3468686, 4635451, 2025704, -5100482, -13360516, -17820263, -15789688, -9361870, -3397785, -89324, 2965474, 8091007, 12776929, 11911389, 4477407, -4029278, -7269932, -5536157, -5046894, -8423708, -9285898, -1191926, 10103047, 11194746, -757115, -12687109, -12855031, -5857768, -3919719, -9504567, -14859082, -14749639, -11130761, -7426696, -5859943, -8743400, -15147522, -17692383, -9881505, 4020241, 12839177, 11623661, 5409851, 1419943, 3425354, 11992376, 23448363, 29456580, 24208921, 12068148, 2996278, 1239890, 3127535]
10831C127535J043850q57698j329047J272436N953460O526683n86378p019310
10823H131531k616784O362545M538610p086184j1637148m915204j884406q400499
10815a7507539r802418J430273R999390M780992q65921N629863J1528457J905297
10807G098394j1158427p893153N458563Q707122J406507k460559k951640q858289
10799a0651482j2481348k25804J6845907J4747825k783716p545095P186253J6329875
10791B1422415N211436r018593r226771l399032l647739m573856J225514O298012
10783D291386L083634j466425n12473m05497n250112m918691O081138J3415457
10775A4318417M020914j0926841j2556548k910996J970599r48397j313473L203666
$$ y = [3127535, 4171385, 3313687, 1984640, 3257076, 9210536, 15737219, 15150841, 8131531, 5514747, 11877292, 16415902, 9329718, -2307430, -7222634, -9107040, -17507539, -27309957, -25879684, -15880294, -11099302, -11965223, -6335360, 5193097, 7098394, -4060033, -11953186, -6494623, 2212499, 3619006, 1158447, -1793193, -10651482, -23132830, -23358634, -6512727, 8235098, 5451382, -2093713, 5092540, 21422415, 26633851, 17615258, 8388487, 4989455, 1341716, -3232140, -2006626, 4291386, 7375020, 5908595, 5396122, 4990625, -259487, -5178178, 902960, 14318417, 18339331, 7412490, -5144058, -8055054, -6084455, -7032852, -8346325, -5142659]
10767e142659M392789P52767j09176L006426K235072m229063p692253l364359
10759a0150456J963566J466829j332117N48052O218826Q303346L100309m739198
10751E379157p339030j820518O604883R800154N004061l042207q079316q003329
10743a496145m118815J743992P169380Q904113N659185L18659k442498n54650
10735A5183221L629010N210212J131007o033455r880384p409857k577726n82123
10727a330095j365024j826310j343006j059490o92871k83457j655408l694032
10719a3249693r71226P102663J1506104N903513k162205k521418P42647l326754
10711C023631j2059007j1522845P46157J0935552R689921L390348N01535J34421
$$ y = [-5142659, -749870, 2897, -106279, 2900147, 5135219, 906156, -6786097, -10150456, -8186890, -6720061, -8052178, -7504126, -1285300, 7018046, 10118355, 5379157, -1959873, -3780391, 2824492, 12624646, 17628707, 14586500, 6507184, -1496145, -5614960, -3870968, 3298412, 12202525, 17861710, 18180369, 15737871, 15183221, 18812231, 24022443, 25153450, 19119995, 9239611, 1829754, -747972, -1330095, -2695119, -4521429, -5864435, -6923925, -7616796, -7900253, -9555661, -13249693, -14220919, -7118256, 4387848, 10291361, 8129156, 5607738, 6350385, 3023631, -9035376, -20558221, -19812064, -8876512, 813409, 4203757, 4705292, 4839713]
10703D839713k65754J562788M884815L101055m336661p878601k886501K124874
10695A145728K91832j616052L756202R340579M462165o285401q733403m83168
10687A878482O257367K925015n218651q952708o555618k299377N44987J586870
10679i833633J333963K48542j045109j820061j485341J73774K864153N901566
10671c662146P947669O918293K225299k697181l673065k522245n226576j1076771
10663a1766723j0773890k84204J0948279J2776178P898067L998406N76037n016439
10655H355711o699321L76002O017893j074455j0792524m164052J3397407J5335615
10647B0752276n680789k4283547j8448155J749919J3472445J1368844M553018
$$ y = [4839713, 4573959, 6136747, 11021562, 14122617, 9785956, 1907355, -979146, 1145728, 1437560, -178492, 3577710, 12918289, 17380454, 11095053, 2361650, 1878482, 8135849, 11060864, 5842213, -3110495, -9666113, -11965490, -11420503, -9833633, -8499670, -8251128, -9296237, -11116298, -12601639, -12427865, -9563712, -3662146, 4285523, 11203816, 13429115, 10731934, 7058869, 4536624, -689952, -11766723, -22540613, -22824817, -11876538, 899640, 8797707, 12796113, 13372150, 8355711, 1656390, 2032392, 8050285, 6975830, -3816694, -7980746, 5416661, 20752276, 15071487, -9212060, -27660215, -25910296, -12437851, -1069007, 3484011]
10640C484011j882755p124515p059326l30175N726228N693835M394644N967702
10632H869649M985627k065905p510580n216482j529123k392033j476022N852644
10624d82225Q927356j653872j4048589j0246811N764051J3968384Q429817K173999
10616A2832110K975959L501069j201719l680114J312881N468918m22912j0812740
10608I973452j2204369k421236N480117M15001j0703463j0090474O993996K2558293
10600A0001317J7345042k802288j3956976o735292K793668p90502j0364516j0402971
10592a4912518q44544O396808O982388O562300P672384O554379J805185l397023
10584A6819359p056461r032782p392170p87992O767041R205725N515755k57708
$$ y = [3484011, 1601256, -5523259, -12582585, -12912760, -7186532, -1492697, 2901947, 8869649, 13855276, 11789371, 4278791, -937691, -2466814, -4858847, -6334869, -482225, 8445131, 6791259, -7257330, -17504141, -11740090, 2228294, 10658111, 12832110, 15808069, 19309138, 18107419, 14427305, 15740186, 21209104, 20786192, 9973452, -2230917, -4652153, 827964, 1242965, -9460498, -19550972, -12556976, 10001317, 27346359, 24544071, 10587095, 3851803, 6645471, 5854969, -4509547, -14912518, -15757062, -9360254, -2377866, 4184434, 11856818, 18411197, 20216382, 16819359, 9762898, 730116, -6662054, -7450046, -683005, 8522720, 14038475, 13780767]
10576A3780767m029942l835791k61576K690973J054459k975389l349616K12262
10568C286147J628188j039831k648332q83757j14046k092071k252126O54668R31052
10559b530108l103890m082208K536912R977554R519413J577581o789425r033222
10551a927393k065668J0110029J5624107P302046n104565p109117j379432j772082
10543A3677925p819798n328649O811914J2621889N647224k591383n390679q736311
10535H892132j1211586k134195J2729215J1779853n547209j1986041L876760J7578317
10527B3977246R638242m258287m920274j502426p106483j0771193j277962O747668
10519A0526531p34660q379939J515206J5403386J1698554k966086r420100p539321
$$ y = [13780767, 9750825, 5915034, 5653458, 8344431, 9398890, 6423501, 3073885, 3286147, 4914335, 3874504, 1226172, 342415, 228369, -1863702, -4115828, -3461160, -2530108, -5633998, -9716206, -7179294, 2798260, 12317673, 13895254, 7105829, -1927393, -3993061, 6116968, 21741075, 29043121, 23938556, 16829439, 15450007, 13677925, 5858127, 529478, 7341392, 19963281, 25610505, 23019122, 17628443, 8892132, -2319454, -4453649, 8275566, 20055419, 14508210, 2522169, 6398929, 23977246, 33615488, 29357201, 24436927, 22934501, 15828018, 5056825, 3778863, 10526531, 9791871, 1411932, 2927138, 18330524, 30029078, 27062992, 17642892, 10103571]
10511A0103571n127601K302496J4057336J2197674n829738j2116516N213280J5506477
10503C6306979j115241j4570225M20723J4960690R20994j1941193O707049K2870305
10495E4560081K095405j3669721J9073394M6807577P653815k8672154M3677602
10488A31525999J51880321J02310862j15825145k64211916j76043782J3877723
10482a56485938P8758591J0111046l2173959R848022M4081881J7045776j1973494
10475d0788075J692367J7372247M8559j7641773m378439J4682316J0117247k938874
10467b1834425j785058M821071K849558k39579K656738K618137k701900j284581
10459a4900039P071185P061155j684343k005651O516398M135149j0999749j5837504
$$ y = [10103571, 4975970, 7278466, 21335802, 33533476, 27703738, 15587222, 20800502, 36306979, 35191738, 20621513, 21042236, 36002926, 36923920, 24982727, 31689776, 54560081, 56655486, 42985765, 62059159, 108866736, 116520551, 87848397, 131525999, 283406320, 385717182, 269892037, 5680121, -170363661, -156485938, -77727347, -67616301, -99790260, -89942238, -45860357, -28814581, -40788075, -39095708, -21723461, -21674902, -39316675, -43695114, -29012798, -18895551, -21834425, -23619483, -18798412, -15948854, -16188433, -13531695, -10913558, -13615458, -14900039, -7828854, -767699, -2452042, -4457693, 2058705, 6193854, -4805895, -20643399]
10451b0643399k920606O011717j452525q665928k411420M962801J446012l218224
10443b6891572J733164Q544475P428102L372008L221190K853363j817911o174226
10435g731407p149332p662714o436991O49926P099190K410562o491759k057195
10427b7369720J3321359J7525214M315826o332695j499972N627736J172510p214710
10419d54452o948764q44596K359183K572164K101459j576209p458804q216311
10411a8466330k791953J140854J742065M854253Q064821J550996j0455441j0148272
10403b4509007M286604J1598622R30307r455568j765928J2724668J3039864R23221
10395G772783o038279l046429l95089l116845n401459l213128L53890J849022
$$ y = [-20643399, -23564005, -17552288, -19004813, -27670741, -30082161, -25119360, -23673348, -26891572, -25158408, -16613933, -9185831, -5813823, -2592633, 260730, -1557181, -7731407, -14880739, -22543453, -28980444, -28330518, -21231328, -18820766, -25312525, -27369720, -14048361, 3476853, 7792679, 1459984, -39988, 5587748, 6760258, -454452, -7403216, -8247812, -5888629, -3316465, -1215006, -2791215, -10250019, -18466330, -21258283, -20117429, -18375364, -13521111, -5456290, -3905294, -14360735, -24509007, -20222403, -8623781, -7693474, -17149042, -18914970, -6190302, 6849562, 7772783, 1734504, -1311925, -1707014, -4823859, -10225318, -13438446, -13084556, -11235534]
10387a1235534J527848J762811N200719J0658062R863709l211807j8262649j6369078
10379b0065919L256122J7733722J0110884p951590j3912910m169635O730185R169190
10371I00049O896196N437038M201436R82024l313635n884881m604042K3331L826240
10362H463756K439364k873092o272501n152310k784109k466249l641649m578657
10354a6865447m425435k242110J854206N116963N547125M694822L217689j723360
10346d825547r096808j0572705k679575M782671L127412j00238N887676J4390291
10338I13177J1011138p57436l891979L644626N781978m197944j3511590j1924307
10330a2932337n102820r5637M611101Q024200L356180o477574p256782L868738
$$ y = [-11235534, -9707686, -7944875, -2744156, 7913906, 17777615, 14565808, -3696841, -20065919, -16809797, 923925, 11034809, 3083219, -10829691, -14999326, -8269141, 900049, 7796245, 13233283, 17434719, 18416743, 15103108, 9218227, 4614185, 4637516, 8463756, 10903120, 8030028, 1757527, -3394783, -6178892, -8645141, -12286790, -16865447, -21290882, -23532992, -21678786, -16561823, -11014698, -6319876, -3102187, -4825547, -13922355, -24495060, -27174635, -22391964, -19264552, -19364790, -13477114, 913177, 11924315, 11166879, 7274900, 10919526, 16701504, 12503560, -1008030, -12932337, -18035157, -18130794, -13519693, -5495493, -2139313, -8616887, -15873669, -12004931]
10322a2004931J0796419L482863n792961k946240O132218P783143K041594j983448
10314G508657k158876j750478l09379K146328N4023p537475j0289201j653239
10306a3989640P732022M662337n537835o638960L946206J2303355Q871043j29726
10298A1218802l969916p91840L635357M636587K393757o88858l578379o619901
10290F235609q404446n478237K325340Q876658P951004M41927p979124j3050171
10282i081440j2205844m251222N954159R158048M528952K509177P124642O879172
10274A0615644m874870j3464292m095982J2025229J3961461L752600j306051p61017
10266A5852722p151904j5449204q256917R007519J1408430l508021j0814304j948931
$$ y = [-12004931, -1208512, 2274351, -3518610, -6464850, -332632, 7450511, 9492105, 7508657, 5349781, 3599303, 3289924, 5436252, 5490275, -2047200, -12336401, -13989640, -6257618, -1595281, -7133116, -13772076, -9825870, 2477485, 11348528, 11218802, 7248886, 6457046, 10092403, 14728990, 17122747, 16433889, 12855510, 6235609, -2168837, -7647074, -5321734, 3554924, 11505928, 11947855, 3968731, -9081440, -21287284, -25538506, -19584347, -10426299, -5897347, -3388170, 3736472, 10615644, 5740774, -7723518, -11819500, 205729, 14167190, 17919790, 16613739, 15852722, 8700818, -6748386, -15005303, -5997784, 5410646, 1902625, -8911679, -10860610]
10258a0860610J942765q473868j1966185L527799J6581650R170228l252480k473188
10250e803889J004163o083594r956036L549707J6712900P605128r970211q786758
10242a1728590N950952Q706702j203798l148841M505408M108037n200194o092711
10234d103035K676862L460811o724531j0594131k556031K607288j417391k228608
10226a8878766N497751R495103L905195K69413M706426N914000k851157r680467
10218a622502m671791K401433j002875r195040q370089J762828R394158P851046
10210c452832J254616l444391k863147J930167O457974O518223K337508k867403
10202E870715o998548q443728m912156J743576L899557j666550o555344j850098
$$ y = [-10860610, -8917845, -17391713, -29357898, -25830099, -9248449, -78221, -3330701, -5803889, -4799726, -10883320, -20839356, -17289649, -576749, 7028379, -2941832, -11728590, -5777638, 2929064, 1725266, -1423575, 3081833, 7189870, 1989676, -4103035, -1426173, 2034638, -4689893, -15284024, -17840055, -15232767, -16650158, -18878766, -13381015, -3885912, 19283, 288696, 4995122, 10909122, 8057965, -1622502, -6294293, -3892860, -4895735, -14090775, -22460864, -20698036, -11303878, -3452832, -2198216, -5642607, -8505754, -6575587, -117613, 6400610, 8738118, 5870715, -1127833, -9571561, -14483717, -12740141, -8840584, -10507134, -17062478, -18912576]
10194a8912576Q204678J2711533R723319N558869K963286J52662k553002m967226
10186A2881543j0626600j8115376j6155171J66441J6051025J4983782L137945
10179B323589j156427L933411N151165k8035q24713L962248K408139p807564j3176574
10170e214761o639636J411163J164244k666147j891593K771689O481583O998267
10162B414809K840021n401349j0490830n978166K202110L662695R24636L724135
10154f101939Q512629K984575q831516q168790P262292J5949798N128748r928555
10146F807242j0745683j632339K701009L94513j114933k41636N64744K588760
10138f78323N613800L659601m463685r633773o338335j923902k925919l517265
$$ y = [-18912576, -10707898, 2003635, 11726954, 17285823, 20249109, 20401771, 17848769, 12881543, 2254943, -15860433, -32015604, -31849163, -15798138, -814356, 2323589, 1167162, 5100573, 10251738, 10223703, 9398990, 13361238, 15769377, 7961813, -5214761, -11854397, -10443234, -9278990, -11945137, -13836730, -11065041, -4583458, 2414809, 5254830, -146519, -10637349, -16615515, -14413405, -10750710, -9826074, -6101939, 2410690, 5395265, -3436251, -11605041, -4342749, 11607049, 16735797, 6807242, -3938441, -5570780, -2869771, -2475258, -3590191, -3831827, -3267083, -678323, 4935477, 8595078, 4131393, -5502380, -11840715, -13764617, -16690536, -20207801]
10130b0207801J853680N826323Q13407n874301l661297K964028K704605k528747
10122a8110103j722160M996362O313695n20743m722251N96981Q223053Q641027
10114C695861K797672k419327m875317p013935q308190m492648M695360J1581023
10106d339501Q448985j881642q391083n719365J48632K800179M464009P928277
10098C458491P239478k977484j4326014j3543541k079088O115890N061617J631801
10090i418850M97862j138141k591352J194847O692501L548618o331087p596946
10082a5142548M221626J3397793P790978l508992p128969n419982o357175o358544
10074a8505813J060373Q839640N160162o555342j1384858m048347O178285R970240
$$ y = [-20207801, -18354121, -12527798, -11714391, -17588692, -21249989, -18285961, -15581356, -18110103, -19832263, -14835901, -8522206, -9042949, -13765200, -13168219, -4945166, 3695861, 6493533, 4074206, -801111, -7815046, -16123236, -20615884, -15920524, -4339501, 4109484, 2227842, -6163241, -11882606, -11733974, -8933795, -4469786, 3458491, 10697969, 7720485, -6605529, -20149070, -22228158, -16112268, -11050651, -9418850, -8920988, -10059129, -12650481, -11455634, -4763133, -1214515, -7545602, -15142548, -10920922, 2476871, 10267849, 6758857, -370112, -5790094, -12147269, -18505813, -17445440, -8605800, -3445638, -10000980, -21385838, -25434185, -19255900, -9285660]
10066i285660O776970N26456m468543m577522r34815J7924l761714m279279M690974
10057a5295209J5018812J3330819K01953r666592o475949L566417P640850J224061
10049I545162q362506j0849301m487139K005014Q02920m150969l493217K413482
10041a6576554M271552j5623j855924K274855M299200l73965l888112l35789K958192
10032i242168j075646n582788j888648M362290K960367k821653k778918J620482
10024a4446682J035199k916318Q12046J2286629J7139973P063922q215888j4104597
10016a345716p711724K683722Q222156O138258J87885l464927k857982j823352
10008B8320l170741m275848l028657k673035m993826m459063L080792J0818071
$$ y = [-9285660, -2508690, -1982234, -6450777, -11028299, -11963114, -11945190, -15706904, -19986183, -15295209, -276397, 13054422, 13256375, 3589783, -2886166, 680251, 8321101, 9545162, 1182656, -9666645, -14153784, -12148770, -11345850, -15496819, -18990036, -16576554, -12305002, -12320625, -14176549, -11901694, -7602494, -7976459, -11864571, -12200360, -9242168, -10317814, -15900602, -17789250, -13426960, -10466593, -13288246, -16067164, -14446682, -13411483, -16327801, -15515755, -3229126, 13910847, 20974769, 12758881, -1345716, -9057440, -6373718, 1848438, 7986696, 8174581, 4709654, 1851672, 28320, -3142421, -7418269, -10446926, -13119961, -18113787, -22572850, -19492058, -8673987]
10000h673987R219996L37305n396292m151533j282103p00052p99889j87008P90141
9991a0843422L505384Q377122R983030L078713p259159j0017107l168998L581576
9983b762861K130826m681967q668025n948659O56391N630232O320003N382127
9975a941933N899770M813933k372217r787459m892649J1093727J8764634O167321
9967B7745127j2395296j6060223n930433J820216K982769O169472J1075301O999590
9959B2406523n957648j3529975r087903k104804k91493P33218M161047L866479
9951A95444k552061o052900l90190P041373P213846K577962k4445n65296j751300
9942E692433j785884P33719J623386j881775n312401m504742k358392k224862
$$ y = [-8673987, 546009, 883314, -4512978, -8664511, -9946614, -10646666, -11446555, -11633563, -10843422, -7338038, 1039084, 11022114, 14100827, 6841668, -3175439, -6344437, -2762861, -632035, -5314002, -13982027, -19930686, -19274295, -13644063, -7324060, -1941933, 3957837, 8771770, 6399553, -3387906, -8280555, 2813172, 21577806, 27745127, 15349831, -710392, -6640825, -4820609, -1837840, 4331632, 15406933, 22406523, 16448875, 2918900, -6169003, -8273807, -8565300, -7832082, -3671035, 195444, -2356617, -8409517, -8799707, -1758334, 5455512, 8033474, 8009029, 7443733, 5692433, 3906549, 4640268, 6263654, 4381879, -930522, -5435264, -7793656, -10018518]
9934a0018518j710290R99510K244764N65362J160588N736993O490309j351600
9926D117118r159290o887866J617334N788966M573051M020369L697702j687603
9918F079781r464473j0414992l348899K515094J279213k614118l226113j300182
9910b0494689p05741k111949k801683L211O037455J0598252Q730791K864757J167179
9901C287583M628962L366014p115805j4418939n723139J0544694J4402869K961963
9893A1934202o645571l538397M018342N754240L653843K177509j633384q936116
9885F784668j1619550m476868M330871N054223N82382q14568Q07852O20559j197327
9876G2242l287189q595582j5165905j1188328O599608J9375075R658822r311793
$$ y = [-10018518, -11728808, -10729298, -8484534, -7919172, -6758584, -1021591, 5468718, 4117118, -5042172, -11930038, -10312704, -4523738, 49313, 4069682, 7767384, 6079781, -3384692, -13799684, -17148583, -14633489, -13354276, -15968394, -19194507, -20494689, -21200430, -23312379, -26114062, -26110851, -20073396, -9475144, -744353, 2120404, 3287583, 7916545, 11282559, 4166754, -10252185, -15975324, -5430630, 8972239, 11934202, 5288631, 1750234, 5768576, 11522816, 15176659, 17354168, 15720784, 6784668, -4834882, -9311750, -4980879, 73344, 655726, -158842, 649010, 1269569, 72242, -3214947, -11810529, -26976434, -38164762, -31565154, -12190079, -2531257, -11843050]
9868a1843050j0160051O653750J3641832P80803r350443m83554J0730696M350716
9860D320699r472050r424881J400668M240724j830167j497178O738640P986748
9852B463203j299492o673589p70363N763201M441627J545179L150151M245724
9844A2865641J362344R66790N724835O183183l203371j2096985r927133k673467
9836g98163j587544m580017k442542L727309N684838L771041N081427Q165659
9828A7022008L569748r345011j7915269j1907562L937697J5780935J4281060J847272
9820A7270878r647894r494829N4648N809089J068027n250589l323174J690629
9812a823215m43304n682707j428521J0640548J4096520K676605r777962j0124152
$$ y = [-11843050, -22003101, -15349351, -1707519, -926716, -10277159, -10760713, -30017, 4320699, -5151351, -14576232, -13175564, -8934840, -10765007, -12262185, -5523545, 2463203, 1163711, -5509878, -6280241, -517040, 3924587, 5469766, 8619917, 12865641, 14227985, 15194775, 20919610, 27102793, 23899422, 11802437, 1875304, -798163, -2385707, -6965724, -9408266, -5680957, 3881, 3774922, 8856349, 17022008, 20591756, 11246745, -6668524, -18576086, -14638389, 1142546, 15423606, 17270878, 7622984, -1871845, -1817197, 3991892, 5059919, -190670, -3513844, -1823215, -2266519, -7949226, -9377747, 1262801, 15359321, 18035926, 8257964, -1866188]
9804a866188l085787M34488M07122K612544N341516K779642l423874o427376m890486
9795h118399k593246n04312K117032J922481l493283p165464n50163J0669703
9787g715651J0899946k457851j2596439o199744P623714J0703272Q21722p787169
9779f708200n535205K021816M961460J069809n066580q453559o926310k561450
9771b7198219n40427k382076j798238O325901J4923333J2414968J119620m143844
9763a278982J388466M976854j728224p453116l4086J1257455Q548989o228093
9755I449263j3678610n806118M674364N721849J106241n36558J182274K443551
9747D556256K538349J571752j283219l513186j240287K158729r77538q487987
$$ y = [-1866188, -4951975, -4517487, -4110365, -1497821, 3843695, 6623337, 3199463, -3227913, -8118399, -10711645, -11215957, -9098925, -7176444, -10669727, -17835191, -18385354, -7715651, 3184295, 726444, -11869995, -18069739, -10446025, 257247, 1078969, -6708200, -12243405, -10221589, -5260129, -4190320, -9256900, -17710459, -24636769, -27198219, -27738646, -30120722, -31918960, -25593059, -10669726, 1745242, 2864862, -1278982, 109484, 5086338, 3358114, -4095002, -4129088, 7128367, 15677356, 9449263, -4229347, -10035465, -5361101, 360748, 1466989, 930431, 2112705, 4556256, 7094605, 8666357, 7383138, 3869952, 2629665, 4788394, 3810856, -4677131]
9739d677131q851454j15109M476654k753272r979425l611858J0061492J4206304
9731a243799O067017j479903l78797L420460K118631k914012n709148m847621
9723d967172l984547n534218o545178k152712O332414R864384K813128o825513
9715a0999414o195015M129250J0384784N542581j978725l162838n53254M04545
9707b428086J205073L558356K667450l707025q017808m153183J872085J892276
9699g110862j303090p55035K056498J991216J017182L220820M943299R14195n070095
9690i5872o172963l707528j976652J421017Q563805J1543841L264737q225324
9682D615061j0504640o212519o215163q599184k355893J0644361J6034768R592957
$$ y = [-4677131, -13528585, -13643694, -9167040, -11920312, -21899737, -25511595, -15450103, -1243799, 4823218, 3343315, 2964518, 6384978, 8503609, 5589597, -119551, -4967172, -8951719, -14485937, -21031115, -23183827, -16851413, -6987029, -4173901, -10999414, -17194429, -13065179, -2680395, 2862186, 883461, -2279377, -2832631, -2428086, -1223013, 2335343, 5002793, 1295768, -6722040, -10875223, -9003138, -7110862, -8413952, -9168987, -7112489, -5121273, -4104091, -883271, 4060028, 4974223, -95872, -6268835, -9976363, -11953015, -10531998, -1968193, 9575648, 12840385, 4615061, -5889579, -12102098, -18317261, -26916445, -29272338, -18627977, -2593209, 6999748]
9674F999748K051174p7428j507996l888014j736254L468125J842227o880005r597675
9665i326098m91675R309286R658636M796055J243434l480362j0668376j2156734
9657a1115834l502371N374660M242826j894523k865403o59266l743236r853612
9649b4016759q262703K440441J0842152Q448794K81159l057204J407467O855597
9641e061056O034944O95849l33264O208935J0991084L507744j1575375j7983072
9633g514211q628633N632635J0665208M544100n088609j1417390j1384377m765959
9625b7957236M123540Q210848N392466Q65742n61050L27452J477548K978747L604520
9616a537423M41395m789515n497837n096M796836L650217M12266M72889J752243
$$ y = [6999748, 9050922, 8973494, 7465498, 3577484, 1841230, 5309355, 7151582, 271577, -9326098, -9817773, -508487, 9150149, 13946204, 15189638, 11709276, 1040900, -11115834, -14618205, -9243545, -5000719, -6895242, -9760645, -10419911, -14163147, -24016759, -32279462, -29839021, -18996869, -10548075, -10266916, -13324120, -11916653, -5061056, 973888, 1669737, 1336473, 7545408, 18536492, 22044236, 10468861, -7514211, -16142844, -10510209, 154999, 4699099, -389510, -11806900, -23191277, -27957236, -23833696, -15622848, -10230382, -9364640, -9925690, -9598238, -8120690, -5141943, -1537423, -1096028, -5885543, -11383380, -11388476, -6591640, -2941423, -2529157, -2056268, -304025]
9607c04025o48046n289641o326020k276199K409278L687833K243075J482145K802362
9598b219238L383244O0924m246398k456699N147528P538525j820774j2292930
9590f905818r267281M011340J0886857O003469R14207L344070N845850O54439
9582A5487133o858305p214883l79962O261986O931367P15889p669518r256033
9574a982326j014408O302004J618281p168598l180924J0433673J1932609l915464
9566A3024847j4464002l512618J3988137J6563276P086600R64532q18337o085332
9558B6747103j0818524o124448J850629J04198q162100q666512p36369K681490
9550c124533k045318n241351k868930j436061k472714Q11634Q252935R694108
$$ y = [-304025, -952071, -6241712, -12567732, -14843931, -12434653, -8746820, -6503745, -5021600, -2219238, 1164006, 1224930, -3021468, -5478167, -330639, 7207886, 5387112, -6905818, -16173099, -12161759, -1274902, 4728567, 5642774, 8986844, 14832694, 15487133, 8628828, 1413945, 1033983, 7295969, 14227336, 14943225, 7273707, -1982326, -2996734, 3305270, 4923551, -2245047, -5425971, 5007702, 16940311, 13024847, -1439155, -4951773, 9036364, 25599640, 32686240, 33650772, 32832435, 26747103, 15928579, 9804131, 11654760, 11758958, 3596858, -5069654, -5806023, -3124533, -5169851, -10411202, -13280132, -14716193, -17188907, -16377273, -8124338, 1569770]
9542A569770J589127o722445p656936m437938j692039J657492N887585O973924
9534b831460L783704M39538j095350k768784l830208j589110P72966k427409p424324
9525a6970437m109359O944338J2934010P895403R78568M84607J685322k124884
9517G717568o989690n743553l86529J895089j90437k429482k494808j000925J095255
9508h527512J700049j441680n373816l204092N191994J0257911N787517j666346
9500B724025k914545L58898J21750m514624p083231m733015j202660N62754J801075
9491a4879573L690823N343662O394067P000218N396469k5716o277975p931528
9483a289553m059235R66241L732213M660112M364876J942876j596799k577583
$$ y = [1569770, 3158897, -3563548, -11220484, -15658422, -17350461, -15692969, -9805384, -2831460, 952244, 1391782, 296432, -2472352, -6302560, -7891670, -7118704, -9546113, -16970437, -21079796, -14135458, -1201448, 6693955, 7672523, 8157130, 9842452, 7717568, 727878, -5015675, -5402204, -3507115, -3697552, -6127034, -8621842, -9622767, -8527512, -6827463, -8269143, -13642959, -16847051, -11655057, -1397146, 4390371, 2724025, -190520, 168378, 290128, -4224496, -11307727, -16040742, -17243402, -16680648, -14879573, -11188750, -5845088, 548979, 7549197, 12945666, 12919950, 6641975, -1289553, -5348788, -4382547, -650334, 4009778, 8374654, 10317530, 8720731, 6143148]
9475F143148J06658K329768K11297m185868n653030k726794J057402J807919j254176
9466b163676n994779q566085n419722K814935R850051R456713L051985j629590
9458A399832l44605K435787p4339p970076j4388771j2820900l165338Q133434
9450b6794976J3086017R140772J941056q55564J599422L906987L260449K195320
9442G479483J642678j687393p692601r669669l928259L387565M868735J680334
9434c919127r37394j733283n27312N315667J3111562J1697061k751275j5228624
9426E027275j0013920N685704J1762669M279893l055519l765043n181281r485307
9418d745529q439901j066227K540843L89278K636911J0166644R271198l242833
$$ y = [6143148, 6249806, 8579574, 8790871, 4605003, -1048027, -3774821, -2717419, -909500, -2163676, -8158455, -16724540, -22144262, -19329327, -9479276, -22563, 3029422, 1399832, 1055227, 3491014, 3416675, -4553401, -18942172, -31763072, -34928410, -26794976, -13708959, -4568187, -2627131, -3482695, -1883273, 2023714, 5284163, 7479483, 9122161, 7434768, -257833, -9927502, -13855761, -10468196, -5599461, -3919127, -4856521, -6589804, -7117116, -1801449, 11310113, 23007174, 20255899, 5027275, -4986645, 699059, 12461728, 16741621, 13686102, 9921059, 4739778, -4745529, -13185430, -14251657, -11710814, -11321536, -8684625, 1482019, 10753217, 7510384]
9410G510384j0168138j543853P401248J590702q418149n047895O722059Q915911
9402F962269o94768r336727j1146058r848922n782924K302454P715056M234358
9394a5595262j141985J114351O157478M255536k69114K685555Q601418N690553
9386A1498530k663021l300217K669757K527660l539317k716903N655964P952891
9378A8085344J142138k249069J701518R12743r179569j5187673p993890K533836
9370a0234622M962207K619553K583652K758893L2613j488661R9258j257313p277608
9361g202028r296131k891123L839291N165071P366998J3337958J1927565l360050
9353A8887551j7265296j1396677P812088J7080468Q432404l067099l589077K287421
$$ y = [7510384, -2657754, -4201607, 3199641, 4790343, -3627806, -8675701, -1953642, 6962269, 6267501, -3069226, -14215284, -24064206, -29847130, -27544676, -19829620, -15595262, -16737247, -15622896, -9465418, -5209882, -5478996, -2793441, 5807977, 11498530, 8835509, 5535292, 8205049, 10732709, 7193392, 4476489, 10132453, 18085344, 19227482, 16978413, 18679931, 19592674, 10413105, -4774568, -12768458, -10234622, -5272415, -2652862, -69210, 2689683, 2722296, 1233635, 1332893, 75580, -7202028, -16498159, -19389282, -15549991, -10384920, -3017922, 10320036, 22247601, 18887551, 1622255, -9774422, -1962334, 15118134, 23550538, 20483439, 16894362, 19181783]
9345A9181783K734744l729575q475399n886225m89460m65979o298610r316492
9337a2745213l772531L522459J978914o649732r934170k830294N804438P200197
9329a7425932L360043k42580l039564m825169j590365P034386J2913751Q952111
9321E136681j422759r558223j1177551o437105L044162J1905443J2282515L681852
9313G455015l629343j256158N891583O848852n22870p910207p710345j272754
9305b106227L311365J24115o805394o558607M015196J2665305O799791p294655
9297D150889j1868118k758544O954176Q894035Q735339R795372M887129p141555
9289B1648723j3153175n594726L482156J407889m719769j585741P142184Q060632
$$ y = [19181783, 21916527, 18186952, 9711553, 3825328, 3335868, 2869889, -3428721, -12745213, -16517744, -12995285, -11016371, -17666103, -27600273, -30430567, -24626129, -17425932, -14065889, -14308469, -17348033, -22173202, -23763567, -16729181, -3815430, 5136681, 3713922, -5844301, -17021852, -23458957, -20414795, -8509352, 3773163, 7455015, 3825672, 2569514, 8461097, 15309949, 14787079, 6876872, -833473, -2106227, 1205138, 1329253, -5476141, -12034748, -8019552, 4645753, 11445544, 4150889, -7717229, -10475773, -3521597, 5372438, 14107777, 23903149, 28790278, 21648723, 8495548, 2900822, 6382978, 7790867, 3071098, 1485357, 8627541, 16688173]
9281A6688173J011173k475275M69608J519335k748058o659207o961616o042532
9273e198399l865393J940668Q000201P650958J609887k984177l552967l361836
9265B38942l323508j764453q40914l577881n862340j361284O528790P945081J573325
9256d44242l732646k718978P23591K519285L243317K801769m48412l875458k786401
9247d718175M24045j328855p011773p300745K57999O321273M026669j603574l610744
9238a4543880l107408k971188k34148O929397J1350616N616879n132199q591922
9230a0683853k239972L612937O83403o466405p527325J51027R116806J1105509
9222b247873N646432q02797k408122N64338L254681J851043k662555n622847l377939
$$ y = [16688173, 17699346, 15224071, 15693679, 17213014, 14464956, 7805749, 844133, -5198399, -9063792, -7123124, 877077, 8528035, 10137922, 7153745, 3600778, 238942, -3084566, -4849019, -5689933, -9267814, -15130154, -16491438, -9962648, -2017567, -444242, -4176888, -6895866, -6172275, -3652990, -409673, 2392096, 1943684, -1931774, -4718175, -4294130, -5622985, -12634758, -19935503, -19677504, -13356231, -9329562, -10933136, -14543880, -17651288, -20622476, -20856624, -13927227, -2576611, 3040268, -2091931, -10683853, -12923825, -9310888, -8627485, -15093890, -22621215, -22470188, -13353382, -2247873, 3398559, 2595762, 187640, 751978, 4006659, 5857702, 3195147, -2427700, -5805639]
9213e805639K235620M378100j844134j2524696j7504855j1023234K246018J2803375
9205b7039445J5311627J0759481L371625j800137j407219K403870L127160j649781
9197C077181n702588k572195M158033N168601j057553o008729l650951J555902
9189e032299K459090o17020k600267k506475k927332k650373K246800Q797163
9181b830713P005345n673453j6528538j2299981K607835J2301577J1319960Q419453
9173D321485Q215073L656551p610316j3772799o428251L946738L459704l457564
9165g669379l239894K818190J647742p620701j1221412l094400P063314J0520148
9157a0796392R061658N245766j742891p388061m277128L088508J521904q752463
$$ y = [-5805639, -3570019, 808081, -1036053, -13560749, -31065604, -42088838, -39842820, -27039445, -11727818, -968337, 2403288, 603151, -804068, 1599802, 4726962, 3077181, -2625407, -5197602, -1039569, 4129032, 3071479, -2937250, -6588201, -5032299, -2573209, -3190229, -5790496, -8296971, -11224303, -13874676, -11627876, -2830713, 4174632, -1498821, -18027359, -30327340, -27719505, -15417928, -4097968, 4321485, 12536558, 16193109, 8582793, -5190006, -11618257, -7671519, -4211815, -7669379, -10909273, -8091083, -6443341, -14064042, -25285454, -28379854, -21316540, -10796392, -1734734, 3511032, 1768141, -5619920, -9897048, -6808540, -5286636, -14039099]
9149a4039099j1981901k255653O721858M668676l44988N64571K178814j009336
9141a5497058k837510M99442R02830m381037l311600Q449888J3708478N12524
9133a954043j4291514r452387P417944J3749836O581620n63246m168020q872331
9125a1552141q636198L558697J4538419P020868q875792q996610M359575O756738
9117a826444m877744p328623O007283J2149731o28210j1453601k670593J1170734
9109E42533R855961l91599k742499J279626O18661k523043m33198J221992o480151
9100I48283j5315715j0360579M482667J0874653L671842l543317j156732L698038
9092f700860Q32291p782717j1937353o492278L353260Q287282M862678j258818
$$ y = [-14039099, -26021000, -28276653, -21554795, -16886119, -17231107, -16666536, -14487722, -15497058, -18334568, -17835126, -16932296, -21313333, -24624933, -16175045, -2466567, -1954043, -16245557, -25697944, -18280000, -4530164, 2051456, 1488210, -2679810, -11552141, -20188339, -16629642, -2091223, 4929645, -3946147, -12942757, -8583182, -1826444, -6704188, -14032811, -8025528, 4124203, 3495993, -7957608, -10628201, 542533, 10398494, 10006895, 7264396, 8544022, 9162683, 6639640, 6206442, 7428434, 948283, -14367432, -24728011, -20245344, -9370691, -5698849, -9242166, -10398898, -6700860, -5868569, -13651286, -25588639, -32080917, -28727657, -20440375, -15577697, -16836515]
9084a6836515k981886l50170K402136M938545Q712034R866303M317184k095152
9076G972479n89496M644090J793912p406766q831893n61136K842507l694417n977454
9067i808174L459657J0040478K157475p186295k024176Q795754O635451n446735
9059F623435q822513l69409M741439o16525o174923k750517N578260J0132371
9051H341618O940929l125313j3865190j5029600l532991R545156J2250786P043183
9043H568578K873959n55033p214740j0768972l233915O933635L925126r838179
9035i309541j5664022o643809M390441P237007O766938Q541178Q614016L846641
9027G778849j789526o526838j2696567j5251489m375475J4635032K1415369R286962
$$ y = [-16836515, -19818401, -20168571, -17766435, -12827890, -4115856, 5750447, 10067631, 7972479, 7382983, 12027073, 13820985, 6414219, -2417674, -2978810, -136303, -3830720, -9808174, -6348517, 3691961, 5849436, -1336859, -3361035, 5434719, 12070170, 6623435, -2199078, -2568487, 2172952, 1556427, -4618496, -7369013, -1790753, 8341618, 15282547, 12157234, -1707956, -16737556, -20270547, -10725391, 1525395, 8568578, 11442537, 10887504, 3672764, -7096208, -10330123, -3396488, 528638, -9309541, -24973563, -31617372, -27226931, -19989924, -13222986, -4681808, 3932208, 7778849, 5989323, -537515, -13234082, -28485571, -32861046, -18226014, 3189355, 12476317]
9019A2476317l141959o24755N615876p76699j2129830r696890M180491R943402
9011E845953K973025j166932M624662O974242l596619j4527632j0027123M339164
9003d561260J0261921L085444m790271m729325k187133l438100l897013K608495
8995g647242J0336581P817147m332119j1980296o475385L564532N375036K97870
8987c043876l06678N635405O961676l052460j4959774j5422413m721752N651183
8979b3258689Q896292P844588N605753Q70420n124750n424295K962655J1437696
8971C809670R032678k842080j1711871r927941k647985J622695K068201L208193
8963g388440O138715P232835L485631m513113j2808871j4609355m819230J1295729
$$ y = [12476317, 9334358, 8709603, 14325479, 13548780, 1418950, -8277940, -4097449, 5845953, 8818978, 7652046, 12276708, 19250950, 15654331, 1126699, -8900424, -4561260, 5700661, 8786105, 3995834, -733491, -2920624, -6358724, -10255737, -7647242, 2689339, 10506486, 6174367, -5805929, -12281314, -8716782, -3341746, -3043876, -3350554, 2284851, 9246527, 6194067, -8765707, -24188120, -28909872, -23258689, -14362397, -6517809, -912056, -41636, -5166386, -10590681, -7628026, 3809670, 12842348, 10000268, -1711603, -11639544, -14287529, -12664834, -10596633, -7388440, -1249725, 5983110, 9468741, 4955628, -7853243, -22462598, -27281828, -15986099]
8955a5986099J8724144R377250n290249p522623K734155Q126074r18196j3261440
8947d016984j4005139l874037N530178P860731N399355J934630k34872r6648k55530
8938a758316m906665j1149975r315642K314523J1578826R363054L526887M898341
8930D551033Q049918J117505j1117466j2051034N1215Q454991L706703m334128
8922a571263n607735m306092n649521l634405N883070J2354528N302375p006838
8914d235881r076411k214851m55793n549522m408608O299731J1279869Q80377
8906g481089j0617093m607547J3110653J9370491O499209q249197r138351k680113
8898c793037l016027q300314n657728N798829J2427440P086237j307516l546959
$$ y = [-15986099, 2738045, 12115295, 6825046, -697577, 2036578, 10162652, 9244456, -4016984, -18022123, -21896160, -16365982, -8505251, -3105896, -1171266, -1406138, -1502786, -1758316, -6664981, -17814956, -27130598, -24816075, -13237249, -3874195, -347308, 4551033, 12600951, 13718456, 2600990, -9450044, -9398829, -943838, 2762865, -1571263, -7178998, -11485090, -17134611, -20769016, -14885946, -2531418, 2770957, -4235881, -13312292, -15527143, -15982936, -21532458, -25941066, -19641335, -8361466, -7481089, -18098182, -22705729, -9595076, 9775415, 16274624, 8025427, -1112924, -3793037, -6809064, -15109378, -20767106, -14968277, -2540837, 4545400, 3237884, -309075]
8890c09075l159432o470432r885350o608598J085090N916332O591623N770286
8882g069556K455605l823785o394072j15036P497367N819911j674439k913492
8874f217497K817230N355057K892493L921093Q551267N908797n045828j0092733
8866H089879l068252K566381l847142j2171645r273194o13241J619233R9660M658454
8857a1939867J1991886J1296291M013363J63917l60196m942208j0211466n784896
8849e773176N098368P682702k81133m884178N35013N890722K986030k720038m762932
8840C771378n030683m661543k49585N206583K813172m971331m478154M777062
8832b823101N183556q867560j6673207l173987J3915116J0292034o773613j1206975
$$ y = [-309075, -3468507, -9938939, -19824289, -26432887, -25347797, -19431465, -12839842, -7069556, -4613951, -8437736, -14831808, -14946844, -7449477, -1629566, -3304005, -6217497, -3400267, 1954790, 4847283, 8768376, 17319643, 23228440, 18182612, 8089879, 5021627, 7588008, 3740866, -8430779, -17703973, -18317214, -16697981, -16598321, -11939867, 52019, 11348310, 15361673, 15525590, 15165394, 10223186, 11720, -5773176, -674808, 7007894, 6726761, 1842583, 2377596, 8268318, 11254348, 8534310, 3771378, -1259305, -5920848, -6170433, -963850, 1849322, -3122009, -7600163, -2823101, 2360455, -6507105, -23180312, -26354299, -12439183, -2147149, -8920762, -20127737]
8824b0127737J140761J0690003P782194K153920q6975l999826q123592k740679
8816a3311931R298209J1675669J048304o000594l34470N283330n68052q651094
8808a560629n850193L961818R238987Q470414O085575J923416l513535m099382
8800A4656471P31509J235852n682670q072975M31921O610883k17013p280792O97827
8791C111013J3130903R778545m728510q879729q03941J129755p216652r140299
8783c618915J449706Q982494M165617j576121N94752J923675l797036o205563
8775A918609J436007O864252p12014j1076687j0171143k293418J379941K793992
8767i860461P754283R207194m57459j0461670n864914O631757Q249140j696400
$$ y = [-20127737, -18986976, -8296973, -514779, 1639141, 1552166, -2447660, -10571252, -13311931, -4013722, 7661947, 8710251, 2709657, 2375187, 7658517, 7090465, -1560629, -7410822, -3449004, 5789983, 14260397, 20345972, 22269388, 18755853, 14656471, 15387980, 16623832, 10941162, 2868187, 3300108, 9910991, 9693978, 2413186, 3111013, 16241916, 26020461, 21291951, 12412222, 11608281, 12738036, 5521384, -3618915, -2169209, 6813285, 10978902, 9402781, 9997533, 11921208, 8124172, 1918609, 3354616, 10218868, 9506854, -1569833, -11740976, -14034394, -12654453, -9860461, -2106178, 7101016, 6643557, -3818113, -9683027, -3051270, 5197870, 3501470]
8759C501470o785253j837327J840079k41513Q22203O856833O234339m900897j2961336
8750g471402p703223K089442L692115r57791k168187J465174M140675L402619
8742c510578J134464j039667j213577K733298P689211O058770l145079j0334493
8734a627651p683555N92300N343579L991977R8693k682573j674488L694064P799566
8725G851912L125230p081550r419641L40212Q450088K573073r361985j1309682
8717a4832343k661222L939127L458809K401836L631704K077102k929824m403336
8709i318147l34707K067780o21337j373557M872885J1077548P898340k540390
8701A1728415r924142q867379k818548K210130K873697m35157m144551m814884
$$ y = [3501470, -3283783, -5121110, -3281031, -3522544, -2700341, 4156492, 10390831, 5489934, -7471402, -15174625, -13085183, -9393068, -10350859, -12519046, -11053872, -6913197, -3510578, -2376114, -3415781, -4629358, -1896060, 5793151, 11851921, 8706842, -1627651, -9311206, -8718906, -3375327, 616650, 715343, -1967230, -3641718, 52346, 7851912, 10977142, 3895592, -5524049, -5183837, 3266251, 5839324, -3522661, -14832343, -17493565, -13554438, -10095629, -7693793, -4062089, -1984987, -4914811, -9318147, -9652854, -7585074, -8206411, -9579968, -4707083, 6370465, 14268805, 11728415, 1804273, -7063106, -9881654, -7671524, -4797827, -5232984, -9377535, -14192419]
8693a4192419l359611k906057k344370K010708P266917M993599m618679q910182
8685b2060094l89807J0159732Q515135j405421l572727N581840J2541528P633774
8677A7003960k393512o815365m963960j855647J343839N266663P029897M113922
8669A8729797m86440k705731l446768n309897p009016n915715k779674M84356
8661h439088M028987O963518N701142L81819k297387J122050L822989m25353m762158
8652F096519J306276J2839361J2945781l209048j9847659k0482577o812972P550902
8644i613417J3723219J1159152J888510r762559j5203376q469851M605139J0824433
8636h48750M969884m211097n906260r94737R53924l132451m591136L558991J3856604
$$ y = [-14192419, -17552030, -20458087, -22802457, -20791749, -13524832, -8531233, -13149912, -22060094, -22449901, -12290169, -3775034, -5180455, -8753182, -3171342, 9370186, 17003960, 14610448, 7795083, 2831123, 975476, 2319315, 7585978, 14615875, 18729797, 18243357, 15537626, 12090858, 6780961, -228055, -6143770, -8923444, -8439088, -4410101, 2553417, 8254559, 8636378, 6338991, 7461041, 11284030, 10858677, 6096519, 7402795, 20242156, 33187937, 29978889, 10131230, -10351347, -17164319, -9613417, 4109802, 15268954, 17157464, 7394905, -7808471, -16278322, -11673183, -848750, 4121134, -89963, -5996223, -6990960, -6037036, -9169487, -13760623, -10201632, 3654972]
8627C654972J3039110J071598q473757p804415l312002r98370L293595J0898590
8619A1369321J1058213j853830j3115026p144232O192857N380703p960903j1904415
8611g977312r04034O462807R85922k890184L240302M049411j0541879k1750320
8603b9325287r804652J1974527J6056952J918154p153488j357554O677056P410836
8595c603456N179578K937550k456832p338137k910259O905609P291412l793548
8587B211917j0981571n521229K688523L443873Q55696J552141K319435j019417
8579d450632l826676j185765K933832L314607K174906L000360L576802J931342
8571G468776J506492L913879M222897o5364l165836r45662J166559k101752n715221
$$ y = [3654972, 16694082, 17765680, 9291923, 1487508, -1824494, -2822864, 470731, 11369321, 22427534, 20573704, 7458678, 314446, 6507303, 11888006, 3927103, -7977312, -8881346, -2418539, -1432617, -4322801, -1082499, 2966912, -7574967, -29325287, -39129939, -27155412, -11098460, -9180306, -16333794, -17691348, -11014292, -3603456, 1576122, 4513672, 2056840, -5281297, -8191556, -1285947, 6005465, 2211917, -8769654, -14290883, -11602360, -8158487, -7302791, -5750650, -3431215, -4450632, -8277308, -9463073, -6529241, -3214634, -1039728, 1960632, 5537434, 7468776, 8975268, 12889147, 17112044, 17046680, 13880844, 12935182, 14101741, 11999989, 6284768]
8562F284768k836526K662026K124256l370064m455895J747740P209498M669491
8554A4035294k683611o154425k851403J476722J175631p95638K544343R563333
8546A6310246R552550j278009j1816678j1704823o468403n879661n766442K668365
8538a4382855J2060695Q003529l697376k541206J1721583J5272806p28550j3302448
8530A2406178m361071R470328M169988j3401172j8474404o690042N092333Q246466
8522c541396Q879347R034838L612566m789189p162349m278431m756622p713660
8514a0714896m134732M927188Q595595N110807L659996N987140L208873o203229
8506A0436742j1712952q086698k344510O51195M428720Q357850M698239n631606
$$ y = [6284768, 3448242, 6110268, 8234524, 4864460, 408565, 2156305, 9365803, 14035294, 11351683, 5197258, 2345855, 3822577, 4998208, 4202570, 6746913, 16310246, 25862796, 24584787, 12768109, 1063286, -5405117, -11284778, -17051220, -14382855, -2322160, 5681369, 1983993, -557213, 11164370, 26437176, 25708626, 12406178, 8045107, 17515435, 21685423, 8284251, -10190153, -16880195, -11787862, -3541396, 5337951, 14372789, 17985355, 13196166, 6033817, 1755386, -3001236, -10714896, -14849628, -9922440, -1326845, 3783962, 7443958, 13431098, 16639971, 10436742, -1276210, -9362908, -11707418, -11056223, -6627503, 1730347, 6428586, 796980]
8498G96980r703673k749946K794214k583144r972121p303817J947797P092497
8490a9681213P160269P329291O811165K778660j80513L118619P149264L140043
8482A7625585n787357q650334l631066J88422k326458o036405n160233o43394
8474a4421240M012029P359285Q255058M944135j751263p882900j0345156q824622
8466a8654674l988988K901969Q483043Q848713L762379k594298n628385m058805
8458a0929046q8159K900768L174755J888040J079523Q74327K94606Q6376J713639
8449I94829L694330K740028p44941k268477J61317K616365L12291o472435j2576411
8440a1543104j1837973j573057J2967769J9878129J2215134k033368q465643m693137
$$ y = [796980, -8906693, -11656639, -8862425, -11445569, -21417690, -28721507, -26773710, -19681213, -12520944, -5191653, 1619512, 4398172, 4217659, 7336278, 14485542, 17625585, 11838228, 3187894, -443172, -254750, -2581208, -8617613, -13777846, -14421240, -10409211, -3049926, 5205132, 10149267, 8398004, 515104, -9830052, -18654674, -22643662, -19741693, -11258650, -2409937, 1352442, -1241856, -6870241, -10929046, -11017205, -8116437, -4941682, -3053642, -1974119, -1099792, -805186, -718810, 994829, 4689159, 7429187, 6684246, 4415769, 4577086, 7193451, 7505742, 1033307, -11543104, -23381077, -24954134, -11986365, 7891764, 20106898, 18073530, 9607887, 4914750]
8432D914750j533234m587282n809525J335230R215052P727875O30212q36154M169174
8423A5226098N875278k44014p723921r636425o450212k152427N81368n6284m324436
8414h904975q133417n870614K168791R003582R093999M163442k46637j390928
8406a16757j087289k203872m470102m449525o63285K700176Q06711l814060l955230
8397a7253233R18853L284292L4166k124865J241242L724065m41296m582389l18783
8388a5517948O151039K084995j0175519j4071618k720341J1110313J3233522N649442
8380d256115K2892J398595M949551M536305n64304n568061n003273N53970L833329
8371i7111O67064k679631J260293P727822N553889m617295r699558l595738M585326
$$ y = [4914750, 3381516, -1205766, -7015291, -5680061, 3534991, 11262866, 11893078, 11056924, 15226098, 21101376, 20857362, 13133441, 3497016, -2953196, -5105623, -4524255, -4580539, -8904975, -17038392, -22909006, -20740215, -11736633, -2642634, 1520808, 1274171, -116757, -1204046, -3407918, -7878020, -12327545, -12990830, -10290654, -9483943, -13298003, -17253233, -16334380, -13050088, -13015922, -15140787, -13899545, -10175480, -10616776, -15199165, -15517948, -9366909, -7281914, -17457433, -31529051, -34249392, -23139079, -9905557, -4256115, -4233223, -2834628, 2114923, 6651228, 6086924, 518863, -4484410, -3930440, -97111, 569953, -2109678, -849385, 6878437, 12432326, 7815031, -1884527, -5480265, -894939]
8362h94939N798543L160912K759243K769803m76059m056620m241244l733046n466771
8353d380178n725488j070349M115738M564815K389884J161850r91991m282918
8345d218637j923486P481947J1141236j84268j3052768p672043J0520939J5797165
8337A7890085q1608j5524625j1385312K916284P224716R0290m704778k134470
8329e709418m38429m468558q172665n201017K226708P562919P466518L487923
8321c246019k40435m23882K212363L995428L633106L401104L456355J54319o311420
8312F630919q571959k732992K904222j307596r980524q123512O481186J7329043
8304B628787J0382207p096263j5934910q462465M883499J0536918O407676K02315
$$ y = [-894939, 4903604, 8064516, 10823759, 13593562, 13117503, 9060883, 4819639, 1086593, -4380178, -10105666, -11176015, -7060277, -2495462, -105578, 1056272, 64281, -4218637, -6142123, 1339824, 12481060, 12296792, -755976, -8428019, 2092920, 17890085, 17808477, 2283852, -9101460, -6185176, 1039540, 1129830, -3574948, -5709418, -6147847, -10616405, -18789070, -23990087, -21763379, -14200460, -6733942, -3246019, -3486454, -3910336, -1697973, 2297455, 5930561, 9331665, 12788020, 12942339, 6630919, -1941040, -4674032, -1769810, -3077406, -13057930, -21181442, -14700256, 2628787, 13010994, 5914731, -10020179, -18482644, -13599145, -3062227, 3345449, 3547764]
8296C547764j861421r54231j309213l101454j909114M433246J0604805Q477850
8288A7928232k431028j2067420j0198284J034778Q163537J869473j0605239j2687772
8280a8993723Q09947J5058589J2593492l509104j2689997m635151O637434M052326
8272f76187o274372m285861J1551670J8737964L521319j6469198j5584226L687254
8264e791637J5016038N665709q641540j0319810m307751m570989q671317k812104
8256b4433401J2110981J7741271N386807r296343q223319L253832N569738n368029
8248c258463j3011546n925797N664405O469571j379937m005018J576474M163831
8240i706480j651652n421747K448456J3434555J1406702l246353j2082084l444154
$$ y = [3547764, 1686343, 732112, -577101, -3678555, -5587669, -1154423, 9450382, 17928232, 15497204, 3429784, -6768500, -5733722, 2429815, 4299288, -6305951, -18993723, -18183776, -3125187, 9468305, 5959201, -6730796, -11365947, -4728513, -676187, -6950559, -11236420, 315250, 19053214, 22574533, 6105335, -9478891, -5791637, 9224401, 14890110, 6248570, -4071240, -8378991, -12949980, -21621297, -24433401, -12322420, 5418851, 10805658, 1509315, -6714004, -3460172, 2109566, -3258463, -16270009, -22195806, -16531401, -10061830, -11441767, -15446785, -13870311, -9706480, -11358132, -16779879, -14331423, -896868, 10509834, 7263481, -4818603, -8262757]
8232h262757J1323294J3190636M71715j0608398q224749J769291O917930M244719
8224A0821681j03686j751136j622489j079396l78207j380777n421016q135835
8216i050861l214923O689216R723480l512j2539296j3594463k560845P785710
8208a6765494Q144539K244665j149831N93677L664445M426817K909062J543487
8200E611367K495506N117458N696098J934716k369493q62497O102983J0109771
8192C3835909N215276m113632r325457q544681o098214m096589j121588J410656
8184G161680q97761o956726q211686K15245J1060414J3352951O487684n13698
8176B1698103k559495l888385q266687j0944000n672356M305724Q829905L853536
$$ y = [-8262757, 3060537, 16251173, 16722888, 6114490, -2110259, -340968, 6576962, 10821681, 10717995, 8966859, 7344370, 6264974, 5886767, 4505990, -915026, -9050861, -12265784, -5576568, 4146912, 4143400, -8395896, -21990359, -24551204, -16765494, -8620955, -6376290, -7526121, -6932444, -3267999, 1158818, 4067880, 5611367, 8106873, 13224331, 18920429, 20855145, 18485652, 17623155, 23726138, 33835909, 39051185, 34937553, 25612096, 17067415, 10969201, 6872612, 5751024, 7161680, 6263919, -692807, -8904493, -8689248, 2371166, 15724117, 22211801, 21698103, 19138608, 15250223, 6983536, -3960464, -9632820, -5327096, 3502809, 7356345]
8168G356345l520820m498662Q15644M910081K862454k176932l606878M71606N209071
8159G821909N095728O37497k709814j778131P93653J147495n71472j792156j853955
8150F790754j667784r22332P61031J323988j022932l681869k790198L48327J162413
8141C01398l32541J80096K868649K992874L16004Q71839N523775N744035k568288
8132A5897841r691423o315939r6503m798532j6581711j6777957k9051J5710079
8124b2683196J4046827K101259k982409K36383n60851q019217r423373K350551
8116b4934026J4898245J1849470m325778j4785636q201194O264186J2176737N762798
8108a295198k433392k790739K659659N490285K032910l759333o249616l761139
$$ y = [7356345, 3835525, -663137, 152507, 5062588, 7925042, 5748110, 2141232, 2612838, 7821909, 12917637, 13555134, 10845320, 9067189, 9860842, 11008337, 10436865, 8644709, 6790754, 5122970, 4200638, 4961669, 6285657, 5262725, 1580856, -1209342, -861015, 301398, -31143, 148953, 3017602, 6010476, 6326480, 7198319, 12722094, 18466129, 15897841, 6206418, -109521, -206024, -5004556, -21586267, -38364224, -38393275, -22683196, -8636369, -6535110, -9517519, -9281136, -9841987, -17861204, -27284577, -24934026, -10035781, 1813689, -2512089, -17297725, -25498919, -19234733, -7057996, -1295198, -3728590, -6519329, -3859670, 1630615, 3663525, -95808, -6345424, -10106563]
8100a0106563J074977M333935M133067K136529J389992K091369R55386l885258
8092B123434q974958q889584k929183L708428N627852K695581n87236n44060J376789
8083f392937O71863l340598n045351p0971O591806N694257k778159p933501k558247
8074a5161838O906723R484738L533843l784848o535011l936169J827044O045694
8066a619824L547506l944048o882561p05673N783756L181880k935369n12202Q719748
8057D633213J1076794K374541o500590p602335n788100n974660l638733M316437
8049g103433R946187N140247m955437q574219l085911L433830L604034k016628
8041c611330p182754o109793M70700M659892R55962m456195j524859P145391Q609488
$$ y = [-10106563, -9031586, -4697651, -564584, 1571945, 2961937, 5053306, 6008692, 2123434, -6851524, -15741108, -18670291, -14961863, -9334011, -6638430, -7225666, -7769726, -6392937, -5721074, -9061672, -14107023, -14177994, -7586188, -1891931, -4670090, -12603591, -15161838, -8255115, 1229623, 4763466, 978618, -5556393, -9492562, -7665518, -1619824, 1927682, -2016366, -8898927, -9604600, -3820844, -638964, -3574333, -4086535, 4633213, 15710007, 18084548, 11583958, 3981623, -1806477, -7781137, -11419870, -7103433, 2842754, 7983001, 3027564, -5546655, -8632566, -5198736, -1594702, -3611330, -10794084, -16903877, -16433177, -11773285, -10817323, -15273518, -16798377, -9652986, -1043498]
8032a043498K50158n120039j64263M913290M36452n629591j508605P864210R319227
8023I317341L214833N33420K418247o46900r771473j3675652o763298J982444
$$ y = [-1043498, -793340, -5913379, -6077642, -1164352, -727900, -6357491, -7866096, -1886, 9317341, 12532174, 13065594, 15483841, 14836941, 5065468, -8610184, -15373482, -13391038]
$$ [...]
##END NTUPLES=NMR SPECTRUM
##END=
