##TITLE=31Pdec_SR_IMG-4
 CDCl3, 124 sc
 17.11.2021
##JCAMPDX= 6.0         $$ Bruker NMR JCAMP-DX V2.0
##DATA TYPE= NMR SPECTRUM
##DATA CLASS= NTUPLES
##ORIGIN= UXNMR, Bruker Analytische Messtechnik GmbH
##OWNER= root
$$ XWIN-NMR		Version 3.5
$$ Wed Nov 17 12:47:37 2021 Russian Standard Time (UT+4h)  she@DPX200
##.OBSERVE FREQUENCY= 81.013821
##.OBSERVE NUCLEUS= ^31P
##.ACQUISITION MODE= SIMULTANEOUS
##.ACQUISITION SCHEME= undefined
##.AVERAGES= 124
##.DIGITISER RES= 16
##SPECTROMETER/DATA SYSTEM= spect
##.PULSE SEQUENCE= zgpg30
##.SOLVENT NAME= CDCl3
##.SHIFT REFERENCE= (INTERNAL, CDCl3, 0, 248.564)
##AUDIT TRAIL= $$ (NUMBER, WHEN, WHO, WHERE, WHAT)
$$ ##TITLE= Audit trail, XWIN-NMR		Version 3.5
$$ ##JCAMPDX= 5.01
$$ ##ORIGIN= Bruker BioSpin GmbH
$$ ##OWNER= she
$$ F:/spectra/data/she/nmr/P31/1/pdata/1/auditp.txt
$$ ##AUDIT TRAIL=  $$ (NUMBER, WHEN, WHO, WHERE, WHAT)
(   1,<2021-11-17 12:46:00.53 +0400>,<she>,<DPX200>,
      <continue with go, POWCHK disabled, PULCHK disabled
       configuration hash MD5:
       00 E9 B6 7A A2 85 ED C7 34 08 36 98 17 FE 4E 26
       data hash MD5: 32K
       69 58 C8 A0 B6 65 A3 97 2F 79 36 B7 8D 98 F3 6D>)
(   2,<2021-11-17 12:46:42.23 +0400>,<she>,<DPX200>,
      <Start of raw data processing
       efp BC_mod = 2 LB = 1 FT_mod = 6 PKNL = 1 PHC0 = -9203.507 PHC1 = 149.2695 SI = 64K 
       data hash MD5: 64K
       94 42 E5 7D 84 13 48 4A C7 33 81 F8 8B B9 D1 9E>)
(   3,<2021-11-17 12:46:59.51 +0400>,<she>,<DPX200>,
      <pk PHC0 = -2.208717 PHC1 = 0 
       data hash MD5: 64K
       F4 DD AA 5B 22 E4 D9 26 27 44 9F C3 D4 45 28 7E>)
(   4,<2021-11-17 12:47:05.54 +0400>,<she>,<DPX200>,
      <abs ABSG = 5 
       data hash MD5: 64K
       17 6E 32 A5 1A 9E D7 B6 8F 0F 03 FC 65 D8 05 CD>)
$$ ##END=
$$ 
$$ hash MD5
$$ 60 9C CD 94 90 1E 6D 1B 4F 38 68 42 9C 65 A3 AE
##$RELAX= 
##$RELAX= 
##$RELAX= 
##$RELAX= 
##$RELAX= 
##$RELAX= 
##$RELAX= 
##$RELAX= 
$$ Bruker specific parameters
$$ --------------------------
##$DU= <F:/spectra>
##$EXPNO= 1
##$NAME= <P31>
##$PROCNO= 1
##$TYPE= <nmr>
##$USER= <she>
##$AMP= (0..31)
100 100 100 100 100 100 100 100 100 100 100 100 100 100 100 100 100 100 
100 100 100 100 100 100 100 100 100 100 100 100 100 100 
##$AQSEQ= 0
##$AQ_mod= 1
##$AUNM= <au_zg>
##$AUTOPOS= <>
##$BF1= 81.014009
##$BF2= 200.13
##$BF3= 200.13
##$BF4= 200.13
##$BF5= 200.13
##$BF6= 200.13
##$BF7= 200.13
##$BF8= 200.13
##$BYTORDA= 1
##$CFDGTYP= 0
##$CFRGTYP= 5
##$CHEMSTR= <none>
##$CNST= (0..31)
1 1 145 1 1 1 1 1 1 1 1 1 1 1 1 1 1 1 1 1 1 1 1 1 1 1 1 1 1 1 1 1 
##$CPDPRG= <waltz16>
##$CPDPRG1= <>
##$CPDPRG2= <waltz16>
##$CPDPRG3= <>
##$CPDPRG4= <mlev>
##$CPDPRG5= <mlev>
##$CPDPRG6= <mlev>
##$CPDPRG7= <mlev>
##$CPDPRG8= <mlev>
##$CPDPRGB= <>
##$CPDPRGT= <>
##$D= (0..31)
0 1 0 0 0 0 0 0 0 0 0 0.03 2e-05 3e-06 0 0 0 0 0 0 0 0 0 0 0 0 0 0 0 0 
0 0 
##$DATE= 1637138589
##$DBL= (0..7)
120 120 120 11 120 120 24 19 
##$DBP= (0..7)
150 150 150 150 150 150 150 150 
##$DBP07= 0
##$DBPNAM0= <>
##$DBPNAM1= <>
##$DBPNAM2= <>
$$ [...]
##$SUBNAM3= <"">
##$SUBNAM4= <"">
##$SUBNAM5= <"">
##$SUBNAM6= <"">
##$SUBNAM7= <"">
##$SUBNAM8= <"">
##$SUBNAM9= <"">
##$SW= 501.771253377433
##$SWIBOX= (0..15)
0 1 3 0 0 0 0 0 0 0 0 0 0 0 0 0 
##$SW_h= 40650.406504065
##$TD= 32768
##$TD0= 1
##$TE= 0
##$TE2= 300
##$TE3= 300
##$TEG= 300
##$TL= (0..7)
0 120 53 12 22 120 120 120 
##$TP= (0..7)
150 150 150 150 150 150 150 150 
##$TP07= 0
##$TPNAME0= <>
##$TPNAME1= <>
##$TPNAME2= <>
##$TPNAME3= <>
##$TPNAME4= <>
##$TPNAME5= <>
##$TPNAME6= <>
##$TPNAME7= <>
##$TPOAL= (0..7)
0.5 0.5 0.5 0.5 0.5 0.5 0.5 0.5 
##$TPOFFS= (0..7)
0 0 0 0 0 0 0 0 
##$TUNHIN= 0
##$TUNHOUT= 0
##$TUNXOUT= 0
##$USERA1= <user>
##$USERA2= <user>
##$USERA3= <user>
##$USERA4= <user>
##$USERA5= <user>
##$V9= 5
##$VALIST= <valist>
##$VCLIST= <CCCCCCCCCCCCCCC>
##$VD= 0
##$VDLIST= <DDDDDDDDDDDDDDD>
##$VPLIST= <PPPPPPPPPPPPPPP>
##$VTLIST= <TTTTTTTTTTTTTTT>
##$WBST= 1024
##$WBSW= 4
##$XGAIN= (0..3)
0 0 0 0 
##$XL= 0
##$YL= 0
##$YMAX_a= 6993
##$YMIN_a= -9251
##$ZGOPTNS= <>
##$ZL1= 120
##$ZL2= 120
##$ZL3= 120
##$ZL4= 120
##$ABSF1= 248.5645
##$ABSF2= -253.2056
##$ABSG= 5
##$ABSL= 3
##$ALPHA= 0
##$AQORDER= 0
##$ASSFAC= 0
##$ASSFACI= 0
##$ASSFACX= 0
##$ASSWID= 0
##$AUNMP= <proc_1d>
##$AZFE= 0.1
##$AZFW= 0.5
##$BCFW= 0
##$BC_mod= 2
##$BYTORDP= 0
##$COROFFS= 0
##$CY= -3
##$DATMOD= 1
##$DC= 0
##$DFILT= <>
##$DTYPP= 0
##$F1P= 0
##$F2P= 0
##$FCOR= 1
##$FTSIZE= 65536
##$FT_mod= 6
##$GAMMA= 0
##$GB= 0
##$INTBC= 1
##$INTSCL= 5.30512e-09
##$ISEN= 30
##$LB= 1
##$LEV0= 0
##$LPBIN= 0
##$MAXI= 10000
##$MC2= 0
##$MEAN= 0
##$ME_mod= 0
##$MI= 50
##$NCOEF= 0
##$NC_proc= -9
##$NLEV= 6
##$NOISF1= 182.463
##$NOISF2= 159.3651
##$NSP= 0
##$NTH_PI= 0
##$NZP= 0
##$OFFSET= 248.5645
##$PC= 4
##$PHC0= -9205.716
##$PHC1= 149.2695
##$PH_mod= 1
##$PKNL= yes
##$PPARMOD= 0
##$PSCAL= 0
##$PSIGN= 0
##$REVERSE= no
##$SF= 81.014009
##$SI= 65536
##$SIGF1= 159.3651
##$SIGF2= -187.1042
##$SINO= 113.3802
##$SIOLD= 16384
##$SREGLST= <1H.CDCl3>
##$SSB= 0
##$STSI= 65536
##$STSR= 0
##$SW_p= 40650.406504065
##$SYMM= 0
##$S_DEV= 0
##$TDeff= 32768
##$TDoff= 0
##$TI= <>
##$TILT= no
##$TM1= 0
##$TM2= 0
##$TOPLEV= 0
##$USERP1= <user>
##$USERP2= <user>
##$USERP3= <user>
##$USERP4= <user>
##$USERP5= <user>
##$WDW= 1
##$XDIM= 65536
##$YMAX_p= 519574059
##$YMIN_p= -171746857
$$ End of Bruker specific parameters
$$ ---------------------------------
##NTUPLES= NMR SPECTRUM
##VAR_NAME=  FREQUENCY,     SPECTRUM/REAL,   SPECTRUM/IMAG
##SYMBOL=    X,             R,               I
##VAR_TYPE=  INDEPENDENT,   DEPENDENT,       DEPENDENT
##VAR_FORM=  AFFN,          ASDF,            ASDF
##VAR_DIM=   65536,         65536,           65536
##UNITS=     HZ,            ARBITRARY UNITS, ARBITRARY UNITS
##FACTOR=    0.620285442955139, 1,           1
##FIRST=     20137.2065510759, 0,            0
##LAST=      -20513.1999529892, 0,           0
##MIN=       -20513.1999529892, -171746857,  0
##MAX=       20137.2065510759, 519574059,    0
$$ Real data points
##PAGE= N=1
##DATA TABLE= (X++(R..R)), XYDATA
$$ [...]
41801C936238k4665260j4118699J3269771K7948714J4102740m728011r68157J3725027
$$ 3936238 -20729022 -34847721 -21577950 6370764 20473504 15745493 14777336 28502363
41793B8502363Q450326j5661658k6706761j1439058Q316794J2397072O495274
$$ 28502363 36952689 21291031 -5415730 -16854788 -8537994 3859078 10354352
41786A0354352J445109n132152j3680755j2072411L467885J4812983P179719o288353
$$ 10354352 11799461 6667309 -7013446 -19085857 -15617972 -804989 6374730 86377
41778H6377m240997R498301J3400593L134062l262540M115682J1748609N020396
$$ 86377 -4154620 5343681 18744274 21878336 18615796 22731478 34480087 39500483
41770C9500483r546977j5109381q208367l85649l77026m972026p397496o484084
$$ 39500483 29953506 14844125 6635758 6250109 5873083 901057 -6496439 -12980523
41762a2980523m615615k073074J923803N051625L960571M34321o9921J752257
$$ -12980523 -17596138 -19669212 -17745409 -12693784 -8733213 -8298892 -8368813 -6616556
41754f616556k762111j5679446k1978250o328492K0255612K7033960M128333j9846215
$$ -6616556 -9378667 -25058113 -47036363 -53364855 -33109243 -6075283 -1946950 -21793165
41746b1793165j5731909M685508Q546168n205052n000394J7705003K7845155J338121
$$ -21793165 -37525074 -32839566 -24293398 -29498450 -34498844 -16793841 11051314 12389435
41738A2389435l0193084k1554214J8140938L7753517J7009862j1865697j7797877
$$ 12389435 -17803649 -39357863 -21216925 16536592 33546454 21680757 3882880
41731C882880p978971N7965Q106674J9027503J7941849l072580k2955614j9879781
$$ 3882880 -4096091 -4038126 4068548 23096051 41037900 37965320 15009706 -4870075
41723d870075m299062J162036j692304K008995O829890k616061j7032997j2451984
$$ -4870075 -9169137 -8007101 -9699405 -7690410 -860520 -3476581 -20509578 -32961562
41715c2961562Q355659J8227742R871047L619848O695592O70241j9097337k6409139
$$ -32961562 -24605903 -6378161 3492886 7112734 13808326 14478567 -4618770 -31027909
41707c1027909n787165J8287582J7194822j94582o997302o02549J766260l417665
$$ -31027909 -36815074 -18527492 -1332670 -1527252 -8524554 -9127103 -7360843 -10778508
41699a0778508m582305j31007M58154k411251J003440Q817183P530325m939086
$$ -10778508 -15360813 -15491820 -15033666 -17444917 -16441477 -7624294 -93969 -5033055
41691e033055j3674716p969391N570363J4473096J3697601N112195n986361j1205160
$$ -5033055 -18707771 -26677162 -21106799 -6633703 7063898 12176093 6189732 -5015428
41683e015428m563964R476047J9120179J7136719N872495o903211j2701267p879038
$$ -5015428 -9579392 -103345 19016834 36153553 42026048 35122837 22421570 14542532
41675A4542532j40287k541334j4121522j6662545j948423R749833k772888k4198565
$$ 14542532 14402245 11860911 -2260611 -18923156 -20871579 -11121746 -13894634 -38093199
41667c8093199j8419737J7973426M4928679L1582726l435610k1137692j4025239
$$ -38093199 -56512936 -38539510 6389169 37971895 34536285 13398593 -626646
41660f26646o112980j0143236j1104647L749635K0607720J8846070K498666n986463
$$ -626646 -6739626 -16882862 -27987509 -24237874 -3630154 15215916 17714582 11728119
41652A1728119N6530K665357r947862k1601254j2153477Q693265J3209174k469236
$$ 11728119 11784649 14450006 4502144 -17099110 -29252587 -20559322 -7350148 -9819384
41644i819384j2497464j655988J2883889J1831941L061807K144382L214277n862036
$$ -9819384 -22316848 -23972836 -11088947 742994 3804801 5949183 9163460 3301424
41636C301424j3719331j243350J9700103J6344494j3749162l3210246j7041235
$$ 3301424 -10417907 -11661257 8038846 24383340 10634178 -22576068 -39617303
41629c9617303J2967693K1746747O886519q025707r751503m304266P45806L630275
$$ -39617303 -26649610 -4902863 1983656 -6042051 -15793554 -20097820 -19352014 -15721739
41621a5721739K854920m65535J375490J1628704J8880070J0839240o121781j4696689
$$ -15721739 -12866819 -13332354 -11956864 -328160 18551910 29391150 23269369 8572680
41613H572680j0343669l253368O18083M828279Q868878N722623l319394o480792
$$ 8572680 -1770989 -5024357 -4406274 422005 9290883 15013506 11694112 5213320
41605E213320m28430K380489n829952j2650559l048925J5924737K2677561J0218732
$$ 5213320 4784890 7165379 1335427 -11315132 -14364057 1560680 24238241 34456973
41597C4456973o082428j0549398m729728O92420J242060j47611m95912O25781
$$ 34456973 28374545 17825147 13095419 13787839 15029899 14882288 14386376 15012157
41589A5012157J708293r71117r076544j5266719r018519N769599J0002669l933800
$$ 15012157 16720450 15749333 6672789 -8593930 -17612449 -11842850 -1840181 -5773981
41581e773981j5851099m144219J9643336K4309632M737630j1084528n816133L223297
$$ -5773981 -21625080 -25769299 -6125963 18183669 22921299 11836771 6020638 9243935
41573I243935k388705r898028j12427J4558674P373693j6652813k4750487o831670
$$ 9243935 6855230 -3042798 -3155225 11403449 18777142 2124329 -22626158 -29457828
41565b9457828R759651M631052n197990L878201K2741631K3624393J510428k0527001
$$ -29457828 -19698177 -15067125 -20265115 -16386914 6354717 29979110 31489538 10962537
41557A0962537k3111469r601159N792619J3421063R817906k951487j4688883j3015374
$$ 10962537 -12148932 -21750091 -15957472 -2536409 7281497 4330010 -10358873 -23374247
41549b3374247K404518J7248525J8594770Q730944j737903r424190j8364441k6077795
$$ -23374247 -20969729 -3721204 14873566 23604510 21866607 12442417 -5922024 -31999819
41541c1999819k0740924J215778K2919015K4255078Q416876k366036J337929M766906
$$ -31999819 -52740743 -51524965 -28605950 -4350872 4066004 1699968 3037897 7804803
41533G804803l721214j1204199j243000J6652647J9165017M249905p665263n942090
$$ 7804803 4083589 -7120610 -8363610 8289037 27454054 31703959 24038696 18096606
41525A8096606j373032l084438n127219k588069j528399l778189K38375J2322910
$$ 18096606 16723574 13639136 8511917 5923848 4395449 617260 855635 13178545
41517A3178545J6742306L215618j4622222j8627469j1424259n876391o39996J3657035
$$ 13178545 29920851 33136469 18514247 -113222 -11537481 -17413872 -18053868 -4396833
41509d396833L0178227K9456679Q297711j2352768j3380008N21230R914486L678975
$$ -4396833 25781394 55238073 63535784 51183016 37803008 38324238 48238724 51917699
41501E1917699j1674527k1628755j9414750j1894852q373435o115446M618706
$$ 51917699 40243172 18614417 -800333 -12695185 -21068620 -27184066 -22565360
41494b2565360K0868068K5375576J0497219r426528j8340558j7567400j3599543
$$ -22565360 -1697292 23678284 34175503 24748975 6408417 -11158983 -24758526
41487b4758526k694541J5281761K2721464P678911r450413j114873K0998287J7583451
$$ -24758526 -27453067 -12171306 10550158 18229069 8778656 7663783 28662070 46245521
41479D6245521j7346542m1564389k4300531R694175J8187708M25515j0287655
$$ 46245521 28898979 -12665410 -36965941 -27271766 -9084058 -8658543 -18946198
41472a8946198O49576J4640595J5467871J0745183J0821881Q790576m547485j9468791
$$ -18946198 -18296622 -3656027 11811844 22557027 33378908 42169484 37621999 18153208
41464A8153208j7590401R63068J4970987Q978885p540344j3974796n075446N242497
$$ 18153208 562807 1525875 16496862 25475747 17935403 3960607 -1114839 4127658
41456D127658M675050l098239p762218o617681k528834M791669J5203907K0266763
$$ 4127658 8802708 5704469 -2057749 -8675430 -11204264 -6412595 8791312 29058075
41448B9058075J1063008o408462j5122366q781974L79913k30542o517283n433635
$$ 29058075 40121083 33712621 18590255 9808281 10188194 9957652 3440369 -1993266
41440a993266N970896J6659530J5452404L913016n900707n744744j420211m793897
$$ -1993266 3977630 20637160 36089564 40002580 34101873 28357129 26936918 22143021
41432B2143021j5396645j8419923o823665M259271k265370j7485041j6105849
$$ 22143021 6746376 -11673547 -18497212 -14237941 -16503311 -33988352 -50094201
41425e0094201O683016K6292531K1608974Q63512j3017352r435414O016054K2161920
$$ -50094201 -43411185 -17118654 4490320 5353832 -7663520 -17098934 -11082880 11079040
41417A1079040K6784804J2056639j2886201k4328751j1336517P349340O863205
$$ 11079040 37863844 49920483 37034282 12705531 1369014 8718354 15581559
41410A5581559j0504365k0751665j2482660J076829M986958J889709K682135Q761434
$$ 15581559 5077194 -15674471 -28157131 -27080302 -22093344 -20203635 -17521500 -8760066
41402h760066J1593968N617035m149677p216665O83378J1327812J2191103J991306
$$ -8760066 2833902 8450937 4301260 -2915405 -2232027 9095785 21286888 23278194
41394B3278194p178507o514603k327201m386810r066501m963100P503561J4071410
$$ 23278194 16099687 9585084 7257883 2871073 -6195428 -11158528 -3654967 10416443
41386A0416443N907494q622491j5164740r656846O67529P907497J0488526J0883533
$$ 10416443 16323937 7701446 -7463294 -17120140 -16452611 -8545114 1943412 12826945
41378A2826945R840663N092437l545561j0486662j0191521n471927l647300m856807
$$ 12826945 22667608 27760045 24214484 13727822 3536301 -1935626 -5582926 -10439733
41370a0439733k975717J113297p44861p160640m648098R738725J8436507R146951
$$ -10439733 -13415450 -12302153 -13047014 -20207654 -24855752 -15117027 3319480 12466431
41362A2466431m052131l041076M322292o08499j2740821j2215288k162939m529904
$$ 12466431 8414300 5373224 9695516 9087017 -3653804 -15869092 -18032031 -22561935
41354b2561935j6928619j0066024K0739289L7660847J5489672j6570212j7518963
$$ -22561935 -39490554 -49556578 -28817289 8843558 24333230 7763018 -9755945
41347i755945N625661J5538555M644149k443222J631559k217705j6216207j4776521
$$ -9755945 -4130284 11408271 16052420 13609198 15240757 13023052 -3193155 -17969676
41339a7969676R190461K3519246M978917k0995932j7367824Q795263K0194414
$$ -17969676 -8779215 14740031 19718948 -1276984 -18644808 -9849545 10344869
41332A0344869O567923o492007l361316R64153o352169j1812432m8787J8454590
$$ 10344869 16912792 10420785 7059469 8023622 1671453 -10140979 -10189766 8264824
41324H264824K3184611J3904341O191728M907136J040120q328048j4890180j4975079
$$ 8264824 31449435 45353776 51545504 56452640 57492760 49164712 34274532 19299453
41316A9299453j4968482j7250370j4351312k935807Q003678J0234291P817516
$$ 19299453 4330971 -12919399 -27270711 -30206518 -22202840 -11968549 -4151033
41309d151033P452784O324069k23550o325246l496658L521322K564670n663853
$$ -4151033 3301751 9625820 9402270 3077024 -419634 3101688 5666358 2505
41301B505p662775L73809N095634k232517j0159785m767032P266646Q502376j709933
$$ 2505 -7660270 -7286461 -2190827 -4423344 -14583129 -19350161 -12083515 -3581139 -5291072
41292e291072o881223r68376J810352p825428j5267271l018296J9151626K4094827
$$ -5291072 -12172295 -13140671 -11330319 -19155747 -34423018 -37441314 -18289688 5805139
41284E805139N972723r962414k696625J5230655J6319646l785983k2190830j9827014
$$ 5805139 11777862 1815448 -881177 14349478 30669124 26883141 4692311 -15134703
41276a5134703k503445J0915908J0326083M51830p246206n155527L036482N118522
$$ -15134703 -17638148 -6722240 3603843 4055673 -3190533 -8346060 -5309578 -191056
41268a91056l478360r229431K256795K0335934J8656809m754498j7929008p8305
$$ -191056 -3669416 -12898847 -10642052 9693882 28350691 23596193 5667185 5588880
41260E588880K2839138J2267804k4311276l9875263j4001938J8476068J7960078
$$ 5588880 28428018 40695822 16384546 -23490717 -37492655 -19016587 -1056509
41253a056509o212915j5094234K316276J8696846J3337002R47920M880739J9476464
$$ -1056509 -7269424 -22363658 -20047382 -1350536 11986466 12934386 17815125 37291589
41245C7291589J7915825p260095l0317630k5629716j663659J1940822N084038
$$ 37291589 55207414 47947319 17629689 -8000027 -9663686 2277136 7361174
41238G361174l266776J351479O261606l697568j5309064m393982K2098049K8545768
$$ 7361174 4094398 5445877 11707483 8009915 -7299149 -11693131 10404918 38950686
41230C8950686O06862l1089771l0702067l304359J6172150R617463p346348j1941412
$$ 38950686 39557548 8467777 -22234290 -25538649 -9366499 250964 -7095384 -19036796
41222a9036796j420958R189882O750014o327429j4536717n743966J3084288K1412483
$$ -19036796 -20457754 -11267872 -4517858 -10845287 -25382004 -31125970 -18041682 3370801
41214C370801J0069343o336944q934332J67205K581411r667167k3310278k0855364
$$ 3370801 13440144 7103200 -1831132 -1663927 917484 -8749683 -32059961 -52915325
41206e2915325q20634K1034495K6714007J2350234p554696j4129451m483311O361120
$$ -52915325 -53735959 -32701464 -5987457 6362777 -1191919 -15321370 -19804681 -13443561
41198a3443561O408627J698141L834185J0442233Q993056l576863j5898578j6499680
$$ -13443561 -7034934 -5336793 -1502608 8939625 17932681 14355818 -1542760 -18042440
41190a8042440n462590P742334J2739859O702343j744187j809997L188542j346354
$$ -18042440 -23505030 -15762696 -3022837 3679506 1935319 125322 3313864 1967510
41182A967510j6181668k0379248j854005J8677836J5292166k342631l140404J4403295
$$ 1967510 -14214158 -34593406 -36447411 -17769575 -2477409 -4820040 -7960444 6442851
41174F442851J7291989r175212l4131692k3826371J0812873L0892639K0200913
$$ 6442851 23734840 14559628 -19572064 -43398435 -32585562 -1692923 18507990
41167A8507990k210484j3233703j0067341l770041k472314m324961j690610P784041
$$ 18507990 16297506 3063803 -7003538 -10773579 -13245893 -17570854 -19261464 -11477423
41159a1477423J4112260O050062r448992j1431002N043238J7458996O953120j1925234
$$ -11477423 2634837 8684899 -764093 -12195095 -7151857 10307139 17260259 5335025
41151E335025j1302988P367386J3700929o251655k6761036j6913939J5781960
$$ 5335025 -5967963 1399423 15100352 8848697 -17912339 -34826278 -19044318
41144a9044318L4481077K1886134O01164k503308M814591l811445k6333278k9506182
$$ -19044318 15436759 37322893 37924057 35420749 40235340 36423895 10090617 -19415565
41136a9415565p49439K5269299J3776705j7717003k5421445m720507Q206859k705569
$$ -19415565 -20165004 5104295 18881000 1163997 -24257448 -28977955 -20771096 -23476665
41128b3476665j2352872k929088O997779O54897n727310M346613J4663902O680710
$$ -23476665 -35829537 -38758625 -31760846 -31105949 -36833259 -32486646 -17822744 -11142034
41120a1142034l648297N454619J7981102N376106j9696965j8783254R182660K4391471
$$ -11142034 -14790331 -9335712 8645390 14021496 -5675469 -24458723 -15276063 9115408
41112I115408Q701790j0123383p160457M264353K977654n311898n245458r24479
$$ 9115408 17817198 7693815 533358 4797711 7775365 2463467 -2781991 -3706470
41104c706470n106854j3829701j2195636K317748J7755338K4386507K2613518
$$ -3706470 -8813324 -22643025 -34838661 -32520913 -14765575 9620932 32234450
41097C2234450J6711312P781062o417391k4405237l4114172k1983348N122611
$$ 32234450 48945762 56726824 50309433 25904196 -8209976 -30193324 -25070713
41090b5070713J9865760Q720657p664754n838539M763231K486324n902492O82772
$$ -25070713 -5204953 3515704 -4149050 -9987589 -5224358 -2738034 -8640526 -7957754
41082g957754J3787341O649868j4332323j4332075R650190K0012891J573771j3712018
$$ -7957754 5829587 12479455 -1852868 -16184943 -6534753 13478138 15051909 1339891
41074A339891l780164Q114711Q67880n938715O044788J4270687k901109k0214635
$$ 1339891 -2440273 5674438 6542318 603603 6648391 20919078 18017969 -2196666
41066b196666o035436K0111263J8269786o214826j6851985q749035o654410j1879485
$$ -2196666 -8232102 11879161 30148947 23934121 7082136 -1666899 -8321309 -20200794
41058b0200794l073056J4609481J2193224r305691j5858010K307309J5555156
$$ -20200794 -23273850 -8664369 3528855 -5776836 -21634846 -19327537 -3772381
41051c772381O851344l878055q15226K487490m028637n508899O005799J0556936
$$ -3772381 3078963 -799092 -1614318 873172 -3155465 -8664364 -2658565 7898371
41043G898371o079009k4184818j9050498K066982J3391556N981892p809865j3376548
$$ 7898371 1819362 -22365456 -41415954 -39348972 -25957416 -19975524 -27785389 -41161937
41035d1161937m972472J1470554J9972888J1137793j867142r59080O203811j382692
$$ -41161937 -46134409 -34663855 -14690967 -3553174 -5420316 -6379396 -175585 -1558277
41027a558277j6864792j0700019J7899000L2467789J5186824o288753o678181
$$ -1558277 -18423069 -29123088 -11224088 21243701 36430525 30141772 23463591
41020B3463591o00027o997826j1247003M425302K1384298J2025835j3988658k5874766
$$ 23463591 22863564 15865738 4618735 9044037 30428335 42454170 28465512 2590746
41012B590746j7249535k871806J2982386L0337231L1776799N240067k3089880
$$ 2590746 -14658789 -17530595 -4548209 25789022 57565821 62805888 39716008
41005C9716008j8689435O042202Q066016j7757718l0779049j0437685J3785827
$$ 39716008 21026573 27068775 35134791 17377073 -13401976 -23839661 -10053834
40998a0053834J3036285R89732K863792J3289308J1913048J0370n517902k204709
$$ -10053834 2982451 3972183 6835975 20125283 32038331 32048701 26530799 24326090
40990B4326090j755523o297539o004672J427213O390258M004635J349116L812808
$$ 24326090 22570567 16273028 10268356 11695569 18085827 22090462 23439578 27252386
40982B7252386M642829m424895j7407919j8235696j855605J6602613J9506639
$$ 27252386 31895215 27470320 10062401 -8173295 -10028900 6573713 26080352
40975B6080352P982378l325980q522020j4232972k1456467j9723625m916206J1323654
$$ 26080352 34062730 30736750 22214730 7981758 -13474709 -33198334 -38114540 -26790886
40967b6790886J7505813J4934885P947387l298465j2135751n414197J3592439
$$ -26790886 -9285073 5649812 13597199 10298734 -1837017 -7251214 6341225
40960F341225K0631817M420768j3288481j0523814R85422j181968j0763997o488063
$$ 6341225 26973042 31393810 18105329 7581515 8566937 7384969 -3379028 -9867091
40952i867091P705325R790749J03287j06875J1024264J1810829l254589j2717088
$$ -9867091 -2161766 7628983 7732270 7625395 18649659 30460488 27205899 14488811
40944A4488811n030126M107343J840227k383228k62229j811659j3553534k1500023
$$ 14488811 9458685 13566028 15406255 13023027 12760798 10949139 -2604395 -24104418
40936b4104418j2754219L276179J0698218R347638P310893M695496j819204r057256
$$ -24104418 -36858637 -33582458 -22884240 -13536602 -6225709 -1530213 -3349417 -12406673
40928a2406673j2585019j2187319n765860R452272K4102189K1385928K771293
$$ -12406673 -24991692 -37179011 -42944871 -33492599 -9390410 11995518 14766811
40921A4766811p825194L651121K0350213J8277636j772963j8743079j8140002
$$ 14766811 6941617 10592738 30942951 49220587 47447624 28704545 10564543
40914A0564543l901138Q910635O563985j0476785k4623879k0939092p990485l663920
$$ 10564543 6663405 15574040 22138025 11661240 -12962639 -33901731 -41892216 -45556136
40906d5556136m341462P685572K6739551K5046840p99388j7416370l937855J6871835
$$ -45556136 -49897598 -42212026 -15472475 9574365 8774977 -8641393 -12579248 4292587
40898D292587J6621204J723994p672490j2091797j8349196j5209820M842211J9807197
$$ 4292587 20913791 22637785 14965295 2873498 -15475698 -30685518 -25843307 -6036110
40890f036110Q309567j0840096n287986J7338545K1255952P96398j3331168o234476
$$ -6036110 2273457 -8566639 -13854625 3483920 24739872 25536270 12205102 5970626
40882E970626J709519m783382j1043922k095361J0541318R169783k000171n861796
$$ 5970626 7680145 2896763 -8147159 -10242520 298798 9468581 7468410 1606614
40874A606614K004171J0143513P973157k418085r446337n644608J377943k334187
$$ 1606614 3610785 13754298 21727455 19309370 9863033 4218425 5596368 3262181
40866C262181j4808744j7062195j633809J3996321J4865048J0545350J1900112
$$ 3262181 -11546563 -28608758 -30242567 -16246246 -1381198 9164152 21064264
40859B1064264P160475j2774559k5596501q772182J6173241J1430357j4579765
$$ 21064264 28224739 15450180 -10146321 -18918503 -2745262 8685095 -5894670
40852e894670j8343922O885577J9808493K27191j9264408r644368J0023013J0605408
$$ -5894670 -24238592 -17353015 2455478 2682669 -16581739 -26226107 -16203094 -5597686
40844e597686q23299k587662K684143J452819j261681M589306R520844J203850
$$ -5597686 -6420985 -9008647 -6324504 -4871685 -6133366 -1544060 7976784 9180634
40836I180634j0032390q138117R24080K937800J927278P455151J0065913k748260
$$ 9180634 -851756 -8989873 -8065793 -5127993 -3200715 4254436 14320349 11572089
40828A1572089j8031065j3972882L503134R791167J383175k571117M087012O314003
$$ 11572089 -6458976 -20431858 -16928724 -7137557 -5754382 -8325499 -4238487 2075516
40820B075516k536684r000934l236272O361712Q458963K776063m788404p596564
$$ 2075516 -461168 -9462102 -12698374 -6336662 2122301 4898364 109960 -7486604
40812g486604J038477J8689328K7924763J5264896p492620j8019580j4620237
$$ -7486604 -6448127 12241201 40165964 55430860 47938240 29918660 15298423
40805A5298423j2412827j3560668o655023N538070N810484o096515r473266K527654
$$ 15298423 2885596 -10675072 -17330095 -11792025 -5981541 -12078056 -21551322 -19023668
40797a9023668J1093616N218506p8544O427835J0136406k074738j5005078q629139
$$ -19023668 -7930052 -2711546 -2790090 3637745 13774151 11699413 -3305665 -11934804
40789a1934804R055503J6202059R984200K141449n247223j4756303j5812770P25360
$$ -11934804 -2879301 13322758 23306958 25448407 20201184 5444881 -10367889 -9642529
40781i642529J8286605J3678499m789388q909650K307702J916668j4939604j8334124
$$ -9642529 8644076 22322575 17533187 8623537 10931239 12847907 -2091697 -20425821
40773b0425821N285390K5484123J4715671q131137j1281037j861740p002357k0603182
$$ -20425821 -15140431 10343692 25059363 16928226 5647189 3785449 -3216908 -23820090
40765b3820090j2459845J4950327K3849049K181027j4777819r82879J9066305
$$ -23820090 -36279935 -21329608 2519441 4700468 -10077351 -11060230 8006075
40758H006075J1565714j3320226k1780624r763386n66739o30146N231632J7278131
$$ 8006075 19571789 6251563 -15529061 -25292447 -25859186 -26489332 -21257700 -3979569
40750c979569J6197863O49519m597209R406363J6859585m17656j9262086j1232423
$$ -3979569 12218294 12867813 8270604 17676967 34536552 34118896 14856810 3624387
40742C624387Q463548L187775k3766318k9481227J988250L0639742J7621836j7108088
$$ 3624387 12087935 15275710 -8490608 -37971835 -35983585 -5343843 12277993 -4830095
40734d830095k4063410M478347K7320338J6970819n207029q724550M55405k033557
$$ -4830095 -28893505 -24415158 2905180 19875999 14668970 5944420 6399825 4366268
40726D366268j4549566j3859855K640363J0137682m277188k2100323k2388206
$$ 4366268 -10183298 -24043153 -21402790 -11265108 -15542296 -37642619 -60030825
40719f0030825p705662R690512K5557557L3840061K1797751n781102j8287015
$$ -60030825 -67736487 -58045975 -32488418 1351643 23149394 17368292 -918723
40712i18723O60570K3035259J4793570j1399046j6734949Q60394N531356j5276702
$$ -918723 -258153 22777106 37570676 26171630 9436681 10297075 15828431 551729
40704E51729l0937529j9175439J363403P502886O707055J3632633J9985809J3298293
$$ 551729 -30385800 -49561239 -48197836 -40694950 -33987895 -20355262 -369453 12928840
40696A2928840L457785M632731Q520400N81965j2286767j4839859j0816274j2634373
$$ 12928840 16386625 21019356 29539756 30121721 17834954 2995095 -7821179 -20455552
40688b0455552j5502697p065485O230804P583534j550136m769908J957307P940228
$$ -20455552 -35958249 -43023734 -36792930 -29209396 -30759532 -35529440 -33572133 -25631905
40680b5631905Q562114Q259115O901049J935298j038642K499497L733159m357141
$$ -25631905 -17069791 -8810676 -1909627 25671 -1012971 1486526 5219685 862544
40672H62544j0069342k076303O995482J139450q005398j000578J0746665K749018
$$ 862544 -9206798 -11283101 -4287619 -3148169 -11153567 -12154145 -1407480 1341538
40664A341538j4822535r866040J3148933J4309932j4841147l2970931j4381668
$$ 1341538 -13480997 -23347037 -10198104 4111828 -10729319 -43700250 -58081918
40657e8081918J1423797J0403564m373347k327262J4479850K3803236K2135512
$$ -58081918 -46658121 -36254557 -40627904 -42955166 -28475316 -4672080 17463432
40650A7463432J9097943J1840644m143946j4103385l598743J3310265J2861539
$$ 17463432 36561375 48402019 44258073 30154688 26555945 39866210 52727749
40643E2727749k601761j3541763j6377966k0594474k2679069j1263274Q001156
$$ 52727749 50125988 36584225 20206259 -388215 -23067284 -34330558 -26329402
40636b6329402J8814234J9858633J9561833J2823191r269219l1805021k8369158
$$ -26329402 -7515168 12343465 31905298 44728489 35459270 3654249 -24714909
40629b4714909j113082J9228997J5436292J27112j1965376k0806584k4758818
$$ -24714909 -25827991 -6598994 8837298 8964410 -3000966 -23807550 -48566368
40622d8566368j4331824P350289J9941111J3305628J832898J232525P226172P438325
$$ -48566368 -62898192 -55547903 -35606792 -22301164 -20468266 -19235741 -12009569 -4571244
40614d571244M09561p051883j0300715p281861J476737Q787370P107519R82100
$$ -4571244 -4161683 -11213566 -21514281 -28796142 -27319405 -18532035 -11424516 -10442416
40606a0442416J195165O362225N539650q03308j330852K757227k851109j6752430
$$ -10442416 -9247251 -2885026 2654624 1851316 520464 3277691 426582 -16325848
40598a6325848j6562598N384615K3440403J3154472j3299659k5715624j6361891
$$ -16325848 -32888446 -27503831 -4063428 9091044 -4208615 -29924239 -46286130
40591d6286130j437630Q073351J5010323J9511274J4744664J621017p611150n431450
$$ -46286130 -47723760 -39650409 -24640086 -5128812 9615852 11236869 3625719 -1805731
40583a805731J129216J348281m784394p637211j215095Q229725R201287L87951
$$ -1805731 -676515 671766 -4112628 -11749839 -12964934 -4735209 4466078 4854029
40575D854029n993303l33663J0673129J4020523Q227980O99273o533096j3985031
$$ 4854029 -1139274 -1472937 9200192 23220715 31448695 32147968 25614872 11629841
40567A1629841j3234870K498096J8692907J2939504j0184938k1483336r705495
$$ 11629841 -1605029 893067 19585974 32525478 22340540 857204 -8848291
40560h848291L318409m34360q727057m209228P202031J1231276Q861742O409445
$$ -8848291 -5529882 -5964242 -14691299 -18900527 -11698496 -467220 8394522 14803967
40552A4803967K6491j1054902j3602782k440253M675322m436387j1952808J002950
$$ 14803967 14830458 3775556 -9827226 -12267479 -7592157 -12028544 -23981352 -22978402
40544b2978402J9408284J7476690J054480n141697R9982o90700o198968o13041
$$ -22978402 -3570118 13906572 14961052 9819355 9919337 9228637 3029669 2416628
40536B416628J0265244N654685q813524n674283J5278594K2188072L578354j3206148
$$ 2416628 12681872 18336557 9523033 3848750 19127344 41315416 44893770 31687622
40528C1687622q842294l5648l203436n188779O917732J6751249N638000j4713017
$$ 31687622 22845328 22809680 19606244 14417465 21335197 38086446 43724446 29011429
40520B9011429k1811331j5808645j0228961o500872P0066M532871L421764O470324
$$ 29011429 7200098 -8608547 -18837508 -25338380 -25268314 -20735443 -17313679 -10843355
40512a0843355J7312769J8968744J97310j9925935j7675017n78080P232652K632152
$$ -10843355 6469414 25438158 25635468 5709533 -11965484 -12543564 -5310912 -2678760
40504b678760K4779J066599l986329j1441364q044339L808335R308382O456050
$$ -2678760 -2653981 -1587382 -5573711 -17015075 -25059414 -21251079 -11942697 -5486647
40496e486647M921346L984646m207975j3202868r475125J531764K828142k680662
$$ -5486647 -565301 3419345 -788630 -13991498 -23466623 -21934859 -19106717 -21787379
40488b1787379L118123J7076387J4822902o613877j8154630l205593J5956132
$$ -21787379 -18669256 -1592869 13230033 6616156 -11538474 -14744067 1212065
40481A212065J3588178k232464q377810l282119j624351n166522k246016Q727009
$$ 1212065 14800243 12567779 4189969 907850 -716501 -5883023 -8129039 597970
40473E97970J4702859P145842p181291j5952740j4287640p544518m561173p014623
$$ 597970 15300829 22446671 15265380 -687360 -14975000 -22519518 -27080691 -34095314
40465c4095314n975092O165990K2297203K7520572J7964797K547084j1472023
$$ -34095314 -40070406 -33904416 -11607213 15913359 33878156 36425240 24953217
40458B4953217k1026276j7965010L577838K8497333L0295677O080466j7473215
$$ 24953217 3926941 -14038069 -10460231 18037102 48332779 54413245 36940030
40451C6940030k0814416j3140557p338379K256026J9261731K5023722M711551
$$ 36940030 16125614 2985057 -4353322 -2097296 17164435 42188157 46899708
40444D6899708k1358073k0751787M235151K0010534R790088p591383j0215465
$$ 46899708 25541635 4789848 9024999 29035533 38825621 31234238 21018773
40437B1018773j564370K103203l620071r770341q247180j88299N615439P35053
$$ 21018773 19454403 21557606 17937535 8167194 -79986 -268285 5347154 6082207
40429F082207j2244649j8962700r547399P422998J5389198J0986937M983462M625245
$$ 6082207 -6162442 -25125142 -34672541 -27249543 -11860345 -873408 4110054 8735299
40421H735299O252066N106431J775341k455643p729584j1539815r840199l426380
$$ 8735299 14987365 20093796 21869137 19413494 11683910 144095 -9696104 -13122484
40413a3122484K398263M354015K953625J48997l64520M948905J2216574J1636865
$$ -13122484 -10724221 -6370206 -3416581 -3267584 -3632104 1316801 13533375 25170240
40405B5170240K537194k536056K162252L621006p540475j5513301j760466J9765752
$$ 25170240 27707434 25171378 27333630 30954636 23414161 7900860 6140394 25906146
40397B5906146J7138436j1169179l0927365k0764211R81937R052307N682231N345688
$$ 25906146 43044582 31875403 948038 -19816173 -18834236 -9781929 -4099698 1245990
40389A245990O135416j625788j1819683j0466505m27618K549163l938408n121986
$$ 1245990 7381406 5755618 -6064065 -16530570 -16958188 -14409025 -18347433 -23469419
40381b3469419P059678K1364257K3023635J2003157Q11992j09014Q021308J3887282
$$ -23469419 -16409741 4954516 27978151 39981308 40793300 40684286 48705594 62592876
40373F2592876O657363j2173856k8257544k8208093j2668093N758696J4672448
$$ 62592876 69250239 57076383 28818839 610746 -12057347 -6298651 8373797
40366H373797J0863427J667573j107367O146670J1537611J149904j8615547k4329277
$$ 8373797 19237224 20904797 19797430 25944100 37481711 38631615 20016068 -4313209
40358d313209p649113R045677K191219j7698016j8686261P379360L1866347K7157496
$$ -4313209 -11962322 -2916645 -725426 -18423442 -37109703 -29730343 2136004 29293500
40350B9293500J785832j3588403n957454Q566893J1146592L568065j398273k592657
$$ 29293500 31079332 17490929 11533475 20100368 31246960 34815025 33416752 30824095
40342C0824095r684133k1715674k2458939m700067J3696028J1501287o081480
$$ 30824095 21139962 -575712 -23034651 -27734718 -14038690 -2537403 -8618883
40335h618883j5380720p528999M368596R974986J2932533J4249145O697600n804010
$$ -8618883 -23999603 -31528602 -27160006 -17185020 -4252487 9996658 16694258 10890248
40327A0890248n320982J0167179J5145758o199184k9732766k2842356P170873
$$ 10890248 5569266 15736445 30882203 24683019 -5049747 -27892103 -20721230
40320b0721230K3941091J4076208o12740j865749K640206J317010j791440K94271
$$ -20721230 3219861 17296069 16683329 14817580 17457786 18774796 16983356 17277627
40312A7277627M051871M801123M684450L656101l077939j2193754j2460839m630281
$$ 17277627 21329498 26130621 30815071 34471172 31393233 19199479 6738640 2108359
40304B108359l765163j2816403j2954393O108230K4375490J9027131p29382q701336
$$ 2108359 -1656804 -14473207 -27427600 -21319370 3056120 22083251 21353869 12652533
40296A2652533k147624j921464j4750637k1364791q764577P234532N103477j0297150
$$ 12652533 10504909 8583445 -6167192 -27531983 -36296560 -29062028 -23958551 -34255701
40288c4255701j4555905K501894K4328452L0476564K0750501R969323N471543
$$ -34255701 -48811606 -46309712 -21981260 8495304 29245805 39215128 44686671
40281D4686671Q78144p737665j2016248n555285J648674l667698j5564977j5790711
$$ 44686671 45564815 37827150 25810902 20255617 21904291 18236593 2671616 -13119095
40273a3119095k396412O552714J626419m509460p74267L992147R4784k706361
$$ -13119095 -15515507 -8962793 -7336374 -11845834 -12620101 -8627954 -8533170 -11239531
40265a1239531P159469J8321245J1876298o533324j3932855n700691M55391l177579
$$ -11239531 -4080062 14241183 26117481 19584157 5651302 -49389 406002 -2771577
40257b771577l194146P367804J3929884M939682p540199p039433J688822K776247
$$ -2771577 -5965723 1402081 15331965 20271647 12731448 5692015 7380837 10157084
40249A0157084m494358o278333L285042J4526712J6475487Q071031m646138j4469612
$$ 10157084 5662726 -615607 2669435 17196147 33671634 41742665 37096527 22626915
40241B2626915j6432533j1631625p142762p540958q466504l154873P252165J4840807
$$ 22626915 6194382 -5437243 -12580005 -20120963 -28587467 -31742340 -24490175 -9649368
40233i649368J4234159O793218j624521l536866N153647J8081146K0849986O982687
$$ -9649368 4584791 11378009 9753488 6216622 11370269 29451415 50301401 57284088
40225E7284088j1887599j8547434j0532605r81474n79854n961413p043699k78662
$$ 57284088 45396489 26849055 16316450 15334976 14755122 8793709 1750010 1471348
40217A471348Q059067R875712N140089K560449Q035476J4192880Q097541r877699
$$ 1471348 9530415 19406127 24546216 27106665 35142141 49335021 57432562 47554863
40209D7554863k3656828k1664446j0252260j178728M146219Q839134R038812J523236
$$ 47554863 23898035 2233589 -8018671 -9197399 -5051180 3787954 12826766 14350002
40201A4350002m325592K349750J4616879J5474796L193485p253351p945466n714937
$$ 14350002 10024410 12374160 26991039 42465835 45659320 38405969 30460503 24745566
40193B4745566l965437L750758J5164572J3717700o024432k3669434j9750608
$$ 24745566 20780129 24530887 39695459 53413159 47388727 23719293 3968685
40186C968685m514208j212363r659617q820780O448369J4763870J215559j7935916
$$ 3968685 -545523 -1757886 -11417503 -20238283 -13789914 973956 2189515 -15746401
40178a5746401j6939891M034411K0009905J4059459l930767j2916453n569650
$$ -15746401 -32686292 -28651881 -8641976 5417483 1486716 -11429737 -16999387
40171a6999387P159147J0971087K480655r360683j2112447j162468J4754708K0936576
$$ -16999387 -9840240 1130847 3611502 -5749181 -17861628 -19024096 -4269388 16667188
40163A6667188J3113098L734532N715800J2799563P364671j1142512k0652278
$$ 16667188 29780286 33514818 39230618 52030181 59394852 48252340 27600062
40156B7600062p743713J0146512R240211n179002r229400k53168J99179j4327102
$$ 27600062 19856349 30002861 39243072 34064070 24834670 24581502 24780681 10453579
40148A0453579k0673471l293028J7764913J5818156k326755q429633M423530J4813962
$$ 10453579 -10219892 -13512920 4251993 20070149 17743394 9313761 13737291 28551253
40140B8551253O661254j0641850j8638282j1233368M077940J5703552J6075147
$$ 28551253 35212507 24570657 5932375 -5300993 -1223053 14480499 30555646
40133C0555646P786098J419100J470020m99204j0320701j7025695q111833P554640
$$ 30555646 38341744 39760844 41230864 40731660 30410959 13385264 5273431 12828071
40125A2828071R833531k529522j0539237m045097O119341P606064J086097p684298
$$ 12828071 22661602 20132080 9592843 5547746 11667087 19273151 20359248 12674950
40117A2674950j3812270r146517R467743K5427765J7280647o963108j4771152
$$ 12674950 -1137320 -10283837 -816094 24611671 41892318 34929210 20158058
40110B0158058L200345J7377361N852180j1241002o791324Q576884P064287r020736
$$ 20158058 23358403 40735764 46587944 35346942 28555618 37132502 44196789 35176053
40102C5176053j4714764o498304l447202q293006l110656J3098794J6603428j726617
$$ 35176053 20461289 13962985 10515783 2222777 -887879 12210915 28814343 27087726
40094B7087726j9036175j5786050k963667J319366j9472M001482R874761R100819
$$ 27087726 8051551 -7734499 -10698166 -9378800 -9398272 -5396790 4477971 13578790
40086A3578790O040748P901386Q389398j052224j3422100j6398946j1514522o714730
$$ 13578790 19619538 27520924 35910322 34858098 21435998 5037052 -6477470 -13192200
40078a3192200O32942J4475168K2381311R698074j2573634j7938491l572035M355764
$$ -13192200 -12559258 1915910 24297221 33995295 21421661 3483170 -88865 4266899
40070D266899q898754k3079268j3144617J3284298K6325071J4038732m620988
$$ 4266899 -4631855 -27711123 -40855740 -27571442 -1246371 12792361 8171373
40063H171373p055206N439245J2890094L701570j0996026j2690567q88386N797565
$$ 8171373 1116167 6555412 19445506 23147076 12151050 -539517 -1427903 4369662
40055D369662l121013j2280357j224045K3447470L2785269J3161977j6001156
$$ 4369662 1248649 -11031708 -12255753 11191717 43976986 57138963 41137807
40048D1137807k7453051j6188687K930014J5804085J7136426P082205p511658
$$ 41137807 13684756 -2503931 426083 16230168 33366594 40448799 32937141
40041C2937141j3205340l168186J1332274J2597646q81246j2542451r017468N266690
$$ 32937141 19731801 16563615 27895889 40493535 39612289 27069838 18052370 23319060
40033B3319060J6749420J8140031J1049665n74372j2956424k0341338j7012964
$$ 23319060 40068480 58208511 69258176 68683804 55727380 35386042 18373078
40026A8373078m345607P349324Q506000J606008k040779J674106L352026m864852
$$ 18373078 14027471 21376795 29882795 31488803 29448024 31122130 34474156 29609304
40018B9609304j4584251j1816233J149945P687345J149212o819887o133961j848450
$$ 29609304 15025053 3208820 4358765 12046110 13195322 6375435 241474 -1606976
40010a606976m91659K645591J0853409J3402932J259980j3664578j2697513J123862
$$ -1606976 -2098635 546956 11400365 24803297 26063277 12398699 -298814 825048
40002H25048O862235l254752j3872694r772083N627449J8488047J9293283O945709
$$ 825048 7687283 4432531 -9440163 -19212246 -13584797 4903250 24196533 31142242
39994C1142242j0468949j7347661m753363J5396246K1857500J0227658n115070
$$ 31142242 20673293 3325632 -1427731 13968515 35826015 46053673 40938603
39987D0938603j3927855j7886669j5333746j39885J8607371J8973392o62308j2970027
$$ 40938603 27010748 9124079 -6209667 -6349552 12257819 31231211 30568903 17598876
39979A7598876j282081J3708315O958476j0838150j2078328L442668J2602554
$$ 17598876 16316795 30025110 36983586 26145436 14067108 17509776 30112330
39972C0112330Q740673O230003Q028047M28506j6002771k0291400m997931J0295205
$$ 30112330 38853003 45083006 53111053 53539559 37536788 17245388 12247457 22542662
39964B2542662J0985801P558359R108699K655604j9173131l2077010j1389582
$$ 22542662 33528463 41086822 50195521 52851125 33677994 1600984 -9788598
39957i788598K4052422L2287116Q192068j0344061o28183J3606191M640355j4034329
$$ -9788598 14263824 46550940 54743008 44398947 43770764 57376955 62017310 47982981
39949D7982981j1555242Q802964J4496673m093058j8674026p924556J0733427
$$ 47982981 36427739 45230703 59727376 55634318 36960292 29035736 39769163
39942C9769163J0991065k632752q271130m916187q582750j6878246r364256J2909552
$$ 39769163 50760228 48127476 39856346 34940159 26357409 9479163 114907 13024459
39934A3024459J9628256l077384k5743804j5897284J4136866K5399837O851320
$$ 13024459 32652715 29575331 3831527 -12065757 2071109 27470946 34322266
39927C4322266j4673482j5096114L90968J3065070J3570725N001686l154142j602576
$$ 34322266 19648784 4552670 4943638 18008708 31579433 36581119 33426977 31824401
39919C1824401Q401207J3285089N349327m287028l972273k159799j0285735j6153461
$$ 31824401 40225608 53510697 58860024 54572996 50600723 48440924 38155189 22001728
39911B2001728k018814J7919794J2550942j3489384k0603743L280700K0743800
$$ 22001728 19982914 37902708 50453650 36964266 16360523 19641223 40385023
39904D0385023M590946j7811756r144256J9365161K9825866J6250039K662897
$$ 40385023 44975969 27164213 18019957 37385118 67210984 83461023 86123920
39897H6123920l041948j2864394k2423172j1677212J4745500K4665216N894089
$$ 86123920 83081972 70217578 47794406 36117194 50862694 75527910 81421999
39890H1421999j4317730j0946571M274476O936901l166322r386297p260311m905185
$$ 81421999 67104269 56157698 60432174 67369075 64202753 54816456 47556145 42650960
39882D2650960k508637Q097285K4087767K8504030J2012861j1543630j8798927
$$ 42650960 40142323 48239608 72327375 100831405 112844266 101300636 82501709
39875H2501709l604528J5955954J9069513N649963p666205j1327325j1377452
$$ 82501709 78897181 94853135 113922648 119572611 111906406 100579081 89201629
39868H9201629j3048978j0140170J402288J1798075J0702277K417952l528437
$$ 89201629 76152651 66012481 67414769 79212844 89915121 92333073 88804636
39861H8804636o956543j0078315p963739q63678k363076j5776221j7209153J0991661
$$ 88804636 81848093 71769778 63806039 62942361 60579285 44803064 27593911 38585572
39853C8585572M2135880L4928991m083927k6500003j2750833M477306j358887
$$ 38585572 80721452 115650443 111566516 85066513 72315680 76792986 75434099
39846G5434099j0937226j76811J6148742J3252195J94590k92887N233000m433118
$$ 75434099 64496873 64320062 80468804 93720999 93915589 93622702 98855702 94422584
39838I4422584k1326718j7606844O855117K2216501J4475869J210225k368629
$$ 94422584 73095866 55489022 62344139 84560640 99036509 100246734 97878105
39831I7878105l149470q192170r642401k675147K902083M13227j949637K410777
$$ 97878105 94728635 86536465 76894064 74218917 77121000 77534227 75584590 77995367
39823G7995367O144461K359741k695648j426928K894663M744365N741754P496582
$$ 77995367 84139828 86499569 83803921 82376993 85271656 90016021 95757775 103254357
39815A03254357O660640M389752P944863J5122211J1760084m861811j5581041
$$ 103254357 109914997 114304749 122249612 137371823 149131907 144270096 128689055
39808A28689055o713507O265767J120365j5611114j7815616j81757J3803732P056645
$$ 128689055 121975548 128241315 129361680 113750566 95934950 95753193 109556925 116613570
39800A16613570q100304j0395817J654573J2064384R669739j565838j0167523
$$ 116613570 108513266 98117449 99772022 111836406 121506145 119940307 109772784
39793A09772784q172760L020123J3738087J5266770R794243P175533J0369149
$$ 109772784 101600024 104620147 118358234 133625004 143419247 150594780 160963929
39786A60963929J0333308n01019j5399482k0589224j2567147j430651K631313
$$ 160963929 171297237 170796218 155396736 134807512 122240365 120809714 123441027
39779A23441027J02211k078415l98874L172648O300008Q993539J1244522J1629498
$$ 123441027 123543238 121464823 121065949 124238597 130538605 139532144 150776666 162406164
39771A62406164R727125P116304M034686j784320r559496j2313641n586543K791520
$$ 162406164 172133289 179249593 183284279 181499959 171940463 159626822 154040279 156831799
39763A56831799M99112j1043037j6627320r144243K37616J650460L773941J7081912
$$ 156831799 157330911 146287874 129660554 120516311 120753927 122404387 126178328 143260240
39755A43260240K9393711J8759792j1348793l1402515k4552556n835773M986769
$$ 143260240 172653951 191413743 180064950 148662435 124109879 118274106 123260875
39748A23260875R031818J3370350J0333898p060877k2567789j4991513O706390
$$ 123260875 132292693 145663043 155996941 148936064 126368275 111376762 118083152
39741A18083152J2026614o875442k3595061j5627808P193571K1687783K0697660
$$ 118083152 130109766 123234324 99639263 84011455 91205026 112892809 133590469
39734A33590469J1745295R87653q088504j0342263n876516l696545q445940j1491089
$$ 133590469 145335764 146323417 138234913 127892650 122016134 118319589 109873649 98382560
39726I8382560m807388N207399Q668075Q021412J0327899J1829666M948329m995632
$$ 98382560 93575172 98782571 107450646 115472058 125799957 137629623 142577952 137582320
39718A37582320n618373K844389Q250491N303313j34825l957448o888531n667944
$$ 137582320 131963947 134808336 143058827 148362140 148227315 144269867 137381336 131713392
39710A31713392L507496J2173022O511756r881905j6513068m985686Q227065O578161
$$ 131713392 135220888 147393910 153905666 144023761 127510693 122525007 130752072 137330233
39702A37330233l214456m239069N089292J1800673Q228135r10874p783047q155405
$$ 137330233 134115777 129876708 134966000 146766673 154994808 154083934 146300887 138145482
39694A38145482j560930P179595R242908J858347n691733l204059O063357R685803
$$ 138145482 136584552 143764147 153007055 154865402 149173669 145969610 152032967 161718770
39686A61718770K918695o302974q560533k264693Q113504J6483153J7152741Q908800
$$ 161718770 164637465 158334491 149773958 147509265 155622769 172105922 189258663 198167463
39678A98167463j009391k781738L416339O430955L22381m075698P169193K7388589
$$ 198167463 197158072 194376334 197792673 204223628 204546009 200470311 207639504 235028093
39670B35028093L1518047Q202822k0514208k4011966k029881J7290763J7303195
$$ 235028093 266546140 274748962 254234754 230222788 228192907 245483670 262786865
39663B62786865J0811986J2000244J2427887J283052q779924k30526J6190809
$$ 262786865 273598851 285599095 298026982 299310034 290530110 290299584 306490393
39656C06490393J4962541j998553o765036Q466945J7755376M255633j2704767
$$ 306490393 321452934 319454381 312689345 321156290 338911666 343167299 330462532
39649C30462532j1029850q81603k756638j0741751o141453N313438J271591j6916268
$$ 330462532 319432682 318551079 315794441 305052690 298911237 304224675 305496266 288579998
39641B88579998k2839686p349811O232248n23369j2835846q263868P155680R449492
$$ 288579998 265740312 258390501 264622749 264099380 251263534 242999666 250155346 259604838
39633B59604838n305093j5490207p053766O818187P235203k715519n207533L906280
$$ 259604838 254299745 238809538 231755772 238573959 245809162 243093643 237886110 241792390
39625B41792390R836302L157602n892714n043432N02368j648313r774828j1429909
$$ 241792390 251628692 254786294 248893580 243850148 244352516 242704203 232929375 221499466
39617B21499466l375246O209607J2019615J3454186O096799j0932458k1960918
$$ 221499466 218124220 224333827 236353442 249807628 255904427 244971969 223011051
39610B23011051j0474716J2060067J7070145J605377p006886L322128R857723
$$ 223011051 212536335 224596402 241666547 243271924 236265038 239587166 249444889
39603B49444889m033271j9104120j4349705l278126o908596j3947869k325045
$$ 249444889 245411618 226307498 211957793 208679667 201771071 187823202 185498157
39596A85498157J7454485J8523277N279936M789959J6994938J5410821k460707
$$ 185498157 202952642 221475919 226755855 231545814 248540752 263951573 261490866
39589B61490866q277408O210512J3056338k378761j4470399j371064J7496716
$$ 261490866 253213458 259423970 272480308 270101547 255631148 254260084 271756800
39582B71756800J4753866r48142m000375M957825N739367m440909j0627569r611317
$$ 271756800 286510666 285562524 281562149 286519974 292259341 287818432 277190863 267579546
39574B67579546j1868872j6531605j0292183O356680J4329031L757380j1285503
$$ 267579546 255710674 239179069 228886886 235243566 249572597 253329977 242044474
39567B42044474j4284570q435671o709708r537509n691694P038958J4775323O444132
$$ 242044474 227759904 219324233 212614525 203077016 197385322 204424280 219199603 225643735
39559B25643735q232431r816415L696962J3070433N072165q992601j1204535k131083
$$ 225643735 217411304 207594889 211291851 224362284 229434449 220441848 209237313 207106230
39551B07106230N512465Q589582J1322352Q560917p108705k4278573k2246340
$$ 207106230 212618695 221208277 232530629 241091546 233982841 209704268 187457928
39544A87457928l496162O830505j004202p816809Q30814J1089263N277971r984181
$$ 187457928 183961766 190792271 189788069 181971260 182802074 193891337 199169308 189185127
39536A89185127j6976313j2838227n877611J346377R501819J3686266J1299911
$$ 189185127 172208814 159370587 153492976 154839353 164341172 178027438 189327349
39529A89327349R017144J0119538O492961m754931j0267261n53922J1980491J1585055
$$ 189327349 198344493 208464031 214956992 210202061 199934800 199380878 211361369 222946424
39521B22946424L902521M339794J1911533J3689371P821440L434525K649488k37265
$$ 222946424 226848945 231188739 243100272 256789643 264611083 268045608 270695096 270457831
39513B70457831n034391n404991R40661J2210543K5825565L2608816J9985775
$$ 270457831 265423440 260018449 260959110 273169653 298995218 331604034 351589809
39506C51589809o322969j8507009j734635K1547098K2970525R363838P047692
$$ 351589809 345266840 326759831 325025196 346572294 369542819 378906657 385954349
39499C85954349J7267901J7959610M176430m779066J031839J0046802J3499681
$$ 385954349 403222250 421181860 425358290 420579224 421611063 431657865 445157546
39492D45157546J5604734J5952789P492928l062475J434392J7663317J9330828
$$ 445157546 460762280 476715069 484207997 481145522 482579914 500243231 519574059
39485E19574059m263957k9892357l2857543j8240580o801917o275226r944319
$$ 519574059 515310102 485417745 452560202 434319622 427517705 421242479 411298160
39478D11298160j1241890q599677m941730q154003k1611826l2532803k4915322
$$ 411298160 400056270 391456593 386514863 378360860 356749034 324216231 299300909
39471B99300909n980127o63587j5120890k6638604j8202557k454446N50144q712671
$$ 299300909 293320782 292657195 277536305 250897701 232695144 230240698 230790842 222078171
39463B22078171j6641990j6618328r547291J822644Q662610O87961j5246090j7458907
$$ 222078171 205436181 188817853 179270562 181093206 189755816 190443777 175197687 157738780
39455A57738780j012469J0983502Q91923j6986174k0305186j2298812j1189877
$$ 157738780 156726311 167709813 168601736 151615562 131310376 119011564 107821687
39448A07821687j8434056j8964691o339927J0379067K0341911J7932180K461401
$$ 107821687 89387631 70422940 64083013 74462080 94803991 112736171 115197572
39441A15197572j6648058k1880383p298761J1100072J5566495Q052444Q53779
$$ 115197572 98549514 76669131 69370370 80470442 96036937 104089381 104943160
39434A04943160k732818n516312n376513j130033M88300l686599n766665k182518
$$ 104943160 102210342 96694030 91317517 90187484 90675784 86989185 81222520 79040002
39426G9040002k183772q552609q001756L266480N654063j0696400k1353960m714282
$$ 79040002 76856230 68303621 60301865 63568345 69222408 58526008 37172048 32457766
39418C2457766J7410552J1980739r695305j0710283Q334138J2596881l536370
$$ 32457766 49868318 61849057 52153752 41443469 49777607 62374488 58838118
39411E8838118p410650J0023619J4714121r448616k7577491j0182182J7574145
$$ 58838118 51427468 61451087 76165208 66716592 39139101 28956919 46531064
39404D6531064J7789289j176086o408508L024303K963806p310438n409004J0552371
$$ 46531064 64320353 63144267 56735759 59760062 62723868 55413430 50004426 60556797
39396F0556797J7029136N515944n319191l830009k667286j2307368k1532677j6817501
$$ 60556797 77585933 83101877 77782686 73952677 71285391 58978023 37445346 20627845
39388B0627845l323125N687339P505526P606623Q163294P289971L152936n584817
$$ 20627845 17304720 22992059 30497585 38104208 46267502 53557473 56710409 51125592
39380E1125592j6811401k1547157j2960245P75138M605023j214040j250119R836544
$$ 51125592 34314191 12767034 -193211 581927 5186950 3972910 2722791 12559335
39372A2559335J8606409J5782588J0372748J0134684N210965j2593898k8548052
$$ 12559335 31165744 46948332 57321080 67455764 72666729 60072831 31524779
39365C1524779k3462854l887530Q229058R747811J5448872K4940833J8758395
$$ 31524779 8061925 4174395 12403453 22151264 37600136 62540969 81299364
39358H1299364n946825k2887514j3974980L348222M533458n144180m807573M920000
$$ 81299364 75352539 52465025 38490045 41838267 46371725 41227545 36419972 41339972
39350D1339972N612061n039129r943463k887234K545374j938800p047203m415802
$$ 41339972 46952033 41912904 31969441 29082207 31627581 29688781 22641578 18225776
39342A8225776J874956Q147017J6474776K0932931R039713j3981580k3168198
$$ 18225776 20100732 28247749 44722525 65655456 74695169 60713589 37545391
39335C7545391q190339J0249821J2421898O871646P373766M090422j6160796l6951895
$$ 37545391 29355052 39604873 52026771 58898417 66272183 70362605 54201809 17249914
39327A7249914l0449309p75596K0570788J9454136J0898022O934211J983594n531073
$$ 17249914 -13199395 -13974991 6595797 26049933 36947955 43882166 45865760 40334687
39319D0334687n101164L608878N206549m097704o502647P240415J8880931R797367
$$ 40334687 35233523 38842401 44048950 39951246 33448599 40689014 59569945 69367312
39311F9367312j0328752j9168517j2509681k493231L956957Q176635R086972M773002
$$ 69367312 59038560 39870043 27360362 24867131 28824088 37000723 46087695 50860697
39303E0860697n79699l160952o631432j2456975j2006911m86792J0423034Q229155
$$ 50860697 50280998 47120046 40488614 28031639 16024728 15537936 25960970 34190125
39295C4190125k39920l57920N763868M782182k246616n30134J1510537J6310058
$$ 34190125 33950205 33592285 39356153 44138335 41891719 41361585 52872122 69182180
39287F9182180M095225j1088609j1036241L374187J7183154J9563302R055327
$$ 69182180 73277405 62188796 51152555 54526742 71709896 91273198 100328525
39280A00328525r776295k5428488k3300466k171274J7356215J2711493j2465220
$$ 100328525 90552230 65123742 41823276 39652002 57008217 69719710 57254490
39273E7254490k9914169j9193513Q735699K4703289J3934072r413572j9651015
$$ 57254490 27340321 8146808 16882507 41585796 55519868 46106296 26455281
39266B6455281p928793R415591J1465483j382420q468866K231726J5146243P570337
$$ 26455281 18526488 27942079 39407562 38025142 29556276 31788002 46934245 54504582
39258E4504582j5467096k3780887m282414J7030748J0326685j3683763j7747413
$$ 54504582 39037486 15256599 10974185 28004933 38331618 24647855 6900442
39251F900442O993356K6473633J1986396k0205908l3664324j9532396N03660Q833880
$$ 6900442 13893798 40367431 52353827 32147919 -1516405 -21048801 -20545141 -11711261
39243a1711261Q029905N864486M011399L442782O192973R300364P969342M530570
$$ -11711261 -3681356 2183130 6194529 9637311 15830284 25130648 33099990 37630560
39235C7630560L633803J463058o994282j3439713o093311P186478N571289j1622763
$$ 37630560 41264363 42727421 35733139 22293426 16200115 23386593 28957882 17335119
39227A7335119j8898646l47115K5809632L0231285P704111k1528594l6020824
$$ 17335119 -1563527 -1910642 23898990 54130275 61834386 40305792 4284968
39220D284968k9201494r403577P598249J1606033P786686P188001Q514732K311341
$$ 4284968 -24916526 -34320103 -26721854 -15115821 -7329135 -141134 8373598 10684939
39212A0684939p078137l169167J3650969K0007162L911740j4411780j1934946
$$ 10684939 3606802 437635 14088604 34095766 38007506 23595726 11660780
39205A1660780L735048R172672L15057p534062n946298L33070P702202J5755001
$$ 11660780 15395828 24568500 24883557 17349495 11403197 11736267 19438469 35193470
39197C5193470J8097389P538461j0642241k3104665k3775367j5098465k67225
$$ 35193470 53290859 60829320 50187079 27082414 3307047 -11791418 -12058643
39190a2058643J4643761J8685007R368172K73161J747541L503992p154069k0045856
$$ -12058643 2585118 21270125 30638297 30911458 32658999 36162991 29008922 8963066
39182H963066j6395745j226895K946233p495786j2097770j3859J4414761J6057274
$$ 8963066 -7432679 -8659574 -5713341 -13209127 -25306897 -25320756 -10905995 5151279
39174E151279Q856376L079353m71561m586287p325755p387707p138033n574982
$$ 5151279 14007655 17087008 16615447 12029160 4703405 -2684302 -9822335 -15397317
39166a5397317N83853O087750J080383j0678601j2899074j685571O655193J231241
$$ -15397317 -14813464 -8725714 -7645331 -18323932 -31223006 -32908577 -26253384 -25022143
39158b5022143n624449J450277J5415530J6989388L343186q333326m593837Q330483
$$ -25022143 -30646592 -29196315 -13780785 3208603 6551789 -1781537 -6375374 1955109
39150A955109J4171925N566221r023666j5012085p317193M370092P158344l56705
$$ 1955109 16127034 21693255 12669589 -2342496 -9659689 -5289597 1868747 1512042
39142A512042q346201q170066J25877R854708J1789363M02538j6583730j9959464
$$ 1512042 -6834159 -15004225 -14878348 -5023640 6765723 7168261 -9415469 -29374933
39134b9374933j020776K2082381K3256721K250515j5033211j1083016L746214
$$ -29374933 -30395709 -8313328 14943393 17193908 2160697 -8922319 -5176105
39127e176105J0792598P202677J736450k082295p121621j2315117j1085456R9602
$$ -5176105 5616493 12819170 14555620 12473325 5351704 -6963413 -18048869 -17949267
39119a7949267J5883023K4756273J7843938k118171k1009537k5842572j6077807
$$ -17949267 -2066244 22690029 40533967 38415796 17406259 -8436313 -24514120
39112b4514120k62802J3953941K1642904J8499142N294915r030245j5733041j3981820
$$ -24514120 -24776922 -10822981 10819923 29319065 34613980 25583735 9850694 -4131126
39104d131126n842171P559899J8300823J3150345n656757j5465815m810949N859138
$$ -4131126 -9973297 -2413398 15887425 29037770 23381013 7915198 3104249 8963387
39096H963387l361241j5448689l326960J9701293J6327386j1194990j8778927
$$ 8963387 5602146 -9846543 -13173503 6527790 22855176 11660186 -7118741
39089g118741Q743148K8792815N703882l2278755l3006387N798124L6712322K6357565
$$ -7118741 1624407 30417222 36121104 3842349 -29164038 -23365914 13346408 39703973
39081C9703973r325617l1686979k1888512M657371J7319106M634507j0718892
$$ 39703973 30378356 -1308623 -23197135 -18539764 -1220658 3413849 -7305043
39074g305043j544083K2584435K5498546j452950k3786123j4436198Q312024J3201858
$$ -7305043 -8849126 13735309 39233855 37780905 13994782 -441416 7870608 21072466
39066B1072466J438427n454315l623859m595229q112831m832452J701439K94075
$$ 21072466 22510893 17056578 13432719 8837490 724659 -4107793 -2406354 -2112279
39058b112279n969387m356852N429476J2316888J2002432P750735J12237q196618
$$ -2112279 -8081666 -12438518 -7009042 5307846 17310278 25061013 25173250 16976632
39050A6976632o344565Q087621J6580809L527376j6573005j7532160K68365J2943961
$$ 16976632 10632067 18719688 35300497 38827873 22254868 4722708 4991073 17935034
39042A7935034R410923J172611k348577n621252j2053908j5686853j1258605r2258
$$ 17935034 27345957 28518568 26169991 20548739 8494831 -7192022 -18450627 -18542885
39034a8542885J3635027K2337998J6289642k556959j5871089j1822308l020044
$$ -18542885 -4907858 17430140 33719782 31162823 15291734 3469426 449382
39027D49382n697155j2498539o431133Q169778J2476245M540737k62724L464197
$$ 449382 -5247773 -17746312 -24177445 -16007667 -3531422 1009315 746591 4210788
39019D210788O191957L380946p11792o134595j3846248j3808139J981436J9310783
$$ 4210788 10402745 13783691 13071899 6937304 -6908944 -20717083 -18735647 575136
39011E75136J7147344j164610j4239402j3984040p085399N957913K4805756L0620151
$$ 575136 17722480 16557870 2318468 -11665572 -18750971 -12793058 12012698 42632849
39003D2632849P283920k3175820k2860733M999438J9349277M017305j3165437
$$ 42632849 49916769 26740949 3880216 8879654 28228931 32246236 19080799
38996A9080799j0971335k956252k369699L78570P592367Q10195k0449446k3637512
$$ 19080799 8109464 5153212 2783513 3162083 10754450 11564645 -8884801 -32522313
38988c2522313O153931L3998897K4530813n314876j6357352n636117J127704k780254
$$ -32522313 -26368382 7630515 32161328 26846452 10489100 4852983 5980687 3200433
38980C200433k200318N161886N179992m981591j2499205j0130442j499655R860456
$$ 3200433 1000115 6162001 11341993 6360402 -6138803 -16269245 -17768900 -7908444
38972g908444J9268130J7074149L414518m006535M909836J2750142R37650j7514934
$$ -7908444 11359686 28433835 31848353 27841818 32751654 45501796 46439446 28924512
38964B8924512j6629893J843798J3064376P191662l196283q403299r053551k742618
$$ 28924512 12294619 14138417 27202793 34394455 31198172 22794873 13741322 10998704
38956A0998704J1503748J8926697M555476j9241392k5716530j2211525o8195J705784
$$ 10998704 22502452 41429149 45984625 26743233 1026703 -11184822 -11253017 -9547233
38948i547233M021031Q491518J952406j3873474j7835960m814890L118096n463243
$$ -9547233 -5526202 2965316 4917722 -8955752 -26791712 -31606602 -28488506 -33951749
38940c3951749j0253742N643372K4504319K1214889K353156p475286m473647m123733
$$ -33951749 -44205491 -38562119 -14057800 7157089 9510245 2034959 -2438688 -6562421
38932f562421r080884n725432Q347661J7332448J1513652l41793p741440j1259693
$$ -6562421 -15643305 -21368737 -13021076 4311372 15825024 15483231 7741791 -3517902
38924c517902j2801850q318171J519089O217440R67423l346463L005737J0634017
$$ -3517902 -16319752 -24637923 -23118834 -16901394 -15933971 -19280434 -16274697 -5640680
38916e640680M139809j1899232j6258177r36939J7236238J9559227P582415m571493
$$ -5640680 -1500871 -13400103 -29658280 -30595219 -13358981 6200246 13782661 9211168
38908I211168r498220r413710p900120p913843j1544844j3387845j898500K2274577
$$ 9211168 -287052 -9700762 -17600882 -25514725 -37059569 -50447414 -52345914 -30071337
38900c0071337L7584993K5457994k769951j8728950j3353041k805524N10737K406386
$$ -30071337 7513656 32971650 30201699 11472749 -1880292 -4685816 -4175079 -1768693
38892a768693Q250076R862964J130671q292920o505768L511431R879141O919270
$$ -1768693 6481383 16344347 17475018 9182098 2676330 6187761 16066902 22986172
38884B2986172k717853j2606704j3564062J60920J9707031K6580577J4757967
$$ 22986172 20268319 7661615 -5902447 -5741527 13965504 40546081 55304048
38877E5304048k400779j2213630j6634000j9399730j4423082J149430J4561100
$$ 55304048 52903269 40689639 24055639 4655909 -9767173 -8617743 5943357
38870E943357J2156069j279494r886177p386430o67732J395910n000457j6199934
$$ 5943357 18099426 16819932 6933755 -452675 -1120407 275503 -4724954 -20924888
38862b0924888k0261384p540953J3043578K0272829Q930550k536213j10848O804238
$$ -20924888 -41186272 -48727225 -35683647 -15410818 -6480268 -9016481 -9127329 -2323091
38854b323091N164160o00409j606804k013346o587525o143889N591575J4244527
$$ -2323091 2841069 2240660 633856 -1379490 -7967015 -14110904 -8519329 5725198
38846E725198M586737j3227282j8038801q581325L20167K919134L236843N010
$$ 5725198 10311935 -2915347 -20954148 -29535473 -29215306 -26296172 -23059329 -23054319
38838b3054319p604447q408549M320901J4430745N216890r571182m999410J2555241
$$ -23054319 -30658766 -39067315 -34746414 -20315669 -15098779 -24669961 -29669371 -17114130
38830a7114130J3963558m598326j5554753m844071Q992933Q331567L64881l163656
$$ -17114130 -3150572 -7748898 -23303651 -28147722 -19154789 -10823222 -10458341 -13621997
38822a3621997n098118r336697q895167J45681R173637J1196393R964037Q454257
$$ -13621997 -18720115 -28056812 -36951979 -36806298 -27632661 -16436268 -6472231 1982026
38814A982026L409050l334775l735715J385565J585058n061320q348583k985064
$$ 1982026 5391076 2056301 -1679414 -293849 1291209 -3770111 -12118694 -15103758
38806a5103758N672386J2331625J2068412m564874l4218230m5736267j4364067
$$ -15103758 -9431372 2900253 14968665 10403791 -23814439 -69550706 -83914773
38799h3914773L1676550L7778314J347901j9709070P379455M0296346K6492695
$$ -83914773 -52238223 -14459909 -13112008 -32821078 -25441623 14854723 41347418
38792D1347418j8871248l8938638j5570796J6654745K5226323J2163461n068718
$$ 41347418 22476170 -16462468 -32033264 -15378519 9847804 22011265 16942547
38785A6942547j5376081j4452011l892914P219200J0932928Q013801P81610j1075584
$$ 16942547 1566466 -12885545 -16778459 -9559259 1373669 9387470 10169080 -906504
38777i06504k0434757j4430983L607508J2363916M757504K73532J0092667J5643105
$$ -906504 -21341261 -35772244 -32164736 -19800820 -15043316 -14769784 -4677117 10965988
38769A0965988L171338p710562J114833R182938p916837k9014181j6889480J7040998
$$ 10965988 14137326 6426764 7541597 16724535 8807698 -20206483 -37095963 -20054965
38761b0054965K6430583L338007j2036085J167320J6060971R859981q73713K633154
$$ -20054965 6375618 9713625 -2322460 -1155140 14905831 24765812 23892099 26525253
38753B6525253P430026k608907j5232172j3586412o658687r242209j2311002j004065
$$ 26525253 33955279 31346372 16114200 2527788 -4130899 -13373108 -25684110 -26688175
38745b6688175J4115532J2187398k199922n919378N049115J0206708k488590j8935227
$$ -26688175 -12572643 -385245 -2585167 -8504545 -3455430 6751278 4262688 -14672539
38737a4672539j9382791l092678J3482369J6624280R410863O167042J2234416
$$ -14672539 -34055330 -37148008 -23665639 -7041359 2369504 8536546 20770962
38730B0770962J3869842k442760k4600337k6262071n400391J0052921L728592
$$ 20770962 34640804 32198044 7597707 -18664364 -24064755 -14011834 -10283242
38723a0283242m839584O258748K4049046K0642160l171918k0372276j7019713
$$ -10283242 -15122826 -8864078 15184968 35827128 32655210 12282934 -4736779
38716d736779m717187L085351M291915j534200j4045193k1752957j1336184R765747
$$ -4736779 -9453966 -6368615 -2076700 -3610900 -17656093 -39409050 -50745234 -40979487
38708d0979487J9171410J0886102J354596J046795J905036o95704K643190J2454723
$$ -40979487 -21808077 -10921975 -9567379 -8520584 -6615548 -7311252 -4668062 7786661
38700G786661J0512145r486266k2182682n340270K0950653J8516748j2461535
$$ 7786661 18298806 8812540 -13370142 -18710412 2240241 20756989 8295454
38693H295454l1626311j5535816J1674983J6181587M75265p248963L329588J3570075
$$ 8295454 -23330857 -38866673 -27191690 -11010103 -10534838 -17783801 -14454213 -884138
38685h84138P121835o136136n757581R234654J7977864N578132j6659691k5723807
$$ -884138 6237697 101561 -5656020 3578634 21556498 27134630 10474939 -15248868
38677a5248868j6000273k912835J859364N007584J4974888K3150432J4618886
$$ -15248868 -31249141 -34161976 -32302612 -27295028 -12320140 10830292 25449178
38670B5449178q432642k7000368k6551287p959529J8462524L7758889L3885739
$$ 25449178 17016536 -9983832 -36535119 -44494648 -26032124 11726765 45612504
38663D5612504M944394k5473927k8825978o259650J2526135Q066832p666216j3625059
$$ 45612504 50556898 25082971 -3743007 -10002657 2523478 10590310 2924094 -10700965
38655a0700965n664345P618622J7940590J6682536j506914k3010222k1610115
$$ -10700965 -16365310 -8746688 9193902 25876438 24369524 1359302 -20250813
38648b0250813M474388K1076404L690658k3790571k2597109L307429J6308675
$$ -20250813 -15776425 5299979 8990637 -14799934 -37397043 -34089614 -17780939
38641a7780939M704597m035268P118078J8246368R211663p493014j0708632m666970
$$ -17780939 -13076342 -17111610 -9993532 8252836 17464499 9971485 -737147 -5404117
38633e404117o116411j2845850q832757P071022J8798430J6748778O890691k797017
$$ -5404117 -11520528 -24366378 -33199135 -26128113 -7329683 9419095 16309786 13512769
38625A3512769j0099600j1864088l180301J1890043J8325360O332500j3869899
$$ 13512769 3413169 -8450919 -11631220 258823 18584183 24916683 11046784
38618A1046784k0145599l332325J9697347K3533041M521224j4982146j6451114
$$ 11046784 -9098815 -12431140 7266207 30799248 35320472 20338326 3887212
38611C887212p763175n405386o259706L157511J6257889J1563055r484376j7562080
$$ 3887212 -3875963 -9281349 -15541055 -12383544 3874345 15437400 5953024 -11609056
38603a1609056O57137J8909302R752017j4006147j9834790l554608R545366N764299
$$ -11609056 -10951919 7957383 17709400 3703253 -16131537 -19686145 -10140779 -4376480
38595d376480r07505L796554J2170320Q151302r342480k4899710k3316333m482288
$$ -4376480 -5283985 -1487431 10682889 18834191 9491711 -15407999 -38724332 -43206620
38587d3206620J5848668K1130716J1720461K585963J424148l89549q642272j1786850
$$ -43206620 -27357952 -6227236 5493225 8079188 9503336 9113787 471515 -11315335
38579a1315335O03125J5952014J3811583l278308j3759925r327174k741920k246525
$$ -11315335 -10712210 5239804 19051387 15773079 2013154 -7314020 -10055940 -12302465
38571a2302465O13810J0670904J5380036L620540j4310393j9018697p823384L612368
$$ -12302465 -11688655 -1017751 14362285 17982825 3672432 -15346265 -23169649 -19557281
38563a9557281L213288l491729l070544P332196J5420239Q637083q921653j9743593
$$ -19557281 -16343993 -19835722 -22906266 -15574070 -153831 8483252 -438401 -20181994
38555b0181994j3762902J005908J1604826J4795205J2546348L674419r115208
$$ -20181994 -33944896 -32938988 -21334162 -6538957 6007391 9681810 566602
38548E66602j3565846l809525N764621m50438j2789558r287369Q573506J7125023
$$ 566602 -12999244 -16808769 -11044148 -11494586 -24284144 -33571513 -24998007 -7872984
38540g872984Q711599K445691R213807J2135915k885334j9414669j4268359O359336
$$ -7872984 838615 3284306 12498113 24634028 21748694 2334025 -11934334 -5574998
38532e574998J7197428J0970723K880110K546824K929246k123849p692844r303588
$$ -5574998 11622430 22593153 25473263 28020087 30949333 28825484 21132640 11829052
38524A1829052j0338436j2603699j0486019n22806J0782569J4290184R015501
$$ 11829052 1490616 -11113083 -21599102 -22121908 -11339339 2950845 11966346
38517A1966346J909677n82353J179251J226962l889171q251858k573430J1106364
$$ 11966346 13876023 13293670 14472921 15699883 11810712 3558854 985424 12091788
38509A2091788J8232945J0619313j605020n440187m195372q650190j5475054j1309385
$$ 12091788 30324733 40944046 39339026 33898839 29703467 21053277 5578223 -5731162
38501e731162L132427J1261668O699259L774862J3193321K1965638J1276258j4152598
$$ -5731162 -2598735 8662933 15362192 19137054 32330375 54296013 65572271 51419673
38493E1419673k9257879j9663590J372566R160728m840845k4066946k4926782
$$ 51419673 22161794 2498204 3870770 13031498 8190653 -15876293 -40803075
38486d0803075l827612J7224554J6906956J730774m215272N969285J4377837Q322523
$$ -40803075 -44630687 -27406133 -10499177 -8768403 -12983675 -7014390 7363447 15685970
38478A5685970j849943m467549n890942j2244201j0753477Q048939K4854105J6394135
$$ 15685970 13836027 9368478 3477536 -8766665 -19520142 -11471203 13382902 29777037
38470B9777037m805715p762371N520587L320500j8833924k5567311M1983K4671928
$$ 29777037 24971322 17208951 22729538 26050038 7216114 -18351197 -18309214 6362714
38462F362714J5692444r029397j3586992m01133K101393r462950j2963906k313756
$$ 6362714 22055158 13025761 -561231 -962364 1139029 -8323921 -21287827 -23601583
38454b3601583O622766P870877R876124J0080077k393211j8450695j6178463J292286
$$ -23601583 -16978817 -9107940 768184 10848261 8455050 -9995645 -26174108 -24881822
38446b4881822Q053006m86900j107623J2118324J4506350l021656j2738949K805545
$$ -24881822 -16828816 -17315716 -18423339 -6305015 8201335 5179679 -7559270 -4753725
38438d753725J8107491P772377r267131l434216J3301574R150875j1045601j4224194
$$ -4753725 13353766 21126143 11859012 8424796 21726370 30877245 19831644 5607450
38430E607450L865956J2536184j469284j3934515m381238J4101206J8391477M662155
$$ 5607450 9473406 22009590 20540306 6605791 2224553 16325759 34717236 39379391
38422C9379391j6521260l3730920l4305237j1059535K0209052K9141483Q799579
$$ 39379391 22858131 -10872789 -45178026 -56237561 -36028509 -6887026 1912553
38415A912553j1779806n928113J5501903K2767335Q358476q536272j1916022n700795
$$ 1912553 -9867253 -15795366 -293463 22473872 30832348 22296076 10380054 4679259
38407D679259j128000j271374j758804J149540P206780J3116576J4151166O801673
$$ 4679259 3551259 2279885 521081 1670621 8877401 21993977 36145143 42946816
38399D2946816p258268j9150633j7806303j844676J4201104J3042643l467561
$$ 42946816 35688548 16537915 -1268388 -3113064 11088040 24130683 20663122
38392B0663122j4432162p318740M910766L760868p590141j1650879m531947J189870
$$ 20663122 6230960 -1087780 3822986 7583854 -6287 -11657166 -16189113 -14999243
38384a4999243n10149j475687K929417N325055R20550l666433k713549j53479
$$ -14999243 -15509392 -16985079 -14055662 -8730607 -7810057 -11476490 -14190039 -14343518
38376a4343518O73229M212907J1705478J3870501M480032p075129p506076J438843
$$ -14343518 -13670289 -9457382 2248096 16118597 20598629 13523500 6017424 7456267
38368G456267O187148Q88885n873240m338508M086924J0777129J1631426R920608
$$ 7456267 13643415 14532300 8659060 4320552 8407476 19184605 30816031 40736639
38360D0736639P797902Q04421j3742428k6121122k1770795j324329J7162720K0638457
$$ 40736639 48534541 49338962 35596534 9475412 -12295383 -13619712 3543008 24181465
38352B4181465J4737018Q397036j297838j6313992k3326377j1502803M472685
$$ 24181465 38918483 47315519 46017681 29703689 6377312 -5125491 -652806
38345f52806J899987j3806688j5155622M732780K1012957J5020496n86046n824484
$$ -652806 1247181 -12559507 -27715129 -22982349 -1969392 13051104 12465058 6640574
38337F640574k128312k435892p998742j0610144p665857j842626O284486J4830830
$$ 6640574 4512262 2076370 -5922372 -16532516 -24198373 -26040999 -19756513 -4925683
38329d925683J7424449J2003131M859433o42884q958993j9035181j9185604n687139
$$ -4925683 12498766 24501897 29361330 28718446 19759453 724272 -18461332 -24148471
38321b4148471O040521K137453p897984m752562J2210276K4180952J7169744l687245
$$ -24148471 -18107950 -15970497 -23868481 -28621043 -16410767 7770185 24939929 21252684
38313B1252684k0974834j9131414K066422K1961188J6757723r424799k4028384
$$ 21252684 277850 -18853564 -16787142 5174046 21931769 12506970 -11521414
38306a1521414p759945J7928418K1659483O111623k042826L885607N428508m260578
$$ -11521414 -19281359 -1352941 20306542 26418165 24375339 28260946 33689454 29428876
38298B9428876q651193J89882N100207o754561j9795623j3706335M456950J2225731
$$ 29428876 20777683 20967565 26067772 19313211 -482412 -14188747 -9731797 2493934
38290B493934N882667J246810M544310M425398m284673r047725j275537O317443
$$ 2493934 8376601 9623411 14167721 18593119 14308446 5260721 3985184 10302627
38282A0302627j114915j3755370q129301J6686963L2824066K0201441o265365
$$ 10302627 9187712 -4567658 -12696959 3990004 36814070 57015511 50750146
38275E0750146j8400797j2402058p578737j2574200j3212548J504531J8490951
$$ 50750146 32349349 19947291 12368554 -205646 -13418194 -11913663 6577288
38268F577288J7271704j534546j6245978r802905J2509040K9910810K5951640
$$ 6577288 23848992 22314446 6068468 -3734437 8774603 38685413 64637053
38261F4637053L036934j9520087k3555635r708203N333452Q588677K315289m042742
$$ 64637053 67673987 48153900 24598265 14890062 20223514 28812191 31127480 27084738
38253B7084738n268099j236560N480793Q750619K901909p933579j1564858l492321
$$ 27084738 21816639 20580079 26060872 34811491 37713400 29779821 18214963 14722642
38245A4722642O139700O198984j961068r499705j0906926n077287N568715J2035401
$$ 14722642 20862342 27061326 25100258 15600553 4693627 -383660 5185055 17220456
38237A7220456N940418l746265M356650L0821707M3103928J6252161k5856903
$$ 17220456 23160874 19414609 23771259 54592966 97696894 113949055 88092152
38230H8092152l6458796r684995J0662684p123486l9121705m0897113p156338
$$ 88092152 51633356 41948361 52611045 45487559 6365854 -34531259 -41687597
38223d1687597K6076119L0296945J3436297j38907P2306P219081J1785480J0194587
$$ -41687597 -15611478 14685467 28121764 27982857 28055163 35274244 47059724 57254311
38215E7254311L913524k217653k428308L624150P631266Q84601j3492069k1289951
$$ 57254311 61167835 58950182 56521874 60146024 67777290 68661891 55169822 33879871
38207C3879871j3039956L952993J3290920P952657l236570q203529o131724n587971
$$ 33879871 20839915 24792908 38083828 46036485 42799915 34596386 28464662 22876691
38199B2876691j0348675j3110502o222914N349423Q242582j719966j2693652j1185576
$$ 22876691 12528016 -582486 -6805400 -1455977 6786605 5066639 -7627013 -18812589
38191a8812589K287924J7069337K5777113K5797331J4007698o551456j8627047
$$ -18812589 -16524665 544672 26321785 52119116 66126814 59575358 40948311
38184D0948311p490994J3014894J1894751j4447826l1162714j2745405J8899138
$$ 40948311 33457317 46472211 58366962 43919136 12756422 11017 18910155
38177A8910155K5673834O195227r227826o129110J337742J681143K77980l69106
$$ 18910155 44583989 50779216 41551390 35422280 36760022 38441165 38719145 38350039
38169C8350039o933831j5296416r599636R628904J9826415J0043087j613172K447968
$$ 38350039 31416208 16119792 6520156 16149060 35975475 46018562 44405390 46853358
38161D6853358J2489749J0416449j337968p716160n258932j370174J190976L804191
$$ 46853358 59343107 69759556 68421588 60705428 55446496 54076322 55267298 59071489
38153E9071489L692246m31871j585819M286624P401134k954000j9711998k4098008
$$ 59071489 62763735 62331864 60746045 65032669 72433803 69479803 49767805 25669797
38145B5669797q502790J4304798K3431456Q968126j6703143k7461271j1658808
$$ 25669797 17167007 31471805 54903261 63871387 47168244 19706973 8048165
38138H048165J0892082J3203492j357225n690197P933715J7323868Q309375m507384
$$ 8048165 18940247 32143739 30786514 25096317 33030032 50353900 58663275 54155891
38130E4155891o247689m184962o824205o686709j346792n134458j9513023j9475895
$$ 54155891 47908202 43723240 36899035 30212326 28865534 23731076 4218053 -15257842
38122a5257842N487762K5047576J3823509l664840P238472K9761036K1205813
$$ -15257842 -9770080 15277496 29101005 25436165 32674637 62435673 83641486
38115H3641486j3891768k8038263o219408J3831055N283934j0388771o919920
$$ 83641486 69749718 41711455 35492047 49323102 54607036 44218265 37298345
38108C7298345M941688K353765j1626724j8301330j1745533J566401J5139165
$$ 37298345 42240033 44593798 32967074 14665744 2920211 4486612 19625777
38101A9625777K0236731P902627j3848726k1524913p551189O608144K212010q925235
$$ 19625777 39862508 47765135 33916409 12391496 4840307 11448451 13660461 4735226
38093D735226n155032J0636924J7141176P304971l783659k021361Q886944J5536300
$$ 4735226 -419806 10217118 27358294 34663265 30879606 28858245 37745189 53281489
38085E3281489J1144927J021645n044052m088248k249969m884011r064926j0300527
$$ 53281489 64426416 65448061 60404009 56315761 54065792 49181781 40116855 29816328
38077B9816328j0376937j0733840n265430Q477501J7402661P946784j0259513
$$ 29816328 19439391 8705551 3440121 11917622 29320283 37267067 27007554
38070B7007554j3213386M446811K1703790J9313645J185475j5980783k1432759
$$ 27007554 13794168 18240979 39944769 59258414 60443889 44463106 23030347
38063B3030347j4647960j823714P966257J0512791J0406385J0771400N060898
$$ 23030347 8382387 6558673 14524930 25037721 35444106 46215506 51276404
38056E1276404r575538j8519380o665125J5364001K1550576N825671j2242538
$$ 51276404 41700866 23181486 16516361 31880362 53430938 59256609 47014071
38049D7014071j7320564j3999945j0150383m335203M109910Q492523N047081j374760
$$ 47014071 29693507 15693562 5543179 1207976 5317886 13810409 18857490 17482730
38041A7482730n181989m503144Q28376N905618Q00769j3930732k0630646r045990
$$ 17482730 12300741 7797597 8625973 14531591 15332360 1401628 -19229018 -28275008
38033b8275008L923533n75125j0908536l962186J4590671K0220670J1373281O916004
$$ -28275008 -24351475 -24926600 -35835136 -39797322 -25206651 -4985981 6387300 13303304
38025A3303304P809215q74129j2929670p093661R845780R824587l630223K640453
$$ 13303304 21112519 20238390 7308720 215059 10060839 19885426 16255203 18895656
38017A8895656K8323939L0507394n189951l5697630k7459906m248905J300081
$$ 18895656 47219595 77726989 72537038 36839408 9379502 5130597 6430678
38010F430678j938530M280783Q030616k218414o936179M888644M488655k4686198
$$ 6430678 4492148 8772931 16803547 14585133 7648954 12537598 17026253 -7659945
38002g659945m2651696j2160181L2056952L1963872k452389j3704660Q908838
$$ -7659945 -50311641 -62471822 -30414870 1549002 -903387 -14608047 -5699209
37995e699209K1352203M828807j0015971k893398Q502174R382116P618983M572245
$$ -5699209 15652994 20481801 10465830 7572432 16074606 25456722 33075705 37647950
37987C7647950q666733j9793960n833023J8836272J3537257k0457449l3851153
$$ 37647950 28981217 9187257 3354234 22190506 35727763 15270314 -18580839
37980a8580839o702076J9708526J1136067q743213o042683Q733431J0179867N307534
$$ -18580839 -25282915 -5574389 5561678 -3181535 -9224218 -490787 9689080 14996614
37972A4996614J1405281J5798814n19932k0752085j5783826M860453O918787j1646588
$$ 14996614 26401895 42200709 41680777 20928692 5144866 10005319 16924106 5277518
37964E277518j8010164R35353J8348400J0460964r668037j5351018l037715R301829
$$ 5277518 -12732646 -11797293 6551107 17012071 7344034 -8006984 -11044699 -1742870
37956a742870R124101J126163l962936l063608j695103m317118p029697k935195
$$ -1742870 7381231 8507394 4544458 1480850 -214253 -4531371 -11561068 -14496263
37948a4496263O717999J2924937J1311130P047702N161610L569857n44017m570136
$$ -14496263 -7778264 5146673 16457803 23505505 28667115 32236972 31692955 27122819
37940B7122819n164362l254520q06462J793453K758780k65031m478179m193604
$$ 27122819 21958457 18703937 17897475 19690928 22449708 22184677 17706498 13512894
37932A3512894l30594N03143k367837k776947k90620k140731q563177q243482
$$ 13512894 13182300 13685443 11317606 8540659 8250039 6109308 -2453869 -10697351
37924a0697351M640340J8939876K0274793Q727006m449002j1278881j1648659
$$ -10697351 -6057011 12882865 33157658 41884664 37435662 26156781 14508122
37917A4508122r147865q059105r629881p850769M409999K1652405K6645361J0900559
$$ 14508122 5360257 -2698848 -12328729 -20179498 -15769499 5882906 32528267 43428826
37909D3428826j2887210k5033056j9635251n936754M726981P224262L004757j805980
$$ 43428826 30541616 5508560 -14126691 -20063445 -15336464 -8112202 -5107445 -6913425
37901f913425j923575J93908k411854q842350q763842J975845J1859713Q023305
$$ -6913425 -8837000 -8643092 -11054946 -19897296 -28661138 -26685293 -14825580 -6802275
37893f802275m564925p776990N823020K1692752K0198064J560693j2320472m024979
$$ -6802275 -11367200 -19144190 -13321170 8371582 28569646 30130339 17809867 13784888
37885A3784888J5938248K0250182l61460k4077688k5486439o182631J1647463
$$ 13784888 29723136 49973318 49611858 25534170 47731 -6134900 5512563
37878E512563J4033547N218331n664063j3888988j6611114j3067642p372475k717017
$$ 5512563 19546110 24764441 19100378 5211390 -11399724 -24467366 -31839841 -34556858
37870c4556858M033191J3371794J5606531M803331o829761m607242M559251K991337
$$ -34556858 -30523667 -17151873 -1545342 3257989 -3571772 -8179014 -3619763 -628426
37862f28426o892348n295263J0760492J9670644P833292j0853263j6960901r805955
$$ -628426 -7520774 -12816037 -2055545 17615099 25448391 14595128 -2365773 -12171728
37854a2171728p67298L050346M23375o001494p550618K152193J3835841J2463478
$$ -12171728 -12939026 -9888680 -9465305 -15466799 -23017417 -20865224 -7029383 5434095
37846E434095J862144M32555R590312R625119n976354j6653348p091994R557756
$$ 5434095 7296239 7728794 17319106 26944225 20967871 4314523 -2777471 6780285
37838F780285J5291887J2438897Q982540J81883j5493007k1621818p497010R860213
$$ 6780285 22072172 34511069 43493609 43675492 28182485 6560667 -936343 8923870
37830H923870J0400654K469489M453557R385332k012280k1697756k0707576M867119
$$ 8923870 19324524 21794013 26247570 35632902 33620622 11922866 -8784710 -3917591
37822c917591K4536705J6411882n426177j5914980j0882004k282424K742108M658235
$$ -3917591 20619114 37030996 31604819 15689839 4807835 2525411 5267519 9925754
37814I925754K733296m175144j1334741j1130291k364808P466798R955718M567109
$$ 9925754 12659050 8483906 -2850835 -13981126 -16345934 -8879136 1076582 5643691
37806E643691j660169l676007m435353p552617q444201j296125Q432416J0281085
$$ 5643691 3983522 307515 -4127838 -11680455 -20124656 -21420781 -12988365 -2707280
37798b707280N773850M879409O588217J033041q074756n182323Q078505J0303441
$$ -2707280 3066570 7945979 14534196 15567237 7492481 2310158 10388663 20692104
37790B0692104l929994j2189482k207389N974247m104136j4850147o428713O462302
$$ 20692104 16762110 4572628 2365239 8339486 4235350 -10614797 -17043510 -10581208
37782a0581208J852707p745615J329165J6408786P388047j7531623k1020181J266182
$$ -10581208 -8728501 -16474116 -15144951 1263835 8651882 -8879741 -29899922 -28633740
37774b8633740J4391123M460103j132311J3550834K3726027Q414214j2853752
$$ -28633740 -14242617 -9782514 -10914825 2636009 26362036 34776250 21922498
37767B1922498j3791743k346192m39570n901348k870974O276484O415039k932737
$$ 21922498 8130755 5784563 5344993 -556355 -3427329 2849155 9264194 6331457
37759F331457q272468l802023M700489J1204722J1407904J767340j1572135j2985301
$$ 6331457 -1941011 -5743034 -1042545 10162177 21570081 23337421 11765286 -1220015
37751a220015J487291J4136066R245076m679931r907781n252301j492623r75724
$$ -1220015 267276 14403342 23648418 18968487 9060706 3808405 2315782 1340058
37743A340058J479601M120423O49600o778149r773234n798479J036978N970721
$$ 1340058 2819659 6940082 7589682 811533 -8961701 -14760180 -13723202 -7752481
37735g752481L396700j0068478k4296905j9811468N457682K6721332K3904245
$$ -7752481 -4355781 -14424259 -38721164 -58532632 -53074950 -26353618 -2449373
37728b449373R268401N534900R368178P17794j8912021k5012264q072801J1754917
$$ -2449373 6819028 12353928 21722106 22439900 3527879 -21484385 -29557186 -17802269
37720a7802269J5103614Q281808O992245J0463680N854463q836041j9310181j3143091
$$ -17802269 -2698655 5583153 12575398 23039078 28893541 20057500 747319 -12395772
37712a2395772L542967J1919612K864923j1006192j1530829j99442M430337m140938
$$ -12395772 -8852805 3066807 5931730 -5074462 -16605291 -16804733 -12374396 -16515334
37704a6515334r516625Q80253J3861767J0546976l072527m772603J0298341K3766794
$$ -16515334 -26031959 -25151706 -11289939 -742963 -3815490 -8588093 1710248 25477042
37696B5477042K0981700P289225m111202o949333k500447L538141L463234m356136
$$ 25477042 46458742 53747967 49636765 42687432 40186985 43725126 47188360 42832224
37688D2832224j0998772r088476n097186q364136j3034378o216393Q181294J0820197
$$ 42832224 31833452 22744976 17647790 9283654 -3750724 -9967117 -1785823 9034374
37680I034374n413071k3452738k2508585r23274K4078061L2450738J8000393m107589
$$ 9034374 3621303 -19831435 -42340020 -43263294 -19185233 13265505 31265898 27158309
37672B7158309j0384572L209227J4584770O391629q892715j0667400l123794l085928
$$ 27158309 16773737 19982964 34567734 40959363 32066648 21399248 18275454 15189526
37664A5189526o777447J105108J2192440L534893j8680853k2338319k390384Q361485
$$ 15189526 8412079 9517187 21709627 25244520 6563667 -15774652 -18165036 -9803551
37656i803551n636746j6054402P326K0651909J7205244K80006m605731j118264
$$ -9803551 -15440297 -31494699 -31487373 -10835464 6369780 6649786 2044055 925791
37648I25791o021935j0657528K081385J7665824Q537385j5345517j6581959R718981
$$ 925791 -5096144 -15753672 -13672287 3993537 12530922 -2814595 -19396554 -9677573
37640i677573K6375937J1194800j2493795j5047636p23712P584190K517331m907403
$$ -9677573 16698364 27893164 15399369 351733 -371979 7212211 9729542 4822139
37632D822139l788709O166883J4893653J0283707n299041j1980490L15887J1142164
$$ 4822139 1033430 7200313 22093966 32377673 27078632 15098142 15414029 26556193
37624B6556193j760217k2722891j8511411O170751J2174779j0593404k5021625
$$ 26556193 24795976 2073085 -16438326 -10267575 1907204 -8686200 -33707825
37617c3707825p424893J4313410R019865o755702o51010J9062207J9001442k485349
$$ -33707825 -41132718 -26819308 -17799443 -24555145 -25206155 -6143948 12857494 10372145
37609A0372145j4125600k440784J2477583J3705247Q516828O088015Q23895j1259537
$$ 10372145 -3753455 -6194239 6283344 19988591 28505419 34593434 35417329 24157792
37601B4157792j9471558j3917604j100914N806568L628037q17892j023335L534068
$$ 24157792 4686234 -9231370 -10332284 -4525716 -897679 -1715571 -2738906 795162
37593G95162P910249O578578Q87894j210879K586042L061708o229170j5881295
$$ 795162 8705411 15283989 16171883 14961004 17547046 20608754 14379584 -1501711
37585a501711j3489334l619003m17803l913428l96509J3209151K2006388J4655257
$$ -1501711 -14991045 -18610048 -19027851 -22941279 -23337788 -10128637 11877751 26533008
37577B6533008j302000j1376427j0473084k030657Q790912J4796329Q912648n470398
$$ 26533008 25231008 13854581 3381497 1350840 10141752 24938081 33850729 28380331
37569B8380331j2987363l596016J2153306J3411619n038184k3568561j9157474
$$ 28380331 15392968 11796952 23950258 37361877 32323693 8755132 -10402342
37562a0402342N435950K0998645O014789k3742820l1668643o339681K3885161
$$ -10402342 -4966392 16032253 22047042 -1695778 -33364421 -39704102 -15818941
37555a5818941K8003684Q442388j0985001j7845656j5013516m400946J1489148
$$ -15818941 12184743 20627131 9642130 -8203526 -23217042 -27617988 -16128840
37548a6128840J8876851O604964j1924078j2843094L280064J3500685R343532
$$ -16128840 2748011 9352975 -2571103 -15414197 -12134133 1366552 10710084
37541A0710084N511543Q007086K545422j4349399k1049960n583237R927992K684796
$$ 10710084 16221627 24228713 26774135 12424736 -8625224 -14208461 -4280469 -1595673
37533a595673j2898179q190112J2497433J8095862j279344k1601189k1547180
$$ -1595673 -14493852 -22683964 -10186531 7909331 6629987 -14971202 -36518382
37526c6518382o763866P369095J5205920J5336899M779124j0586717j4391406
$$ -36518382 -43282248 -35913153 -20707233 -5370334 -591210 -11177927 -25569333
37519b5569333j53577J6960290J8734528N915678p022539j0979707p028643N98504
$$ -25569333 -25722910 -8762620 9971908 15887586 8865047 -2114660 -9143303 -8544799
37511h544799O552932N054017k140460l839573M885193J1264214J656274j5044319
$$ -8544799 -1991867 3062150 921690 -2917883 1967310 13231524 14887798 -156521
37503a56521j7165229k776597O261465j769316r390244K169992K1222525K1324601
$$ -156521 -17321750 -20098347 -13836882 -15606198 -24996442 -22826450 -1603925 19720676
37495A9720676J140498j3273657o609983N688653L109238j0321582j4557940k686680
$$ 19720676 20861174 7587517 977534 6666187 9775425 -546157 -15104097 -17790777
37487a7790777J1224778J1126531k839955j5657684j3299316K418214J4899308
$$ -17790777 -6565999 4560532 1720577 -13937107 -27236423 -24818209 -9918901
37480i918901J1547725q83273o352222j841558J864696N57407K071930Q189979
$$ -9918901 1628824 745551 -5606671 -7448229 -5583533 -5026126 -2954196 5235783
37472E235783Q558085M85400k693801N343744R728648j113192j2967629p946375
$$ 5235783 13793868 14279268 11585467 16929211 26657859 25544667 12577038 4630663
37464D630663M325804J603992j3930318j9572515q985215R15908K49597j448868
$$ 4630663 8956467 10560459 -3369859 -22942374 -31927589 -31011681 -30762084 -32210952
37456c2210952L158138P520634O613101M717705L147711j550841m273288L739494
$$ -32210952 -29052814 -21532180 -14919079 -10201374 -7053663 -8604504 -12877792 -9138298
37448i138298J4033869P999301j0561621j5634592k01461J0207816j019801j3975067
$$ -9138298 4895571 12894872 2333251 -13301341 -13502802 -3294986 -4314787 -18289854
37440a8289854o470086Q436659N711249q647396p890373J1142093K2710408J0285506
$$ -18289854 -24759940 -16323281 -10612032 -19259428 -27149801 -16007708 6702700 16988206
37432A6988206j2890429k4003697j5271990L593040J5879089J1124326l362530
$$ 16988206 4097777 -19905920 -35177910 -31584870 -15705781 -4581455 -7943985
37425g943985p931031M573203J7203526J2413908k703149q828844l174341J209459
$$ -7943985 -15875016 -11301813 5901713 18315621 15612472 6783628 3609287 4818746
37417D818746j192576l447912j535970J600909N128626Q896223O597235m332959
$$ 4818746 3626170 178258 -1357712 243197 5371823 14268046 20865281 16532322
37409A6532322j0752965J2189J5622969J1830461r652545j9632111l733491J5843344
$$ 16532322 5779357 5791546 21414515 33244976 23592431 3960320 226829 16070173
37401A6070173J2735879o953528j6364158n713303P961530O070494q727877j7028612
$$ 16070173 28806052 21852524 5488366 -224937 7736593 13807087 5079210 -11949402
37393a1949402m866009K0003371L3995471K2273525l452809j6908222p297421
$$ -11949402 -16815411 3187960 37183431 59456956 56004147 39095925 31798504
37386C1798504Q994455Q973052j0328119k9735063k9648499j0422611R018695
$$ 31798504 40792959 49766011 39437892 9702829 -19945670 -30368281 -21349586
37379b1349586J1893364J020297p005116k948752O692158J2526423J3284499J0161289
$$ -21349586 -9456222 -8435925 -15441041 -18389793 -11697635 828788 14113287 24274576
37371B4274576J641361q313742q311157L091487Q703475m090623k0771994j8747822
$$ 24274576 25915937 17602195 9291038 12382525 21086000 16995377 -3776617 -22524439
37363b2524439k582011K204263j0083796j5103928L230134K5729158K4427918
$$ -22524439 -25106450 -22902187 -32985983 -48089911 -44859777 -19130619 5297299
37356E297299K295833j1770356k827525J1931466Q183758j3374282k8336794j9283022
$$ 5297299 7593132 -4177224 -7004749 4926717 13110475 -263807 -28600601 -47883623
37348d7883623L573252J6837534J2811302M029396J129345L54674k784641k484007
$$ -47883623 -44310371 -27472837 -14661535 -10632139 -9502794 -9148120 -11932761 -14416768
37340a4416768M738746R612227N589588K776067R967606J4058361j008577k2195828
$$ -14416768 -9678022 -65795 5523793 8299860 18267466 32325827 31317250 9121422
37332I121422k0095690O896311K6889119J8061732n580399k0326959k2397110
$$ 9121422 -10974268 -4077957 22811162 40872894 35292495 14965536 -7431574
37325g431574j9134917j0427808M216293J3983874R526963j398087n749789m656649
$$ -7431574 -26566491 -36994299 -32778006 -18794132 -9267169 -10665256 -16415045 -21071694
37317b1071694o537771q258093j88444J3256386J5554951K378294j0769111j0084467
$$ -21071694 -27609465 -35867558 -36056002 -22799616 -7244665 -4866371 -15635482 -25719949
37309b5719949o23337N252932O720433J0968650J6191192J1690192l255608j3155070
$$ -25719949 -26343286 -21090354 -14369921 -3401271 12789921 24480113 21224505 8069435
37301H069435o803680N219831N503503l676248m703867N708910J0190667n57308
$$ 8069435 1265755 6485586 11989089 8312841 3608974 9317884 19508551 18951243
37293A8951243j1779974q915665o89094j757670o833659k580468N512529K010643
$$ 18951243 7171269 -1744396 -2433490 -4191160 -11024819 -13605287 -8092758 -6082115
37285f082115q509351n740289J2316033K3870859J5851534j31847j0149629j4972880
$$ -6082115 -14591466 -20331755 -8015722 15855137 31706671 31574824 21425195 6452315
37277F452315j6292456o801592J2665562K3033956J0537979j0422827j4179524
$$ 6452315 -9840141 -16641733 -3976171 19057785 29595764 19172937 4993413
37270D993413K072438J5511473Q259535j0588621j7668149n270555Q169262J947329
$$ 4993413 7065851 22577324 30836859 20248238 2580089 -2690466 5478796 7426125
37262G426125j6872826k0637253j566803J3673075L850552j1302929p33957K6075621
$$ 7426125 -9446701 -30083954 -31650757 -17977682 -14127130 -25430059 -26164016 -88395
37254h8395L0650193N311422j5478109r920685R43737o797129k1276560j8211214
$$ -88395 30561798 35873220 20395111 10474426 11418163 4621034 -16655526 -34866740
37246c4866740P44810J6265470K0662213J7869570Q736585m330377j1010778q220620
$$ -34866740 -34121930 -17856460 2805753 20675323 29411908 25081531 14070753 5850133
37238E850133p620341j2686519o864396J5689122K7926488O029345k8037418l2430447
$$ 5850133 -1770208 -14456727 -21321123 -5632001 22294487 28323832 286414 -32144033
37230c2144033n137951J5799881R597219l331503l75867J0461711R806313k781609
$$ -32144033 -37281984 -21482103 -11884884 -15216387 -15592254 -5130543 4675770 1894161
37222A894161j2615180j0663368Q88101J4296168J9500136J0218398o820577j6028810
$$ 1894161 -10721019 -21384387 -20496286 -6200118 13300018 23518416 16697839 669029
37214F69029j0961766j382376Q71597l990712o887081j124756J1622956K1297943
$$ 669029 -10292737 -11675113 -10803516 -14794228 -21681309 -22806065 -11183109 10114834
37206A0114834J5504995p175041k9485541k9550864n520771K0267209K4803940
$$ 10114834 25619829 18444788 -11040753 -40591617 -46112388 -25845179 -1041239
37199a041239P360049j3108098j8798083q447043N119030R563280M594059p60663
$$ -1041239 6318810 -6789288 -25587371 -34034414 -28915384 -19352104 -14758045 -15518708
37191a5518708m48509K753989L665507K051557J634786N335446J2261441J5951695
$$ -15518708 -15967217 -13213228 -9547721 -7496164 -5861378 -525932 11735509 27687204
37183B7687204P649969j1934391k6658485k1050632j348387J1836001J1350126
$$ 27687204 35337173 23402782 -3255703 -24306335 -25654722 -13818721 -2468595
37176b468595Q385189Q183279O95051j7333105l0701806k7896684j7401589r026172
$$ -2468595 5916594 14099873 14794924 -2538181 -33239987 -61136671 -78538260 -87564432
37168h7564432K935623K1665161L0905412J7490507k947520n951293O175881J2111136
$$ -87564432 -84628809 -62963648 -32058236 -14567729 -17515249 -23466542 -17290661 -5179525
37160e179525O690272L323313N631630K175581r656090j6717909j0534507K681511
$$ -5179525 1510747 4834060 10465690 12641271 2985181 -13732728 -24267235 -21585724
37152b1585724J4158501J9349944J3644397j987043j2599875m758616J0473449
$$ -21585724 -7427223 11922721 25567118 23580075 10980200 6221584 16695033
$$ [...]
##END NTUPLES=NMR SPECTRUM
##END=
