##TITLE=31Pdec_SR_Ala
 CDCl3, 24 sc
 27.04.2021
##JCAMPDX= 6.0         $$ Bruker NMR JCAMP-DX V2.0
##DATA TYPE= NMR SPECTRUM
##DATA CLASS= NTUPLES
##ORIGIN= UXNMR, Bruker Analytische Messtechnik GmbH
##OWNER= root
$$ XWIN-NMR		Version 3.5
$$ Tue Apr 27 16:36:45 2021 Russian Standard Time (UT+4h)  she@DPX200
##.OBSERVE FREQUENCY= 81.013821
##.OBSERVE NUCLEUS= ^31P
##.ACQUISITION MODE= SIMULTANEOUS
##.ACQUISITION SCHEME= undefined
##.AVERAGES= 24
##.DIGITISER RES= 16
##SPECTROMETER/DATA SYSTEM= spect
##.PULSE SEQUENCE= zgpg30
##.SOLVENT NAME= CDCl3
##.SHIFT REFERENCE= (INTERNAL, CDCl3, 0, 248.564)
##AUDIT TRAIL= $$ (NUMBER, WHEN, WHO, WHERE, WHAT)
$$ ##TITLE= Audit trail, XWIN-NMR		Version 3.5
$$ ##JCAMPDX= 5.01
$$ ##ORIGIN= Bruker BioSpin GmbH
$$ ##OWNER= she
$$ F:/spectra/data/she/nmr/P31/1/pdata/1/auditp.txt
$$ ##AUDIT TRAIL=  $$ (NUMBER, WHEN, WHO, WHERE, WHAT)
(   1,<2021-04-27 16:35:29.23 +0400>,<she>,<DPX200>,
      <created by zg, POWCHK disabled, PULCHK disabled
       configuration hash MD5:
       00 E9 B6 7A A2 85 ED C7 34 08 36 98 17 FE 4E 26
       data hash MD5: 32K
       D3 0E EC 2F 3D D7 A4 FA F4 F8 E9 59 1A D5 FD E9>)
(   2,<2021-04-27 16:35:32.00 +0400>,<she>,<DPX200>,
      <Start of raw data processing
       efp BC_mod = 2 LB = 1 FT_mod = 6 PKNL = 1 PHC0 = -6131.935 PHC1 = 813.4016 SI = 64K 
       data hash MD5: 64K
       21 E6 83 D8 B9 2A 38 55 CC 6D 63 AF 72 39 81 04>)
(   3,<2021-04-27 16:36:12.62 +0400>,<she>,<DPX200>,
      <pk PHC0 = 191.7827 PHC1 = -516.5999 
       data hash MD5: 64K
       B3 66 09 5E B2 03 5C 05 2C 56 ED B2 5E 18 72 F4>)
(   4,<2021-04-27 16:36:18.64 +0400>,<she>,<DPX200>,
      <abs ABSG = 5 
       data hash MD5: 64K
       E8 2C 7D 68 5E 73 13 10 18 D7 D5 33 E3 C0 77 22>)
$$ ##END=
$$ 
$$ hash MD5
$$ 57 CB 47 00 56 3E 0E 7A 79 C3 CF 48 1A BF CF 86
##$RELAX= 
##$RELAX= 
##$RELAX= 
##$RELAX= 
##$RELAX= 
##$RELAX= 
##$RELAX= 
##$RELAX= 
$$ Bruker specific parameters
$$ --------------------------
##$DU= <F:/spectra>
##$EXPNO= 1
##$NAME= <P31>
##$PROCNO= 1
##$TYPE= <nmr>
##$USER= <she>
##$AMP= (0..31)
100 100 100 100 100 100 100 100 100 100 100 100 100 100 100 100 100 100 
100 100 100 100 100 100 100 100 100 100 100 100 100 100 
##$AQSEQ= 0
##$AQ_mod= 1
##$AUNM= <au_zg>
##$AUTOPOS= <>
##$BF1= 81.014009
##$BF2= 200.13
##$BF3= 200.13
##$BF4= 200.13
##$BF5= 200.13
##$BF6= 200.13
##$BF7= 200.13
##$BF8= 200.13
##$BYTORDA= 1
##$CFDGTYP= 0
##$CFRGTYP= 5
##$CHEMSTR= <none>
##$CNST= (0..31)
1 1 145 1 1 1 1 1 1 1 1 1 1 1 1 1 1 1 1 1 1 1 1 1 1 1 1 1 1 1 1 1 
##$CPDPRG= <waltz16>
##$CPDPRG1= <>
##$CPDPRG2= <waltz16>
##$CPDPRG3= <>
##$CPDPRG4= <mlev>
##$CPDPRG5= <mlev>
##$CPDPRG6= <mlev>
##$CPDPRG7= <mlev>
##$CPDPRG8= <mlev>
##$CPDPRGB= <>
##$CPDPRGT= <>
##$D= (0..31)
0 1 0 0 0 0 0 0 0 0 0 0.03 2e-05 3e-06 0 0 0 0 0 0 0 0 0 0 0 0 0 0 0 0 
0 0 
##$DATE= 1619526928
##$DBL= (0..7)
120 120 120 11 120 120 24 19 
##$DBP= (0..7)
150 150 150 150 150 150 150 150 
##$DBP07= 0
##$DBPNAM0= <>
##$DBPNAM1= <>
##$DBPNAM2= <>
$$ [...]
##$SUBNAM3= <"">
##$SUBNAM4= <"">
##$SUBNAM5= <"">
##$SUBNAM6= <"">
##$SUBNAM7= <"">
##$SUBNAM8= <"">
##$SUBNAM9= <"">
##$SW= 501.771253377433
##$SWIBOX= (0..15)
0 1 3 0 0 0 0 0 0 0 0 0 0 0 0 0 
##$SW_h= 40650.406504065
##$TD= 32768
##$TD0= 1
##$TE= 0
##$TE2= 300
##$TE3= 300
##$TEG= 300
##$TL= (0..7)
0 120 53 12 22 120 120 120 
##$TP= (0..7)
150 150 150 150 150 150 150 150 
##$TP07= 0
##$TPNAME0= <>
##$TPNAME1= <>
##$TPNAME2= <>
##$TPNAME3= <>
##$TPNAME4= <>
##$TPNAME5= <>
##$TPNAME6= <>
##$TPNAME7= <>
##$TPOAL= (0..7)
0.5 0.5 0.5 0.5 0.5 0.5 0.5 0.5 
##$TPOFFS= (0..7)
0 0 0 0 0 0 0 0 
##$TUNHIN= 0
##$TUNHOUT= 0
##$TUNXOUT= 0
##$USERA1= <user>
##$USERA2= <user>
##$USERA3= <user>
##$USERA4= <user>
##$USERA5= <user>
##$V9= 5
##$VALIST= <valist>
##$VCLIST= <CCCCCCCCCCCCCCC>
##$VD= 0
##$VDLIST= <DDDDDDDDDDDDDDD>
##$VPLIST= <PPPPPPPPPPPPPPP>
##$VTLIST= <TTTTTTTTTTTTTTT>
##$WBST= 1024
##$WBSW= 4
##$XGAIN= (0..3)
0 0 0 0 
##$XL= 0
##$YL= 0
##$YMAX_a= 22228
##$YMIN_a= -24841
##$ZGOPTNS= <>
##$ZL1= 120
##$ZL2= 120
##$ZL3= 120
##$ZL4= 120
##$ABSF1= 248.5645
##$ABSF2= -253.2056
##$ABSG= 5
##$ABSL= 3
##$ALPHA= 0
##$AQORDER= 0
##$ASSFAC= 0
##$ASSFACI= 0
##$ASSFACX= 0
##$ASSWID= 0
##$AUNMP= <proc_1d>
##$AZFE= 0.1
##$AZFW= 0.5
##$BCFW= 0
##$BC_mod= 2
##$BYTORDP= 0
##$COROFFS= 0
##$CY= -3
##$DATMOD= 1
##$DC= 0
##$DFILT= <>
##$DTYPP= 0
##$F1P= 0
##$F2P= 0
##$FCOR= 1
##$FTSIZE= 65536
##$FT_mod= 6
##$GAMMA= 0
##$GB= 0
##$INTBC= 1
##$INTSCL= 5.30512e-09
##$ISEN= 30
##$LB= 1
##$LEV0= 0
##$LPBIN= 0
##$MAXI= 10000
##$MC2= 0
##$MEAN= 0
##$ME_mod= 0
##$MI= 50
##$NCOEF= 0
##$NC_proc= -3
##$NLEV= 6
##$NOISF1= 182.463
##$NOISF2= 159.3651
##$NSP= 0
##$NTH_PI= 0
##$NZP= 0
##$OFFSET= 248.5645
##$PC= 4
##$PHC0= -5940.152
##$PHC1= 296.8017
##$PH_mod= 1
##$PKNL= yes
##$PPARMOD= 0
##$PSCAL= 0
##$PSIGN= 0
##$REVERSE= no
##$SF= 81.014009
##$SI= 65536
##$SIGF1= 159.3651
##$SIGF2= -187.1042
##$SINO= 113.3802
##$SIOLD= 16384
##$SREGLST= <1H.CDCl3>
##$SSB= 0
##$STSI= 65536
##$STSR= 0
##$SW_p= 40650.406504065
##$SYMM= 0
##$S_DEV= 0
##$TDeff= 32768
##$TDoff= 0
##$TI= <>
##$TILT= no
##$TM1= 0
##$TM2= 0
##$TOPLEV= 0
##$USERP1= <user>
##$USERP2= <user>
##$USERP3= <user>
##$USERP4= <user>
##$USERP5= <user>
##$WDW= 1
##$XDIM= 65536
##$YMAX_p= 305498071
##$YMIN_p= -26771540
$$ End of Bruker specific parameters
$$ ---------------------------------
##NTUPLES= NMR SPECTRUM
##VAR_NAME=  FREQUENCY,     SPECTRUM/REAL,   SPECTRUM/IMAG
##SYMBOL=    X,             R,               I
##VAR_TYPE=  INDEPENDENT,   DEPENDENT,       DEPENDENT
##VAR_FORM=  AFFN,          ASDF,            ASDF
##VAR_DIM=   65536,         65536,           65536
##UNITS=     HZ,            ARBITRARY UNITS, ARBITRARY UNITS
##FACTOR=    0.620285442955139, 1,           1
##FIRST=     20137.2065510759, 0,            0
##LAST=      -20513.1999529892, 0,           0
##MIN=       -20513.1999529892, -26771540,   0
##MAX=       20137.2065510759, 305498071,    0
$$ Real data points
##PAGE= N=1
##DATA TABLE= (X++(R..R)), XYDATA
$$ [...]
40804D4951k76791j50850J55737L31247K73095Q8488j32468l06771k79189m306
$$ 44951 -231840 -382690 -226953 104294 377389 465877 333409 26638 -252551 -256857
40794b56857K87340L19818J08325r3888j13401J4996J58181J97891J03155k6653
$$ -256857 30483 350301 458626 364738 251337 266333 424514 622405 725560 698907
40784F98907p6215r8361k19892l45580k25863R4468K32334N2060p6665J01425
$$ 698907 622692 524331 304439 -41141 -267004 -172536 59798 111858 35193 136618
40774A36618K36419n1785m39024l34442J42552L07965j6k03049J7860K27506N4964
$$ 136618 373037 321252 -117772 -452214 -309662 -1697 -1713 -204762 -186902 40604 95568
40763I5568j50372L6319L36346K23848j93336l67422j73145K6198O0748J08319
$$ 95568 -54804 -18485 317861 541709 348373 -19049 -192194 -165996 -105248 3071
40753C071J85598O2572k27783l12838o6081J81158J82159R6656P2593m6976l10821
$$ 3071 188669 251241 23458 -289380 -355461 -174303 7856 104512 177105 130129 -180692
40742a80692l68896J2506M62231M69134J11610j25371r3197n1965r4200l2492
$$ -180692 -549588 -537082 -74851 394283 505893 380522 287325 235360 141160 108668
40732A08668J09324L4156k47125k87753P2537L33114P7992l09729k15878K01564
$$ 108668 217992 252148 5023 -282730 -210193 122921 200913 -108816 -324694 -123130
40722a23130K38272k10420m50500q9722L49310K89404r652K2899K74422J83592
$$ -123130 115142 -95278 -545778 -635500 -286190 3214 -6438 16461 290883 474475
40712D74475k30532l37556N7961L54120Q8627l54905l63174K6846L05618K44724
$$ 474475 243943 -93613 -35652 318468 407095 52190 -310984 -284138 21480 266204
40702B66204L2803j39578k17012j36623P5123J70716k240j68904J0173L46002
$$ 266204 299007 159429 -57583 -194206 -119083 51633 49393 -119511 -109338 236664
40692B36664L29949q8735l99682k86556m2437m5688j95296j44988J39836L48620
$$ 236664 566613 477878 78196 -208360 -250797 -296485 -491781 -636769 -496933 -148313
40682a48313K53940l3004k15282j20509J28183K38885Q3950j51039k27681j46510
$$ -148313 105627 72623 -142659 -263168 -134985 103900 187850 36811 -190870 -337380
40672c37380l3167J10241K95264L30582N2061l05335l38151n8524J35974Q3876
$$ -337380 -370547 -260306 34958 365540 417601 112266 -225885 -284409 -148435 -64559
40662f4559K6857R2582P2363j21540k11783j1655K38239K48422Q5282m8136j39142
$$ -64559 -37702 54880 127243 5703 -206080 -217735 20504 268926 354208 306072 166930
40651A66930k25533k12738p9171N746n366R0842L29253L81266Q2068k04578j23960
$$ 166930 -58603 -271341 -350512 -344766 -350132 -259290 69963 451229 533297 328719 204759
40640B04759R7169M9089j80719k14167m1448M5053J3204N9812J27684n473k10500
$$ 204759 301928 351017 170298 -43869 -85317 -40264 -27060 32752 160436 154963 -55537
40629e5537j32587J53940J73401j74995m07988k06985J14450J48811j9213p8238
$$ -55537 -188124 -34184 139217 -35778 -443766 -650751 -536301 -387490 -406703 -484941
40619d84941o278L1226O1267K09949L54787K26043j50625m00081k66290N6889
$$ -484941 -491219 -459993 -398726 -188777 166010 392053 241428 -158653 -424943 -368054
40609c68054J86390M0571q3581O4733L27525L31453m144l29681k89202O2953L61482
$$ -368054 -181664 -141093 -224674 -159941 167584 499037 494893 165212 -123990 -61037 300445
40598C00445L37392L5927k75250l30524q7224K12101K84500J31945r630l2404
$$ 300445 637837 673764 398514 67990 -19234 192867 477367 609312 599682 567278
40588E67278m9205j11055j16039o4079q6669j29017K8422K90569K27458k24766
$$ 567278 518073 407018 290979 226900 140231 11214 39636 330205 557663 332897
40578C32897n04518k24063K11506K38463j2570m5492J49137J92445M3573r744
$$ 332897 -171621 -395684 -184178 54285 41715 -3777 145360 337805 381378 371634
40568C71634M9192p812j20484l6963J27703M5553j62199o8441K55342K63757j49289
$$ 371634 420826 413014 292530 255567 383270 428823 266624 198183 453525 717282 567993
40557E67993m40956k85140o335O0427L2503N6796P087j16799m3530K12883J97938
$$ 567993 127037 -158103 -164438 -104011 -71508 -14712 -7625 -124424 -167954 44929 242867
40546B42867k34264n47564l09429J34577K34806O1545L9715J94556K12413N0358
$$ 242867 8603 -538961 -848390 -713813 -479007 -417462 -377747 -183191 29222 79580
40536G9580l3635K9833L7465r7795k05309j21777J12670L15313L05305O3303j89579
$$ 79580 45945 75778 113243 15448 -189861 -311638 -198968 116345 421650 484953 295374
40525B95374k10754o1081L712k5406R8734L81671M69828J94908j37613k19186
$$ 295374 84620 23539 27251 1845 100579 482250 952078 1146986 1009373 790187
40515G90187j50157j44063j54618o7815K5240J2065l7642o2530j26311j72425
$$ 790187 640030 495967 341349 273534 298774 310839 273197 210667 84356 -88069
40505h8069j3563K41140J73273k60187m85159j26778L61265L42640q8796l49621
$$ -88069 -101632 139508 312781 52594 -432565 -559343 -198078 144562 55766 -293855
40495b93855k32017p17J61318K80298L05570J78588Q1630J84456K66777L4252
$$ -293855 -525872 -526589 -365271 -84973 220597 399185 480815 665271 932048 966300
40485I66300l16364l32554l1585J14227p5458k43672r5538J75660K30149M6844
$$ 966300 649936 317382 285797 400024 324566 80894 -14644 161016 391165 438009
40475D38009j30365j25330K2544J42364J04397m2520j30818j00198n4155m8127
$$ 438009 307644 182314 204858 347222 451619 409099 278281 178083 123928 75801
40465G5801p43J00239J15667o349j30069j77333k11278j74048J11491N16715N84306
$$ 75801 75058 175297 290964 284615 154546 -22787 -234065 -408113 -296622 220093 804399
40454H04399J81702k11739j66816J29935K89924K90893K67258J64871K6619J74039
$$ 804399 986101 774362 607546 737481 1027405 1318298 1585556 1750427 1777046 1951085
40444A951085O29363Q55395O53179P56193J701273K567242J915984j44167j901667
$$ 1951085 2580448 3435843 4089022 4845215 6546488 9113730 11029714 10885547 8983880
40435H983880k156854j440301q78469p40672n79468j58609L16377N82425N89739
$$ 8983880 6827026 5386725 4508256 3767584 3188116 3029507 3345884 3928309 4518048
40426D518048N74978R31171J682996K110953J392674k96846j817204k308542j931120
$$ 4518048 5093026 6024197 7707193 9818146 11210820 10913974 9096770 6788228 4857108
40417D857108j291836p32732l98130m13680o31157o21144k55647M9246n6216l55214
$$ 4857108 3565272 2832540 2434410 2020730 1389573 768429 512782 562028 505812 150598
40407A50598m45838k86369p8951R4230K42809L14824K92807K38064J18596j41330
$$ 150598 -295240 -581609 -660560 -566330 -323521 -8697 284110 522174 640770 499440
40397D99440l66710k52761J08465K42170r19j93714j7447K54036K54382Q5091
$$ 499440 132730 -120031 -11566 230604 229685 35971 18524 272560 526942 612033
40387F12033J5202p953j48646k85986k28876q5176m4385j8902J32491K43363R0729
$$ 612033 627235 619282 470636 184650 -44226 -129402 -173787 -192689 -60198 183165 273894
40376B73894j70066k09824l1602R4069Q5549Q0488R8549L3882o1338k3415J06910
$$ 273894 103828 -105996 -137598 -43529 42020 122508 221057 254939 193601 170186 277096
40365B77096J22034J039o7248l4828p5363k39581k95375n9743K90031M16042K50416
$$ 277096 399130 400169 332921 298093 222730 -16851 -312226 -371969 -81938 334104 584520
40354E84520N6874N6120J44087R6880m1733l171K44977L55931J07025k01734j63524
$$ 584520 641394 697514 841601 938481 896748 893577 1138554 1494485 1601510 1399776 1236252
40343A236252J01077J28635j56847l55786k48129o3904J411P0516K02274J83039
$$ 1236252 1337329 1465964 1309117 953331 705202 641298 642709 713225 915499 1098538
40333A098538l9784j36913O6017K12026m1685m30499m77782k25950q4652j24486
$$ 1098538 1058754 921841 987858 1199884 1158199 727700 249918 23968 -60684 -185170
40323a85170n3653J57716J72278j02193k71051l8601L23110L70424J11809p7702
$$ -185170 -238823 -81107 91171 -11022 -282073 -320674 2436 372860 484669 406967
40313D06967m3043j5955j69923l06279j59472J66668L16296J74784j6849o3727
$$ 406967 363924 347969 178046 -128233 -287705 -121037 195259 370043 353194 289467
40303B89467n8520j14180j31094k9162K7739j00571k33837j36685P9958J40649
$$ 289467 230947 116767 -14327 -43489 -15750 -116321 -350158 -486843 -406885 -266236
40293b66236N3413L6813J10348J12004L4657r971o8283k18352k84419q8299J43675
$$ -266236 -212823 -176010 -65662 46342 80999 71028 2745 -215607 -500026 -588325 -444650
40282d44650R3225o6669M9295K96830J93757j95425l00714j9786J30613k2867
$$ -444650 -351425 -418094 -368799 -71969 121788 -73637 -374351 -394137 -263524 -286391
40272b86391k5662K62396K91517j89595n67440l26357J31625K28143J18391K00159
$$ -286391 -312053 -49657 241860 52265 -515175 -841532 -709907 -481764 -363373 -163214
40262a63214L07338J22630j09421l7442P0582j63280l91740o7410N01599N23782
$$ -163214 144124 266754 157333 119891 190473 27193 -364547 -431957 69642 593424
40252E93424r414l14659m1649L13394K83092l079k34793k95539j38534J73541
$$ 593424 584010 269351 227702 541096 824188 821109 586316 290777 152243 325784
40242C25784K90061k7725l73811j68047L91622N45010J54432r9153J42845L66597
$$ 325784 615845 588120 214309 46262 437884 982894 1137326 1038173 1181018 1547615
40232A547615J05130k89928k66724O0393J81228j3114j90267j54315o3594j18826
$$ 1547615 1652745 1362817 1096093 1156486 1337714 1324600 1134333 980018 916424 797598
40222G97598k85398l45501j58859J18027J61451o3339j70809P4547L02531O8277
$$ 797598 512200 166699 7840 125867 287318 223979 53170 127717 430248 498525
40212D98525l68723l63388J05175L81755J42534j84908j73471K6304J02630N1582
$$ 498525 129802 -233586 -128411 253344 395878 210970 37499 63803 166433 218015
40202B18015l2831j64495k16344N3594M75623M84644k4442l85861j05939L87558
$$ 218015 185184 20689 -195655 -142061 333562 818206 793764 407903 301964 689522
40192F89522M27806R1232q4291j4895m7465k11699j59140J61003L36038J09958
$$ 689522 1117328 1208560 1124269 1109374 1061909 850210 691070 852073 1188111 1298069
40182A298069k56523l87783k51312q1811n1527j19470j07209R1672L27659L21906
$$ 1298069 1041546 653763 402451 320640 269113 149643 42434 134106 461765 783671
40172G83671N4762j57496j18375m7104j78966l14528j33560K06279K34569r6528
$$ 783671 838433 680937 562562 515458 336492 21964 -111596 94683 329252 232724
40162B32724k95573n5941L00208L12790J8989j79374j02748N2965R4817Q0195
$$ 232724 -62849 -118790 181418 494208 513197 333823 231075 284040 378857 459052
40152D59052J15888J27413k086j72149j56797M5534J67154N7581r3522p9632k1810
$$ 459052 574940 702353 700267 528118 371321 416855 584009 641590 548068 468436 446626
40141D46626j29369k73996j65799J06463J40529j09316j79023J77224N19816L40193
$$ 446626 317257 43261 -122538 -16075 124454 15138 -163885 13339 533155 873348
40131H73348j56045l30911l6693K12566K2211l40832l71208k7045K50500J43762
$$ 873348 717303 386392 349699 562265 584476 243644 -127564 -154609 95891 239653
40121B39653j45156j91515P8982L02522J94409n9191j13808J124j4558j71448
$$ 239653 94497 -97018 -18036 284486 478895 419704 305896 307020 292462 121014
40111A21014j53127R3796J83207q1501l22925j71800J27708J33331n7210j5302
$$ 121014 -32113 61683 244890 163389 -159536 -331336 -203628 -70297 -127507 -142809
40101a42809K37031K50385n8950k35414m0002J67768O0959j17357j2417K17599
$$ -142809 94222 344607 285657 50243 10241 178009 238968 121611 109194 326793
40091C26793J80250q2721j79441k0219P6549m9802j58780o3616L6237q7972k71875
$$ 326793 507043 424322 244881 224662 301211 251409 92629 29013 65250 -22722 -294597
40080b94597j97437Q7761K19606P0301o1436P9352K97823K29124j15926l48498
$$ -294597 -492034 -404273 -184667 -114366 -175802 -96450 201373 430497 314571 -33927
40070c3927k33329K5542J20573N7382N6670J63071J88468M0415j16800j19512
$$ -33927 -267256 -241714 -121141 -63759 -7089 155982 344450 384865 268065 148553
40060A48553n0874p7783j52672q0893J32238K14813l90k94372l11714k3127K38629
$$ 148553 97679 19896 -132776 -213669 -81431 133382 132992 -161380 -473094 -496221 -257592
40049b57592K14563K2610n8832K4540R2333M7047N497N8743P6781q5879k82332
$$ -257592 -43029 -20419 -79251 -54711 37622 84669 90166 148909 225690 139811 -142521
40038a42521j98364J81988M56727K99873q4430k25313k0105J73197R6463o1530
$$ -142521 -340885 -158897 297830 597703 513273 287960 267855 441052 537515 475985
40028D75985k8901J00214M4459j88034l06096j83600k0995j3672q9473p3831M3944
$$ 475985 447084 547298 591757 403723 97627 -85973 -106968 -120640 -210113 -283944 -240000
40017b40000J18325L7554j56953k91069k00246P7893K90533K48013N4394o9917
$$ -240000 -121675 -84121 -241074 -532143 -732389 -654496 -363963 -115950 -61556 -131473
40007a31473j03106j58818j92820n6208J74025K33698R6724M2661J80867K23699
$$ -131473 -234579 -393397 -586217 -642425 -468400 -234702 -137978 -95317 85550 309249
39997C09249o1370m32839m70219j29285K40778L43117J95016J27q0182m2917q585
$$ 309249 247879 -184960 -655179 -784464 -543686 -200569 -5553 -5426 -85608 -128525 -137110
39986a37110m7680o1548N5205J87789J46649J1424M3271K26188K31314n6891l21066
$$ -137110 -184790 -246338 -191133 -3344 143305 154729 198000 424188 655502 598611 277545
39975B77545k87181j00986j8947j8154M2522J23138J09208J5089j05610k33723
$$ 277545 -9636 -110622 -129569 -147723 -105201 17937 127145 142234 36624 -197099
39965a97099k37486M2519M11078M03735k7135l28280j33111K04654K24578N5745
$$ -197099 -434585 -392066 19012 422747 395612 67332 -65779 138875 363453 419198
39955D19198M1262Q7812n6536k17423q5044J69832J63838l1152p3660j292q5388
$$ 419198 460460 548272 491736 274313 189269 359101 522939 491787 418127 416835 331447
39944C31447k18673q9575J65903J39262j15799j73145J0352Q4828J729M1872J71319
$$ 331447 112774 23199 189102 328364 212565 39420 49772 134600 136329 178201 349520
39933C49520O7474j91363j73492J07334J59855j10942k22278L2054K53786J72632
$$ 349520 416994 225631 52139 159473 319328 208386 -13892 18162 271948 444580
39923D44580K7453q929j17270k99612k24376J20998K67592L8736j54805p4865
$$ 444580 472033 463104 345834 46222 -178154 -57156 210436 249172 94367 19502
39913A9502l4936k00111k16408O5404J95901p8160k94641p0645K17636J18521
$$ 19502 -15434 -215545 -431953 -366549 -170648 -248808 -543449 -614094 -396458 -277937
39903b77937j19944o6788J34191J52562J25938K77912L35416J0766l28031j75592
$$ -277937 -397881 -464669 -330478 -177916 -51978 225934 561350 572116 244085 68493
39893F8493K35092K72262j11506l90743k95072m3820J15305J18226j4277j05816
$$ 68493 303585 575847 464341 73598 -221474 -265294 -149989 -31763 -46040 -151856
39883a51856J01057M69156M53453o2619m29157k10272R1243p4339l12981k3190
$$ -151856 -50799 418357 871810 809191 380034 169762 261005 186666 -126315 -149505
39873a49505M33267L05277k08352k92461O2143J13664k54102l72484o1193Q0572
$$ -149505 283762 589039 380687 88226 150369 264033 9931 -362553 -423746 -343174
39863c43174j43399j48217K86533N06629Q6771m32151m33570j07866P7910J27220
$$ -343174 -486573 -634790 -348257 158372 245143 -187008 -620578 -728444 -650534 -523314
39853e23314K01976J59438o3085j23315J47777L24243N4365l06261k68291J924
$$ -523314 -321338 -161900 -224985 -348300 -200523 123720 178085 -128176 -396467 -394543
39843c94543M1944j04445n1171K03971L06907J64660J2104n0371j14093j21025
$$ -394543 -352599 -457044 -508215 -304244 2663 167323 179427 129056 14963 -106062
39833a06062P5832L16514K30045j97917n10433l63204M0334K50597J32643m3448
$$ -106062 -30230 286284 516329 318412 -192021 -555225 -514891 -264294 -131651 -175099
39823a75099k222K03161L04309J78689l1300j64814k34682k74016j82126P4831
$$ -175099 -177321 25840 330149 508838 477538 312724 78042 -195974 -378100 -303269
39813c03269K71343K00232K1058K6419J66285J61984J6591o011J04128N9808j91002
$$ -303269 -31926 168306 189364 215783 382068 544052 560643 554632 658760 718568 527566
39802E27566l31332j91765Q134O9529P0074P1041k3832j55105p0538K06671K92562
$$ 527566 196234 4469 12603 82132 152206 223247 199415 44310 -26228 180443 473005
39791D73005M5081j75163j00698K5541o1262j72722n3871J42924J72377J27871
$$ 473005 518086 342923 242225 267766 206504 33782 -20089 122835 295212 423083
39781D23083J44659L7440k90043m26280j5736N28151N03099n0464m33348l22846
$$ 423083 567742 605182 315139 -111141 -126877 401274 904373 853909 420561 97715
39771I7715p8550l200M9206J87383K00966Q070j09623j437M4633j95462m32110
$$ 97715 19165 15965 65171 252554 453520 461590 351967 350530 395163 199701 -232409
39760b32409k80755J32040L60809K74521J31669J05904Q8032k2973j26317j12402
$$ -232409 -513164 -381124 -20315 254206 385875 491779 579811 556838 430521 318119
39750C18119n0126o2762j35490j59514j05096m6874l2653j6212N3030J38083J66164
$$ 318119 267993 205231 69741 -89773 -194869 -241743 -274396 -290608 -237578 -99495 66669
39739F6669J33491R0261M8460l743j0735R4048K12411J24326j94749m48280l66428
$$ 66669 200160 290421 338881 335138 324403 418451 630862 755188 560439 112159 -254269
39728b54269o4711J36571J60242J90930K78864K28781k7887k28838j35667J10583
$$ -254269 -318980 -182409 -22167 168763 447627 676408 648521 419683 284016 394599
39718C94599K13406J46950R4242O5827r3690l25625l33689n1893J76372P9584
$$ 394599 608005 754955 849197 915024 821334 495709 162020 110127 286499 366083
39708C66083j49704j94847j06003j15146j47838M5371L42181L24300k8686k11258
$$ 366083 216379 21532 -84471 -199617 -347455 -302084 40097 364397 335711 124453
39698A24453L4145K69222L2278m06123m24577J9940L47422J98608j36497k22742
$$ 124453 158598 427820 460098 53975 -370602 -350662 -3240 195368 58871 -163871
39688a63871m2532J16501Q7597m9337j34155p4068J08056K84034L13697J70082
$$ -163871 -206403 -89902 -2305 -51642 -185797 -259865 -151809 132225 445922 616004
39678F16004m0074j70296j41628j1669N3515k9864j02329M2170K78636K28800
$$ 616004 575930 405634 264006 252337 305852 275988 173659 215829 494465 723265
39668G23265j70558m70555l02659R9850K66915J44734K6892J6988k5735j00575
$$ 723265 552707 82152 -220507 -120657 146258 290992 317884 334872 309137 208562
39658B08562m4859J13705J52307J4998j34688k10815k46408j75917Q4070L58720
$$ 208562 163703 277408 429715 444713 310025 99210 -147198 -323115 -239045 119675
39648A19675L66400J37711m8072j05403j59149j80267l5616J26442J5864k54406
$$ 119675 486075 623786 575714 470311 311162 130895 95279 221721 237585 -16821
39638a6821k59105M7505K47262J60869R0510K05470K41714M2392j31614r7982
$$ -16821 -275926 -228421 18841 179710 270220 475690 717404 759796 628182 530200
39628E30200n2260r3678J8294L10097L55598N769j92902J70810O20671M84920
$$ 530200 477940 384262 402556 712653 1068251 1074020 881118 1051928 1672599 2157519
39618B157519o6280l49615k27584j23182j70313q7053J53890K19868M2995n4629
$$ 2157519 2091239 1741624 1514040 1390858 1220545 1133492 1287382 1507250 1550245 1495616
39608A495616L1637J525k75078m78775l37861j6620J84852J93983O9262j48755
$$ 1495616 1527253 1528778 1253700 774925 437064 420444 605296 799279 868541 719786
39598G19786l25056k54454K4991J87987N8609j35652j18029M3480J02073K7794
$$ 719786 394730 140276 165267 353254 411863 276211 158182 201662 303735 331529
39588C31529N693J18453K42001K54004J86927J29690Q3158m227j02103j09454
$$ 331529 337222 455675 697676 951680 1138607 1268297 1351455 1347228 1245125 1135671
39578A135671k8021o389j08361j48804N4151L38922L69929J30918n8304o3361
$$ 1135671 1107650 1101261 992900 844096 898247 1237169 1607098 1738016 1679712 1616351
39568A616351j10422k95928l15706K1774L41894J72148l33193n67479k90674J26663
$$ 1616351 1505929 1210001 894295 916069 1257963 1430111 1096918 529439 238765 365428
39558C65428K76457J62136m631j49350l10848m37248l72846m4087L85910N96935
$$ 365428 641885 804021 799390 650040 339192 -98056 -470902 -514989 -129079 467856
39548D67856M26183Q0822j03982r6648j37946k82277k94599r2871O9590L4976
$$ 467856 894039 974861 870879 774231 636285 354008 59409 -33462 36128 71104
39538G1104j1956N2816L4225j49560j87990R3748L29322J83487o3270k9800O1894
$$ 71104 59148 111964 146189 -3371 -191361 -97613 231709 415196 351926 322126 384020
39527C84020j51342l70776j03926L15492J29550m82639m88267L60078R95051N97978
$$ 384020 232678 -138098 -242024 73468 203018 -279621 -767888 -407810 587241 1185219
39517A185219k12705m14712p7130J628l23386m32012n8121L04997K27911n1534
$$ 1185219 972514 557802 480672 482300 158914 -273098 -331219 -26222 201689 150155
39507A50155r1171J03617J82730j534k13468j75075O9923K22697J35476J0347
$$ 150155 58984 162601 345331 343797 130329 -44746 25177 247874 383350 393697
39497C93697P4463J90189M6727l05609m45861j77856J92499L22709K66601K28776
$$ 393697 468160 658349 705076 399467 -46394 -224250 -31751 290958 557559 786335
39487G86335J72325k6953k27682j63307J29648L08455J62812j39829k81823j49308
$$ 786335 958660 931707 704025 540718 670366 978821 1141633 1001804 719981 570673
39477E70673P1088J06354q9567k65839j97408j1534m860j71566j94337M3684K52672
$$ 570673 641761 748115 658548 392709 195301 183767 178907 7341 -186996 -143312 109360
39466A09360J87380R526j3968Q3941J26914J34874K00993J96381n6557l95637
$$ 109360 296740 306266 292298 376239 503153 638027 839020 1035401 978844 583207
39456E83207m45285j37538J85259K41478J37192J27213K37206K59607M7412k86893
$$ 583207 137922 384 185643 427121 564313 691526 928732 1188339 1235751 948858
39446I48858m66723l32960k1704J84809J80967J12439J11093J10465J2406j14446
$$ 948858 482135 149175 127471 312280 493247 605686 716779 827244 839650 725204
39436G25204j41972p6825q037M1572P8608O0392m671N156J24685J67002q985k16239
$$ 725204 583232 506407 498370 539942 618550 678942 674271 679427 804112 971114 962129 745890
39424G45890j74258N9496J74624P9984j9918l1073j15075l24506m05399j58816
$$ 745890 571632 631128 805752 885736 865818 834745 719670 395164 -10235 -169051
39414a69051K21002L78727K21984n6977k44944k33324l1029J66892P6354k95983
$$ -169051 51951 430678 652662 595685 350741 117417 86388 253280 329634 33651
39404C3651n20671k58571K25471L90279J70136q28R5959J91326Q9691J6853J39506
$$ 33651 -487020 -745591 -520120 -129841 40295 39467 135426 326752 416443 433296 572802
39393E72802J81499q2732l19247j21708K62870K80944j4183n3173K64210L78933
$$ 572802 754301 671569 352322 230614 493484 774428 760245 707072 971282 1350215
39383A350215K7798k91620j44299J41704N4305k84854m01875k31787o1737M6073
$$ 1350215 1378013 1086393 942094 1083798 1138103 853249 451374 219587 157850 203923
39373B03923K32424L90190K65197m5149j63482N374J89196K12170J59453Q8053
$$ 203923 436347 826537 1091734 1046585 883103 888477 1077673 1289843 1449296 1537349
39363A537349n0518j89824j95189j29839j54688k05145j09454M0009K1034q5404
$$ 1537349 1486831 1297007 1101818 971979 817291 612146 502692 542701 563735 478331
39353D78331l2834Q4116l7458k91537k40328J36886L56399K18591R0269K00471
$$ 478331 445497 529613 492155 200618 -39710 97176 453575 672166 762435 962906
39343I62906K54730M5812j20026J3636J63715K072k92171l98706l69575l39747
$$ 962906 1217636 1263448 1143422 1157058 1320773 1322845 1030674 631968 262393 -77354
39333g7354j33120L32806O10982K81191l04870m24188K0653M50010M48640J41129
$$ -77354 -210474 122332 733314 1014505 709635 285447 306100 756110 1204750 1345879
39323A345879k03200m34171m09732r4402K11349J58006j24108j81800P3361K57078
$$ 1345879 1142679 708508 298776 204374 415723 573729 449621 267821 341182 598260
39313E98260J36431o0018o9696L2043M2710o1472j73919k16959j68078p5883n3185
$$ 598260 734691 674673 604977 637020 679730 618258 444339 227380 59302 -16581 -69766
39302f9766j09215p2891J26392K54011J21267l9328P1634K56383J00818k72285
$$ -69766 -178981 -251872 -125480 128531 249798 210470 282104 538487 639305 367020
39292C67020l07473R2923L78486K04649r1238j15245N885N28n4996m113J6600
$$ 367020 59547 152470 530956 735605 644367 529122 535007 535535 480539 476426 493026
39281D93026j15682j59711R3713L50988K12792j63991k92256j10151p490j43824
$$ 493026 377344 217633 311346 662334 875126 711135 418879 308728 301238 157414
39271A57414k41967j22175J1633l0184j05081j4543J68816K40401J37730p0663
$$ 157414 -84553 -206728 -195095 -225279 -330360 -344903 -176087 64314 202044 131381
39261A31381k92432l81918j96519J61777L39797J57355j08666q2746J77216K69277
$$ 131381 -161051 -542969 -739488 -577711 -237914 -80559 -189225 -271971 -94755 174522
39251A74522L5017k26069k04469L305R3437J501p4340k8427J6104l4861o0944
$$ 174522 209539 -16530 -220999 -217694 -124257 -122756 -197096 -225523 -209419 -244280 -305224
39240c05224P3968K68193K86093O4849k18070l63691l16228j21747J35065L16479
$$ -305224 -231256 36937 323030 387879 169809 -193882 -510110 -631857 -496792 -180313
39230a80313K86036O8309j19264q7469J02094K08992R5601j24107k21293r6580
$$ -180313 105723 174032 54768 -32701 69393 278385 373986 249879 28586 -67994
39220f7994J21604K02394M0228k20658l02005p4669K67574L72763J13321k43144
$$ -67994 53610 256004 296232 75574 -226431 -301100 -33526 339237 452558 209414
39210B09414l29628j22322M8045l6255j77152p7191J84575K53732M1117j37242
$$ 209414 -120214 -242536 -194491 -230746 -407898 -485089 -300514 -46782 -5665 -142907
39200a42907l8967J67510K12069J28128J07812J28346J6595j98573k94842k10594
$$ -142907 -181874 -14364 197705 325833 433645 561991 578586 380013 85171 -125423
39190a25423j26124j51292j63011k8632J92776L51601L67349K36132K3236j13300
$$ -125423 -251547 -402839 -565850 -594482 -401706 -50105 317244 553376 576612 463312
39180D63312n6219O4192j9139l12144m70520k50205J24718K44248N5930j05213
$$ 463312 407093 471285 452146 140002 -330518 -580723 -456005 -211757 -155827 -261040
39170b61040j0586J69289J57019j4077o2106R5566J69503r2557m61276m50379
$$ -261040 -271626 -102337 54682 40605 -21501 74065 243568 151011 -310265 -760644
39160g60644N203L93952L06589r439o4446J27412J42765j00670j95656N8901K98533
$$ -760644 -755441 -361489 -54900 -64339 -128785 -1373 141392 40722 -154934 -96033 202500
39149B02500J75495j00034j40202O882K4567r9105j02357M0060O6495j03178k30192
$$ 202500 377995 277961 137759 144641 169208 70103 -32254 7806 74301 -28877 -259069
39138b59069j61107m1018j3130O262J05844J73990R5693j5956L5806K56068M60148
$$ -259069 -420176 -461194 -474324 -468062 -362218 -188228 -92535 -108491 -72685 183383 643531
39127F43531M75721K59086r8888m05851m94902l81820k19536q6289N1723J68461
$$ 643531 1119252 1378338 1279450 873599 378697 -3123 -222659 -308948 -257225 -88764
39117h8764J70812J07366J48951K70002K14494o8296k42663q0620J44270R2655
$$ -88764 82048 189414 338365 608367 822861 754565 511902 431282 575552 668207
39107F68207o0121P1058L56639K84862j81159m51333j81085K18426K27084o0738
$$ 668207 608086 679144 1035783 1320645 1139486 688153 507068 725494 952578 891840
39097H91840k22605j68307r3830l6003P4452R0548j51423m07008k73273J55833
$$ 891840 669235 500928 407098 371095 445547 536095 384672 -22336 -295609 -139776
39087a39776L49933J06729j97132k28389j21784r1907m4478J37248K63523J40466
$$ -139776 210157 316886 119754 -108635 -230419 -322326 -366804 -229556 33967 174433
39077A74433n2172m2844O2351l0601k64197k79142Q472K48459J60320r6803j96992
$$ 174433 122261 79417 141768 111167 -153030 -432172 -423700 -175241 -14921 -111724 -308716
39066c08716q0137N5916P5323M4925P1503J21022O7159j06150k38855j94121n3755
$$ -308716 -388853 -332937 -257614 -212689 -141186 -20164 46995 -59155 -298010 -492131 -545886
39055e45886Q460k606N2937J49834R4005j17554k10561m8820J34504J19772M8811
$$ -545886 -537426 -540032 -487095 -337261 -243256 -360810 -571371 -620191 -485687 -365915 -317104
39044c17104J27631K31404J39188m2657p3076l1392j54347l30750k34851O9480
$$ -317104 -189473 41931 181119 138462 65386 33994 -120353 -451103 -685954 -616474
39034f16474J60864m7765j50801P2271K96921K03124l0528p5216L5745N3728o9621
$$ -616474 -455610 -503375 -654176 -581905 -284984 -81860 -112388 -187604 -151859 -98131 -167752
39023a67752j91443k11838q8594J75369L89209K81664o6557k10119K1101K30024
$$ -167752 -359195 -571033 -659627 -484258 -95049 186615 120058 -90061 -68960 161064
39013A61064R2715j06518M161K01769N6235k72865k61230R8311K92386J37524
$$ 161064 253779 147261 151422 353191 409426 136561 -124669 -26358 266028 403552
39003D03552j7714o138r7117l49708l46668R1026M60273K78004j75386k80082
$$ 403552 385838 379700 282583 -67125 -413793 -322767 137506 415510 240124 -39958
38993c9958L6959L06832K40444N247j55449k05991k08695j98756j92793j59626
$$ -39958 -2999 303833 544277 549524 394075 188084 -20611 -219367 -412160 -571786
38983e71786k5952J57312J75196n2084k74686k35933m6832K2989o322Q4140K48198
$$ -571786 -597738 -440426 -265230 -317314 -592000 -827933 -874765 -851776 -858098 -773958 -525760
38972e25760J89509j15821k82254n9164K77425L02792K2522j80637r1494J03289
$$ -525760 -336251 -452072 -734326 -793490 -516065 -213273 -190751 -371388 -462882 -359593
38962c59593J54467J04907J55110K87835K55473j8103k48214j79084N080n8501
$$ -359593 -205126 -100219 54891 342726 598199 580096 331882 152798 157878 99377
38952I9377l22170l63185m1062K74359K80271J56801J56668J51539n1735k54095
$$ 99377 -222793 -585978 -627040 -352681 -72410 84391 241059 392598 340863 86768
38942H6768j68950M2010K4065j38354p3229J81401K04402o6421k02402j8915J19835
$$ 86768 -82182 -40172 -16107 -154461 -227690 -46289 158113 91692 -110710 -129625 -9790
38931i790m3384k11266n7864K20202K41694R989k03889k85440k58919q2880K10654
$$ -9790 -53174 -264440 -322304 -102102 139592 149581 -54308 -339748 -598667 -681547 -470893
38920d70893L72231K39580J2748n1296k4679r9777j97162j16460P9652J71434
$$ -470893 -98662 140918 153666 102370 77691 -22086 -219248 -335708 -256056 -84622
38910h4622J51569J65648J89715Q7047r7352k01072k23645k57366k41046q9660
$$ -84622 66947 232595 422310 509357 412005 210933 -12712 -270078 -511124 -600784
38900f00784L3613p8587k67477j66223K37256N33389M22611L5411l01892l73904
$$ -600784 -567171 -645758 -913235 -1079458 -842202 -308813 113798 149209 -152683 -526587
38890e26587j52259J91130L58299K34557P3249J45521L12266K38056o9023k77951
$$ -526587 -678846 -487716 -129417 105140 178389 323910 636176 874232 805209 527258
38880E27258k35574r2873K8623J33575J42214m2502k59235k42065m2239O3521
$$ 527258 291684 198811 227434 361009 503223 460721 201486 -40579 -82818 -19297
38870a9297M3809Q2512J29149l4530k83824k46118L3566Q9934j71420k67207O3401
$$ -19297 24512 107024 236173 201643 -82181 -328299 -294733 -204799 -376219 -643426 -580025
38859e80025M20039L94013J39534l6241j63990l23785l19345m9420J85518J45230
$$ -580025 -159986 234027 373561 337320 173330 -150455 -469800 -519220 -333702 -188472
38849a88472M7116J12697J11936j90082m97115l95802j2231K41179L07928L69189
$$ -188472 -141356 -28659 83277 -106805 -603920 -999722 -1011953 -770774 -462846 -93657
38839i3657L33525O690l89352m21517r6897J72598J94003J37860J23949R4193
$$ -93657 239868 246558 -142794 -564311 -661208 -488610 -294607 -156747 -32798 61395
38829F1395N3563M6135m3822k90274m28853j75695K52360L77283J51203m1303
$$ 61395 114958 161093 117271 -173003 -601856 -777551 -525191 -147908 3295 -38008
38819c8008k3003N850o3607p9838O457K6898p3692j44749j24300r8050m5299J31370
$$ -38008 -61011 -55161 -118768 -198606 -192149 -165251 -238943 -383692 -507992 -606042 -651341 -519971
38807e19971L07598K25378p9601k69034j63568P5819K32587K24139M8410j72563
$$ -519971 -212373 13005 -66596 -335630 -499198 -423379 -190792 33347 81757 -90806
38797i0806j80506Q3092K71544J17216q5723N1403K82292P8965m22206n44131
$$ -90806 -271312 -188220 83324 200540 114817 166220 448512 527477 105271 -438860
38787d38860j36566K14766J53815N871O8189J49570R7481J32459L20571L11897
$$ -438860 -575426 -360660 -206845 -200974 -132785 16785 114266 246725 567296 879193
38777H79193k5328k64108r9364J52210J32615J6041P1291J34276j2813j70772
$$ 879193 853865 589757 490393 642603 775218 791259 862550 996826 984013 813241
38767H13241j11455l5196j59048k36733N814L20387L46343K28016K74888L28465
$$ 813241 701786 666590 507542 270809 276623 597010 943353 1171369 1446257 1774722
38757A774722O6509l23090l93289j72826m6272n3013Q2782L19674L06221L120
$$ 1774722 1841231 1518141 1124852 952026 905754 852741 935523 1255197 1561418 1564538
38747A564538k48972k90273k78274k71730j61248j4765k4514j08770k2043J53524
$$ 1564538 1315566 1025293 747019 475289 314041 299276 274762 165992 143949 297473
38737B97473J06122j24212j71352J9767J03277m5824j39457k5791P2721K7878
$$ 297473 403595 279383 108031 127798 231075 185251 45794 20003 92724 120602
38727A20602L0024J56944J79971J4380p6515L9331J06725l6203j44662l4456M5944
$$ 120602 150626 307570 487541 501921 425406 464737 571462 535259 390597 356141 402085
38716D02085j32127l22702k12712K8129N4907m5579N1490K74010K39380o7733
$$ 402085 269958 -52744 -265456 -237327 -182420 -227999 -176509 97501 336881 269148
38706B69148k19611k9917J44561j9625k96848k55074J06205L66697K62621n853
$$ 269148 49537 19620 164181 144556 -152292 -407366 -301161 65536 328157 322304
38696C22304q1212J13027L31548L15982M8088k74387m28021l26646p3329J17709
$$ 322304 241092 354119 685667 1001649 1049737 775350 347329 20683 -52646 65063
38686F5063J06933l2962j15669q1752m0324m3514K5709K27576L68198K19023j28639
$$ 65063 171996 139034 23365 -58387 -98711 -142225 -116516 111060 479258 698281 569642
38675E69642l24797j79851J29305K88313J61970j26631l32648k98617r2544Q5260
$$ 569642 244845 64994 194299 482612 644582 517951 185303 -113314 -205858 -120598
38665a20598J58051K23602K97265K07609r0765l13839k17745M963K1670r5051
$$ -120598 37453 261055 558320 765929 675164 361325 143580 148543 170213 75162
38655G5162k0218K09690K11637q1750k60587q3820J59258J51609R913k7414j1940
$$ 75162 54944 264634 476271 394521 133934 50114 209372 360981 370894 343480 331540
38644C31540o7063p5841N5931R9948j32317l55117j84473K06486K94143N462j86880
$$ 331540 264477 188636 244567 344515 212198 -142919 -327392 -120906 173237 178699 -8181
38633h181j7521K04089J43680m8890l6499J86771L47606K85667O1738j97742l69483
$$ -8181 -25702 178387 322067 273177 236678 423449 771055 1056722 1118460 920718 551235
38622E51235l56218k12205j40898k12426k14312K7515L16006L26230R1096n7927
$$ 551235 195017 -17188 -158086 -370512 -584824 -557309 -241303 84927 176023 118096
38612A18096r994O698j09190j14851J24775K89720M4595l78347m40444p2810K27446
$$ 118096 108102 114800 5610 -109241 15534 305254 349849 -28498 -468942 -541752 -314306
38601c14306J34544p6545k6080J84729J89667m4712j78592J00L12450M43670K70808
$$ -314306 -179762 -256307 -282387 -97658 92009 47297 -131295 -131195 181255 624925 895733
38590H95733p5679l30216k83114J0480K40934J91582N910n9162m4182j78780m01620
$$ 895733 820054 489838 206724 217204 458138 649720 655630 596468 552286 373506 -28114
38579b8114l44379Q8851M46828K85597j97386l81261k0107M48472M61935J3375
$$ -28114 -372493 -283642 163186 448783 251397 -129864 -149971 298501 760436 773811
38569G73811l75887l04200N6394K31994O0620j58830j40161Q989L5357l9055j9979
$$ 773811 397924 93724 150118 382112 442732 283902 143741 152730 188087 149032 129053
38558A29053N7141k3448k19391k14280O3830K67751J65826K0054J38019L16985
$$ 129053 186194 162746 -56645 -270925 -207095 60656 226482 246536 384555 701540
38548G01540J37698l17782m91633j43289K75504K32343j68510l56431p0667L19899
$$ 701540 839238 521456 29823 -113466 162038 394381 225871 -130560 -201227 118672
38538A18672L29412j9557k63319j27671J32396J27435j06890j86911K7451K16276
$$ 118672 448084 428527 165208 37537 169933 297368 190478 3567 31018 247294
38528B47294Q5706j89599k38492l8859R9243L3764l1349Q3281K51219K60143J16962
$$ 247294 333000 143401 -95091 -133950 -34707 -943 -32292 50989 302208 562351 679313
38517F79313k9685j29535k05835j84265K9434L06878L48620O1164k75831l40267
$$ 679313 649628 520093 314258 129993 159427 466305 814925 876089 600258 259991
38507B59991j53564Q982J0261m1352n9717j24140k62586k94923q1494J91582K05745
$$ 259991 106427 115409 125670 84318 24601 -99539 -362125 -657048 -738542 -546960 -341215
38496c41215m2079k12976q7001J60687K46323J56200P0559L5019o5202k23628
$$ -341215 -383294 -596270 -683271 -522584 -276261 -120061 -49502 -14483 -79685 -303313
38486c03313k35293J820K66043K54599j6885k29406j81800k1305K8135P87P4988
$$ -303313 -538606 -536786 -270743 -16144 -33029 -262435 -444235 -465540 -437405 -436618 -361630
38475c61630K25520K30933K9078j67941j78353o1737N9173J67852K23998J03503
$$ -361630 -136110 94823 123901 -44040 -222393 -284130 -224957 -57105 166893 270396
38465B70396j46278k26366r461J79445K3720k45575j81873J43808K41129O004
$$ 270396 124118 -102248 -111709 67736 91456 -154119 -335992 -192184 48945 54949
38455E4949j23873O1272J69412j14836m49175l41093R1140L17854J69586k7790
$$ 54949 -68924 -7652 161760 46924 -402251 -743344 -652204 -334350 -164764 -192554
38445a92554j0695J20086J65631R1366k7640j14674j11627l1919K0555j0856n2804
$$ -192554 -203249 -83163 82468 173834 146194 31520 -80107 -112026 -91471 -102327 -155131
38434a55131n3114p2985j04000K188K31112K75612n918k43693o1314K71430J91269
$$ -155131 -208245 -281230 -385230 -383042 -151930 123682 117764 -125929 -187243 84187 275456
38423B75456k49916m09040m2278L15368J80578j87236k68449m9380J07935Q1065
$$ 275456 25540 -383500 -425778 -110410 70168 -117068 -385517 -434897 -326962 -245897
38413b45897L7984L3713l1494j13524m2607J58681K65469J77887J7474j15061
$$ -245897 -207913 -174200 -205694 -319218 -361825 -203144 62325 240212 257686 142625
38403A42625k41673l29873k40891N3446L58318M48085K75112m3697l33156m26861
$$ 142625 -99048 -428921 -669812 -616366 -258048 190037 465149 421452 88296 -338565
38393c38565k67609p639J03495J0345o1100R8231L65198L98268P0472l29207m07090
$$ -338565 -606174 -613813 -510318 -499973 -561073 -462842 -97644 300624 371096 41889 -365201
38382c65201j22681J77777J94232P599j03227n1453K7651O6051J38010K22009
$$ -365201 -487882 -310105 -115873 -108274 -211501 -262954 -235303 -169252 -31242 190767
38372A90767J45996j12134k95132k12383k7240J3925k3670Q9073L04684L20552
$$ 190767 336763 224629 -70503 -282886 -310126 -296201 -319871 -230798 73886 394438
38362C94438M2467k57842l18370j87920n3313L7745J40131K22438J70035l8394
$$ 394438 436905 179063 -139307 -327227 -380540 -342795 -202664 19774 189809 151415
38352A51415k36631j95444J14850L95525K90363j42414m12832k18291J25769J50781
$$ 151415 -85216 -280660 -165810 229715 520078 377664 -35168 -253459 -127690 23091
38342B3091o3649p0192J70435K28174k4159j46335J24393L83243J94466j98623
$$ 23091 -40558 -110750 59685 287859 263700 117365 241758 625001 819467 620844
38332F20844k70178j9727J23086Q080j36012k05643l12282l88147j96543J98016
$$ 620844 350666 330939 454025 462105 326093 120450 -191832 -579979 -776522 -578506
38322e78506M05465K61597K7734n8851o2829o5857J6539J68447J73827k1193j57882
$$ -578506 -173041 88556 116290 57439 -5390 -71247 -54708 113739 287566 266373 108491
38311A08491p1946N4004M9623M9612J77074K45576Q4881j09823r9744l2444j58657
$$ 108491 36545 90549 140172 189784 366858 612434 697315 587492 487748 455304 296647
38300B96647l14960j41880K78696M72314K69576K2437L1448J43483Q7931r7942
$$ 296647 -18313 -160193 118503 590817 860393 882830 914278 1057761 1145692 1047750
38290A047750j97202j54777p6951k2554J8803J8839o2980j76708k12279j23120
$$ 1047750 850548 695771 618820 596266 615069 633908 570928 394220 181941 58821
38280E8821L2538J48936J43468J4949j34203j70493n9047R1912J29695J840j81265
$$ 58821 91359 240295 383763 398712 264509 94016 34969 126881 256576 258416 77151
38269G7151k30078o5702J67888K41566R9552r6291j78433j13613O5893K87857
$$ 77151 -152927 -218629 -50741 190825 290377 194086 15653 -97960 -32067 255790
38259B55790L57343R0019l46788m81803j41780K32118J64757j59248j71558K22694
$$ 255790 613133 703152 356364 -125439 -267219 -35101 129656 -29592 -201150 21544
38249B1544N15727L50527l0031k28458k19214k08890k39828j88461j2408J96672
$$ 21544 537271 887798 857767 629309 410095 201205 -38623 -227084 -239492 -42820
38239d2820L16401K46698n181k11524r2018K77444M39355J34894k83465k88366
$$ -42820 273581 520279 515098 303574 211556 489000 928355 1063249 779784 491418
38229D91418R7240L30107R0636l15478m10481j58887P5045O4122l2787R310J19512
$$ 491418 588658 918765 1009401 693923 283442 124555 199600 263722 230935 240245 359757
38218C59757O0324j65806k70950j01473J07936P0728j14164j19480P5967J26883
$$ 359757 420081 254275 -16675 -118148 -10212 60516 -53648 -173128 -97161 29722
38208B9722j24618l36047j30538L18846M78376J77941j71239j73224K3174K6781
$$ 29722 -94896 -430943 -561481 -242635 235741 413682 242443 69219 92393 119174
38198A19174j56400j54484J15853K48944o898k91851j85009R0937L4049k51425
$$ 119174 -37226 -191710 -75857 173087 166189 -125662 -310671 -219734 -185685 -437110
38188d37110j91952K40056L95332L6015k19907L7248K58677r3921n03242k10176
$$ -437110 -629062 -389006 6326 42341 -177566 -140318 118359 24438 -478804 -688980
38178f88980M23626M29757j58666l75915K7766K21856j81389m34451p56M77347
$$ -688980 -265354 164403 5737 -370178 -342412 -120556 -301945 -736396 -737152 -259805
38168b59805K88552j60532j39791J32515j1140m19463l85515R3968L19265O5987
$$ -259805 28747 -131785 -271576 -139061 -150201 -569664 -955179 -861211 -541946 -475959
38158d75959j45240n917J62948R4842j5461J7550P0646O6309J23434K03296Q3536
$$ -475959 -621199 -627116 -464168 -369326 -384787 -367237 -296591 -230282 -106848 96448 179984
38147A79984j79180k31761j847J75916J33250P1982O1280j12849l89090l16263
$$ 179984 804 -230957 -232804 -56888 76362 148344 209624 96775 -292315 -608578
38137f08578J74399M56837J22023l12160j77732K70069K57676k58162n12263j13005
$$ -608578 -434179 22658 144681 -167479 -345211 -75142 182534 -75628 -587891 -700896
38127g00896M07711M42424J22825p3524r7761k31865m42681l62389O4580L66354
$$ -700896 -293185 149239 272064 198540 100779 -131086 -573767 -936156 -871576 -505222
38117e05222J78773k17219k93622k2816J46569J1626j09659M7703K42041J38110
$$ -505222 -326449 -543668 -837290 -860106 -713537 -701911 -811570 -763867 -521826 -383716
38107c83716j18388j35478P7958J39508o5174k05391n7434J55108J50888J0498
$$ -383716 -502104 -637582 -559624 -420116 -485290 -690681 -748115 -593007 -442119 -431621
38097d31621k0927P1803J18235O5045J6585L8046Q0938P6444O436q9815j38842
$$ -431621 -452548 -380745 -262510 -197465 -180880 -142834 -61896 14548 20984 -68831 -207673
38086b07673j13223q6357j18696j22928Q359J70249J48681l3286j08085L9004
$$ -207673 -320896 -407253 -525949 -648877 -640518 -470269 -321588 -354874 -462959 -423955
38076d23955J98717J57536k3217j47600j09257R8308L73371M48378J30366l01230
$$ -423955 -225238 -67702 -90919 -238519 -347776 -249468 123903 572281 702647 401417
38066D01417k85850K43485O42384L94840j75223m05837k06537J809L4291Q1539
$$ 401417 115567 359052 1001436 1396276 1221053 815216 608679 610488 644779 726318
38056G26318J92375J78438P3889J70620M74246N99206L80452J42377J29495J05600
$$ 726318 918693 1097131 1171020 1341640 1815886 2415092 2795544 2937921 3067416 3173016
38046C173016j62119m17388l38169j42793k66569o01451o03095j44795K53470
$$ 3173016 3010897 2593509 2255340 2112547 1845978 1244527 641432 496637 750107
38037G50107J73628j64930l26898k47879j22678k878J51176K08759K7754k13846
$$ 750107 923735 758805 431907 184028 61350 58472 209648 418407 446161 232315
38027B32315j98130M5244J74129P8426K5372J56003K10853j1876k43354j29053
$$ 232315 34185 79429 253558 331984 357356 513359 724212 712336 468982 339929
38017C39929J80691K20146q9617l21429j65042J71768L03284J40435j22076k87291
$$ 339929 520620 740766 651149 329720 164678 336446 639730 780165 658089 370798
38007C70798k70743r2955R4603R7267q3607k07565r4609J51518L20127L54946
$$ 370798 100055 7100 101703 198970 115363 -92202 -186811 -35293 284834 639780
37997F39780L12223J94987q981k19297l39903l61572k76906l1712K86341L78670
$$ 639780 952003 1146990 1138009 918712 578809 217237 -59669 -91381 194960 573630
37987E73630R6679k46252k10642J71495M26238K63527j15001l69799l92065k34985
$$ 573630 670309 424057 213415 384910 811148 1074675 959674 589875 197810 -37175
37977c7175L1674K48590K01492q0291k60523j24682J11702J31449k6478r1548
$$ -37175 -5501 243089 444581 364290 103767 -20915 90787 222236 195758 104210
37967A04210l18Q2602R4067J14679J21412J8593p5364Q9608M50178O06068L92440
$$ 104210 103892 186494 280561 395240 516652 535245 459881 549489 999667 1605735 1998175
37956A998175J52211K03341L24176J06527l69611o13939m27251j43580j12071
$$ 1998175 2150386 2353727 2677903 2784430 2414819 1800880 1373629 1230049 1117978
37947A117978k62937l25160k20240n6823Q8909J90959J79343J7824j67140j93645
$$ 1117978 855041 529881 309641 252818 341727 532686 712029 729853 562713 369068
37937C69068n9391N1301J5009p4323n1401P3388J04236p3043k93185k95929q4828
$$ 369068 309677 360978 375987 301664 250263 323651 427887 354844 61659 -234270 -319098
37926c19098P6240P6981J35858L84640N24125K36303k18756k81936M7887J64267
$$ -319098 -242858 -165877 -30019 354621 878746 1115049 896293 614357 662244 826511
37916H26511j97379n09801k84885J36830J38349j83247k09319J76741M24286K12722
$$ 826511 629132 119331 -165554 -28724 109625 -73622 -282941 -106200 318086 530808
37906E30808r7741j02062P5266J26117P7186J20978K04749J33910p2693k19140
$$ 530808 433067 331005 406271 532388 609574 730552 935301 1069211 996518 777378
37896G77378k22384j41016j1670J39849K06913J08850o3939j47803q7352O7553
$$ 777378 554994 413978 402308 542157 749070 857920 793981 646178 558826 626379
37886F26379K31024K62279M4236k96534m29748k29194N1400J66209J94920K55267
$$ 626379 857403 1119682 1163918 867384 437636 208442 259842 426051 620971 876238
37876H76238J92908r5028k90594p5762K56169J61529k55930l32491J01846M18558
$$ 876238 1069146 974118 683524 607762 863931 1025460 769530 437039 538885 957443
37866I57443J86862j56665o1659K43723J86996j92391l66132j95357l7647m5632
$$ 957443 1144305 987640 925981 1169704 1356700 1164309 798177 602820 565173 519541
37856E19541N921J47976Q7815j89568k60892L8662K72467R6005j65499o7343K03431
$$ 519541 525462 673438 761253 571685 310793 349455 621922 717927 552428 485085 688516
37845F88516J57961j55025k24581P9398L02998J33601j50238j47860J02985K76454
$$ 688516 846477 691452 466871 546269 849267 982868 832630 684770 787755 1064209
37835A064209K33229J08565O0312J21671K39127L25176L04276J70693k5848k43862
$$ 1064209 1297438 1406003 1466315 1587986 1827113 2152289 2456565 2627258 2601410 2357548
37825B357548m24193m37568k01815J44070L33013K68557J00982j2089o9851j14448
$$ 2357548 1933355 1495787 1293972 1438042 1771055 2039612 2140594 2128505 2058654 1944206
37815A944206j10794k7714O3472N8506n0272j46943q5342J49613L55896L03392
$$ 1944206 1833412 1805698 1869170 1927676 1877404 1730461 1645119 1794732 2150628 2454020
37805B454020O4549k4038J49765K62988O1441j84740q7062K11174K52892J0793
$$ 2454020 2518569 2494531 2644296 2907284 2968725 2783985 2696923 2908097 3160989 3171782
37795C171782j10757J4460P9365l7245n4407J56489L29191L16584L39871M86330
$$ 3171782 3061025 3075485 3154850 3117605 3063198 3219687 3548878 3865462 4205333 4691663
37785D691663M66686J74967Q233K67920O62981P77446O51874N47521N13942N48540
$$ 4691663 5158349 5333316 5341549 5609469 6272450 7049896 7701770 8249291 8763233 9311773
37775I311773P98621J230141J479246J414804J456766J945002K605147L059793
$$ 9311773 10110394 11340535 12819781 14234585 15691351 17636353 20241500 23301293
37767B3301293L446303M081893M939707N913419P176952Q851587J0783019J3046056
$$ 23301293 26747596 30829489 35769196 41682615 48859567 57711154 68494173 81540229
37759H1540229J6146756K0449295K6087427L3276034M0785048M3388804L3736603
$$ 81540229 97686985 118136280 144223707 177499741 218284789 261673593 295410196
37752B95410196J0087875j8612429l8729609m3752603l8267336l0533222k4364791
$$ 295410196 305498071 286885642 248156033 204403430 166136094 135602872 111238081
37745A11238081j9245123j4765310j1675790r881826q278967o503268n103739
$$ 111238081 91992958 77227648 65551858 55670032 47391065 40887797 35784058
37738C5784058m175571l276651k489596k244936k258337j847751j148021q63676
$$ 35784058 31608487 28331836 25842240 23597304 21338967 19491216 18343195 17479519
37730A7479519r54254p04646l6973L59945K41467J15757K53249L37888K31459
$$ 17479519 16525265 15820619 15783646 16143591 16385058 16500815 16754064 17091952 17323411
37721A7323411K05854K61676K1728n37513r79336j149046j313751j479558j316311
$$ 17323411 17529265 17790941 17812669 17275156 16295820 15146774 13833023 12353465 11037154
37712A1037154q87590p14768r35040j079832q70691n82898m46929l32946k06469
$$ 11037154 10149564 9434796 8499756 7419924 6549233 5966335 5519406 5186460 4979991
37703D979991k64526m37758l75166r1044j275j67424j83068J4199l7168m27248
$$ 4979991 4715465 4277707 3902541 3811497 3810222 3642798 3459730 3473929 3436761 3009513
37693C009513n63226j40825K77053J27978l06455m22579j47115K05131M52463
$$ 3009513 2446287 2305462 2582515 2710493 2404038 1981459 1834344 2039475 2491938
37684B491938M74715R2852n10857p04630k23530L56985M46215K69817L13994M07930
$$ 2491938 2966653 3059505 2548648 1844018 1620488 1977473 2423688 2693505 3007499 3415429
37674C415429Q2171m80398o42530l30936j14345k63370m07785k41415J6445O0875
$$ 3415429 3497600 3017202 2374672 2043736 1929391 1666021 1258236 1016821 1033266 1094141
37664A094141n3778j26813j24295q0102M3351K13441K60380J14735n1710o1470
$$ 1094141 1040363 913550 789255 709153 752504 965945 1226325 1341060 1289350 1227880
37654A227880K0334N64j62053l01541k43268J03K30923K58344Q8793r4872j34081
$$ 1227880 1248214 1248778 1086725 785184 541916 542019 772942 1031286 1120079 1025207 891126
37643H91126k3212J40010K35247J62981n8396k32191j80612k1392m3592k50067
$$ 891126 867914 1007924 1243171 1406152 1347756 1115565 934953 913561 869969 619902
37633F19902k76312P8387M69539M08170q9076n18002n09009j84417J17091K35619
$$ 619902 343590 421977 891516 1299686 1210610 692608 183599 -818 116273 351892
37623C51892K11659R6906p3244j83389j10401O6968J00170p4039j66290P4414
$$ 351892 563551 660457 587213 403824 293423 360391 460561 386522 220232 294646
37613B94646M25031M48207J37644q5018n8475r1931l11228l31219M9135L38914
$$ 294646 719677 1167884 1305528 1220510 1162035 1070104 758876 427657 476792 815706
37603H15706R7774k44750l1274M61227L65110l57990p60364l27055L08663M10154
$$ 815706 913480 668730 637456 1098683 1463793 1105803 345439 18384 327047 737201
37593G37201J43271M9107J17640j2955l14713m10525j77651J29867K61621J75922
$$ 737201 880472 929579 1047219 1034264 719551 309026 131375 261242 522863 698785
37583F98785k4423j51803o3919J28821J63305P611j04359p6032o3806j28841j48681
$$ 698785 674362 522559 458640 587461 750766 758377 654018 577986 514180 385339 236658
37572B36658j38754k25819k42752J07992N79871N24846o7253l86870k1625L83117
$$ 236658 97904 -127915 -370667 -262675 317196 842042 774789 387919 366294 749411
37562G49411J91781k14339j75943J33435J51683j5494J15307L97552K68068k08121
$$ 749411 941192 726853 550910 684345 836028 820534 935841 1333393 1601461 1393340
37552A393340l97255j41237Q2117M1664Q805P9168o00k11447j84806Q7566J41481
$$ 1393340 996085 854848 936965 978629 987434 1066602 1066002 854555 669749 757315 898796
37541H98796j56052l30865q6019K26473K18091K4540o6623q3663j30389q6727
$$ 898796 742744 411879 325860 552333 770424 794964 728341 644678 514289 427562
37531D27562J05102K02770N1985q6838O2530L17025K98631n574k63229k63001
$$ 427562 532664 735434 787419 700581 763111 1080136 1378767 1373193 1109964 846963
37521H46963r3856P1539J50940J33470M0025q6737k02893k52981j65382M5958
$$ 846963 753107 824646 975586 1109056 1149081 1062344 859451 606470 441088 487046
37511D87046K06334J45606p2888k23146j91206m3698J21099K23558J68329m1542
$$ 487046 693380 838986 766098 542952 351746 308048 429147 652705 821034 779492
37501G79492k04655j40746L0973L9056j49901k91081j89834R5071L34369K94952
$$ 779492 574837 434091 465064 504120 354219 63138 -126696 -31625 302744 597696
37491E97696n8323m08106l39120Q7114K98953P582l12684j20983L56326N09233
$$ 597696 539373 131267 -207853 -120739 178214 185796 -126888 -247871 108455 617688
37481F17688K86202J32413J61068O4369k00579l06389j71451o1109k3858J50651
$$ 617688 903890 1036303 1197371 1261740 1061161 754772 583321 522212 498354 649005
37471F49005L47724J71998k91694m45279j10851J81636J05417L6345K64652L89995
$$ 649005 996729 1168727 877033 431754 320903 502539 607956 644301 908953 1298948
37461A298948L4881l99731l17123J28903K98822L5170k18745j47262R5716K45814
$$ 1298948 1333829 934098 616975 745878 1044700 1079870 861125 713863 809579 1055393
37451A055393K30337Q7238j31950l31298m02643l10138r9773J17039K03565J46971
$$ 1055393 1285730 1372968 1241018 909720 507077 196939 97166 214205 417770 564741
37441E64741J15510J95653J94050l4994k32625r2252J89629K09141N1636R5950
$$ 564741 680251 875904 1069954 1034960 802335 710083 899712 1108853 1160489 1256439
37431A256439K49610J05161k05849j67976Q4172j27894p17520p32457N0638N73407
$$ 1256439 1506049 1611210 1405361 1237385 1321557 1193663 476143 -256314 -205676 367731
37421C67731J57306l90407j68153L51584K89951q9250j1902L22015K03147j42893
$$ 367731 525037 134630 -33523 318061 608012 518762 506860 828875 1032022 889129
37411H89129M4970N34985L91468l21522n43998k1188K76968j61623n77948l13231
$$ 889129 934099 1469084 1860552 1539030 995032 973844 1250812 1089189 511241 198010
37401A98010J33801P1887k74138l28756j31153l5830J1313K36370M68245L94476
$$ 198010 331811 403698 129560 -199196 -330349 -366179 -354866 -118496 349749 744225
37391G44225J17661k1730K3344K8266j09255k69794k79861m7069L05302M27339
$$ 744225 861886 840156 863500 891766 782511 512717 232856 185787 491089 918428
37381I18428J34503k34356k22459N2892J02554r8988j00360J74743K62088p051
$$ 918428 1052931 818575 596116 649008 751562 652574 552214 726957 989045 981994
37371I81994k12969j24995o4688j92934j56420J67275K93987j1555k04854J20672
$$ 981994 769025 644030 579342 386408 229988 397263 691250 679695 474841 595513
37361E95513M39530J31017m41495m91455m0202K42862J50940O1483J09034M8345
$$ 595513 1035043 1166060 724565 233110 192908 435770 586710 648193 757227 805572
37351H05572r3295J8591L44759M23327J21750j45625r6961M5258L5842j2478N2414
$$ 805572 712277 730868 1075627 1498954 1620704 1475079 1378118 1423376 1459218 1446740 1499154
37340A499154J15311M7925k4293N9756K14700K35194P6067j23294k14749j75744
$$ 1499154 1614465 1662390 1638097 1697853 1912553 2147747 2223814 2100520 1885771 1710027
37330A710027j09979j05513q0546J09221L67213L79281O9265k24460k31878j36227
$$ 1710027 1600048 1494535 1413989 1523210 1890423 2269704 2338969 2114509 1882631 1746404
37320A746404j98222k81317j32832J00490R3269q5653j04315L1337J2996j70448
$$ 1746404 1548182 1266865 1134033 1234523 1327792 1242139 1137824 1169161 1182157 1011709
37310A011709j85249N3069K27059J56124L7198K1795j8103j40789j52708K7401
$$ 1011709 826460 879529 1106588 1262712 1299910 1321705 1303602 1162813 1010105 1037506
37300A037506J73471J24900M2137R6351K00978K42179K79625L18356J87219j16183
$$ 1037506 1210977 1335877 1378014 1474365 1675343 1917522 2197147 2515503 2702722 2586539
37290B586539k52840k720L50597M11255K42714K00265L35290L49876J17057j10827
$$ 2586539 2333699 2330979 2681576 3092831 3335545 3535810 3871100 4220976 4338033 4227206
37280D227206r9395K3323l1981l07365n37495m78546k08325l7396j18614k39199
$$ 4227206 4127811 4151134 4119153 3811788 3274293 2795747 2587422 2550026 2431412 2192213
37270B192213j11854J92535L01859N2551k80913l72907k59960j89495k11081j60725
$$ 2192213 2080359 2272894 2574753 2627304 2346391 1973484 1713524 1524029 1312948 1152223
37260A152223K351R2528r772j43896p9276J35006J81862j13954m83436m63290
$$ 1152223 1154574 1247102 1237330 1093434 1014158 1149164 1331026 1217072 733636 270346
37250B70346K8640N16440M93168K9771l28470k43813N6442J62304P466j48943
$$ 270346 298986 815426 1308594 1338365 1009895 766082 822524 984828 992294 843351
37240H43351j40432p9700j23015k18582j93352k5124R9366L4670j11524j20861
$$ 843351 702919 623219 500204 281622 88270 63146 162512 197182 85658 -35203
37230c5203K9862J49174J17439K6073j4485k3022j2892R6124K82493L22827Q7219
$$ -35203 -5341 143833 261272 287345 272860 249838 236946 333070 615563 938390 1025609
37219A025609k14351l00488j99302j19529p2146Q2057K86009L08025J02625j27947
$$ 1025609 811258 510770 311468 191939 119793 201850 487859 795884 898509 770562
37209G70562k34493k33796j46024J2749J01462n42j47927j23877k2192p7573j73238
$$ 770562 536069 302273 156249 168998 270460 269918 121991 -1886 -24078 -101651 -274889
37198b74889K2279M07255M59544L7390l47556k91111m1743K4902J2815J74564
$$ -274889 -252610 154645 614189 651579 304023 12912 -28831 -3929 8886 183450
37188A83450L55180K50884l1664j47246p1551m9529j14473q5945L3022O1390J793
$$ 183450 538630 789514 757850 610604 539053 489524 375051 289106 322128 383518 385311
37177C85311K2061R2313j347k58511l99391k48321P1688L48863M54691L17088
$$ 385311 407372 499685 498338 239827 -159564 -407885 -336197 12666 467357 784445
37167G84445k2351l14073l06839p1631Q8941M4876o9969j44498k02305k15007
$$ 784445 762094 448021 141182 69551 158492 203368 133399 -11099 -213404 -428411
37157d28411q2618J28995J76892k3671k38662k00672P1159L14498K97771K2245
$$ -428411 -511029 -382034 -205142 -228813 -467475 -668147 -596988 -282490 15281 37526
37147C7526k65539k74433K5133L34685L67758J80072L0655J8177M0081K5102j0151
$$ 37526 -228013 -502446 -477313 -142628 225130 405202 435857 454034 494115 519217 509066
37136E09066p7704j77877j98571p0112M6991l0940j81598j25461J38751L30927
$$ 509066 431362 253485 54914 -15198 31793 853 -180745 -306206 -167455 163472
37126A63472K99408J48696k1177j95443k71699j36305O7179Q2290k5880M4697
$$ 163472 462880 611576 590399 394956 123257 -13048 54131 136421 110541 155238
37116A55238K71353K72103l9129k35238n9477J23749p2216l82178k87893J46067
$$ 155238 426591 698694 659565 424327 364850 488599 416383 34205 -253688 -107621
37106a07621L56350J27860j38816q2701J14822R0466j21250j61270R2497L15479
$$ -107621 248729 376589 237773 155072 269894 360360 239110 77840 170337 485816
37096D85816J79720j66270k69690K235K65254J66056j18286j87493m0018j7377
$$ 485816 665536 499266 229576 231811 497065 663121 544835 357342 317324 299947
37086B99947k02671l00589j63662j6801j8561O038J83900L02712J70861l0969
$$ 299947 97276 -203313 -366975 -383776 -402337 -396299 -212399 90313 261174 230205
37076B30205n2553K3802j0698j02067o9994M4358Q4816Q5036J53017J82285J613
$$ 230205 177652 201454 190756 88689 18695 63053 147869 232905 385922 568207 569820
37065E69820k80445l89955k80469j34809m6464L2688R9614J13996J29053J75440
$$ 569820 289375 -100580 -381049 -515858 -562322 -529634 -430020 -316024 -186971 -11531
37055a1531J34695l0341r9437N2704J52315l4664k02943K6124L40291J21011m73203
$$ -11531 123164 92823 -6614 46090 198405 163741 -39202 -13078 327213 448224 -24979
37044b4979n98326l0797M34487K25723j51172l9221K78408J54097k59144k85309
$$ -24979 -623305 -654102 -219615 6108 -145064 -184285 94123 248220 -10924 -296233
37034b96233R8929K58826J2844j20128R1818J81428j34527l81959j07267L35685
$$ -296233 -197304 61522 74366 -45762 46056 227484 92957 -289002 -396269 -60584
37024f0584L33740n1626k86169k27410j76007k02154m4242K95501M15635J25610
$$ -60584 273156 221530 -64639 -292049 -468056 -670210 -714452 -418951 -3316 122294
37014A22294k48612l41792j66830R4067L37508M02413R6641l78416m39474P7667
$$ 122294 -126318 -468110 -634940 -540873 -203365 199048 295689 -82727 -522201 -444534
37004d44534N09929K43639l21785l17765K63389N33240N9781n05134m55095k6228
$$ -444534 65395 309034 -12751 -330516 -67127 466113 525894 20760 -434335 -460563
36994d60563J31799j6701k5838J61791J62128r7393k09431J8336K38546J51699
$$ -460563 -328764 -345465 -371303 -209512 -47384 -144777 -354208 -335872 -97326 54373
36984E4373k7380J0044J32513L1370k12884k48364m5068M8598j15498k32107l4400
$$ 54373 26993 37037 169550 200920 -11964 -260328 -305396 -256798 -372296 -604403 -638803
36973f38803K67306L05654J18077N6445K02360K33252l7858l03148j69317K59472
$$ -638803 -371497 -65843 52234 108679 311039 544291 506433 203285 33968 293440
36963B93440M83474K36320k29982m99958m27312j60418Q3816J67730P1971r6144
$$ 293440 776914 1013234 783252 283294 -144018 -304436 -220620 -52890 19081 -77063
36953g7063j74208r3587N9208J47668J17636J9368o1354q3288p0104l1044J05268
$$ -77063 -251271 -344858 -285650 -137982 -20346 -978 -62332 -145620 -215724 -246768 -141500
36942a41500L57449M98458K32731l13812n52960j50880M37716N20498R1806k50408
$$ -141500 215949 714407 947138 633326 80366 -70514 367202 887700 979506 729098
36932G29098k30836j82133l23542l40871K2962M26987L86055k9199l29908k60343
$$ 729098 498262 316129 -7413 -348284 -325322 101665 487720 458521 128613 -131730
36922a31730M860J69506P0887k27853m12486j86055K72921M10792O6702k27134
$$ -131730 -126870 42636 113523 -114330 -526816 -712871 -439950 -29158 37544 -189590
36912a89590k9929L15081K32806j68166l04116l6610K18223K11785J13265N1115
$$ -189590 -219519 95562 328368 160202 -143914 -180524 37699 249484 362749 413864
36902D13864m9986j42930p8320J5717j12925k75340q510N88761Q07798L45415
$$ 413864 363878 220948 142628 158345 45420 -229920 -238430 350331 1158129 1503544
36892A503544k26349l31213j73662k19753l77825k54005R3437K38921P7385r0902
$$ 1503544 1277195 945982 772320 552567 174742 -79263 14174 253095 330480 239578
36882B39578j00595q5427j05904l1692J42285K16164J17844J8965J1788m9187
$$ 239578 138983 53556 -52348 -84040 58245 274409 392253 411218 423006 373819
36872C73819k26540k74287J9210M11181M25229q943m03266l13394J08231L54932
$$ 373819 147279 -127008 -107798 303383 728612 719669 316403 3009 111240 466172
36862D66172K27888j1041j08732j24819j77203j83095m8161J11711J56420J43931
$$ 466172 694060 683019 574287 449468 272265 89170 41009 152720 309140 453071
36852D53071J53235Q5472j10706k22597p9566J18984J13875K7905J13302K50562
$$ 453071 606306 691778 581072 358475 278909 397893 511768 539673 652975 903537
36842I03537J55541p3197j28920r0841k62810n01036l63851O7261K32712M6282
$$ 903537 1059078 985881 856961 766120 503310 2274 -361577 -294316 -61604 -15322
36832a5322K8968L01560K85100k25009n31261j50036L07651J10391l70936k93038
$$ -15322 13646 315206 600306 375297 -155964 -306000 1651 112042 -258894 -551932
36822e51932K57569M53492Q4470k32574j64704q0368k21817k68346o851K22950
$$ -551932 -294363 159129 243599 11025 -153679 -234047 -455864 -724210 -731061 -508111
36812e08111J20643l8110J41617N15399N83131J64215l97801o40898m34845n8965
$$ -508111 -387468 -425578 -283961 231438 814569 978784 580983 -59915 -494760 -553725
36802e53725J14276L1343j5711J59331L34509K20674p1952j95559p4076O1408
$$ -553725 -439449 -408106 -423817 -264486 70023 290697 218745 23186 -50890 10518
36792A0518O7033N321o6119j18636l2796K29568M07420K33462j23855k67312j45322
$$ 10518 77551 82872 16753 -101883 -134679 94889 502309 735771 611916 344604 199282
36781A99282k8578R278J24869K45243R1161k66186l70692n1930L10065L53603
$$ 199282 170704 179982 304851 550094 641255 375069 4377 -47553 262512 616115
36771F16115J63118k7725j53519j68414J2865K36961J74992j42957k69704k4340
$$ 616115 779233 751508 597989 429575 442440 679401 854393 711436 441732 417392
36761D17392K11740J34136k0340K6346J01524O32m5695J80480L55302J01034l01405
$$ 417392 629132 763268 742928 769274 870798 871430 825735 1006215 1361517 1462551 1161146
36750A161146l04126K4759J63461M4438R4861L70645L67446j23050n86574n09162
$$ 1161146 857020 881779 1045240 1089678 1184539 1555184 1922630 1799580 1213006 703844
36740G03844n1321L05572L92023L12648J12180j66800l21629k11222P686J08972
$$ 703844 652523 958095 1350118 1662766 1774946 1608146 1286517 1075295 1082981 1191953
36730A191953R8352P0950k3563k08281k73618o7476J63790P7780k31201l81788
$$ 1191953 1290305 1361255 1337692 1129411 855793 788317 952107 1029887 798686 416898
36720D16898l13266l04507l79727j95207L15015O47864M00873j14533l02703q2736
$$ 416898 103632 -200875 -580602 -775809 -460794 187070 587943 473410 170707 87971
36710H7971J33371Q9928r5100k63079l51881k40501J27924M56697L49926q2856
$$ 87971 221342 311270 216170 -46909 -398790 -639291 -511367 -54670 295256 212400
36700B12400l02697j22611M9375p2098j86147K0936K93400K41988Q278j9562J01868
$$ 212400 -90297 -212908 -163533 -235631 -421778 -400842 -107442 134546 142824 123262 225130
36689B25130K3833k05139j93010Q7025K18139L8597j20462m5339J2521j65843
$$ 225130 248963 43824 -149186 -62161 155978 194575 74113 28774 41295 -124548
36679a24548l52921k62944k5872N0139m1982p1281M7771K02968L05175L35373
$$ -124548 -477469 -740413 -766285 -716146 -758128 -829409 -781638 -578670 -273495 61878
36669F1878K52104M1554j90884l10402k81022j32239R7401L06454L44378J76968
$$ 61878 313982 355536 164652 -145750 -426772 -559011 -461610 -155156 189222 366190
36659C66190n3820j93380k00512r9702M6143J10344K9546m7036M9808J92273J23024
$$ 366190 312370 118990 -81522 -181224 -135081 -24737 4809 -42227 7581 199854 322878
36648C22878p3394o0296J31702O1534l46787n06223k9637N58489N07155p3657
$$ 322878 249484 189188 320890 382424 35637 -470586 -500223 58266 565421 491764
36638D91764m20238k46781j9074q9254j95470k8333K22188K17344K4096l7550
$$ 491764 71526 -175255 -194329 -283583 -479053 -507386 -285198 -67854 -43758 -81308
36628h1308R0850J73743Q5559l3785m1731K347k0196p1370j6253J31602J69294
$$ -81308 9542 183285 268844 235059 193328 195675 175479 104109 87856 219458 388752
36617C88752j6855k45404k63681j06855j8649l7326M8797K63889L00896J6594
$$ 388752 371897 126493 -137188 -244043 -262692 -300018 -251221 12668 313564 330158
36607C30158k43746j31758J41491J26967j36980j81759J39338M18173L06721l1925
$$ 330158 86412 -45346 96145 223112 86132 -95627 43711 461884 768605 736680
36597G36680k54930k95578k76880k21304q2826Q4168J80456J86325J14470l1213
$$ 736680 481750 186172 -90708 -312012 -394838 -310670 -130214 56111 170581 139368
36587A39368j53466r0591J25691K23592O5021j15771n6772J15520R0065j16813
$$ 139368 -14098 -104689 21002 244594 309615 193844 137072 252592 342657 225844
36577B25844j82079j919J34087n072k46497k93829j40990P732P9795J51186K05828
$$ 225844 43765 41846 175933 170861 -75636 -369465 -510455 -502723 -422928 -271742 -65914
36566f5914J42248R351k0704M3293j1259k23731l17174j08202J63597J63938l9336
$$ -65914 76334 85685 64981 108274 97015 -126716 -443890 -552092 -388495 -224557 -263893
36555b63893r8425Q5633K63390K42408R3551o8657k19692k79277j19010J74683
$$ -263893 -362318 -276685 -13295 229113 322664 254007 34315 -244962 -363972 -189289
36545a89289K96962J14015j55443k55682j74575j6249J51201K04978J2942k69546
$$ -189289 107673 221688 66245 -189437 -364012 -380261 -229060 -24082 -11140 -280686
36535b80686k53542J21025L93553K28406o9831n3084J49864Q5230k41311l66298
$$ -280686 -534228 -413203 -19650 208756 138925 85841 235705 320935 79624 -286674
36525b86674j09262J93134K46266J46107O5968r870r8094r8452j3953l562q9131
$$ -286674 -395936 -202802 43464 189571 255539 245669 147575 49123 35170 31608 -57523
36514e7523q9133M1008J03770K9162K5170J72028J99181n9969k86877j14699K55511
$$ -57523 -146656 -105648 -1878 27284 52454 224482 423663 363694 76817 -37882 217629
36503B17629K93698p8845l69510k30997Q1813J52655Q862k895K00530L12547J17621
$$ 217629 511327 432482 62972 -168025 -86212 66443 75305 72410 272940 585487 703108
36492G03108j88306l01881k23820j48743r5465N3800K01630P8789k84539m70631
$$ 703108 514802 212921 -10899 -159642 -255107 -201307 323 79112 -205427 -676058
36482f76058k34731J34500K43541J26988P3166J37027J60421J24828J33228J32574
$$ -676058 -910789 -776289 -532748 -405760 -332594 -195567 -35146 89682 222910 355484
36472C55484l678j66084j08700J50027L05439J50683k20763n35700m96616N07
$$ 355484 351806 185722 77022 227049 532488 683171 462408 -73292 -569908 -569401
36462e69401N75687N73673q4194n83467k56923L88007L76779k46707n25166j12287
$$ -569401 6286 579959 495765 -87702 -344625 43382 420161 173454 -351712 -463999
36452d63999K98862K26858O8995J51881R5595l08789m77426j5242M45203K15560
$$ -463999 -165137 61721 130716 282597 378192 69403 -408023 -423265 21938 237498
36442B37498k87768k71005R4827P9461k58932k37316J48331K10698j46779k23993
$$ 237498 -50270 -321275 -226448 -146987 -405919 -643235 -494904 -284206 -430985 -654978
36432f54978K32986N78776L51293o8136k23811k23016k23983l2504L49192M49121
$$ -654978 -421992 156784 508077 439941 216130 -6886 -230869 -263373 85819 534940
36422E34940Q2918k26393p7766J51695J9154j94532m4940K34610J74400m9973
$$ 534940 617858 391465 313699 465394 484548 290016 245076 479686 654086 604113
36412F04113M7312L30208K50149j72009l76896k28227j50230k58127j50128K53768
$$ 604113 651425 981633 1231782 1059773 682877 454650 304420 46293 -103835 149933
36402A49933M35459J59808o5922J51182L92838J51563k53575j74270K67278L34423
$$ 149933 585392 745200 679278 830460 1223298 1374861 1121286 947016 1214294 1548717
36392A548717j50830n24094l02290J34582J81225j42164l60063k60876m7302P1567
$$ 1548717 1397887 873793 571503 706085 887310 745146 385083 124207 76905 148472
36382A48472P3155k5958j90636k53110o0134K44458L36744J48849n6764r7846
$$ 148472 221627 195669 5033 -248077 -308211 -63753 272991 421840 365076 267230
36372B67230q9701j53028j78739n6327R7229J43392J54457K13089J74282r6020
$$ 267230 177529 24501 -154238 -210565 -113336 30056 184513 397602 571884 475864
36362D75864m01723m45276k61267j02940k038J88887L84600L28494Q0169m703
$$ 475864 74141 -371135 -632402 -735342 -737380 -548493 -163893 164601 244770 240067
36352B40067J31078J29925j35659k70922R06L21280K09444k12344m28727k58350
$$ 240067 371145 501070 365411 94489 95395 416675 626119 413775 -14952 -273302
36342b73302L8210K22391K43923O0155k88906m82463k19659K73366M38871J43002
$$ -273302 -235092 -12701 231222 291377 2471 -479992 -699651 -426285 12586 155588
36332A55588j53843q5580J45756J77703L7404jJ04177J21620m6187j96705j15105
$$ 155588 1745 -83835 61921 239624 277028 277027 381204 502824 456637 259932 144827
36321A44827J02737J36748j37840m19293l12133J23145L78523J57872k21869k97248
$$ 144827 247564 384312 246472 -172821 -484954 -361809 16714 174586 -47283 -344531
36311c44531q0485R8866J58799K44784K77934L3675l33943l69004j4952K53969
$$ -344531 -425016 -326150 -167351 77433 355367 389042 55099 -313905 -328857 -74888
36301g4888J58197j6779J3251Q9004K6334K551J50167K01004k6004j87592K0836
$$ -74888 83309 66530 79781 168785 195119 197670 347837 548841 522837 335245 356081
36290C56081K36165k2319m63535m02985J20176L76069J03873j41282J9337J92985
$$ 356081 592246 569927 106392 -296593 -176417 199652 303525 162243 181580 374565
36280C74565k5474l29324k37815R7533J86915J5592j1638J84672K23386p4194
$$ 374565 349091 19767 -218048 -120515 66400 81992 70354 255026 478412 404218
36270D04218l44284k01126J95829L52768R8186k19990k25967q165N3649j33898
$$ 404218 59934 -141192 54637 407405 505591 285601 59634 51469 105118 -28780
36260b8780k49808q2889J20688P3420n7490M4432K25887O0406l70984m63677O846
$$ -28780 -278588 -361477 -240789 -167369 -224859 -180427 45460 105866 -265118 -728795 -721949
36249g21949M98663M84063J47513m1899m4632j06949k16547j79814n2147m0383
$$ -721949 -223286 260777 408290 366391 321759 214810 -1737 -181551 -233698 -274081
36239b74081r2041J1095K30778L15775K06178O3283k7929p2098Q122K16926K91795
$$ -274081 -366122 -355027 -124249 191526 397704 460987 433058 360960 369082 586008 877803
36228H77803N1134k05948j03321J36869j7601m91137o15338j64055K80616K46847
$$ 877803 928937 722989 619668 756537 738936 247799 -367539 -531594 -250978 -4131
36218d131M6033J41825L66971K71728j05671l36420k53089m6137J33369K48340
$$ -4131 41902 183727 550698 822426 716755 380335 127246 81109 214478 462818
36208D62818J81314j23528m02489l36440k2645J62361J10583L4183K0919n8623
$$ 462818 644132 520604 118115 -218325 -240970 -78609 31974 66157 87076 28453
36198B8453j82848j27382J17639K41856P5982j50406j78065o7530N876N2264J43106
$$ 28453 -154395 -281777 -164138 77718 153700 3294 -174771 -242301 -236425 -184161 -41055
36187d1055J96270J21147J4448j9104q6080k85826m12866k02446J88492L04452
$$ -41055 155215 276362 290810 271706 185626 -100200 -513066 -715512 -527020 -222568
36177b22568L6160k05303r1166J70535K13148P5719N7598J70512J30526j23409
$$ -222568 -186408 -391711 -482877 -312342 -99194 -23475 34123 204635 335161 211752
36167B11752k91946j94676m3858o1746j23099k6474J23296J08028r467k0010L5479
$$ 211752 -80194 -274870 -318728 -380474 -503573 -530047 -406751 -298723 -308190 -328200 -292721
36156b92721k2700r2173Q7771L92906L71271l9263l26896j74161L9658j33609
$$ -292721 -315421 -407594 -319823 73083 444354 405091 78195 -95966 -56308 -189917
36146a89917m59402l84563P6638L59506J91646q1330p6485J39552K77968K15562
$$ -189917 -649319 -1033882 -957244 -597738 -406092 -487422 -563907 -424355 -146387 69175
36136F9175J0155k12507k65386l6698K65731K55764j09863l98736k59159J23871
$$ 69175 79330 -133177 -398563 -435261 -169530 86234 -23629 -422365 -681524 -557653
36126e57653L31347K55260R7484q58m9103m1639J4017k3724k41208m09551k26204
$$ -557653 -226306 28954 126438 125580 76477 34838 48855 25131 -216077 -625628 -851832
36115h51832J80084L23863L2043k87745k22249R2760K46337J53032N4457N2484
$$ -851832 -671748 -347885 -315842 -603587 -825836 -733076 -486739 -333707 -279250 -226766
36105b26766O163j17315j36116J5737J42102J03326L2589O6507Q6635m7679j92623
$$ -226766 -220603 -337918 -474034 -458297 -316195 -212869 -180280 -113773 -27138 -74817 -267440
36094b67440j21986P6126J04903p3617j74922l2637J73552K28236J78712J75082
$$ -267440 -389426 -313300 -208397 -282014 -456936 -489573 -316021 -87785 90927 266009
36084B66009K01108J50242M9248J1581K1342n2292k11093k50559j6691L25800
$$ 266009 467117 617359 666607 678188 699530 647238 436145 185586 168895 494695
36074D94695M06663Q1643l38924m27436j68670N4399L5172Q596J71533K71568
$$ 494695 901358 983001 644077 216641 47971 102370 137542 146138 317671 589239
36064E89239L7874k42980j03890K83842K93584j31357l24696K3335L36961J17643
$$ 589239 627113 384133 280243 564085 857669 726312 401616 424951 761912 879555
36054H79555k13448m9380L43654K77273j68179k66390J28458L34656m3158n12340
$$ 879555 666107 616727 960381 1237654 1069475 803085 931543 1266199 1223041 710701
36044G10701m97417j36346R3331P4323k019l1439M327J46831K77597J18400k95894
$$ 710701 213284 76938 170269 244592 242573 211134 215461 362292 639889 758289 462395
36033D62395m60135p0415M27770L90558j15690m20176j89259J89600K21071p3140
$$ 462395 2260 -68155 359615 750173 634483 214307 25048 214648 435719 362579
36023C62579k92728j85898J22468L19604K17467q7007l32706l70022k58293r2842
$$ 362579 69851 -116047 6421 326025 543492 456485 123779 -246243 -504536 -597378
36013e97378J07767K74300K49565M3981n2306J52551L95143K61574k13879n55702
$$ -597378 -489611 -215311 34254 78235 25929 178480 573623 835197 621318 65616
36003F5616m66555j53673M2900Q3659J25750J74564P5121j86087l66625k36353
$$ 65616 -400939 -554612 -511712 -428053 -302303 -127739 -52618 -238705 -605330 -841683
35993h41683J18930L63088K87939M0011r4036m6495K1748K1559L9097J06066R4268
$$ -841683 -722753 -359665 -71726 -31715 -125751 -172246 -150498 -128939 -89842 16224 110492
35982A10492m3459j32400m6471O0101M841r3436j776K13020K59920Q5287m5643
$$ 110492 67033 -65367 -111838 -51737 -46896 -140332 -142108 70912 330832 416119 370476
35971C70476K5866J23219L6202j74337l07371k86365j61387J3184J70854K15844
$$ 370476 396342 519561 555763 381426 74055 -212310 -373697 -360513 -189659 26185
35961B6185J40971P0135P0665L0566j35162k63826j42955J11350J31409j70932
$$ 26185 167156 237291 307956 338522 203360 -60466 -203421 -92071 39338 -131594
35951a31594l92228j54615L28270M95216K04890q6581k2012J38256j6478l38448
$$ -131594 -523822 -678437 -350167 145049 349939 263358 241346 379602 363124 24676
35941B4676l34853J2174J68547j10315l71752j74943K21014K88925M8991m4487
$$ 24676 -310177 -298003 -129456 -239771 -611523 -786466 -565452 -276527 -227536 -272023
35931b72023J25137K09659M2984q7918L6307J95734J23903m0221J370J91084J72620
$$ -272023 -146886 62773 105757 17839 54146 249880 373783 333562 334932 526016 698636
35920F98636j70656n00218m31170j2966L23003K68308k5479j81319p9098O3364
$$ 698636 527980 27762 -403408 -416374 -93371 174937 149458 -31861 -110959 -47595
35910d7595P7196O6511J34879J37206o1628k68493k05751L9787J38208K5596n3946
$$ -47595 29601 96112 230991 368197 306569 38076 -167675 -127888 10320 35916 -18030
35899a8030J56K0316n7051o8526K3201J8943j18398j12679J60166L85984K68634
$$ -18030 -17874 2442 -54609 -123135 -99934 -80991 -199389 -312068 -151902 234082 502716
35888E02716q371r1147M466P930j22067j90756j40596q5364l3236R4756K09490
$$ 502716 494345 403198 407664 415594 293527 102771 -37825 -123189 -156425 -61669 147821
35877A47821J45979o364n057J02967J0649l00972m30818j52840K05339K42288
$$ 147821 293800 287436 282379 385346 395995 95023 -335795 -488635 -283296 -41008
35867d1008N7593J8228J57174J93076N1841m1271o792n1630k44798l14879q9204
$$ -41008 16585 34813 191987 385063 436904 395633 388841 337211 92413 -222466 -311670
35856c11670J65692J33773n3815o0091R0078R7794l7288l607K25589K70683j7291
$$ -311670 -145978 -12205 -66020 -126111 -36033 61761 24473 20866 246455 517138 499847
35845D99847k64491j83294l7962j42329k92046j63097O0722K4542q5116J71946
$$ 499847 235356 52062 14100 -128229 -420275 -583372 -522650 -498108 -583224 -411278
35835d11278O12504N74829q181m11480k05107J41445Q7164j56391j08162J47531
$$ -411278 201226 776055 767874 356394 151287 292732 379896 223505 115343 262874
35825B62874J70411q0751k41663j49371n656N546p6115j23988m0191J76946L34355
$$ 262874 433285 352534 110871 -38500 -44156 -38610 -114725 -238713 -278904 -101958 232397
35814B32397K00886j04281j74930N4388J34745j68688m23777k20709J27864J27027
$$ 232397 433283 329002 154072 208460 343205 174517 -249260 -469969 -342105 -215078
35804b15078m5341R7417M05246K83682k66925n69042k74719K20206M67633M58551
$$ -215078 -260419 -163002 242244 525926 259001 -310041 -584760 -364554 103079 561630
35794E61630L07698L3882k02944j81493m9064j43713l37866j82793K29365K92246
$$ 561630 869328 903210 700266 518773 469709 325996 -11870 -194663 34702 326948
35784C26948o5228j83569J69636L23318j24214n15373k14145K80497J71191k91632
$$ 326948 261720 78151 247787 571105 446891 -68482 -282627 -2130 169061 -122571
35774a22571k99490R1799J19945k79630l34610K13516O32860L72055j38144k71697
$$ -122571 -422061 -330262 -210317 -489947 -824557 -611041 21819 393874 255730 -15967
35764a5967j17942j12350k56766k32558N942K07561K37159J75424J10548P4080
$$ -15967 -133909 -246259 -503025 -735583 -729641 -522080 -284921 -109497 1051 75131
35754G5131R5573J46580J21717L60q0137j5643J07557J29048n148k14995l39415
$$ 75131 170704 317284 439001 439361 359224 343581 451138 580186 575038 360043 20628
35743B0628k33617M4521J93569J4462k54430k10619J32836L58948K56637N9329
$$ 20628 -212989 -168468 25101 39563 -214867 -425486 -292650 66298 322935 382264
35733C82264j2104o1134j89651k19835j3213K12037J86097M341n7805K1433O5570
$$ 382264 370160 309026 119375 -100460 -113673 98364 284461 288802 230997 252430 318000
35722C18000N4024R5760J29596j2719k55009l10355j18630M3441m449p2655N8947
$$ 318000 372024 467784 597380 584661 329652 19297 -99333 -55892 -60341 -132996 -74049
35711g4049K42550J63725j57454l48470j92972Q9948J90967J31603J36087K13609
$$ -74049 168501 332226 174772 -173698 -366670 -276722 -85755 45848 181935 395544
35701C95544J50427q9048k42104j29695Q2999J59262J14368Q1915N1567l2348
$$ 395544 545971 456923 214819 85124 168123 327385 441753 523668 575235 542887
35691E42887q2769m1595p7541l01358m33014j50369L11845L78601j8736k97517
$$ 542887 460118 418523 340982 39624 -393390 -543759 -231914 146687 127951 -169566
35681a69566p6651K86355K79235l1157k04779r6508O5136J10187Q0713K6280m9759
$$ -169566 -246217 40138 319373 288216 83437 -13071 52065 162252 242965 269245 219486
35670B19486p0195L7779J59876J03794j18447k96914k94142j49070N0817K26222
$$ 219486 149291 187070 346946 450740 332293 35379 -258763 -407833 -357016 -130794
35660a30794K63452J05292j01661j17042R2644K87420K33134m2439l09152l78757
$$ -130794 132658 237950 136289 19247 111891 399311 632445 590006 280854 -97903
35650i7903k48205m1527J35285K51420K79861J62521p2010k36723j82298k5750
$$ -97903 -346108 -387635 -252350 -930 278931 441452 369442 132719 -49579 -75329
35640g5329n286j24479j54154k961J57340J92591J73900J51835L7266j51476k00420
$$ -75329 -80615 -205094 -359248 -362209 -204869 -12278 161622 313457 350723 199247 -1173
35629a173n1350K3761j63087l72169k86751K577J73547J61028J44683J81651J83694
$$ -1173 -52523 -28762 -191849 -564018 -850769 -848192 -674645 -513617 -368934 -187283 -3589
35618c589J64022J83699J34120j00519l32488k64332M1923K24751J37220k7344
$$ -3589 160433 344132 478252 377733 45245 -219087 -177164 47587 184807 157463
35608A57463j15335j75214k16084j42672J0943Q7417R0726J62535K50690J47236
$$ 157463 42128 -133086 -349170 -491842 -480899 -393482 -302756 -140221 110469 257705
35598B57705r4236j59227J1340R6012o4263j87596l2711J98254K07971N3415m1259
$$ 257705 163469 4242 15582 111594 47331 -140265 -172976 25278 233249 286664 245405
35587B45405o5172j17504j40609n3677K5683k4462p8236K2052J55521J08142p3687
$$ 245405 180233 62729 -77880 -131557 -105874 -130336 -208572 -186520 -30999 77143 3456
35576C456j88642j95053j44943K5151L12123M23182J33380k48041k17465J58307
$$ 3456 -185186 -380239 -525182 -500031 -187908 235274 368654 120613 -96852 61455
35566F1455L01353j075k79848j23493K20897K81963M7548j42916j53517j28289
$$ 61455 362808 361733 81885 -41608 179289 461252 508800 365884 212367 84078
35556H4078j39264j04833k2832L390j9749L1004J60766K09683Q1791j29809k72712
$$ 84078 -55186 -160019 -182851 -179461 -199210 -168206 -7440 202243 284034 154225 -118487
35545a18487k63155r0382J55055K61313Q7180j94112k37437J5097K16900R0987
$$ -118487 -381642 -472024 -316969 -55656 31524 -162588 -400025 -384928 -168028 -77041
35535g7041j61392j36766J90364M12546K23468k00339m33148k83567N4439K64413
$$ -77041 -238433 -375199 -184835 227711 451179 250840 -182308 -465875 -411436 -147023
35525a47023K24639O7001k1824r715k923n1126o6302J8745J06904N1743j36975
$$ -147023 77616 144617 122793 113078 110155 59029 -7273 11472 118376 170119 33144
35514C3144k97579k85659o9724K57087M68799L39620n5517l08788j70010O9776
$$ 33144 -264435 -550094 -619818 -362731 106068 445688 390171 81383 -88627 -18851
35504a8851m125k51690j64493K76517M69313R8002l51344l24613l149Q7628p2315
$$ -18851 -22976 -274666 -439159 -162642 306671 404673 53329 -271284 -274433 -186805 -259120
35493b59120r2117R2726J61686K1261p1642j4870J5893K715J37948L34389K07792
$$ -259120 -351237 -258511 -96825 -75564 -147206 -162076 -146183 -143468 -5520 328869 536661
35482E36661k42844m41873m7967M68469M66698K7675k58750j81443p3215j53651
$$ 536661 293817 -148056 -196023 272446 739144 766819 508069 326626 253411 99760
35472I9760k09535m7838J24570J4813k79663l72835j15403J94839J94938p4621
$$ 99760 -109775 -157613 -33043 -18230 -297893 -670728 -786131 -591292 -396354 -470975
35462d70975k21306m684L64684N08114L28573L9109j50037j81323o1759J36257
$$ -470975 -692281 -696965 -332281 175833 504406 543515 393478 212155 150396 286653
35452B86653K03536k3569l73975m72687k17572J03599K31412K16210J88892J21955
$$ 286653 490189 466620 92645 -380042 -597614 -494015 -262603 -46393 142499 264454
35442B64454k2176j35317j37998j23020j61236j51554l0521O4450K7780j0939
$$ 264454 242278 106961 -31037 -154057 -315293 -466847 -497368 -432918 -405138 -416077
35432d16077P5934J61625Q8284k9511Q0Q6234K586j83293j57599J48794M09608
$$ -416077 -340143 -178518 -90234 -119745 -119665 -33431 -30845 -214138 -371737 -222943 186665
35421A86665L31546K2766j79930j22401L9302P5791l0998q4138K9105J19260o3333
$$ 186665 518211 540977 361047 238646 277948 353739 322741 238603 267708 386968 323635
35410C23635l87414l98941O0962N40599N10076M5450k94698k00087O9923J18708
$$ 323635 -63779 -462720 -401758 138841 648917 694367 399669 199582 269505 388213
35400C88213q2230k42452j70797J2873Q6208L1837K1851J10197J20588m9108j97780
$$ 388213 305983 63531 -107266 -94393 -8185 23652 45503 155700 276288 227180 29400
35389B9400j17751M0241J2994q8889M7547L34032L42109J7013j98620r7565j3639
$$ 29400 -88351 -48110 -35116 -124005 -76458 257574 599683 616696 418076 320511 306872
35378C06872j61391k40658m6443Q2352j20505k93365n2177K97554K64032n177
$$ 306872 145481 -95177 -141620 -59268 -179773 -473138 -525315 -227761 36271 31094
35368C1094o3598J0712j33147l17322r7489L30799L31021j07485l32642j08190
$$ 31094 -32504 -21792 -154939 -472261 -569750 -238951 92070 -15415 -348057 -456247
35358d56247R2151J05n2384J14480J58519p6623j91802M5723K48484R2302j30706
$$ -456247 -364096 -363991 -416375 -301895 -143376 -219999 -411801 -366078 -117594 -25292 -155998
35347a55998q4004L2379n0716j24055N7857K23928L4869k65702k12878J30586
$$ -155998 -240002 -207623 -258339 -382394 -324537 -100609 -65740 -331442 -544320 -413734
35337d13734L22268K31324Q2086j9110j17461j08433J26244L67336K76313q0103
$$ -413734 -91466 139858 221944 202834 85373 -23060 103184 470520 746833 666730
35327F66730l00398k08687j3599N7458j1772j26530j65665k8704J96493K33683
$$ 666730 366332 157645 144046 201504 189732 63202 -102463 -131167 65326 299009
35317B99009p759k33610j80028j8314m6950j91738j76260j9117L9218j2568J2340
$$ 299009 291250 57640 -122388 -140702 -187652 -379390 -555650 -574767 -535549 -548117 -535777
35306e35777Q9625J6907j63191j67131O7118K67084K34095P0261n8904j24141
$$ -535777 -446152 -429245 -592436 -759567 -692449 -425365 -191270 -121009 -179913 -304054
35296c04054j31546m9363R1885J85368J71275P2022n8884j32629p3943L0037l05
$$ -304054 -435600 -484963 -393078 -207710 -36435 35587 -23297 -155926 -229869 -199832 -200137
35285b00137j10639j9090K80175L65882L2667k87559j66018J19893P0880j60545
$$ -200137 -310776 -329866 -49691 316191 348858 61299 -104719 15174 86054 -74491
35275g4491o9182K32785J49853l17638m69848m4681L44785K22049m1132L2607
$$ -74491 -143673 89112 238965 -78673 -548521 -593202 -248417 -26368 -67500 -34893
35265c4893K18339Q5977j99707k03141Q303M3100r1080n8693J32560J31826r2997
$$ -34893 183446 269423 69716 -133425 -125122 -82022 -173102 -231795 -99235 32591 -60406
35254f0406j52347J00665K81799N2473l71373n25116k77942J04602L21948K72182
$$ -60406 -212753 -112088 169711 222184 -149189 -674305 -952247 -847645 -525697 -253515
35244b53515L6325j84939j71476J08913L89676L46336l387k67449j52742J34629
$$ -253515 -217190 -402129 -573605 -464692 -75016 271320 267933 484 -152258 -17629
35234a7629J55380j30340k72949J2996L89631L60396p411k00246j9326J95479
$$ -17629 137751 7411 -265538 -252542 137089 497485 490074 289828 270502 465981
35224D65981J48638k1461r9160j59996l12555l64850r4510L09416M17789J27718
$$ 465981 614619 593158 493998 334002 21447 -343403 -437913 -128497 289292 417010
35214D17010k19151k87208r7957R4352J06777l8174j75462j61445k1951Q4172
$$ 417010 197859 -89349 -187306 -92954 13823 -24351 -199813 -361258 -383209 -299037
35204b99037P9727O7726J53305K67572K72096J58811L3856l7205o6610q1534j09581
$$ -299037 -219310 -151584 1721 269293 541389 700200 734056 696851 630241 548707 439126
35193D39126j66360j92298r6178O7121R5261p5591k30618j74244j7183L5465L5190
$$ 439126 272766 80468 -15710 51411 146672 71081 -159537 -333781 -350964 -315499 -280309
35182b80309J51465K83719J65528j40260k28724L9794K67337Q6285k79666l41063
$$ -280309 -128844 154875 320403 180143 -48581 -8787 258550 344835 65169 -275894
35172b75894m9221J92374J54779L2830J7546m573j51107k54695j37932M5494M9444
$$ -275894 -325115 -132741 22038 54868 72414 67841 -83266 -337961 -475893 -430399 -380955
35161c80955l9120M5353K57208K88662J02518M440R4361P1374k09684l93807j68245
$$ -380955 -420075 -374722 -117514 171148 273666 278106 372467 443841 234157 -159650 -327895
35150c27895J80652J74966j16090k17472q589J56875Q9600L2393J68509K88153
$$ -327895 -147243 27723 -88367 -305839 -314428 -157553 -67953 -35560 132949 421102
35140D21102J57387r7813k06088j24344L27O2550L0659q8691j82776r6190J19242
$$ 421102 578489 480676 274588 150244 150571 213121 243780 155089 -27687 -123877 -4635
35129d635K00900M6449j08370l4371J56936K00731M4874j45589k20210j30422
$$ -4635 196265 242714 134344 99973 256909 457640 502514 356925 136715 6293
35119F293P9279K30550J16408k07437m03647k81051n1612K5197L5448J78839L32643
$$ 6293 85572 316122 432530 225093 -178554 -459605 -511217 -486020 -450572 -271733 60910
35108F0910K07384j34878k85621n8656K47995K70994M3840j05731Q72J94581J92911
$$ 60910 268294 133416 -152205 -210861 37134 308128 351968 246237 247109 441690 634601
35097F34601l9777k31304j46183Q1106J21316n9579j42553K7755J67749Q772k44041
$$ 634601 594824 363520 217337 298443 419759 360180 217627 245382 413131 421903 177862
35086A77862k22069L3891J78583J14498M0442R226j31109l25947k82783J7236
$$ 177862 -44207 -10316 168267 282765 323207 332433 201324 -124623 -407406 -390170
35076c90170J73794n6050l70543l72894j35310r834p2980r2935M4945J92589K08067
$$ -390170 -216376 -272426 -642969 -1015863 -1151173 -1161007 -1233987 -1326922 -1281977 -1089388 -881321
35065h81321J21959J7658n7636m6537P6463J97332J64420K1204l1958N9269J26394
$$ -881321 -759362 -741704 -799340 -845877 -769414 -572082 -407662 -386458 -418416 -359147 -232753
35054b32753P1716L6811J44021K50282J57432n9301j69643j57587j98480k86777
$$ -232753 -161037 -124226 19795 270077 427509 368208 198565 40978 -157502 -444279
35044d44279k07871L7515J16624j22187l12568o4259M06237N27652J72153k03761
$$ -444279 -652150 -614635 -498011 -620198 -932766 -997025 -590788 -63136 109017 -94744
35034i4744k33014n3403N9061R7950J63329J90663R3363l5718r1866j36090j92887
$$ -94744 -327758 -381161 -322100 -224150 -60821 129842 223205 187487 95621 -40469 -233356
35023b33356r3478K04806L55218M4003m48437n17049n1620M02260L77465L1060
$$ -233356 -326834 -122028 233190 277193 -171244 -688293 -739913 -337653 39812 70872
35013G0872j91740j43017m982O0431N3039J7377j8234j6905J7559l141j29934
$$ 70872 -120868 -263885 -268867 -208436 -155397 -138020 -156254 -173159 -155600 -158741 -288675
35002b88675k39221j48668J13134K75749J46127j13414j53874J05341L32164K00785
$$ -288675 -527896 -676564 -563430 -287681 -141554 -254968 -408842 -303501 28663 229448
34992B29448j51460k82338l9758K41689K25513K2944l3520R9899J54049k4828
$$ 229448 77988 -204350 -244108 -2419 223094 246038 212518 312417 466466 441638
34982D41638k71718l52603k26783j4621J46125J68382P0294l20Q2304K17298J65047
$$ 441638 169920 -182683 -409466 -424087 -277962 -109580 -39286 -39606 42698 259996 425043
34971D25043j09427l32866k64523j5078J13870K6272r8772j06587n1544k9776
$$ 425043 315616 -17250 -281773 -296851 -182981 -156709 -255481 -362068 -413612 -443388
34961d43388N042J25719K42168K10734Q7040O0823J29806P9300j34133k44358
$$ -443388 -438346 -312627 -70459 140275 227315 288138 417944 497244 363111 118753
34951A18753r1235Q7394M2374m9576R7058L09393J78833k25602l94078j70333
$$ 118753 27518 114912 157286 107710 204768 514161 692994 467392 73314 -97019
34941i7019K6453q0144k14270r9732Q3021J18324J62529L30207L14883q5126m40476
$$ -97019 -70566 -150710 -364980 -464712 -381691 -263367 -100838 229369 544252 459126 18650
34930A8650k62167J86439K65678n0137k14522m8035M5660j49566l14407j85431
$$ 18650 -243517 -57078 208600 158463 -56059 -104094 -58434 -208000 -522407 -707838
34920g07838M3693J30469J43731J82896J24792r4858k55726j56834Q0660K11210
$$ -707838 -664145 -533676 -389945 -207049 -82257 -177115 -432841 -589675 -509015 -297805
34910b97805J76145O9138l4198r3739r7168r5764j15662o2919R8313J64495l1736
$$ -297805 -121660 -52522 -86720 -180459 -277627 -373391 -489053 -551972 -453659 -289164 -320900
34899c20900k60587j75820J09123J67495k7315m2973K66390M82524K94516l4230
$$ -320900 -581487 -757307 -648184 -480689 -508004 -550977 -284587 197937 492453 458223
34889D58223j46998j17983j68546k15407o8842J68938K44261J24673k9839j18469
$$ 458223 311225 193242 24696 -190711 -259553 -90615 153646 278319 248480 130011
34879A30011j23051l7858O6634P3006P138j704J0189j00172k27216j08263J60996
$$ 130011 6960 -30898 35736 108742 115880 114176 124365 24193 -203023 -311286 -150290
34868a50290J67599j26472k52196p517J96415P2820l9502J58175L21698P7825
$$ -150290 17309 -109163 -361359 -368876 -172461 -99641 -139143 19032 340730 418555
34858D18555k57422k12861R784m5717j94478N8744N08518M37231k07214o43917
$$ 418555 161133 -51728 -41944 -87661 -282139 -223395 285123 722354 515140 -128777
34848a28777l99559J00011K86682J71481M0267m1454j04584o0567R4227J57052
$$ -128777 -528336 -428325 -141643 29838 70105 28651 -75933 -136500 -42273 114779
34838A14779L2242q9538m1884O7113N9374p4386k37446l18928j86580J61041M23294
$$ 114779 147021 57483 15599 82712 142086 67700 -169746 -488674 -675254 -514213 -90919
34827i0919K82841j11325k83598r9006Q4620J8461r2711k0391J00480O9241p027
$$ -90919 191922 80597 -203001 -302007 -217387 -198926 -291637 -312028 -211548 -142307 -149334
34816a49334P0062K21112K21830O5995n0626l1339K5604k969j14601j85780j07750
$$ -149334 -79272 141840 363670 429665 379039 347700 373304 370335 255734 69954 -37796
34805c7796L7405M118k80948n04289l12869J80021N03014M19415J30713j00160
$$ -37796 -391 3727 -277221 -781510 -1094379 -914358 -411344 8071 138784 38624
34795C8624k09896j93604l9495J17564Q7248m9434o390K42171L87609K66102P0846
$$ 38624 -171272 -364876 -404371 -286807 -199559 -248993 -255383 -13212 374397 640499 711345
34784G11345k3404r2649j83556j62615j5340N0965k0971j6396J25630J54639j1903
$$ 711345 687941 595292 411736 249121 233781 284746 263775 247379 373009 527648 515745
34773E15745p6235R7939J71495q6482l30819k01180L7844n2999l18012k91941
$$ 515745 439510 537449 708944 622462 291643 90463 128307 75308 -242704 -534645
34763e34645l1641r24k15886j84655K32141N25879L11410j06771k14446L2241
$$ -534645 -566286 -567210 -783096 -967751 -735610 -209731 101679 -5092 -219538 -187297
34753a87297K86710L17952J81401L9486K389N6327N6837j05838l06852l03413
$$ -187297 99413 417365 598766 638252 640641 696968 753805 647967 341115 37702
34743C7702p7569J12863P0535j17924k35826j62785P3028L11131L24394M6048
$$ 37702 -39867 72996 143531 25607 -210219 -373004 -299976 11155 335549 381597
34733C81597k68736l01234q3750O4758J4876k8946R4629K63166L07139K34218
$$ 381597 112861 -188373 -272123 -207365 -192489 -221435 -126806 136360 443499 677717
34723F77717J02674q5036k38660j86977J7814O7848j32013k38474J5830L35251
$$ 677717 780391 695355 456695 269718 287532 355380 223367 -15107 723 335974
34713C35974K57591j26361k80260j3760K63573J72909j24095k38867r7812P7426
$$ 335974 593565 467204 186944 173184 436757 609666 485571 246704 148892 226318
34703B26318J53193J81515J86717R4905j00346k64308k71459j47861k5599J785
$$ 226318 379511 561026 747743 842648 742302 477994 206535 58674 33075 34860
34693C4860l7522l5136O2974J60300J05148q9817k08788r1864J38929K25154R9834
$$ 34860 -2662 -37798 25176 185476 290624 200807 -7981 -99845 39084 264238 364072
$$ [...]
##END NTUPLES=NMR SPECTRUM
##END=
