##TITLE=31Pdec_SR_8
 CDCl3, 124 sc
 3.2.2020
##JCAMPDX= 6.0         $$ Bruker NMR JCAMP-DX V2.0
##DATA TYPE= NMR SPECTRUM
##DATA CLASS= NTUPLES
##ORIGIN= UXNMR, Bruker Analytische Messtechnik GmbH
##OWNER= root
$$ XWIN-NMR		Version 3.5
$$ Mon Feb  3 14:11:16 2020 Russian Standard Time (UT+4h)  she@DPX200
##.OBSERVE FREQUENCY= 81.013821
##.OBSERVE NUCLEUS= ^31P
##.ACQUISITION MODE= SIMULTANEOUS
##.ACQUISITION SCHEME= undefined
##.AVERAGES= 24
##.DIGITISER RES= 17
##SPECTROMETER/DATA SYSTEM= spect
##.PULSE SEQUENCE= zgpg30
##.SOLVENT NAME= CDCl3
##.SHIFT REFERENCE= (INTERNAL, CDCl3, 0, 182.463)
##AUDIT TRAIL= $$ (NUMBER, WHEN, WHO, WHERE, WHAT)
$$ ##TITLE= Audit trail, XWIN-NMR		Version 3.5
$$ ##JCAMPDX= 5.01
$$ ##ORIGIN= Bruker BioSpin GmbH
$$ ##OWNER= she
$$ F:/spectra/data/she/nmr/P31/1/pdata/1/auditp.txt
$$ ##AUDIT TRAIL=  $$ (NUMBER, WHEN, WHO, WHERE, WHAT)
(   1,<2020-02-03 14:10:23.57 +0400>,<she>,<DPX200>,
      <created by zg, POWCHK disabled, PULCHK disabled
       configuration hash MD5:
       00 E9 B6 7A A2 85 ED C7 34 08 36 98 17 FE 4E 26
       data hash MD5: 32K
       92 59 C4 DA 2B BB 09 6E E1 3B 72 27 86 67 1A 3B>)
(   2,<2020-02-03 14:10:26.04 +0400>,<she>,<DPX200>,
      <Start of raw data processing
       efp BC_mod = 2 LB = 1 FT_mod = 6 PKNL = 1 PHC0 = -1666.055 PHC1 = 60.00131 SI = 64K 
       data hash MD5: 64K
       9D 66 CF 05 EC 68 F2 71 60 52 A2 BF DD 25 7F 8C>)
(   3,<2020-02-03 14:10:46.84 +0400>,<she>,<DPX200>,
      <pk PHC0 = 8.235285 PHC1 = 0 
       data hash MD5: 64K
       7D F9 90 69 0E 05 5B 07 80 9A AC 74 CD FF 2F 24>)
(   4,<2020-02-03 14:10:50.54 +0400>,<she>,<DPX200>,
      <abs ABSG = 5 
       data hash MD5: 64K
       02 D1 E3 45 24 EC 2B D2 68 25 54 A2 A9 78 6B DD>)
$$ ##END=
$$ 
$$ hash MD5
$$ 73 20 61 66 C4 32 7D BC A5 8C 50 77 82 49 89 0C
##$RELAX= 
##$RELAX= 
##$RELAX= 
##$RELAX= 
##$RELAX= 
##$RELAX= 
##$RELAX= 
##$RELAX= 
$$ Bruker specific parameters
$$ --------------------------
##$DU= <F:/spectra>
##$EXPNO= 1
##$NAME= <P31>
##$PROCNO= 1
##$TYPE= <nmr>
##$USER= <she>
##$AMP= (0..31)
100 100 100 100 100 100 100 100 100 100 100 100 100 100 100 100 100 100 
100 100 100 100 100 100 100 100 100 100 100 100 100 100 
##$AQSEQ= 0
##$AQ_mod= 1
##$AUNM= <au_zg>
##$AUTOPOS= <>
##$BF1= 81.014009
##$BF2= 200.13
##$BF3= 200.13
##$BF4= 200.13
##$BF5= 200.13
##$BF6= 200.13
##$BF7= 200.13
##$BF8= 200.13
##$BYTORDA= 1
##$CFDGTYP= 0
##$CFRGTYP= 5
##$CHEMSTR= <none>
##$CNST= (0..31)
1 1 145 1 1 1 1 1 1 1 1 1 1 1 1 1 1 1 1 1 1 1 1 1 1 1 1 1 1 1 1 1 
##$CPDPRG= <waltz16>
##$CPDPRG1= <>
##$CPDPRG2= <waltz16>
##$CPDPRG3= <>
##$CPDPRG4= <mlev>
##$CPDPRG5= <mlev>
##$CPDPRG6= <mlev>
##$CPDPRG7= <mlev>
##$CPDPRG8= <mlev>
##$CPDPRGB= <>
##$CPDPRGT= <>
##$D= (0..31)
0 1 0 0 0 0 0 0 0 0 0 0.03 2e-05 3e-06 0 0 0 0 0 0 0 0 0 0 0 0 0 0 0 0 
0 0 
##$DATE= 1580724622
##$DBL= (0..7)
120 120 120 11 120 120 24 19 
##$DBP= (0..7)
150 150 150 150 150 150 150 150 
##$DBP07= 0
##$DBPNAM0= <>
##$DBPNAM1= <>
##$DBPNAM2= <>
$$ [...]
##$SUBNAM3= <"">
##$SUBNAM4= <"">
##$SUBNAM5= <"">
##$SUBNAM6= <"">
##$SUBNAM7= <"">
##$SUBNAM8= <"">
##$SUBNAM9= <"">
##$SW= 369.568048894756
##$SWIBOX= (0..15)
0 1 3 0 0 0 0 0 0 0 0 0 0 0 0 0 
##$SW_h= 29940.119760479
##$TD= 32768
##$TD0= 1
##$TE= 0
##$TE2= 300
##$TE3= 300
##$TEG= 300
##$TL= (0..7)
0 120 53 12 22 120 120 120 
##$TP= (0..7)
150 150 150 150 150 150 150 150 
##$TP07= 0
##$TPNAME0= <>
##$TPNAME1= <>
##$TPNAME2= <>
##$TPNAME3= <>
##$TPNAME4= <>
##$TPNAME5= <>
##$TPNAME6= <>
##$TPNAME7= <>
##$TPOAL= (0..7)
0.5 0.5 0.5 0.5 0.5 0.5 0.5 0.5 
##$TPOFFS= (0..7)
0 0 0 0 0 0 0 0 
##$TUNHIN= 0
##$TUNHOUT= 0
##$TUNXOUT= 0
##$USERA1= <user>
##$USERA2= <user>
##$USERA3= <user>
##$USERA4= <user>
##$USERA5= <user>
##$V9= 5
##$VALIST= <valist>
##$VCLIST= <CCCCCCCCCCCCCCC>
##$VD= 0
##$VDLIST= <DDDDDDDDDDDDDDD>
##$VPLIST= <PPPPPPPPPPPPPPP>
##$VTLIST= <TTTTTTTTTTTTTTT>
##$WBST= 1024
##$WBSW= 4
##$XGAIN= (0..3)
0 0 0 0 
##$XL= 0
##$YL= 0
##$YMAX_a= 16189
##$YMIN_a= -17863
##$ZGOPTNS= <>
##$ZL1= 120
##$ZL2= 120
##$ZL3= 120
##$ZL4= 120
##$ABSF1= 182.463
##$ABSF2= -187.1042
##$ABSG= 5
##$ABSL= 3
##$ALPHA= 0
##$AQORDER= 0
##$ASSFAC= 0
##$ASSFACI= 0
##$ASSFACX= 0
##$ASSWID= 0
##$AUNMP= <proc_1d>
##$AZFE= 0.1
##$AZFW= 0.5
##$BCFW= 0
##$BC_mod= 2
##$BYTORDP= 0
##$COROFFS= 0
##$CY= -3
##$DATMOD= 1
##$DC= 0
##$DFILT= <>
##$DTYPP= 0
##$F1P= 0
##$F2P= 0
##$FCOR= 1
##$FTSIZE= 65536
##$FT_mod= 6
##$GAMMA= 0
##$GB= 0
##$INTBC= 1
##$INTSCL= 5.30512e-09
##$ISEN= 30
##$LB= 1
##$LEV0= 0
##$LPBIN= 0
##$MAXI= 10000
##$MC2= 0
##$MEAN= 0
##$ME_mod= 0
##$MI= 50
##$NCOEF= 0
##$NC_proc= -8
##$NLEV= 6
##$NOISF1= 182.463
##$NOISF2= 159.3651
##$NSP= 0
##$NTH_PI= 0
##$NZP= 0
##$OFFSET= 182.463
##$PC= 4
##$PHC0= -1657.82
##$PHC1= 60.00131
##$PH_mod= 1
##$PKNL= yes
##$PPARMOD= 0
##$PSCAL= 0
##$PSIGN= 0
##$REVERSE= no
##$SF= 81.0140089999434
##$SI= 65536
##$SIGF1= 159.3651
##$SIGF2= -187.1042
##$SINO= 113.3802
##$SIOLD= 16384
##$SREGLST= <1H.CDCl3>
##$SSB= 0
##$STSI= 65536
##$STSR= 0
##$SW_p= 29940.119760479
##$SYMM= 0
##$S_DEV= 0
##$TDeff= 32768
##$TDoff= 0
##$TI= <>
##$TILT= no
##$TM1= 0
##$TM2= 0
##$TOPLEV= 0
##$USERP1= <user>
##$USERP2= <user>
##$USERP3= <user>
##$USERP4= <user>
##$USERP5= <user>
##$WDW= 1
##$XDIM= 65536
##$YMAX_p= 456777442
##$YMIN_p= -84503463
$$ End of Bruker specific parameters
$$ ---------------------------------
##NTUPLES= NMR SPECTRUM
##VAR_NAME=  FREQUENCY,     SPECTRUM/REAL,   SPECTRUM/IMAG
##SYMBOL=    X,             R,               I
##VAR_TYPE=  INDEPENDENT,   DEPENDENT,       DEPENDENT
##VAR_FORM=  AFFN,          ASDF,            ASDF
##VAR_DIM=   65536,         65536,           65536
##UNITS=     HZ,            ARBITRARY UNITS, ARBITRARY UNITS
##FACTOR=    0.456856943014862, 1,           1
##FIRST=     14782.0589164792, 0,            0
##LAST=      -15158.0608439998, 0,           0
##MIN=       -15158.0608439998, -84503463,   0
##MAX=       14782.0589164792, 456777442,    0
$$ Real data points
##PAGE= N=1
##DATA TABLE= (X++(R..R)), XYDATA
$$ [...]
$$ plain form
45625 -6321466 -6042468 -772642 5214371 6988703 4683944 1714650 -669631 -3521487
45617 -3521487 -5696644 -3613783 3393061 11133813 15639707 16958846 16098782 11789769
45609 11789769 3365012 -5670909 -10229581 -8539831 -2615210 4125552 8007901 6719860
45601 6719860 2113825 -1291032 -2492040 -4883670 -8597206 -7322673 2488878 14127450
45593 14127450 18638063 16448205 13897366 11731640 6029110 -1148337 -2118920 4298429
45585 4298429 10025075 9460635 5985806 3945697 2044055 -1354498 -3641670 -3542573 -4845546
45576 -4845546 -9202696 -11094121 -6120808 823071 2715575 1746467 5580913 14467626
45568 14467626 20299108 18719956 14843785 14744485 16864367 15435628 9389140 4189649
$$ packed form
45625f321466K78998N269826N987013J774332k304759k969294k384281k851856
45617c521487k175157K082861P006844P740752M505894J319139q60064m309013
45609A1789769q424757r035921m558672J689750N924621O740762L882349j288041
45601F719860m606035l404857j201008k391630l713536J274533R811551J1638572
45593A4127450M510613k189858k550839k165726n702530p177447r70583O417349
45585D298429N726646n64440l474829k040109j901642l398553k287172R9097j302973
45576d845546m357150j891425M973313O943879J892504r69108L834446Q886713
45568A4467626N831482j579152l876171r9300K119882j428739o046488n199491
$$ plain form
45560 4189649 5084435 10526028 13511702 9735056 3216498 1754197 7153484 13230679
45552 13230679 14401939 12489685 12576272 15323538 16874609 14447284 8825754 2681848
45544 2681848 -785112 1119846 8047868 15775242 19891422 19509092 16349950 12330982
45536 12330982 9496937 9565338 11474259 12102835 11208767 11889036 13804714 11031779 1054371
45527 1054371 -8868486 -10295104 -4822695 -153263 1561744 3445433 4551264 622750
45519 622750 -5801261 -6127277 849010 5360434 932534 -5671754 -4720186 2418854 6395661
45510 6395661 3131336 -2894891 -6536327 -6982025 -5502783 -3258949 -1635320 -1220101
45502 -1220101 -391918 2408763 5683390 7071196 7822007 11640693 18851108 24757370
$$ packed form
45560D189649Q94786N441593K985674l776646o518558j462301N399287O077195
45552A3230679J171260j912254Q6587K747266J551071k427325n621530o143906
45544B681848l466960J904958O928022P727374M116180l82330l159142m018968
45536A2330982k834045O8401J908921O28576q94068O80269J915678k772935r977408
45527A054371r922857j426618N472409M669432J715007J883689J105831l928514
45519F22750o424011l26016O976287M511424m427900o604288R51568P139040L976807
45510F395661l264325o026227l641436m45698J479242K243834J623629M15219
45502a220101Q28183K800681L274627J387806P50811L818686P210415N906262
$$ plain form
45494 24757370 24830323 19597612 13552471 10508825 10576320 10883020 9125685 6776252 7856067
45485 7856067 13445688 18720803 17787598 11081739 5232883 4906210 7482015 7781881 5941447
45476 5941447 6989549 12504676 16394292 11587291 -837396 -12243540 -15611658 -11182238
45468 -11182238 -3250773 4545938 9288996 8391560 2862183 -1514259 -293591 3626873
45460 3626873 3877371 -580584 -4697813 -4986656 -3423325 -3050064 -3875960 -4551485 -4435727
45451 -4435727 -2297081 3461437 10830720 13514834 7591363 -2628642 -8405176 -5886639
45443 -5886639 401381 3259187 379736 -4288206 -5933192 -4444119 -3597218 -5389102
45435 -5389102 -7853373 -9353460 -11460408 -14689028 -14935172 -9222043 -2728700 -3684191
$$ packed form
45494B4757370P2953n232711o045141l043646O7495L06700j757335k349433J079815
45485G856067N589621N275115r33205o705859n848856l26673K575805K99866j840434
45476E941447J048102N515127L889616m807001j2424687j1406144l368118M429420
45468a1182238P931465P796711M743058q97436n529377m376442J220668L920464
45460C626873K50498m457955m117229k88843J563331L73261q25896o75525J15758
45451d435727K138646N758518P369283K684114n923471j0220005n776534K518537
45443e886639O288020K857806k879451m667942j644986J489073Q46901j791884
45435e389102k464271j500087k106948l228620k46144N713129O493343r55491
$$ plain form
45427 -3684191 -11649393 -17440830 -15717769 -11273389 -10675495 -13595104 -15536701 -14128471
45419 -14128471 -9409754 -2357233 3745373 4904273 2390450 2331295 6209146 7452031
45411 7452031 1833925 -4676034 -4428124 763747 4071066 4866991 7238486 10182462
45403 10182462 8306295 1651086 -3401260 -3537158 -1670461 -137375 2084024 4130561
45395 4130561 2415996 -2541624 -4841045 -1935229 683382 -3022237 -11814006 -20102954
45387 -20102954 -24805255 -26051961 -24591799 -21965625 -20469429 -19669128 -15434918 -5823651
45379 -5823651 4105533 7035720 2033224 -4773529 -7916607 -8077210 -9083803 -11624248
45371 -11624248 -12088564 -7687100 -831455 3440703 3696626 3046550 3666047 4049848 3295063
$$ packed form
45427c684191p965202n791437J723061M444380N97894k919609j941597J408230
45419a4128471M718717P052521O102606J158900k513823n9155L877851J242885
45411G452031n618106o509959K47910N191871L307319P95925K371495K943976
45403A0182462j876167o655209n052346j35898J866697J533086K221399K046537
45395D130561j714565m957620k299421K905816K618611l705619q791769q288948
45387b0102954m702301j246706J460162K626174J496196Q00301M234210R611267
45379e823651R929184K930187n002496o806753l143078j60603j006593k540445
45371a1624248m64316M401464O855645M272158K55923o50076O19497L83801p54785
$$ plain form
45362 3295063 3885044 6865674 8204082 4713987 252922 119958 1972193 -535298
45354 -535298 -6511754 -8181983 -2607961 4803320 9547801 12664531 14034958 9670456
45346 9670456 -37151 -6918914 -5452417 -565935 640767 -485540 1834386 7571878
45338 7571878 11380075 10375469 5474033 -2305705 -10940101 -15195065 -11508626 -3750862
45330 -3750862 1140637 1711052 1181029 398125 -2148237 -4701790 -3533808 4295 48495
45321 48495 -5024106 -9691883 -8537404 -2149438 5036391 8662159 5840559 -2598950
45313 -2598950 -10244558 -10198983 -3677330 672787 -2277770 -8014195 -9310299 -5313439
45305 -5313439 -738003 1104887 1213095 2143931 4593163 6330069 4245715 -1338720
$$ packed form
45362C295063N89981K980630J338408l490095m461065j32964J852235k507491
45354e35298n976456j670229N574022P411281M744481L116730J370427m364502
45346I670456r707607o881763J466497M886482J206702j126307K319926N737492
45338G571878L808197j004606m901436p779738q634396m254964L686439P757764
45330c750862M891499N70415n30023p82904k546362k553553J167982L538103M4200
45321D8495n072601m667777J154479O387966P185829L625768k821600q439509
45313b598950p645608M5575O521653M350117k950557n736425j296104L996860
45305e313439M575436J842890J08208R30836K449232J736906k084354n584435
$$ plain form
45297 -1338720 -5219073 -2952749 2663474 4727168 1847765 -345810 1544859 3637322
45289 3637322 1927120 -1016689 -1329034 -1334112 -5353914 -10699910 -10176611 -3350959 1665369
45280 1665369 -561991 -5852787 -7865401 -7297824 -8735208 -11659101 -10696599 -4276353
45272 -4276353 2441817 4546231 2925652 771453 -1562122 -4796834 -6707506 -4529588
45264 -4529588 -507800 -366941 -5418722 -10065653 -8946559 -3629335 -31906 -1314076
45256 -1314076 -5508494 -8653619 -8213313 -4470911 -280787 1292378 76550 -1609569
45248 -1609569 -2957756 -5956914 -11339462 -15758372 -15220840 -9531915 -1562734 5576749
45240 5576749 8736030 5460467 -1926604 -5792279 -1383488 6068867 7184682 476227
$$ packed form
45297a338720l880353K266324N616223K063694k879403k193575J890669K092463
45289C637322j710202k943809l12345n078m019802n345996N23299O825652N016328
45280A665369k227360n290796k012614N67577j437384k923893R62502O420246
45272d276353O718170K104414j620579k154199k333575l234712j910672K177918
45264d529588M021788J40859n051781m646931J119094N317224L597429j282170
45256a314076m194418l145125M40306L742402M190124J573165j215828j686119
45248a609569j348187k999158n382548m418910N37532N688925P969181P139483
45240E576749L159281l275563p387071l865675M408791P452355J115815o708455
$$ plain form
45232 476227 -6303647 -6692657 -2508750 536604 -70461 -2508403 -3522533 -1216813 2981268
45223 2981268 5205245 4343688 5014329 11274168 18430579 16963600 5506120 -5875768
45215 -5875768 -7741205 -1652132 4505723 7043638 8186546 10388762 13437050 16082087
45207 16082087 17322098 16517530 14116990 11645557 10051913 9221666 9341787 10619274
45199 10619274 11443048 9694675 6326565 4276793 3314549 277028 -4269482 -4672145
45191 -4672145 1537417 8338789 8031329 335931 -8549319 -12999441 -11036672 -3830696
45183 -3830696 4052359 6734435 3024564 -2204136 -5375210 -8778337 -13903901 -15454652
45175 -15454652 -8696381 934658 3715539 -396673 -1967824 3380845 8616230 5995726
$$ packed form
45232D76227o779874l89010M183907L045354o07065k437942j014130K305720M198081
45223B981268K223977q61557O70641O259839P156411j466979j1457480j1381888
45215e875768j865437O089073O157855K537915J142908K202216L048288K645037
45207A6082087J240011q04568k400540k471433j593644q30247J20121J277487
45199A0619274Q23774j748373l368110k049772r62244l037521m546510m02663
45191d672145O209562O801372l07460p695398q885250m450122J962769P205976
45183c830696P883055K682076l709871n228700l171074l403127n125564j550751
45175a5454652O758271R631039K780881m112212j571151N348669N235385k620504
$$ plain form
45167 5995726 -2131436 -6919640 -3732002 3656527 7513105 3664448 -3592667 -4663114
45159 -4663114 4348862 15181738 16481116 8296576 1662600 3657100 9603507 11873597
45151 11873597 9712251 6768180 4475882 2523384 2050367 3992414 6786021 8845363
45143 8845363 10547500 11304151 8537955 2826762 -113661 3023724 7228504 5836763
45135 5836763 53907 -3801705 -4178586 -4996002 -7459125 -7690644 -3172779 3916458 10833201
45126 10833201 16784931 20100754 17905140 10840034 3941351 340582 -2248225 -6204425
45118 -6204425 -8909711 -6617427 -754149 3644771 4349714 3164139 1753863 88765
45110 88765 -1014100 405126 3894387 5561615 2742901 -1665930 -1664690 5043623 13879897
$$ packed form
45167E995726q127162m788204L187638P388529L856578l848657p257115j070447
45159d663114R011976J0832876J299378q184540o633976J994500N946407K270090
45151A1873597k161346k944071k292298j952498m73017J942047K793607K059342
45143H845363J702137P56651k766196n711193k940423L137385M204780j391741
45135E836763n782856l855612l76881q17416k463123k31519M517865P089237O916743
45126A0833201N951730L315823k195614p065106o898683l600769k588807l956200
45118f204425k705286K292284N863278M398920P04943j185575j410276j665098
45110H8765j102865J419226L489261J667228k818714m408831J240O708313Q836274
$$ plain form
45101 13879897 17520026 12954571 4156006 -2302321 -3793454 -3076382 -3513603 -4632124
45093 -4632124 -3615590 117226 3898742 5098612 3498200 300942 -3129070 -4844814
45085 -4844814 -2777221 2680273 7777385 8877678 6265841 3153733 1657824 1477951
45077 1477951 2109149 4273241 8640554 14420750 19644517 22057338 20023754 13903466
45069 13903466 6466267 606932 -3141085 -5443669 -5529132 -2533423 994853 1075786 -1109113
45060 -1109113 856576 9195225 16590878 14962595 6661534 1029829 1235989 1463840
45052 1463840 -2048352 -4464675 -517404 6505270 9378379 6988754 3853732 1603414
45044 1603414 -2614205 -9220726 -13863898 -13800851 -11532466 -9462292 -5664072 1092742
$$ packed form
45101A3879897L640129m565455q798565o458327j491133P17072m37221j118521
45093d632124J016534L732816L781516J199870j600412l197258l430012j715744
45085d844814K067593N457494N097112J100293k611837l112108j495909j79873
45077A477951O31198K164092M367313N780196N223767K412821k033584o120288
45069A3903466p437199n859335l748017k302584q5463K995709L528276Q0933k184899
45060a109113J965689Q338649P395653j628283q301061n631705K06160K27851
45052A463840l512192k416323L947271P022674K873109k389625l135022k250318
45044A603414m217619o606521m643172O3047K268385K070174L798220O756814
$$ plain form
45036 1092742 6112636 4227025 -1471825 -2433630 3877126 11050187 13274813 11906755
45028 11906755 10026735 6532078 564814 -3031320 372074 6303771 5817613 -1310893
45020 -1310893 -5559431 -1336373 5628718 7962572 7048997 8273728 10825372 9243385
45012 9243385 3037303 -1799591 -886640 3812129 7643217 7709513 3562180 -2751917 -6911527
45003 -6911527 -5861038 -1514462 1735495 2668099 3111040 3087820 723276 -2879950 -3750298
44994 -3750298 -1381369 -168747 -2350092 -3983548 -1052498 4143892 6403757 4755974
44986 4755974 2469166 1826447 2508596 3993499 6140712 7793113 7529832 5696439 3755499
44977 3755499 2195082 1037124 1635532 5413248 10693174 13004916 9543841 2377552
$$ packed form
45036A092742N019894j885611n698850r61805O310756P173061K224626j368058
45028A1906755j880020l494657n967264l596134L403394N931697m86158p128506
45020a310893m248538M223058O965091K333854r13575J224731K551644j581987
45012I243385o206082m836894R12951M698769L831088O6296m147333o314097m159610
45003f911527J050489M346576L249957R32604M42941k3220k364544l603226q70348
44994c750298K368929J212622k181345j633456K931050N196390K259865j647783
44986D755974k286808o42719O82149J484903K147213J652401k63281j833393j940940
44977C755499j560417j157958N98408L777716N279926K311742l461075p166289
$$ plain form
44969 2377552 -3557913 -5518602 -5628568 -8005785 -13281395 -17574513 -18059103 -17242551 -18589466
44960 -18589466 -19832841 -15861497 -8079481 -4585281 -8875004 -14310393 -13585750 -8398272
44952 -8398272 -4755332 -3391025 -1223733 1121020 575155 -1438606 -813140 1108037
44944 1108037 -1286513 -8043929 -12546249 -12001779 -11635827 -15256195 -18545736 -16365639
44936 -16365639 -10979086 -7582121 -6380729 -5123986 -5514973 -9920170 -14072856 -10910090
44928 -10910090 -1537228 4934033 3838616 561645 1083376 3153543 1414461 -3288050
44920 -3288050 -5424301 -3138266 649124 4494788 9863140 15461338 15812352 8648053
44912 8648053 -30541 -2209851 2824711 9049958 12066042 12659125 12369301 10267258
$$ packed form
44969B377552n935465j960689j09966k377217n275610m293118m84590Q16552j346915
44960a8589466j243375L971344P782016L494200m289723n435389P24643N187478
44952h398272L642940J364307K167292K344753n45865k013761O25466J921177
44944A108037k394550o757416m502320N44470L65952l620368l289541K180097
44936a6365639N386553L396965J201392J256743l90987m405197m152686L162766
44928a0910090R372862O471261j095417l276971N21731K070167j739082m702511
44920c288050k136251K286035L787390L845664N368352N598198L51014p164299
44912H648053q678594k179310N034562O225247L016084N93083k89824k102043
$$ plain form
44904 10267258 5952779 2252916 2190614 5202187 8632166 11340394 13569336 14789533
44896 14789533 14453883 14086270 15836668 18952042 19803839 15604045 6809571 -3441396
44888 -3441396 -10656468 -11097886 -5398524 516295 1126943 -2216580 -3487195 -327188
44880 -327188 3574268 4793071 4445612 4578687 4661303 4437467 6355115 11318279 15060078
44871 15060078 13291777 8522449 6992145 9876303 12455328 11832514 10348479 10254690
44863 10254690 9799854 6989979 3585444 2527293 3869909 5645818 6485619 5237072
44855 5237072 789265 -4685990 -5015127 3017153 13181440 14994961 5828515 -5938022
44847 -5938022 -10515356 -5895303 3313734 11909278 16467676 15242125 9540710 3791800
$$ packed form
44904A0267258m314479l699863o2302L011573L429979K708228K228942J220197
44896A4789533l35650l67613J750398L115374Q51797m199794q794474j0250967
44888c441396p215072m41418N699362N914819O10648l343523j270615L160007
44880c27188L901456J218803l47459J33075Q2616k23836J917648M963164L741799
44871A5060078j768301m769328j530304K884158K579025o22814j484035r3789
44863A0254690m54836k809875l404535j058151J342616J775909Q39801j248547
44855E237072m447807n475255l29137Q032280J0164287J813521r166446j1766537
44847e938022m577334M620053R209037Q595544M558398j225551n701415n748910
$$ plain form
44839 3791800 1276898 747391 -561425 -2397420 -3140933 -4382193 -9396498 -16955886
44831 -16955886 -20934144 -17502136 -9491018 -2163585 2167885 3470009 1431154 -2999927
44823 -2999927 -5671546 -2835494 3698921 8163621 7639208 4537427 2050313 77082
44815 77082 -3009769 -6910486 -9947904 -11966785 -14178514 -15756180 -12773264 -2653819
44807 -2653819 10685090 18638642 16500620 8865729 4223864 5040632 6388180 4498471
44799 4498471 2353688 4233421 8154775 8095904 2499288 -3661975 -5420460 -2838867
44791 -2838867 1191253 4881042 7776971 9579959 10574681 11656596 12565880 11687173 9024880
44782 9024880 7691936 10355197 15105970 16942059 13157904 5743170 -1230726 -4857856
$$ packed form
44839C791800k514902n29507j308816j835995p43513j241260n014305p559388
44831a6955886l978258L432008Q011118P327433M331470J302124k038855m431081
44823b999927k671619K836052O534415M464700n24413l101781k487114j973231
44815G7082l086851l900717l037418k018881k211729j577666K982916J0119445
44807b653819J3338909P953552k138022p634891m641865Q16768J347548j889709
44799D498471k144783J879733L921354n8871n596616o161263j758485K581593
44791b838867M030120L689789K895929J802988R94722J081915R09284q78707k662293
44782I024880j332944K663261M750773J836089l784155p414734o973896l627130
$$ plain form
44774 -4857856 -4147152 142350 5157012 7034138 4428737 700908 739776 5195602 9476266
44765 9476266 9240816 5137352 600853 -3165726 -7095711 -10116998 -9127278 -4040412
44757 -4040412 826644 2565320 3814241 8144383 13818418 16019070 13893219 11171241
44749 11171241 10160041 9460990 8323317 8894644 12016284 14341231 12853724 9977454
44741 9977454 10394359 13586386 13507513 6721349 -2258422 -6131402 -3501976 699370 2885867
44732 2885867 4862902 8624708 11099113 8255373 2202337 -1221071 -1420619 -3500677
44724 -3500677 -8552518 -10168928 -4222291 3998348 7904718 9684774 14976403 21106462
44716 21106462 19597666 9608351 91353 -2784086 -2502364 -4052029 -6319700 -6579249
$$ packed form
44774d857856P10704M289502N014662J877126k605401l727829L8868M455826M280664
44765I476266k35450m103464m536499l766579l929985l021287R89720N086866
44757d040412M867056J738676J248921M330142N674035K200652k125851k721978
44749A1171241j011200o99051j137673N71327L121640K324947j487507k876270
44741I977454M16905L192027p8873o786164q979771l872980K629426M201346K186497
44732B885867J977035L761806K474405k843740o053036l423408j99548k080058
44724c500677n051841j616410N946637Q220639L906370J780056N291629O130059
44716B1106462j508796r989315r516998k875439K81722j549665k267671k59549
$$ plain form
44708 -6579249 -6267129 -7156170 -6484439 -1467676 4443127 5209641 413194 -4784125 -6908691
44699 -6908691 -7468109 -9369898 -13219684 -17232301 -18769652 -16245164 -10949752 -6307582
44691 -6307582 -4209451 -3153390 -1002583 1757232 2538969 -654924 -7355608 -14021847
44683 -14021847 -15826987 -11501642 -5696933 -3213191 -1981577 3221147 10775915 12977459
44675 12977459 8078571 3886658 5987809 9772833 9028013 5545665 4061850 3838553
44667 3838553 2390680 2111769 5224916 6850604 1914209 -4759374 -4649099 894599
44659 894599 3156433 435134 -504393 2805843 4697526 1790624 -2001226 -2932930 -1697482
44650 -1697482 1225015 6088336 8629538 3734501 -4006481 -3929366 3789590 6494046
$$ packed form
44708f579249L12120q89041O71731N016763N910803P66514m796447n197319k124566
44699f908691n59418j901789l849786m012617j537351K524488N295412M642170
44691f307582K098131J056061K150807K759815P81737l193893o700684o666239
44683a4021847j805140M325345N804709K483742J231614N202724P554768K201544
44675A2977459m898888m191913K101151L785024p44820l482348j483815k23297
44667C838553j447873k78911L113147J625688m936395o673583J10275N543698
44659H94599K261834k721299r39527L310236J891683k906902l791850r31704J235448
44650a697482K922497M863321K541202m895037p740982P7115P718956K704456
$$ plain form
44642 6494046 -1068525 -7703911 -4156047 1522385 -2275490 -11631285 -14770673 -11423916
44634 -11423916 -10182323 -11051043 -5802115 5303667 11628677 8836866 4642185 4323055
44626 4323055 2043530 -7831412 -20112718 -26041998 -24411680 -19494341 -13582767 -7613535
44618 -7613535 -4748706 -7268595 -12508878 -16331733 -17935371 -17510850 -12750020 -2674135
44610 -2674135 7527954 10623145 5405322 -2851729 -8551098 -9286815 -5536051 -850349
44602 -850349 -407699 -5063446 -8588243 -5474952 441519 1220589 -2363165 -915839 9008712
44593 9008712 18039854 16204901 6347232 -477337 777781 5926659 10250559 13199518
44585 13199518 14307815 11372832 5285399 1539433 3468570 7503068 8462407 6516081
$$ packed form
44642F494046p562571o635386L547864N678432l797875r355795l139388L346757
44634a1423916J241593q68720N248928J1105782O325010k791811m194681l19130
44626D323055k279525r874942j2281306n929280J630318M917339N911574N969232
44618g613535K864829k519889n240283l822855j603638M24521M760830J0075885
44610b674135J0202089L095191n217823q257051n699369p35717L750764M685702
44602h50349M42650m655747l524797L113291N916471P79070l583754J447326R924551
44593I008712R031142j834953r857669o824569J255118N148878M323900K948959
44585A3199518J108297k934983o087433l745966J929137M034498R59339j946326
$$ plain form
44577 6516081 5218832 5321136 5121990 5347363 8415443 12830237 13373682 8366795 2589554
44568 2589554 905605 2669909 5206639 9370298 17285550 26151821 29079358 22935269
44560 22935269 12304198 4476053 2617224 5000980 8901477 12973208 16162224 16313645
44552 16313645 11371421 2284359 -5965351 -7658356 -1768510 6293665 9601059 6529374
44544 6529374 1552778 -974408 -1920437 -4482517 -7583891 -5814978 2756991 11883393
44536 11883393 13493918 7237419 -66806 -3799375 -5663072 -7738899 -7971146 -4873528
44528 -4873528 -2222441 -4164599 -8450240 -9547750 -6436115 -2227177 1866361 6072291
44520 6072291 7167950 1557931 -6694820 -8802714 -3738650 23451 -2388186 -5806433
$$ packed form
44577F516081j297249J02304j99146K25373L068080M414794N43445n006887n777241
44568B589554j683949J764304K536730M163659P915252Q866271K927537o144089
44560B2935269j0631071p828145j858829K383756L900497M071731L189016J51421
44552A6313645m942224r087062q249710j693005N889846Q062175L307394l071685
44544F529374m976596k527186r46029k562080l101374J768913Q571969R126402
44536A1883393J610525o256499p304225l732569j863697k075827k32247L097618
44528d873528K651087j942158m285641j097510L111635M208938M093538M205930
44520F072291J095659n610019q252751k107894N064064L762101k411637l418247
$$ plain form
44512 -5806433 -5494263 -4932184 -6677879 -3997314 8922853 24344678 29059548 21684427
44504 21684427 11941424 5504370 380302 -3254133 -1774366 2325255 1431133 -3697606
44496 -3697606 -2851935 6593708 12767908 6473674 -4543572 -7377075 -1921576 3114303
44488 3114303 5621135 9570508 12819854 8270890 -2741446 -9602773 -7187670 -1898116
44480 -1898116 54836 1357238 5806806 9468810 6212917 -2502967 -9475311 -10756546
44472 -10756546 -8150144 -5122063 -4553881 -8413605 -15131246 -18548872 -13646743 -2860059
44464 -2860059 6446595 9990877 9155679 6968333 5338376 5655524 8027159 9534597
44456 9534597 6826875 1226489 -1921814 18748 3748057 4585292 1536109 -3339601
$$ packed form
44512e806433L12170N62079j745695K680565J2920167J5421825M714870p375121
44504B1684427r743003o437054n124068l634435J479767M099621q94122n128739
44496c697606Q45671R445643O174200o294234j1017246k833503N455499N035879
44488C114303K506832L949373L249346m548964j1012336o861327K415103N289554
44480a898116J952952J302402M449568L662004l255893q715884o972344j281235
44472a0756546K606402L028081N68182l859724o717641l417626M902129J0786684
44464b860059R306654L544282q35198k187346j629957L17148K371635J507438
44456I534597k707722n600386l148303J940562L729309Q37235l049183m875710
$$ plain form
44448 -3339601 -7740648 -9508147 -6726581 83244 7169598 10725548 9841722 5471067
44440 5471067 -1349825 -8578512 -12759202 -12180994 -9156782 -6872946 -5249779 -2293806
44432 -2293806 1768926 4545879 4844134 3304104 547386 -2340797 -2372880 2460031 8774293
44423 8774293 10228985 5554065 760659 1639797 6878861 10635816 9610795 5228590
44415 5228590 436897 -3119778 -5172708 -5910645 -5398924 -3583210 -841647 2069230
44407 2069230 5201610 9239401 12816821 12220109 6775741 2344277 4502754 9327965
44399 9327965 7340123 -2643126 -10554022 -8697074 -1615709 2176019 2393628 4720188
44391 4720188 10539691 15705625 17217410 15102730 9501875 1612991 -4060188 -4056576 -1188478
$$ packed form
44448c339601m401047j767499K781566O809825P086354L555950q83826m370655
44440E471067o820892p228687m180690N78208L024212K283836J623167K955973
44432b293806M062732K776953K98255j540030k756718k888183l2083M832911O314262
44423H774293J454692m674920m793406Q79138N239064L756955j025021m382205
44415E228590m791693l556675k052930p37937N11721J815714K741563K910877
44407B069230L132380M037791L577420n96712n444368m431464K158477M825211
44399I327965j987842r983249p910896J856948P081365L791728K17609K326560
44391D720188N819503N165934J511785k114680n600855p888884n673179L612K868098
$$ plain form
44382 -1188478 -124030 206686 3584094 7984549 7726978 3167695 47350 -868893 -4782561
44373 -4782561 -12351263 -17308109 -17117283 -16836367 -18504430 -16011745 -6332251 2759695
44365 2759695 3643920 168647 -306280 569231 -2401816 -5287899 261235 11798808
44357 11798808 17358729 12217615 3625042 -2473603 -8370716 -14831169 -15260652 -6343232
44349 -6343232 3697725 5601803 2446019 4319437 12973687 20000273 19210084 13382240
44341 13382240 7992890 4493673 1936102 639552 1255635 2592166 2733649 1338180
44333 1338180 -230761 -266423 1851328 4316426 3367948 -2731869 -10020117 -11636015 -5370591
44324 -5370591 3582384 8706075 9155106 8950640 10708156 12597598 11235698 5525910
$$ packed form
44382a188478J064448L30716L377408M400455k57571m559283l120345r16243l913668
44373d782561p568702m956846J90826K80916j668063K492685R679494R091946
44365B759695Q84225l475273m74927Q75511k971047k886083N549134J1537573
44357A1798808N559921n141114q592573o098645n897113o460453m29483Q917420
44349f343232J0040957J904078l155784J873418Q654250P026586p90189n827844
44341A3382240n389350l499217k557571j296550O16083J336531J41483j395469
44333A338180j568941l5662K117751K465098r48478o099817p288248j615898O265424
44324e370591Q952975N123691M49031k04466J757516J889442j361900n709788
$$ plain form
44316 5525910 -2747914 -10610019 -15452440 -15938454 -12487804 -7111457 -2573570 -1119234
44308 -1119234 -2865437 -4957185 -3623060 1476826 5759116 4494738 -1193127 -5357534
44300 -5357534 -4631521 -2162063 -2859155 -6891652 -10082656 -9402835 -5511980 -374990 4883068
44291 4883068 9074551 10108332 6788024 902271 -3711854 -4533088 -2530413 -758416
44283 -758416 -837254 -1395428 -458039 1640043 3429556 5778604 11153078 18375103 21251964
44274 21251964 15227296 3647571 -5571718 -8536342 -7777776 -6903227 -6310674 -4621654
44266 -4621654 -1379842 2910955 7570007 11493878 13249699 12012861 7891054 1775986
44258 1775986 -4293009 -7758214 -8059251 -7374450 -7251945 -6290431 -3486785 -1565764 -3153405
$$ packed form
44316E525910q273824p862105m842421m86014L450650N376347M537887J454336
44308a119234j746203k091748J334125N099886M282290j264378n687865m164407
44300e357534P26013K469458o97092m032497l191004O79821L890855N136990N258058
44291D883068M191483J033781l320308n885753m614125q21234K002675J771997
44283g58416p8838n58174R37389K098082J789513K349048N374474P222025K876861
44274B1251964o024668j1579725r219289k964624P58566Q74549N92553J689020
44266d621654L241812M290797M659052L923871J755821j236838m121807o115068
44258A775986o068995l465205l01037O84801J22505R61514K803646J921021j587641
$$ plain form
44249 -3153405 -5323067 -2790908 3912836 8316425 6350857 311117 -5808570 -9977142
44241 -9977142 -10374034 -5501961 1867620 5696477 4156622 2011629 3372361 6420928
44233 6420928 7787614 7730163 7979127 8466465 9187221 11471944 14638967 15464050 13696247
44224 13696247 13545110 16770074 19438422 18898862 18024447 18153234 14470453 4723549 -3614059
44215 -3614059 -2796178 3401546 5789630 3631660 3236082 5782974 6496881 4429993 3277887
44206 3277887 2972650 -29141 -4072420 -3437383 1335049 3816257 3147982 4834586 8583396
44197 8583396 6885706 -543232 -2553126 6824030 17611039 17604058 8627915 795336
44189 795336 -2284064 -3383399 -2465094 2357562 7732565 7864461 2812339 -3017074 -8402041
$$ packed form
44249c153405k169662K532159O703744M403589j965568o039740o119687m168572
44241i977142l96892M872073P369581L828857j539855k144993J360732L048567
44233F420928J366686n7451K48964M87338P20756K284723L167023Q25083j767803
44224A3696247j51137L224964K668348n39560q74415J28787l682781r746904q337608
44215c614059Q17881O197724K388084k157970l95578K546892P13907k066888j152106
44206C277887l05237l001791m043279O35037M772432K481208o68275J686604L748810
44197H583396j697690p428938k009894R377156J0787009o981q976143p832579
44189G95336l079400j099335R18305M822656N375003J31896n052122n829413n384967
$$ plain form
44180 -8402041 -14365754 -18226042 -16388083 -11670103 -10240771 -11945694 -10944171 -5602730
44172 -5602730 -420034 2093210 3967941 5106614 1490027 -7388868 -15521841 -17866504
44164 -17866504 -15853438 -12950142 -9922678 -7478048 -8301287 -12022613 -12203341 -3605603
44156 -3605603 9543267 17205835 14774244 7164067 2062835 2105256 4046891 3613213
44148 3613213 418670 -1565343 1054423 5823195 6368391 747979 -4904195 -3864778
44140 -3864778 2185055 5704332 3965309 2214767 5010340 9388804 10225437 8703485
44132 8703485 10054745 14367298 15836913 12106612 8344638 8880898 9923186 5681047
44124 5681047 -1764017 -4958386 -1896719 2111984 3382216 4179361 6603011 8284697
$$ packed form
44180h402041n963713l860288J837959M717980J429332j704923J001523N341441
44172e602730N182696K513244J874731J138673l616587q878895q132973k344663
44164a7866504K013066K903296L027464K444630q23239l721326j80728Q597738
44156c605603J3148870P662568k431591p610177n101232M2421J941635m33678
44148C613213l194543j984013K619766M768772N45196n620412n652174J039417
44140c864778O049833L519277j739023j750542K795573M378464Q36633j521952
44132H703485J351260M312553J469615l730301l761974N36260J042288m242139
44124E681047p445064l194369L061667M008703J270232P97145K423650J681686
$$ plain form
44116 8284697 7259865 6120998 7511415 9400200 8754245 6501152 4625550 1378851
44108 1378851 -5598666 -13257236 -15470605 -10977700 -4592899 -393175 2314231 5494693
44100 5494693 8359689 8605924 5892489 2523297 817695 46856 -3394799 -11192437
44092 -11192437 -18669959 -18244951 -8736708 1860220 5217411 1474751 -3417295 -5908886
44084 -5908886 -6436431 -5360885 -2341226 1040799 2339320 1737784 1080279 87387 -2812573
44075 -2812573 -6377910 -7094763 -3922829 664497 4225163 5966413 5450069 3115168
44067 3115168 1583233 2679443 3358748 -1322398 -10669900 -17699350 -17291976 -11921568
44059 -11921568 -7802200 -7667141 -8904082 -7581385 -3088414 1527116 4280589 8089748
$$ packed form
44116H284697j024832j138867J390417J888785o45955k253093j875602l246699
44108A378851o977517p658570k213369M492905O384801M199724K707406L180462
44100E494693K864996K46235k713435l369192j705602p70839l441655p797638
44092a1192437p477522M25008R508243J0596928L357191l742660m892046k491591
44084e908886n27545J075546L019659L382025J298521o01536o57505r92892k899960
44075b812573l565337p16853L171934M587326L560666J741250n16344k334901
44067C115168j531935J096210O79305m681146r347502p029450M07374N370408
44059a1921568M119368J35059j236941J322697M492971M615530K753473L809159
$$ plain form
44051 8089748 16515637 25701099 26342391 16567427 6732768 6057378 10045096 8472624
44043 8472624 1082235 -4037745 -4654609 -6222711 -10161675 -11144729 -7526502 -4403164
44035 -4403164 -3750705 -1054598 4933939 8379451 6508163 4726881 6675143 7699262
44027 7699262 4072750 674912 2680226 6663490 7154618 5717575 6150210 6627521 4514942
44018 4514942 3626155 8291463 14671161 16338289 14449372 13848838 13008040 7282402 -761066
44009 -761066 -4169516 -3036416 -3327878 -5133929 -2059495 6951407 14353275 14379095 9164568
44000 9164568 3211937 -1131299 -1778180 2056971 5663739 2952943 -3919351 -6360707
43992 -6360707 -2045127 2129227 1710631 879075 3645889 6860650 6503933 4234258 3126345
$$ packed form
44051H089748Q425889R185462O41292r774964r834659o75390L987718j572472
44043H472624p390389n119980o16864j568102l938964r83054L618227L123338
44035d403164O52459K696107N988537L445512j871288j781282J948262J024119
44027G699262l626512l397838K005314L983264M91128j437043M32635M77311k112579
44018D514942q88787M665308O379698J667128j888917o00534q40798n725638q043468
44009g61066l408450J133100k91462j806051L074434R010902P401868K5820n214527
44000I164568n952631m343236o46881L835151L606768k710796o872294k441356
43992f360707M315580M174354m18596q31556K766814L214761l56717k269675j107913
$$ plain form
43983 3126345 2901610 3636993 8114343 15878784 20867536 19872167 17700063 18907732 20407146
43974 20407146 18126528 14853275 14088696 11582559 2055971 -9173977 -11091920 -2446523
43966 -2446523 6704784 9251750 8366124 8799723 8661586 3831739 -4594793 -11396509 -13019431
43957 -13019431 -9784192 -4691390 -1755067 -3098412 -6067239 -5306001 978804 8725587
43949 8725587 12884641 12406004 9387131 5719798 2384370 323775 9312 945622 2857807
43940 2857807 6248128 10269100 11293786 6351914 -1657019 -4978771 469438 9009285
43932 9009285 10853184 3863396 -3986179 -5198018 -1528247 1137194 2381370 5642247
43924 5642247 9545394 8769575 3748637 1481171 4492360 6672108 3699416 108656
$$ packed form
43983C126345k24735P35383M477350P764441M988752r95369k172104J207669J499414
43974B0407146k280618l273253p64579k506137r526588j1229948j917943Q645397
43966b446523R151307K546966q85626M33599j38137m829847q426532o801716j622922
43957a3019431L235239N092802K936323j343345k968827P61238O284805P746783
43949H725587M159054m78637l018873l667333l335428k060595l14463R36310J912185
43940B857807L390321M020972J024686m941872q008933l321752N448209Q539847
43932I009285J843899o989788p849575j211839L669771K665441J244176L260877
43924E642247L903147p75819n020938k267466L011189K179748k972692l590760
$$ plain form
43916 108656 803437 2513955 437874 -2546385 -1095802 2960331 4502412 4512237 6557860
43907 6557860 7542144 2392953 -4317740 -2922909 5718695 10932715 9201121 7817455
43899 7817455 9369946 6531661 -2194864 -5369329 3714979 14131227 13347794 6313011
43891 6313011 5585041 10329269 10093093 4580921 3575118 8453386 9511132 3460215
43883 3460215 -973076 1112571 2798730 -730745 -2225239 5498786 16835678 21614532
43875 21614532 18900495 14213855 9347045 3806077 1076834 3955767 7321195 4790159
43867 4790159 -301709 77812 4955617 5928953 1745044 580748 6276947 12485400
43859 12485400 13750811 13014712 13420061 11365243 4306347 -1573568 504909 6716559
$$ packed form
43916A08656O94781J710518k076081k984259J450583M056133J542081R825K045623
43907F557860R84284n149191o710693J394831Q641604N214020j731594j383666
43899G817455J552491k838285q726525l174465R084308J0416248p83433p034783
43891F313011p27970M744228k36176n512172j005803M878268J057746o050917
43883C460215m433291K085647J686159l529475j494494P724025J1336892M778854
43875B1614532k714037m686640m866810n540968k729243K878933L365428k531036
43867D790159n091868L79521M877805R73336m183909j164296N696199O208453
43859A2485400J265411p36099M05349k054818p058896n879915K078477O211650
$$ plain form
43851 6716559 7632738 1715208 -3967442 -5269092 -5600234 -8419551 -11728761 -12257002 -10375727
43842 -10375727 -8386077 -7241212 -7078253 -8341344 -10290969 -10274336 -6391991 25916
43834 25916 5605246 7805657 6339613 2966764 365528 277025 2383060 5287865 7892117
43825 7892117 9137193 7888583 4723887 2456302 2765600 3649769 2697641 1293981 2149870
43816 2149870 3947652 2849225 -971445 -3009365 -1211756 1560328 2944916 4141022
43808 4141022 5732078 5325681 2190585 -59490 1403123 4795198 8173376 13018490
43800 13018490 19051502 20389755 13243238 3877667 1425527 4741880 4496176 -1959472
43792 -1959472 -6268829 -1623438 7725301 12978436 11074980 4814797 -2272433 -7055031
$$ packed form
43851F716559R16179n917530n682650j301650l31142k819317l309210n28241J881275
43842a0375727J989650J144865J62959j263091j949625J6633L882345O417907
43834B5916N579330K200411j466044l372849k601236q8503K106035K904805K604252
43825G892117J245076j248610l164696k267585L09298Q84169r52128j403660Q55889
43816B149870J797782j098427l820670k037920J797609K772084J384588J196106
43808D141022J591056m06397l135096k250075J462613L392075L378178M845114
43800A3018490O033012J338253p146517r365571k452140L316353k45704o455648
43792a959472m309357M645391R348739N253135j903456o260183p087230m782598
$$ plain form
43784 -7055031 -6972324 -3546129 -2647691 -7216471 -12490091 -12371529 -7649424 -3510617 -1644071
43775 -1644071 -161276 442231 -2710060 -8944086 -13367587 -12958512 -9140567 -3893406
43767 -3893406 2124398 6740327 6678658 3080663 2091616 6669390 11529605 10356708 5291775
43758 5291775 4164865 9195486 13688310 11358492 4980581 2828564 8326758 16299599
43750 16299599 19504903 16504707 11893779 10291715 12197351 15405842 17950947 18505263
43742 18505263 16008092 11118904 6907202 5822634 6759688 7419979 8486209 12083069
43734 12083069 16643518 17759842 15009248 13159472 14221374 13040420 5054427 -5268517
43726 -5268517 -9577112 -7419030 -6332306 -9748027 -11361672 -4763861 6131547 11296526
$$ packed form
43784g055031Q2707L426195Q98438m568780n273620J18562M722105M138807J866546
43775a644071J482795O03507l152291o234026m423501M09075L817945N247161
43767c893406O017804M615929o1669l597995r89047M577774M860215j172897n064933
43758E291775j126910N030621M492824k329818o377911k152017N498194P972841
43750A6299599L205304l000196m610928j602064J905636L208491K545105N54316
43742A8505263k497171m889188m211702j084568R37054O60291J066230L596860
43734A2083069M560449J116324k750594j849776J061902j180954p985993j0322944
43726e268517m308595K158082J086724l415721j613645O597811J0895408N164979
$$ plain form
43718 11296526 7320500 1036314 -53277 2943164 3084429 -2240382 -7520968 -6501107
43710 -6501107 -564908 3390788 2503825 1170361 3573152 7314689 7866768 6058533
43702 6058533 6244967 8722388 9448993 7115124 4953004 4436251 2547251 -2327469 -6498899
43693 -6498899 -6315617 -3812777 -3469331 -6024256 -8820642 -9896598 -8548674 -4256635
43685 -4256635 1510941 4731003 3805086 2931010 6338588 11146701 10910246 5159068 162940
43676 162940 383587 4285931 9076930 14317932 19200548 20950401 18610292 15098320
43668 15098320 13003827 10915290 6249185 -208715 -4615518 -3789277 2232924 9854672
43660 9854672 13848671 11725486 6563876 3477803 3543804 3910643 3186787 2643005 2164127
$$ packed form
43718A1296526l976026o284186j089591K996441J41265n324811n280586J019861
43710f501107N936199L955696q86963j333464K402791L741537N52079j808235
43702F058533J86434K477421P26605k333869k162120n16753j889000m874720m171430
43693f498899J83282K502840L43446k554925k796386j075956J347924M292039
43685d256635N767576L220062r25917q74076L407578M808113k36455n751178m996128
43676A62940K20647L902344M790999N241002M882616J749853k340109l511972
43668A5098320k094493k088537m666105o457900m406803Q26241O022201P621748
43660I854672L993999k123185n161610l086073O6001L66839p23856n43782m78878
$$ plain form
43651 2164127 -67031 -3024949 -3251457 -1305764 -1967117 -5403880 -4458440 4771207 15191487
43642 15191487 17336598 11507514 5223113 2141465 292575 -1151005 -532143 1782179
43634 1782179 3724657 5528554 7708807 6673398 -625043 -8511163 -7098753 4035164
43626 4035164 14138209 14990072 9322488 3658627 372671 49810 4031509 9640081
43618 9640081 9525419 1769649 -4821855 -1988515 6104960 9492323 7298982 7704531
43610 7704531 14315188 20656860 19492701 11660887 3754178 1052927 4139740 9523348
43602 9523348 12751495 12767578 12556697 13848401 13980181 11406833 10570249 15236731 19874764
43593 19874764 15831410 5079578 -1621647 -1371203 -3383396 -12370090 -18394567 -11982111
$$ packed form
43651B164127k231158k957918k26508J945693o61353l436763R45440R229647J0420280
43642A5191487K145111n829084o284401l081648j848890j443580O18862K314322
43634A782179J942478J803897K180253j035409p298441p886120J412410J1133917
43626D035164J0103045Q51863n667584n663861l285956l22861L981699N608572
43618I640081j14662p755770o591504K833340Q093475L387363k193341M05549
43610G704531O610657O341672j164159p831814p906709k701251L086813N383608
43602I523348L228147J6083k10881J291704J31780k573348q36584M666482M638033
43593A9874764m043354j0751832o701225K50444k012193q986694o024477O412456
$$ plain form
43585 -11982111 -1254063 -2086455 -14723868 -22666398 -15577051 -2067099 4214107 1926576
43577 1926576 -814541 5386 1395344 809604 -779882 -2492034 -4420951 -4874256 -1639433
43568 -1639433 3669157 7165168 9074996 13387267 19596073 20454121 11690405 -433070
43560 -433070 -6080545 -3324464 2324623 7099118 11235587 13379835 10435231 4486451
43552 4486451 2959209 8672123 15392776 16960739 15306941 14694101 13582605 9176403
43544 9176403 5892032 10428029 19706242 22706932 15471727 6260120 3301784 4869738
43536 4869738 5356595 4378023 4294896 3969523 1543797 39847 3510203 9440475 11410926
43527 11410926 8713716 7216318 10053631 12990803 10917415 4792799 -143922 -325946
$$ packed form
43585a1982111J0728048q32392j2637413p942530P089347J3509952O281206k287531
43577A926576k741117Q19927J389958n85740j589486j712152j928917m53305L234823
43568a639433N308590L496011J909828M312271O208806Q58048q763716j2123475
43560d33070n647475K756081N649087M774495M136469K144248k944604n948780
43552D486451j527242N712914O720653J567963j653798o12840j111496m406202
43544I176403l284371M535997R278213L000690p235205r211607k958336J567954
43536D869738M86857r78572q3127l25373k425726j503950L470356N930272J970451
43527A1410926k697210j497398K837313K937172k073388o124616m936721j82024
$$ plain form
43519 -325946 3708513 8615352 10626811 8540890 5399837 5580817 9610201 13486518
43511 13486518 13360305 9068985 3203571 -947073 -715737 3601098 7389446 5951777
43503 5951777 713748 -2298376 -987023 119478 -2406874 -5128482 -3321591 1459100
43495 1459100 4146331 4082170 4988952 8008460 9891956 8653220 6785836 7376784 9882432
43486 9882432 11252751 9545175 5640344 2619745 3434616 7856442 12265994 13922251
43478 13922251 14156445 15206438 15865939 14015821 11973887 14134541 19336994 21327438
43470 21327438 18262421 15879879 18167443 20541084 17416352 12259400 13279969 20788704
43462 20788704 25741402 21694836 12600971 6566342 6176819 8083053 9382716 10757854
$$ packed form
43519c25946M034459M906839K011459k085921l141053J80980M029384L876317
43511A3486518j26213m291320n865414m150644K31336M316835L788348j437669
43503E951777n238029l012124J311353J106501k526352k721608J806891M780691
43495A459100K687231o4161R06782L019508J883496j238736j867384N90948K505648
43486I882432J370319j707576l904831l020599Q14871M421826M409552J656257
43478A3922251K34194J049993O59501j850118k041934K160654N202453J990444
43470B1327438l065017k382542K287564K373641l124732n156952J020569P508735
43462B0788704M952698m046566r093865o034629l89523J906234J299663J375138
$$ plain form
43454 10757854 13862945 18229854 21423029 21283425 17590223 11833418 5789765 773588
43446 773588 -1926559 -1331858 1457755 3048167 1261538 -1615279 -1219750 3121865 7102679
43437 7102679 6543268 1876371 -3516721 -7579326 -10245501 -10903567 -7826082 -833870
43429 -833870 7151703 12578975 14615493 14846554 14301031 12763407 11145498 11781753 14562519
43420 14562519 15161692 10333560 3609868 1699409 5464103 8893682 7821027 4998758
43412 4998758 4753110 7385726 11617636 17573714 23269246 23132933 15867543 9623453
43404 9623453 12015999 17869136 15490663 4077521 -4487041 -2352232 4959074 8994785
43396 8994785 9562369 10486484 11469956 10694123 10436824 13512726 17474930 18051194 15540448
$$ packed form
43454A0757854L105091M366909L193175j39604l693202n756805o043653n016177
43446G73588k700147N94701K789613J590412j786629k876817L95529M341615L980814
43437G102679n59411m666897n393092m062605k666175o58066L077485O992212
43429h33870P985573N427272K036518K31061n45523j537624j617909O36255K780766
43420A4562519N99173m828132o723692j910459L764694L429579j072655k822269
43412D998758k45648K632616M231910N956078N695532j36313p265390o244090
43404I623453K392546N853137k378473j1413142q564562K134809P311306M035711
43396H994785N67584R24115R83472p75833k57299L075902L962204N76264k510746
$$ plain form
43387 15540448 12853871 10334895 7561968 6870500 9357856 10602321 6725687 1845590
43379 1845590 2391971 6367189 6321102 1693874 -667770 1490159 2523169 -365917 -1928427
43370 -1928427 1690305 6034499 6007804 4130867 5273762 8119832 8222687 6071919 5691427
43361 5691427 7240824 7130520 4843013 4162308 6836109 8999777 5491632 -3974907
43353 -3974907 -13537395 -15623329 -7768495 4225960 11659627 12154920 10923664 12129506
43345 12129506 13467432 12099383 11092758 14466479 18888771 17066768 8961252 3496569
43337 3496569 7697385 18525506 27166349 28160791 22852436 16446605 13133658 12666082
43329 12666082 11500114 8556983 8279906 14787349 24350219 28633746 25829434 23366296
$$ packed form
43387A5540448k686577k518976k772927o91468K487356J244465l876634m880097
43379A845590N46381L975218m6087m627228k361644K157929J033010k889086j562510
43370a928427L618732M344194k6695j876937J142895K846070J02855k150768l80492
43361E691427J549397j10304k287507o80705K673801K163668l508145r466539
43353c974907r562488k085934P854834J1994455P433667M95293j231256J205842
43345A2129506J337926j368049j006625L373721M422292j822003q105516n464683
43337C496569M200816J0828121Q640843R94442n308355o405831l312947m67576
43329A2666082j165968k943131k77077O507443R562870M283527k804312k463138
$$ plain form
43321 23366296 27460258 34527283 36385683 30721703 22422890 16464368 13617304 12797162
43313 12797162 13947826 17279001 21439461 23934889 23418885 21324348 20675688 22485799
43305 22485799 23847067 21328247 16291460 14445484 18947304 25976398 29010262 26244431
43297 26244431 21990565 21613246 26778590 34948086 41588166 42926876 38207361 29902832
43289 29902832 21339700 14286086 9054884 5754752 4113219 2831251 892311 -488834
43281 -488834 1294444 7207138 15566933 24090664 31267161 35255741 33799818 27464656
43273 27464656 21659561 22244429 28639819 34051626 33840406 31044446 31331358 34934292
43265 34934292 37338934 36601293 35221110 34538799 32414341 28485354 27060357 31275529
$$ packed form
43321B3366296M093962P067025J858400n663980q298813n958522k847064q20142
43313A2797162J150664L331175M160460K495428n16004k094537o48660J810111
43305B2485799J361268k518820n036787j845976M501820P029094L033864k765831
43297B6244431m253866l77319N165344Q169496O640080J338710m719515q304529
43289B9902832q563132p053614n231202l300132j641533j281968j938940j381145
43281d88834J783278N912694Q359795Q523731P176497L988580j455923o335162
43273B7464656n805095N84868O395390N411807k11220k795960K86912L602934
43265C4934292K404642p37641j380183o82311k124458l928987j424997M215172
$$ plain form
43257 31275529 37818640 41411702 41896347 42720096 44608956 45380159 44609768 43860264 43225799
43248 43225799 42113170 42422163 46096730 50465331 51492339 50982960 54251123 60744679
43240 60744679 64367589 64257877 67043079 75329519 82233247 82565258 82059565 88566506
43232 88566506 100129790 110071455 119637250 136454859 162309133 190915195 217114987
43225 217114987 240160011 257707749 265178019 263987992 264086295 274650655 295810534 320910197
43217 320910197 342416966 354200195 353520727 344313361 335066283 330571664 328493769 325861950
43209 325861950 324981620 329663238 338706031 347128910 352344947 355540264 357372031 355253740
43201 355253740 345690063 328124688 305936776 283628682 262829962 241499453 217609477
$$ packed form
43257C1275529O543111L593062M84645Q23749J888860P71203p70391p49504o34465
43248D3225799j112629L08993L674567M368601J027008n09379L268163O493556
43240F0744679L622910j09712K785202Q286440O903728L32011n05693O506941
43232H8566506J1563284R941665R565795J6817609K5854274K8606062K6199792
43225B17114987K3045024J7547738P470270j190027R8303J0564360K1159879K5099663
43217C20910197K1506769J1783229o79468r207366r247078m494619k077895k631819
43209C25861950q80330M681618R042793Q422879N216037L195317J831767k118291
43201C55253740r563677j7565375k2187912k2308094k0798720k1330509k3889976
$$ plain form
43194 217609477 192537478 169517804 150065755 133938992 121220924 111642621 102962719
43187 102962719 93343425 84677112 80198176 79444210 79148539 78306624 78232535 78404111 77112122
43178 77112122 75737193 76906529 78542586 75897703 69854076 66329494 66524341 65707880
43170 65707880 63776815 67888005 80080996 91237578 94272537 95773012 106168374 124398838
43162 124398838 141716299 156256959 173727645 195971248 218621468 239317437 259306920
43155 259306920 276985418 288455722 295459459 305214434 321373033 341975276 366397729
43148 366397729 395886743 425605679 444869691 449182997 445527403 442262880 439900530
43141 439900530 435328145 428907533 422792017 417255596 413375394 415234831 424860287 437996449
$$ packed form
43194B17609477k5071999k3019674j9452049j6126763j2718068r578303q679902
43187A02962719r619294q666313m478936p53966k95671q41915p4089J71576j291989
43178G7112122j374929J169336J636057k644883o043627l524582J94847q16461
43170F5707880j931065M111190J2192991J1156582L034959J500475J0395362J8230464
43162A24398838J7317461J4540660J7470686K2243603K2650220K0695969J9989483
43155B59306920J7678498J1470304P003737R754975J6158599K0602243K4422453
43148C66397729K9489014K9718936J9264012M313306l655594l264523k362350
43141D39900530m572385o420612o115516n536421l880202J859437R625456J3136162
$$ plain form
43133 437996449 448586327 454628929 456777442 454563591 447001636 433654010 412667752
43126 412667752 381848088 344383517 308659634 278702643 249645815 217012381 185328618
43119 185328618 161685375 145265903 130447250 117135599 109852368 107508501 102043346
43112 102043346 88679092 71807747 59149494 54394725 56381188 61068718 63164843
43105 63164843 59807635 54085713 51814221 54019616 55716724 52641486 45791195 38578026
43097 38578026 33016116 29904763 29469285 30147809 29281647 26391134 23565334 21752666
43089 21752666 19310361 15350574 11775483 10408316 10530626 10991188 12452827 15402540
43081 15402540 17764666 16947087 13306218 9554150 7408588 6622681 6742735 7852641
$$ packed form
43133D37996449J0589878O042602K148513k213851p561955j3347626k0986258
43126D12667752l0819664l7464571l5723883k9956991k9056828l2633434l1683763
43119A85328618k3643243j6419472j4818653j3311651p283231k343867n465155
43112A02043346j3364254j6871345j2658253m754769J986463M687530K096125
43105F3164843l357208n721922k271492K205395J697108l075238o850291p213169
43097C8578026n561910l111353m35478O78524q66162k890513k825800j812668
43089B1752666k442305l959787l575091j367167J22310M60562J461639K949713
43081A5402540K362126q17579l640869l752068k145562p85907J20054J109906
$$ plain form
43073 7852641 9550525 10891698 11831408 13417263 15781661 16962013 14961367 10649590
43065 10649590 7312347 7115720 9176279 11401517 12663035 12481460 10781236 9637539
43057 9637539 12680989 19606434 23620076 19159768 10844076 8655454 14112156 18340389
43049 18340389 15924448 12919962 16322799 22539116 23602991 20096765 19544481 24328126
43041 24328126 29268542 30479984 29364477 27771206 25741212 24287175 24207979 22131582
43033 22131582 14441827 5411489 3805426 9870701 13701886 9824128 5896901 11776133
43025 11776133 25562243 36188897 36251260 27601518 17358084 12582238 16064376 23296585
43017 23296585 25700100 19884471 11352131 6834930 6623066 7336135 7987548 9124494
$$ packed form
43073G852641J697884J341173R39710J585855K364398J180352k000646m311777
43065A0649590l337243j96627K060559K225238J261518j81575j700224j143697
43057I637539L043450O925445M013642m460308q315692k188622N456702M228233
43049A8340389k415941l004486L402837O216317J063875l506226n52284M783645
43041B4328126M940416J211442j115507j593271k029994j454037p9196k076397
43033B2131582p689755r030338j606063O065275L831185l877758l927227N879232
43025A1776133J3786110J0626654O2363q649742j0243434m775846L482138P232209
43017B3296585K403515n815629q532340m517201k11864P13069O51413J136946
$$ plain form
43009 9124494 9621532 9060394 10468313 16106199 22911668 26279285 25808717 23349092 18766588
43000 18766588 12728247 10408294 16165494 26576694 34797217 39929886 45712728 51993806
42992 51993806 55465147 58277701 67174214 82376227 95343797 100637162 102831732 107550031
42984 107550031 112129733 110905755 105177125 101587778 102826567 105406457 105793013 104304936
42976 104304936 103025078 103150000 104637554 106357472 106741488 105636447 104478109 103216213
42968 103216213 98993245 90512907 82247415 80644551 85949084 90849547 88361008 78960876
42960 78960876 68708049 62090792 58558716 55113706 49979116 43316278 36288786 30888542
42952 30888542 29500076 32483611 36321824 36361062 32066494 27719440 27083691 29327668
$$ packed form
43009I124494M97038n61138J407919N637886O805469L367617m70568k459625m582504
43000A8766588o038341k319953N757200J0411200Q220523N132669N782842O281078
42992E1993806L471341K812554Q896513J5202013J2967570N293365K194570M718299
42984A07550031M579702j223978n728630l589347J238789K579890L86556j488077
42976A04304936j279858J24922J487554J719918L84016j105041j158338j261896
42968A03216213m222968q480338q265492j602864N304533M900463k488539r400132
42960G8960876j0252827o617257l532076l445010n134590o662838p027492n400244
42952C0888542j388466K983535L838213L9238m294568m347054o35749K243977
$$ plain form
42944 29327668 31300123 31554395 30361367 28000951 25424394 24569879 25256112 23802310
42936 23802310 18110593 12154292 11135978 13657288 13864330 10777950 9529322 12436376
42928 12436376 15008431 13566124 11669704 15070969 23819554 33103499 39198204 41261180
42920 41261180 39918489 37737487 38961159 44987800 51458657 53021195 49732315 46102793
42912 46102793 45686050 49505113 57276053 66045085 69793477 65667711 59597590 60155485
42904 60155485 66991794 71406139 69350122 67095609 70642691 75608273 73631145 65438830
42896 65438830 60766685 65648070 75379787 81282528 80121360 74958133 70234493 68892211
42888 68892211 72256192 79573752 87985454 94915453 100352950 105669060 111239296 117116407
$$ packed form
42944B9327668J972455K54272j193028k360416k576557q54515O86233j453802
42936B3802310n691717n956301j018314K521310K07042l086380j248628K907054
42928A2436376K572055j442307j896420L401265Q748585R283945O094705K062976
42920D1261180j342691k181002J223672O026641O470857J562538l288880l629522
42912D6102793m16743L819063P770940Q769032L748392m125766o070121N57895
42904F0155485O836309M414345k056017k254513L547082M965582j977128q192315
42896F5438830m672145M881385R731717N902741j161168n163227m723640j342282
42888F8892211L363981P317560Q411702O929999N437497N316110N570236N877111
$$ plain form
42880 117116407 125068232 137124867 152125752 166707523 180376933 196164385 214236710
42873 214236710 228164053 231370822 225767224 219926300 218982042 220250975 219460370 217216645
42865 217216645 216777827 217813556 215521242 206048208 191632285 179916064 177201569 181139812
42857 181139812 181433242 170667672 153668403 141876077 138142084 132760406 117401181
42850 117401181 97367943 84295580 80236041 76305697 66381210 54728840 48050682
42843 48050682 46068477 43833570 39329849 34412587 30432240 27068970 24660762 24226341
42835 24226341 25142439 25249414 23370679 20051912 16363008 13850662 14602679 18369808
42827 18369808 20173852 14778927 4408908 -2197000 -763077 2506370 -112199 -6191286
$$ packed form
42880A17116407P951825J2056635J5000885J4581771J3669410J5787452J8072325
42873B14236710J3927343L206769n603598n840924r44258J268933p90605k243725
42865B17216645m38818J035729k292314r473034j4415923j1716221k714495L938243
42857A81139812K93430j0765570j6999269j1792326l733993n381678j5359225
42850A17401181k0033238j3072363m059539l930344r924487j1652370o678158
42843D8050682j982205k234907m503721m917262l980347l363270k408208m34421
42835B4226341R16098J06975j878735l318767l688904k512346P52017L767129
42827A8369808J804044n394925j0370019o605908J433923L269447k618569o079087
$$ plain form
42819 -6191286 -6484075 1213823 8542161 8437355 3789297 490285 -2005621 -6745314
42811 -6745314 -10179480 -5812852 3507230 5676163 -5208275 -19919690 -24986646 -17859813
42803 -17859813 -6482910 2413698 8410065 12447507 13464128 11529214 9869277 11273147
42795 11273147 14791184 17754183 19258000 20053710 20448616 20068914 18963874 17553199
42787 17553199 15956389 14480518 14138967 15209216 15675280 13203170 9184356 8436137
42779 8436137 12980788 18067546 17617055 12701252 10298124 13063533 15477397 12892596
42771 12892596 9334650 11089342 16268958 17800014 15141178 15096723 20380413 25437246
42763 25437246 26459439 28065804 35074971 43532297 46037189 42041890 36860465 33449459
$$ packed form
42819f191286k92789P697898P328338j04806m648058l299012k495906m739693
42811f745314l434166M366628R320082K168933j0884438j4711415n066956P126833
42803a7859813J1376903Q896608N996367M037442J016621j934914j659937J403870
42795A1273147L518037K962999J503817P95710L94906l79702j105040j410675
42787A7553199j596810j475871l41551J070249M66064k472110m018814p48219
42779H436137M544651N086758m50491m915803k403128K765409K413864k584801
42771A2892596l557946J754692N179616J531056k658836m4455N283690N056833
42763B5437246J022193J606365P009167Q457326K504892l995299n181425l411006
$$ plain form
42755 33449459 31219890 30675693 32689270 34149210 30642305 23692165 19852472 21885122
42747 21885122 25658132 26696178 25278130 23694317 22432015 20833976 18653304 15738255
42739 15738255 12505437 11037760 13110491 17263739 20777041 23974753 28896877 34396370
42731 34396370 37315670 38475812 42020938 47946443 51197184 50237002 50524302 56033030
42723 56033030 62728706 64993123 63964363 64098295 64973787 62708567 57563796 53755666
42715 53755666 51887914 47350432 37580459 26477894 19558379 17735810 17930146 17712122
42707 17712122 17183609 17161069 17307787 16534695 14976962 15055021 19489957 27683479 35116873
42698 35116873 37453001 34558133 29528415 24820574 20977131 18411520 18052490 19514260
$$ packed form
42755C3449459k229569n44197K013577J459940l506905o950140l839693K032650
42747B1885122L773010J038046j418048j583813j262302j598039k180672k915049
42739A5738255l232818j467677K072731M153248L513302L197712M922124N499493
42731C4396370K919300J160142L545126N925505L250741r60182K87300N508728
42723E6033030O695676K264417j028760J33932Q75492k265220n144771l808130
42715E3755666j867752m537482r769973j1102565o919515j822569J94336k18024
42707A7712122n28513k2540J46718p73092j557733P8059M434936Q193522P433394
42698C5116873K336128k894868n029718m707841l843443k565611l59030J461770
$$ plain form
42690 19514260 20261327 17991907 13363128 9131468 6598143 4377510 1549666 323394
42682 323394 3068800 7590533 9177410 7850043 8790828 13280682 14665208 8233016
42674 8233016 180676 -690617 3162201 1930262 -4851050 -6459899 1903310 10931364
42666 10931364 11363480 6922395 5990713 8433536 9501855 10379723 14484861 17409145
42658 17409145 11641128 -87381 -6600728 -3944276 -11524 -1895966 -6810454 -8112402
42650 -8112402 -3577962 4795400 13367321 17313718 14265811 9107236 9202974 13540759
42642 13540759 13539755 6568928 707900 2436763 7486843 9197614 8700277 10011004 11120014
42633 11120014 8056841 3646182 3936025 8429627 11589283 12172241 13289043 14319855
$$ packed form
42690A9514260P47067k269420m628779m231660k533325k220633k827844j226272
42682C23394K745406M521733J586877j327367R40785M489854J384526o432192
42674H233016q052340q71293L852818j231939o781312j608849Q363209R028054
42666A0931364M32116m441085r31682K442823J068319Q77868M105138K924284
42658A7409145n768017j1728509o513347K656452L932752j884442m914488j301948
42650h112402M534440Q373362Q571921L946397l047907n158575R5738M337785
42642A3540759j004o970827n861028J728863N050080J710771m97337J310727J109010
42633A1120014l063173m410659K89843M493602L159656N82958J116802J030812
$$ plain form
42625 14319855 10966024 3683257 -1716289 -3196419 -4760218 -7351013 -5117312 4788421
42617 4788421 14812346 15418751 7436858 357354 207193 4268707 7114062 7024854 5548471
42608 5548471 4307006 4199660 6090920 10497597 16582605 21999566 24290835 23191590
42600 23191590 21383093 21556620 22406084 19438093 10989061 1651139 -2416467 -673006
42592 -673006 1519234 -468079 -5660279 -9466113 -8756006 -4379055 20804 1016567 -1728951
42583 -1728951 -4942253 -4902523 -1559795 1560244 2183950 2581794 6314663 12315069 14566996
42574 14566996 8717867 -2417369 -11564298 -14627853 -13774150 -12761927 -11717883 -8724876
42566 -8724876 -5106769 -5278693 -10119093 -13718237 -9871688 -338627 6898335 7248128
$$ packed form
42625A4319855l353831p282767n399546j480130j563799k590795K233701R905733
42617D788421J0023925O06405p981893p079504j50161M061514K845355q9208j476383
42608E548471j241465j07346J891260M406677O085008N416961K291269j099245
42600B3191590j808497J73527Q49464k967991q449032r337922m067606J743461
42592f73006K192240j987313n192200l805834P10107M376951M399859R95763k745518
42583a728951l213302L9730L342728L120039O23706L97844L732869O000406K251927
42574A4566996n849129j1135236r146929l063555Q53703J012223J044044K993007
42566h724876L618107j71924m840400l599144L846549R533061P236962L49793
$$ plain form
42558 7248128 3556698 -83990 -4027581 -9658108 -13953236 -12393676 -6176144 -1810949
42550 -1810949 -3040550 -6878091 -8443960 -6191743 -1166358 5291037 11017428 13299205
42542 13299205 12274300 11742390 14103204 16668257 15626507 11568988 8162768 7298871
42534 7298871 8692370 12175574 16397578 16989270 11022673 2881317 717140 6445852
42526 6445852 13657024 16238511 14567606 11916040 9561354 7939388 8458017 10904015
42518 10904015 12082300 10090419 7483248 7554653 9941746 12325294 13574318 12430822
42510 12430822 6437616 -3852255 -12255544 -13076201 -8225705 -4174033 -3507514 -3843588
42502 -3843588 -3348159 -2073755 1158793 7374115 12875487 11977858 5505786 1129278
$$ packed form
42558G248128l691430l640688l943591n630527m295128J559560O217532M365195
42550a810949j229601l837541j565869K252217N025385O457395N726391K281777
42542A3299205j024905n31910K360814K565053j041750m057519l406220q63897
42534G298871J393499L483204M222004N91692n966597q141356k164177N728712
42526F445852P211172K581487j670905k651566k354686j621966N18629K445998
42518A0904015J178285j991881k607171P1405K387093K383548J249024j143496
42510A2430822n993206j0289871q403289q20657M850496M051672O66519l36074
42502c843588M95429J274404L232548O215322N501372q97629o472072m376508
$$ plain form
42494 1129278 3423555 8687273 11782628 12760044 13369831 11991516 6777431 458987
42486 458987 -2715176 -2488380 -906553 2305619 7893683 12719650 12864194 10256971 10677291
42477 10677291 15052083 18112270 16501426 12857969 10230740 7913576 5746769 7385389
42469 7385389 14634910 22184662 23433097 19606346 17710519 20371036 23380308 23805799
42461 23805799 24850875 30263198 38299398 44511513 47502060 48707866 49076350 49519148
42453 49519148 52316862 57531445 59472772 52309801 39564689 32258749 35219320 40337753
42445 40337753 37676767 29508593 27420297 36668399 49414577 54777928 50820862 43866107
42437 43866107 39369166 37341436 35537801 33325021 31411463 29982779 28951970 29563493
$$ packed form
42494A129278K294277N263718L095355R77416O09787j378315n214085o318444
42486D58987l174163K26796J581827L212172N588064M825967J44544k607223M20320
42477A0677291M374792L060187j610844l643457k627229k317164k166807J638620
42469G385389P249521P549752J248435l826751j895827K660517L009272M25491
42461B3805799J045076N412323Q036200O212115K990547J205806L68484M42798
42453D9519148K797714N214583J941327p162971j2745112p305940K960571N118433
42445D0337753k660986q168174k088296R248102J2746178N363351l957066o954755
42437D3866107m496941k027730j803635k212780j913558j428684j030809O11523
$$ plain form
42429 29563493 33934373 41784572 48384683 48074133 40976542 34407325 35420624 43005033
42421 43005033 50250458 53482308 55669452 60323918 65945568 68628388 67232196 63324508
42413 63324508 58147267 52360986 47053390 42223457 35822466 27279042 20508896 19875365
42405 19875365 23989441 27096790 26035559 22080416 16595121 9809552 4391080 4672381
42397 4672381 9988814 13553832 11158574 6816927 5962505 7082880 5368151 1742094
42389 1742094 1756721 6224441 9235911 6594041 1121602 -2106485 -1455347 2247553 8114068
42380 8114068 13793234 15221868 11391680 7135225 7652781 11540429 12278819 5844251
42372 5844251 -5551842 -16163715 -20532294 -15848295 -4075423 8010358 13674342 12006990
$$ packed form
42429B9563493M370880P850199O600111l10550p097591o569217J013299P584409
42421D3005033P245425L231850K187144M654466N621650K682820j396192l907688
42413F3324508n177241n786281n307596m829933o400991q543424o770146o33531
42405A9875365M114076L107349j061231l955143n485295o785569n418472K81301
42397D672381N316433L565018k395258m341647q54422J120375j714729l626057
42389A742094J4627M467720L011470k641870n472439l228087O51138L702900N866515
42380H114068N679166J428634l830188m256455N17556L887648P38390o434568
42372E844251j1396093j0611873m368579M683999J1772872J2085781N663984j667352
$$ plain form
42364 12006990 7561587 4679485 4102807 4439462 4018374 1268106 -3597120 -6651001
42356 -6651001 -3288428 5414797 12366878 12397600 7830789 3925715 1715131 -1117696
42348 -1117696 -4433830 -5387271 -3612123 -2228225 -2690013 -2307238 1372878 6577804 9771566
42339 9771566 10010446 8840490 7553812 6546081 6038264 5558514 3925443 1397734 264340
42330 264340 1378012 2063604 172325 -1816185 -571095 1760942 143675 -4517930
42322 -4517930 -4945221 2099249 10063539 10704798 4185399 -2573671 -4507412 -1518922
42314 -1518922 4133570 8973475 8922206 3780242 19193 4306310 14740013 22917764
42306 22917764 24015227 20051226 14042347 7148454 2204589 3402859 9841385 14682657
$$ packed form
42364A2006990m445403k882102n76678L36655m21088k750268m865226l053881
42356f651001L362573Q703225O952081L0722m566811l905074k210584k832827
42348a117696l316134r53441J775148J383898m61788L82775L680116N204926L193762
42339I771566K38880j169956j286678j007731n07817m79750j633071k527709j133394
42330B64340J113672O85592j891279j988510J245090K332037j617267m661605
42322d517930m27291P044470P964290O41259o519399o759070j933741K988490
42314a518922N652492M839905n1269n141964l761049M287117J0433703Q177751
42306B2917764J097463l964001o008879o893893m943865J198270O438526M841272
$$ plain form
42298 14682657 13546464 9135086 5169483 1162093 -3385883 -5081578 -1685302 3373205
42290 3373205 6385079 9048805 13455175 15612169 10534008 713032 -7268202 -12078952
42282 -12078952 -16498658 -19223497 -16179543 -9370787 -5950114 -7707773 -9328117 -8107359
42274 -8107359 -7087769 -6729752 -2657126 4510156 6203625 -1104510 -7855852 -4271013
42266 -4271013 4848895 7403900 2053972 -1306433 1928442 4468231 -324695 -7576503
42258 -7576503 -7878167 -500303 5868531 4057104 -4229857 -12187079 -15715673 -15481019
42250 -15481019 -12882671 -7591800 -544835 3660891 1220067 -5124437 -9012027 -8782042
42242 -8782042 -7901515 -7006722 -2406346 4991605 6850313 -791381 -9070597 -7370933
$$ packed form
42298A4682657j136193m411378l965603m007390m547976j695695L396276N058507
42290C373205L011874K663726M406370K156994n078161r820976p981234m810750
42282a2078952m419706k724839L043954O808756L420673j757659j620344J220758
42274h107359J019590L58017M072626P167282J693469p308135o751342L584839
42266d271013R119908K555005n349928l360405L234875K539789m792926p251808
42258g576503l01664P377864O368834j811427q286961p957222l528594K34654
42250a5481019K598348N290871P046965M205726k440824o344504l887590K29985
42242h782042Q80527Q94793M600376P397951J858708p641694q279216J699664
$$ plain form
42234 -7370933 1530514 6339575 4574331 4567835 9993356 13388036 9061059 3135090 4096611
42225 4096611 9989231 12918014 12224567 14491864 21496618 26633504 25496726 23294557
42217 23294557 27244386 35669621 40123475 36896402 30995863 28108802 27875697 27936576
42209 27936576 29995195 36322148 42402621 39870946 27772054 15149267 10064635 10974787
42201 10974787 11969365 11514937 11376107 10956869 8719111 7147516 10508578 18307014 25623244
42192 25623244 29330006 29849024 27901078 24165846 21254522 21168148 21538081 19370864 17508255
42183 17508255 21245833 28651629 31021205 24452290 15023083 10596232 12854553 18985624
42175 18985624 25233414 26632786 19758020 9222436 5344316 10968206 16199087 11433428
$$ packed form
42234g370933Q901447M809061j765244o496N425521L394680m326977n925969R61521
42225D096611N892620K928783o93447K267297P004754N136886j136778k202169
42217B3294557L949829Q425235M453854l227073n900539k887061k33105O0879
42209B7936576K058619O326953O080473k531675j2098892j2622787n084632R10152
42201A0974787R94578m54428j38830m19238k237758j571595L361062P798436P316230
42192B5623244L706762N19018j947946l735232k911324q6374L69933k167217j862609
42183A7508255L737578P405796K369576o568915r429207m426851K258321O131071
42175A8985624O247790J399372o874766j0535584l878120N623890N230881m765659
$$ plain form
42167 11433428 541554 -5275909 -2894747 776732 482813 -963052 1300350 7058456
42159 7058456 11821500 11969827 7880396 3212927 1287847 1867990 2636222 3522536 6401118
42150 6401118 10038491 9995275 5708411 2829630 5100153 8606728 8514407 6822833 7663622
42141 7663622 9025078 6388634 1859022 1584559 5042618 5112168 -268968 -4017957 182752
42132 182752 9937878 18697001 22975370 22219577 16484005 8212477 3024976 4848367
42124 4848367 11865708 19558540 25735454 30422153 33014636 32506797 29765214 27291404
42116 27291404 26440709 25668662 21913514 14433619 7584453 7799971 15873268 24280769
42108 24280769 25463933 21230061 19697710 23845020 28392217 28520499 26036761 24675900
$$ packed form
42167A1433428j0891874n817463K381162L671479k93919j445865K263402N758106
42159G058456M763044J48327m089431m667469j925080N80143P68232Q86314K878582
42150F401118L637373m3216m286864k878781K270523L506575r2321j691574Q40789
42141G663622J361456k636444m529612k74463L458059O9550n381136l748989M200709
42132A82752R755126Q759123M278369p55793n735572q271528n187501J823391
42124D848367P017341P692832O176914M686699K592483n07839k741583k473810
42116B7291404q50695p72047l755148p479895o849166K15518Q073297Q407501
42108B4280769J183164m233872j532351M147310M547197J28282k483738j360861
$$ plain form
42100 24675900 24178896 22441204 20089049 19411839 20997411 24174950 28602671 32832869
42092 32832869 33580235 29419333 23580584 20315852 19887852 19756361 19250636 19943355 22056615
42083 22056615 23524834 22903954 21079886 19677106 19288367 19676461 20635060 22129365 24020321
42074 24020321 26076572 28583030 32916381 40406762 49657348 56287857 57328884 55008452
42066 55008452 53868252 55101551 56785520 58586108 61551621 63165170 58359815 47675700
42058 47675700 39121369 38194613 40301140 37520744 29399955 21829919 17722566 14663278
42050 14663278 10831540 7519586 5424358 3452227 2211692 4143794 8514753 10384425
42042 10384425 7127583 2865503 3262187 7731495 10037876 6161544 -1231440 -6787550
$$ packed form
42100B4675900m97004j737692k352155o77210J585572L177539M427721M230198
42092C2832869P47366m160902n838749l264732m28000j31491n05725O92719K113260
42083B2056615J468219o20880j824068j402780l88739L88094R58599J494305J890956
42074B4020321K056251K506458M333351P490381R250586O630509J041027k320432
42066E5008452j140200J233299J683969J800588K965513J613549m805355j0684115
42058D7675700q554331r26756K106527k780396q120789p570036m107353l059288
42050A4663278l831738l311954k095228j972131j240535J932102M370959J869672
42042A0384425l256842m262080L96684M469308K306381l876332p392984n556110
$$ plain form
42034 -6787550 -8711582 -9047657 -8598073 -4838416 2998379 9231888 6981017 -1396682
42026 -1396682 -4482160 4100863 15946883 17765414 8776685 1549450 5300648 15132341
42018 15132341 20566460 19008694 15929606 15376835 16231492 16830901 17691899 18378102 15811559
42009 15811559 8299995 -840222 -6050220 -5027026 157670 6425509 12004921 15636746
42001 15636746 16117321 14137737 13176892 16599204 24016412 31888477 37652253 41826488
41993 41826488 45805172 49127145 49974882 47787378 44766295 44941839 51184381 61813062
41985 61813062 70502755 71729271 66796192 62210452 61308963 60411752 55140695 47459801
41977 47459801 43058486 43980318 48045562 54051377 62201294 69392681 70135799 64507633
$$ packed form
42034f787550j924032l36075M49584L759657P836795O233509k250871q377699
42026a396682l085478Q583023J1846020J818531q988729p227235L751198R831693
42018A5132341N434119j557766l079088n52771Q54657N99409Q60998O86203k566543
42009A5811559p511564r140217n209998J023194N184696O267839N579412L631825
42001A5636746M80575j979584r60845L422312P417208P872065N763776M174235
41993D1826488L978684L321973Q47737k187504l021083J75544O242542J0628681
41985F1813062Q689693J226516m933079m585740r01489q97211n271057p680894
41977D7459801m401315R21832M065244O005815Q149917P191387P43118n628166
$$ plain form
41969 64507633 60046406 62070481 66439774 66750906 65022372 68394567 76685715 81128056
41961 81128056 77019574 70293187 67653634 66658193 61877039 56226759 57732722 66452455
41953 66452455 73292926 73202740 71745604 75494039 83021784 89998110 96572152 103236045
41945 103236045 105044305 98569697 91011790 92353483 99405295 98146097 83681320 67706903
41937 67706903 61800877 62343861 58563958 48285534 37539801 29451391 22336285 16471470
41929 16471470 14453265 15187943 14326799 10916111 8023073 6915353 6203959 6578344 10249368
41920 10249368 14985231 14837056 8574440 2049507 115875 1144421 1844131 2615394
41912 2615394 4970556 7709604 9151110 10128715 11622234 11891789 8749304 2733273
$$ packed form
41969F4507633m461227K024075M369293L11132j728534L372195Q291148M442341
41961H1128056m108482o726387k639553r95441m781154n650280J505963Q719733
41953F6452455O840471r0186j457136L748435P527745O976326O574042O663893
41945A03236045J808260o474608p557907J341693P051812j259198j4464777j5974417
41937F7706903n906026N42984l779903j0278424j0745733q088410p115106n864815
41929A6471470k018205P34678q61144l410688k893038j107720p11394L74385L671024
41920A0249368M735863j48175o262616o524933j933632J028546O99710P71263
41912B615394K355162K739048J441506R77605J493519K69555l142485o016031
$$ plain form
41904 2733273 -3848268 -8860544 -10357766 -8082706 -6091378 -9208705 -14697309 -13024705
41896 -13024705 -952515 11529078 13130846 5765797 216358 740214 2385062 2071705
41888 2071705 2872373 5878852 6645640 3499499 2193818 7174611 13705339 14488829 10106093
41879 10106093 6550117 4997645 1100770 -5825669 -9712406 -6227966 258297 1642016
41871 1642016 -4275424 -12169271 -16298918 -16556939 -16898284 -19325846 -21001291 -17782906
41863 -17782906 -9762115 -1708268 2337547 3177244 3954281 5331995 5590299 4479323
41855 4479323 3722584 3456750 1441664 -2899920 -6604885 -7462897 -7704425 -10404756 -13862583
41846 -13862583 -13309776 -8013727 -3011064 -2596832 -4896549 -4818906 -609062 4663596 7282045
$$ packed form
41904B733273o581541n012276j497222K275060J991328l117327n488604J672604
41896a3024705J2072190J2481593J601768p365049n549439N23856J644848l13357
41888B071705Q00668L006479P66788l146141j305681M980793O530728P83490m382736
41879A0106093l555976j552472l896875o926439l886737L484440O486263J383719
41871A642016n917440p893847m129647k58021l41345k427562j675445L218385
41863a7782906Q020791Q053847M045815Q39697P77037J377714K58304j110976
41855D479323p56739k65834k015086m341584l704965q58012k41528k700331l457827
41846a3862583N52807N296049N002663M14232k299717P7643M209844N272658K618449
$$ plain form
41837 7282045 6503879 3968238 1094821 -1912341 -4795247 -6107788 -4555254 -1506961
41829 -1506961 -483673 -2866646 -5603482 -5347032 -3645824 -4693631 -8129353 -8166370 -1383555
41820 -1383555 8184654 14156263 15089709 13830446 12233806 10273841 8711461 8550246
41812 8550246 8444510 6423484 4010728 4811739 8549109 10298618 7099458 2225683
41804 2225683 808926 3201783 4729561 1172225 -6642321 -13099470 -12408536 -4043399
41796 -4043399 6326606 12484956 13869653 14533349 16687563 18110888 16291428 12418494
41788 12418494 10183202 12351819 18852755 26247557 29063925 24253033 14785450 6583902
41780 6583902 2196805 502816 1704535 7341844 14635355 16915440 12496718 7697763
$$ packed form
41837G282045p78166k535641k873417l007162k882906j312541J552534L048293
41829a506961J023288k382973k736836K56450J701208j047807l435722l7017O782815
41820a383555R568209N971609R33446j259263j596640j959965j562380j61215
41812H550246j05736k021026k412756Q01011L737370J749509l199160m873775
41804B225683j416757K392857J527778l557336p814546o457149O90934Q365137
41796d043399J0370005O158350J384697O63696K154214J423325j819460l872934
41788A2418494k235292K168617O500936P394802K816368m810892r467583q201548
41780F583902m387097j693989J201719N637309P293511K280085m418722m798955
$$ plain form
41772 7697763 7318750 7482413 3046257 -2839306 -3537917 1452 804156 -2966681 -6469975
41763 -6469975 -8020731 -12283431 -21116020 -28151390 -26623372 -17809067 -7777797 286350
41755 286350 6417567 9785043 9013825 5303206 1748307 326005 1704370 6249808
41747 6249808 12552951 16718069 16281903 13677555 12807024 13303758 11553797 6706299 1971241
41738 1971241 -231702 -1023306 -2324023 -4418980 -7067433 -9913807 -10528531 -5385592
41730 -5385592 4761154 13134288 13826006 8915400 5340650 5554851 5243975 885463
41722 885463 -4360377 -4800412 3974 4636562 4551106 1018174 -1166583 543399 4025579
41713 4025579 5745068 5751269 8107884 15088608 21975163 20779530 10176680 -1368305
$$ packed form
41772G697763l79013J63663m436156n885563o98611L539369Q02704l770837l503294
41763f469975j550756m262700q832589p035370J528018Q814305J0031270Q064147
41755B86350O131217L367476p71218l710619l554899j422302J378365M545438
41747F249808O303143M165118m36166k604348q70531M96734j749961m847498m735058
41738A971241k202943p91604j300717k094957k648453k846374o14724N142939
41730e385592J0146746Q373134O91718m910606l574750K14201l10876m358512
41722H85463n245840m40035M804386M632588q5456l532932k184757J709982L482180
41713D025579J719489O201K356615O980724O886555j195633j0602850j1544985
$$ plain form
41705 -1368305 -4859930 -650856 4236860 6326061 8214017 11686096 14231179 13919028
41697 13919028 12556755 11407081 8418809 3121160 -74397 2028079 5638033 5701631
41689 5701631 4506426 8034482 15237614 18345194 14411628 9376501 8442979 9124449
41681 9124449 7563767 5699770 6566077 6747613 257225 -11709238 -20907366 -21838854
41673 -21838854 -16681993 -10437839 -5842427 -3843475 -4659036 -6589251 -7179009 -7211909 -10300316
41664 -10300316 -16670535 -20835232 -18364381 -12211335 -8771803 -9584587 -10864575 -10156931
41656 -10156931 -9067976 -9134670 -9048229 -7372414 -4918650 -2883108 -1358814 -1315380 -5098951
41647 -5098951 -12384815 -17962123 -16758918 -9907282 -3138159 -290279 -1049553 -3680932
$$ packed form
41705a368305l491625M209074M887716K089201J887956L472079K545083l12151
41697A3919028j362273j149674k988272n297649l195557K102476L609954O3598
41689E701631j195205L528056P203132L107580l933566n035127r33522O81470
41681I124449j560682j863997Q66307J81536o490388j1966463r198128r31488
41673b1838854N156861O244154M595412J998952q15561j930215n89758l2900l088407
41664a0300316o370219m164697K470851O153046L439532q12784j279988P07644
41656a0156931J088955o6694Q6441J675815K453764K035542J524294M3434l783571
41647e098951p285864n577308J203205O851636O769123K847880p59274k631379
$$ plain form
41639 -3680932 -6497977 -7416908 -5858471 -4899846 -7718015 -11952384 -12024713 -7626535 -4866905
41630 -4866905 -7302164 -11100017 -12119687 -12582510 -16010045 -19818032 -19044573 -14829693
41622 -14829693 -12552809 -12511413 -9216260 -885208 6318695 6006916 -546315 -6705343
41614 -6705343 -7937312 -5207619 -3072382 -5358543 -10655596 -12074282 -4541792 7581010
41606 7581010 14049365 10595205 3013026 -1721721 -3357864 -4798835 -5607567 -3474193
41598 -3474193 1088149 5865347 10300870 13716017 12885839 6401363 -425630 -680978
41590 -680978 4633486 7618882 4280032 -1119812 -3675871 -4281794 -5733631 -7195568
41582 -7195568 -6701685 -5922887 -7689503 -10482682 -10278531 -7561712 -7586769 -12190214 -15531861
$$ packed form
41639c680932k817045r18931J558437R58625k818169m234369p2329M398178K759630
41630d866905k435259l797853j019670m62823l427535l807987P73459M214880
41622a4829693K276884M1396L295153Q331052P203903l11779o553231o159028
41614f705343j231969K729693K135237k286161n297053j418686P532490J2122802
41606G581010O468355l454160p582179m734747j636143j440971q08732K133374
41598c474193M562342M777198M435523L415147q30178o484476o826993k55348
41590f80978N314464K985396l338850n399844k556059o05923j451837j461937
41582g195568M93883P78798j766616k793179K04151K716819k5057m603445l341647
$$ plain form
41573 -15531861 -11160134 -886351 7106436 8132942 5229745 3170556 2201233 32450
41565 32450 -2865137 -3758053 -2538165 -2364570 -4802435 -7305626 -6873004 -3941889 -1029343
41556 -1029343 706265 1644435 1695800 284066 -1927221 -2945166 -1424356 1930460 4961897
41547 4961897 5862040 4830258 4110546 5748052 9280330 12530755 14438157 15484710
41539 15484710 15278160 12034530 5606811 -805274 -3465662 -1512430 3215355 8024166
41531 8024166 9992674 6933117 -207944 -7128660 -9978119 -8361528 -3804247 2391482
41523 2391482 8083970 9922613 7108592 3554265 2959331 3364875 394762 -5285044
41515 -5285044 -8218519 -5834255 -1539153 747782 1239134 1809572 2183165 1024292 -1040204
$$ packed form
41573a5531861M371727J0273783P992787J026506k903197k059189r69323k168783
41565C2450k897587q92916J219888J73595k437865k503191M32622K931115K912546
41556a029343J735608R38170N1365j411734k211287j017945J520810L354816L031437
41547D961897R00143j031782p19712J637506L532278L250425J907402J046553
41539A5484710k06550l243630o427719o412085k660388J953232M727785M808811
41531H024166J968508l059557p141061o920716k849459J616591M557281O195729
41523B391482N692488J838643k814021l554327n94934M05544k970113n679806
41515e285044k933475K384264M295102K286935M91352N70438L73593j158873k064496
$$ plain form
41506 -1040204 -1603074 1098572 6841056 13446009 17598545 16899452 11820953 5032668
41498 5032668 -909210 -4274073 -3810114 -12580 3909306 4984979 4080367 3865591 3868725
41489 3868725 1297451 -3239838 -5345706 -3387329 -1001574 -866445 -269118 3639636
41481 3639636 7603127 5867105 -1457958 -7846732 -8114944 -3703201 185750 651208
41473 651208 -469047 414115 3571906 4910647 1687909 -1871565 1364267 11254209
41465 11254209 19098086 18853857 14782038 13855194 14915331 11386404 2338706 -5746847
41457 -5746847 -7876615 -5454323 -1929065 1168237 2848696 2204366 897068 1943740
41449 1943740 4535438 4219652 -42002 -3357072 -1954584 1286792 1643085 -525001
$$ packed form
41506a040204n62870K701646N742484O604953M152536o99093n078499o788285
41498E032668n941878l364863M63959L797534L921886J075673r04612k14776L134
41489C868725k571274m537289k105868J958377K385755J35129N97327L908754
41481C639636L963491j736022p325063o388774k68212M411743L888951M65458
41473F51208j120255Q83162L157791J338741l222738l559474L235832R889942
41465A1254209P843877k44229m071819r26844J060137l528927r047698q085553
41457e746847k129768K422292L525258L097302J680459o44330j307298J046672
41449A943740K591698l15786m261654l315070J402488L241376L56293k168086
$$ plain form
41441 -525001 -1582424 -966491 -1473824 -4250193 -7262659 -8781312 -9745539 -12421689 -18118109
41432 -18118109 -25624789 -30761013 -29079549 -21106072 -13529276 -12667931 -17530066 -21538426
41424 -21538426 -20177959 -14569408 -8562149 -5291725 -6074706 -9466601 -11191229 -7857078
41416 -7857078 -1186316 3935350 5696818 6634737 8341908 8716865 6244076 3591496
41408 3591496 3997406 6320939 6977397 5590340 5344772 7756689 10025192 8645131 4010783
41399 4010783 377824 1870255 8674515 16177797 17580188 8726266 -7995327 -24105839
41391 -24105839 -30392801 -23645509 -9318854 2955055 7747500 7777944 8806746 11698587
41383 11698587 12031881 7443469 1793568 77850 1935129 3154555 1936374 385527
$$ packed form
41441e25001j057423O15933n07333k776369l012466j518653r64227k676150n696420
41432a8118109p506680n136224J681464P973477P576796Q61345m862135m008360
41424b1538426J360467N608551O007259L270424p82981l391895j724628L334151
41416g857078O670762N121666J761468R37919J707171L74957k472789k652580
41408C591496M05910K323533O56458j387057k45568K411917K268503j380061m634348
41399D010783l632959J492431O804260P503282J402391q853922j6721593j6110512
41391b4105839o286962O747292J4326655J2273909M792445L0444J028802K891841
41383A1698587L33294m588412n649901j715718J857279J219426j218181j550847
$$ plain form
41375 385527 611904 2616601 5880278 9911237 12904771 12836656 10605616 9428751 10397234
41366 10397234 11348318 10855935 10058378 9192602 6039614 380719 -3405899 -1843122 2126659
41357 2126659 3319897 2077771 2944954 6569611 8522462 6762802 4688456 4694838 3868938
41348 3868938 -443962 -5124287 -5983744 -4829199 -6206073 -8715313 -5948967 3259763
41340 3259763 11423832 11841248 6961159 3870815 4922058 7274327 9651930 14269950
41332 14269950 21733583 28324108 29974571 26215157 18973582 10313668 3098410 935972
41324 935972 4256593 7953328 6297234 -183109 -5670630 -6740024 -5704862 -5563695
41316 -5563695 -5350254 -3123938 -892442 -2553211 -7479991 -9989959 -6371018 350752
$$ packed form
41375C85527K26377K004697L263677M030959K993534o8115k231040j176865R68483
41366A0397234R51084m92383p97557q65776l152988n658895l786618J562777L969781
41357B126659J193238j242126Q67183L624657J952851j759660k074346O382q25900
41348C868938m312900m680325q59457J154545j376874k509240K766346R208730
41340C259763Q164069M17416m880089l090344J051243K352269K377603M618020
41332A4269950P463633O590525J650463l759414p241575q659914p215258k162438
41324I35972L320621L696735j656094o480343n487521j069394J035162J41167
41316e563695K13441K226316K231496j660769m926780k509968L618941O721770
$$ plain form
41308 350752 4589230 5144232 5284531 6815646 7493554 5467048 3493063 5824023 11690388
41299 11690388 14886788 10714628 1335874 -6958829 -10133053 -8496222 -3992396 1947835
41291 1947835 7904780 12041115 13110866 11142708 7116752 2782431 204054 -44508
41283 -44508 103598 -1317846 -3181499 -2672849 461990 3647077 5477783 6906354 7918358
41274 7918358 6723249 3824983 3114283 6197849 8930345 6991457 2093098 -1286503
41266 -1286503 -2804786 -5149544 -7981874 -8607619 -7878000 -9296175 -11748128 -9430698
41258 -9430698 -1055727 6702422 8157518 5872618 4950597 4866249 2572248 253004 3031252
41249 3031252 9976919 14177334 12710321 10527110 11979981 13777748 10686727 4751238
$$ packed form
41308C50752M238478N55002J40299J531115O77908k026506j973985K330960N866365
41299A1690388L196400m172160r378754q294703l174224J636831M503826N940231
41291A947835N956945M136335J069751j968158m025956m334321k578377k48562
41283d4508J48106j421444j863653N08650L134839L185087J830706J428571J012004
41274G918358j195109k898266p10700L083566K732496j938888m898359l379601
41266a286503j518283k344758k832330o25745P29619j418175k451953K317430
41258i430698Q374971P758149J455096k284900r22021q4348k294001k319244K778248
41249C031252O945667M200415j467013k183211J452871J797767l091021n935489
$$ plain form
41241 4751238 3110563 7141320 9189786 2456164 -9290006 -15595255 -11899760 -4534037
41233 -4534037 -2332994 -6377643 -10391530 -9382725 -4724424 -1064798 -1136800 -4158220
41225 -4158220 -6978320 -5977570 8360 7444375 10493483 7006514 1016590 -1493888
41217 -1493888 1967498 9461960 16795268 19474669 14928175 5208355 -3334101 -4736433
41209 -4736433 2182341 13545288 22557138 22613430 12606267 658547 -1851520 6869756
41201 6869756 15832981 14514677 5536926 -576728 470102 4474326 8076802 12146038
41193 12146038 15751564 14969665 10170655 7677008 10686473 14174121 12682528 8284093
41185 8284093 6536191 8684634 12359719 16396655 20171327 21054624 17426779 12141840
$$ packed form
41241D751238j640675M030757K048466o733622j1746170o305249L695495P365723
41233d534037K201043m044649m013887J008805M658301L659626p2002l021420
41225d158220k820100J000750N985930P436015L049108l486969n989924k510478
41217a493888L461386P494462P333308K679401m546494r719820q542456j402332
41209d736433O918774J1362947R011850N6292j0007163j1947720k510067Q721276
41201F869756Q963225j318304q977751o113654J046830M004224L602476M069236
41193A2146038L605526p81899m799010k493647L009465L487648j491593m398435
41185H284093j747902K148443L675085M036936L774672Q83297l627845n284939
$$ plain form
41177 12141840 8686954 6133534 2212808 -1239184 -1078050 1195804 2054303 2682424
41169 2682424 6683063 12284031 14090876 12484241 13421056 17575988 17869423 11027011
41161 11027011 3912782 3323744 5870283 4202993 -1510723 -5036655 -3758238 -391593
41153 -391593 2910596 6126450 8411314 9055754 10158303 13117543 13941215 7802048 -2927559
41144 -2927559 -11353172 -15756809 -19683673 -22984646 -21275096 -15591817 -13506357 -17055626
41136 -17055626 -18230987 -12014350 -5915424 -8744277 -16193051 -17198707 -10874716 -6618790
41128 -6618790 -8346801 -9171242 -3903987 2358094 2731774 -1137200 -2864799 -948834
41120 -948834 1269783 2743557 5908878 10973038 13964078 12185106 8537629 7850605
$$ packed form
41177A2141840l454886k553420l920726l451992J61134K273854Q58499O28121
41169B682424M000639N600968J806845j606635R36815M154932K93435o842412
41161A1027011p114229n89038K546539j667290n713716l525932J278417L366645
41153c91593L302189L215854K284864O44440J102549K959240Q23672o139167j0729607
41144b927559q425613m403637l926864l300973J709550N683279K085460l549269
41136a7055626j175361O216637O098926k828853p448774j005656O323991M255926
41128f618790j728011q24441N267255O262081L73680l868974j727599J915965
41120i48834K218617J473774L165321N064160K991040j778972l647477o87024
$$ plain form
41112 7850605 10122986 10322575 5741008 977976 2450469 8713188 10715468 3486661
41104 3486661 -6586085 -9832289 -5495261 -1024236 -1338594 -4673330 -8360794 -12164874
41096 -12164874 -14649511 -12382003 -5525254 621467 2632712 3214781 5478151 7545415
41088 7545415 6952985 6222308 8555478 10716275 6402220 -3935136 -12171872 -12145826 -5913822
41079 -5913822 667015 4735206 6844641 7496441 6196088 3327445 894546 749619
41071 749619 2752384 5404416 8084198 11233566 13565579 11162319 2095897 -9126040
41063 -9126040 -15295759 -14580211 -11202260 -8146970 -4065872 1499047 5438045 6389671
41055 6389671 7432661 9602560 7819762 -1406286 -12367992 -16602367 -14266344 -12635550
$$ packed form
41112G850605K272381J99589m581567m763032J472493O262719K002280p228807
41104C486661j0072746l246204M337028M471025l14358l334736l687464l804080
41096a2164874k484637K267508O856749O146721K011245N82069K263370K067264
41088G545415n92430p30677K333170K160797m314055j0337356q236736K6046O232004
41079e913822O580837M068191K109435O51800j300353k868643k432899j44927
41071G49619K002765K652032K679782L149368K332013k403260r066422j1221937
41063i126040o169719P15548L377951L055290M081098N564919L938998R51626
41055F389671J042990K169899j782798r226048j0961706m234375K336023J630794
$$ plain form
41047 -12635550 -14912540 -17065467 -15392068 -11252127 -7753571 -6392483 -7095786 -7552899
41039 -7552899 -3408467 6144979 14072080 12422960 3093677 -4145450 -4206201 -1114816
41031 -1114816 266485 64763 -466283 -1944179 -3471693 -1933094 2748854 6702373
41023 6702373 8490961 10927472 14269358 13615432 6435177 -2669676 -8325362 -10663076
41015 -10663076 -11868945 -11479331 -8872332 -5778338 -2760830 1913372 6565573 5359134
41007 5359134 -2132167 -6991764 -2838990 4061461 3980197 -1828170 -4499048 -2103749
40999 -2103749 -1365776 -5704476 -10384274 -10787962 -8558057 -7528169 -8469192 -9453933 -8194104
40990 -8194104 -3868618 774655 773979 -4422650 -8505955 -6586651 -2194121 -534632 699277
$$ packed form
41047a2635550k276990k152927J673399M139941L498556J361088p03303m57113
41039g552899M144432R553446P927101j649120r329283p239127o0751L091385
41031a114816J381301k01722n31046j477896j527514J538599M681948L953519
41023F702373J788588K436511L341886o53926p180255r104853n655686k337714
41015a0663076j205869L89614K606999L093994L017508M674202M652201j206439
41007E359134p491301m859597M152774O900451q1264n808367k670878K395299
40999b103749P37973m338700m679798m03688K229905J029888r41023r84741J259829
40990h194104M325486M643273o76n196629m083305J919304M392530J659489J233909
$$ plain form
40981 699277 5818134 10311822 6058813 -3933525 -7199099 541223 9790437 11646092
40973 11646092 7726424 2673887 -2815245 -6676023 -3330485 6423011 12142965 7923133
40965 7923133 1974310 3766271 9146809 8312004 2279746 -605619 -825719 -7187264
40957 -7187264 -20425990 -29786775 -28790232 -23903950 -22977091 -23744216 -19796337 -11533643
40949 -11533643 -4497353 -742031 1863891 3836208 3170986 -199313 -3333660 -4162740
40941 -4162740 -3669178 -3740071 -4832445 -6214334 -7096955 -7067626 -6307179 -5703858 -6046098
40932 -6046098 -6647084 -5290692 -572091 5345946 7578874 3888729 -1319198 -1114347
40924 -1114347 5180028 10524680 9466528 5548355 5641713 9407700 9863094 4004815 -2870734
$$ packed form
40981F99277N118857M493688m253009r992338l265574P740322R249214J855655
40973A1646092l919668n052537n489132l860778L345538R753496N719954m219832
40965G923133n948823J791961N380538q34805o032258k885365k20100o361545
40957g187264j3238726r360785R96543M886282R26859p67125L947879Q262694
40949a1533643P036290L755322K605922J972317o65222l370299l134347q29080
40941d162740M93562p0893j092374j381889q82621K9329P60447O03321l42240
40932f046098o00986J356392M718601N918037K232928l690145n207927K04851
40924a114347O294375N344652j058152l918173R3358L765987M55394n858279o875549
$$ plain form
40915 -2870734 -4984948 -3152321 -1169187 634961 3970310 7284860 6808469 2506462
40907 2506462 -1168829 -1426162 -955000 -3890532 -9931618 -14709646 -15474840 -14300941 -14781270
40898 -14781270 -16906876 -17184192 -13821243 -9445069 -7202863 -6238582 -3813673 -541851
40890 -541851 519547 52155 3033488 11001218 17846097 16940426 9713145 3115734 574846
40881 574846 27103 -292617 495012 2001129 1351613 -2311281 -6015537 -7446515 -7512200
40872 -7512200 -6588710 -2690014 3330411 5081113 -1690585 -11342513 -13979969 -7808813
40864 -7808813 -343536 2455906 2332263 2793809 2838807 -130444 -5140957 -9082517 -10839590
40855 -10839590 -10955651 -9374397 -6578536 -5123969 -6733641 -8939871 -7597810 -2098627
$$ packed form
40915b870734k114214J832627J983134J804148L335349L314550m76391m302007
40907B506462l675291k57333M71162k935532o041086m778028p65194J173899m80329
40898a4781270k125606k77316L362949M376174K242206R64281K424909L271822
40890e41851J061398m67392K981333P967730O844879r05671p227281o597411k540888
40881E74846n47743l19720P87629J506117o49516l662894l704256j430978o5685
40872g512200R23490L898696O020425J750702o771698r651928k637456O171156
40864g808813P465277K799442j23643M61546M4998k969251n010513l941560j757073
40855a0839590j16061J581254K795861J454567j609672k206230J342061N499183
$$ plain form
40847 -2098627 4347514 8736238 10097880 8399023 4755212 2368387 4125369 8924578
40839 8924578 12855084 14094836 13979069 13067056 9459466 2428380 -4901937 -8515184
40831 -8515184 -7609715 -4130010 357802 5286414 9285963 10010394 6540047 1001088
40823 1001088 -3138170 -4343513 -3938743 -3509286 -2425952 590527 3981826 3961067 -527253
40814 -527253 -5839566 -8259241 -8409430 -8908195 -9878472 -9914712 -9776013 -11252586 -13296831
40805 -13296831 -13460482 -12797988 -14565639 -17416400 -15215483 -6222830 2019124 1075058
40797 1075058 -7676690 -14873081 -14449946 -9176804 -5079004 -4023258 -3281292 -202753
40789 -202753 4806924 9493557 12248115 12673031 10600958 6193045 1306927 -1018917
$$ packed form
40847b098627O446141M388724J361642j698857l643811k386825J756982M799209
40839H924578L930506J239752j15767r12013l607590p031086p330317l613247
40831h515184R05469L479705M487812M928612L999549P24431l470347n538959
40823A001088m139258j205343M04770M29457J083334L016479L391299k0759m488320
40814e27253n312313k419675j50189m98765r70277l6240J38699j476573k044245
40805a3296831j63651O62494j767651k850761K200917Q992653Q241954r44066
40797A075058q751748p196391M23135N273142M097800J055746P41966L078539
40789b02753N009677M686633K754558M24916k072073m407913m886118k325844
$$ plain form
40781 -1018917 154696 2144057 2081616 755226 964011 3138428 5284057 6571498 7746734
40772 7746734 8003844 5007833 -924686 -5699139 -6142795 -3746110 -2291227 -3341269
40764 -3341269 -5189602 -5070183 -1819065 2643702 4654385 2857431 54514 -606715
40756 -606715 469124 1804410 4619042 9582494 12054939 7108741 -1346803 -3947511
40748 -3947511 476593 2317384 -4874521 -15073320 -18618365 -14132384 -6818954 -481756
40740 -481756 3388501 3416918 882688 499203 3658760 5196332 1849077 -1391744 175397
40731 175397 1385418 -5448357 -17335187 -23876674 -21809919 -17550383 -16217924 -16635699
40723 -16635699 -17078174 -17728742 -16681433 -10998363 -2823792 2163095 2862728 2711592 1837010
$$ packed form
40781a018917J173613J989361o2441j326390K08785K174417K145629J287441J175236
40772G746734K57110k996011n932519m774453m43656K396685J454883j050042
40764c341269j848333J19419L251118M462767K010683j796954k802917o61229
40756f06715J075839J335286K814632M963452K472445m946198q455544k600708
40748c947511M424104J840791p191905j0198799l545045M485981P313430O337198
40740d81756L870257K8417k534230l83485L159557J537572l347255l240821J567141
40731A75397J210021o833775j1886830o541487K066755M259536J332459m17775
40723a6635699m42475o50568J047309N683070Q174571M986887O99633j51136q74582
$$ plain form
40714 1837010 -2782205 -8898266 -9618241 -4412968 -947846 -3172639 -6047704 -5633827
40706 -5633827 -5665863 -8894193 -9947670 -3644612 5736450 10457257 9834983 8268049 7084398
40697 7084398 5113651 3890166 5398737 7101900 5723710 3966531 6812175 12369378
40689 12369378 13308110 7693726 2064034 2034174 5061132 5397269 2492531 486029 588664
40680 588664 -1810931 -10329879 -20191560 -22201277 -15176372 -9277956 -12473921 -17974142
40672 -17974142 -12817396 2779309 14063629 11289326 1544306 -2783004 867335 7064581
40664 7064581 12034680 14415946 11826080 4191939 -2982748 -5045613 -4561426 -5556411
$$ packed form
40714A837010m619215o116061p19975N205273L465122k224793k875065M13877
40706e633827l2036l228330j053477O303058R381062M720807o22274j566934j183651
40697G084398j970747j223485J508571J703163j378190j757179K845644N557203
40689A2369378R38732n614384n629692k9860L026958L36137k904738k006502J02635
40680E88664k399595q518948r861681k009717P024905N898416l195965n500221
40672a7974142N156746J5596705J1284320k774303r745020m327310L650339O197246
40664G064581M970099K381266k589866p634141p174687k062865M84187r94985
$$ [...]
##END NTUPLES=NMR SPECTRUM
##END=
