##TITLE=31Pdec_SR_62
 CDCl3, 124 sc
 1.2.2021
##JCAMPDX= 6.0         $$ Bruker NMR JCAMP-DX V2.0
##DATA TYPE= NMR SPECTRUM
##DATA CLASS= NTUPLES
##ORIGIN= UXNMR, Bruker Analytische Messtechnik GmbH
##OWNER= root
$$ XWIN-NMR		Version 3.5
$$ Mon Feb  1 12:23:40 2021 Russian Standard Time (UT+4h)  she@DPX200
##.OBSERVE FREQUENCY= 81.013821
##.OBSERVE NUCLEUS= ^31P
##.ACQUISITION MODE= SIMULTANEOUS
##.ACQUISITION SCHEME= undefined
##.AVERAGES= 124
##.DIGITISER RES= 17
##SPECTROMETER/DATA SYSTEM= spect
##.PULSE SEQUENCE= zgpg30
##.SOLVENT NAME= CDCl3
##.SHIFT REFERENCE= (INTERNAL, CDCl3, 0, 182.463)
##AUDIT TRAIL= $$ (NUMBER, WHEN, WHO, WHERE, WHAT)
$$ ##TITLE= Audit trail, XWIN-NMR		Version 3.5
$$ ##JCAMPDX= 5.01
$$ ##ORIGIN= Bruker BioSpin GmbH
$$ ##OWNER= she
$$ F:/spectra/data/she/nmr/P31/1/pdata/1/auditp.txt
$$ ##AUDIT TRAIL=  $$ (NUMBER, WHEN, WHO, WHERE, WHAT)
(   1,<2021-02-01 12:22:17.31 +0400>,<she>,<DPX200>,
      <continue with go, POWCHK disabled, PULCHK disabled
       configuration hash MD5:
       00 E9 B6 7A A2 85 ED C7 34 08 36 98 17 FE 4E 26
       data hash MD5: 32K
       18 98 0C 12 2B 28 6D C1 2B 28 A9 BD BC 77 35 CA>)
(   2,<2021-02-01 12:22:19.78 +0400>,<she>,<DPX200>,
      <Start of raw data processing
       efp BC_mod = 2 LB = 1 FT_mod = 6 PKNL = 1 PHC0 = -1693.002 PHC1 = -24.39859 SI = 64K 
       data hash MD5: 64K
       3F C4 F0 00 D8 61 FE 86 5B CC 64 F9 9E 26 18 B9>)
(   3,<2021-02-01 12:22:31.18 +0400>,<she>,<DPX200>,
      <abs ABSG = 5 
       data hash MD5: 64K
       54 BA 2D 15 6F 98 34 A9 E3 35 FC 16 5D 81 7F FB>)
$$ ##END=
$$ 
$$ hash MD5
$$ 8C 1B 7B 34 5D 33 9F E6 83 C7 AF C7 C2 27 D7 0A
##$RELAX= 
##$RELAX= 
##$RELAX= 
##$RELAX= 
##$RELAX= 
##$RELAX= 
##$RELAX= 
##$RELAX= 
$$ Bruker specific parameters
$$ --------------------------
##$DU= <F:/spectra>
##$EXPNO= 1
##$NAME= <P31>
##$PROCNO= 1
##$TYPE= <nmr>
##$USER= <she>
##$AMP= (0..31)
100 100 100 100 100 100 100 100 100 100 100 100 100 100 100 100 100 100 
100 100 100 100 100 100 100 100 100 100 100 100 100 100 
##$AQSEQ= 0
##$AQ_mod= 1
##$AUNM= <au_zg>
##$AUTOPOS= <>
##$BF1= 81.014009
##$BF2= 200.13
##$BF3= 200.13
##$BF4= 200.13
##$BF5= 200.13
##$BF6= 200.13
##$BF7= 200.13
##$BF8= 200.13
##$BYTORDA= 1
##$CFDGTYP= 0
##$CFRGTYP= 5
##$CHEMSTR= <none>
##$CNST= (0..31)
1 1 145 1 1 1 1 1 1 1 1 1 1 1 1 1 1 1 1 1 1 1 1 1 1 1 1 1 1 1 1 1 
##$CPDPRG= <waltz16>
##$CPDPRG1= <>
##$CPDPRG2= <waltz16>
##$CPDPRG3= <>
##$CPDPRG4= <mlev>
##$CPDPRG5= <mlev>
##$CPDPRG6= <mlev>
##$CPDPRG7= <mlev>
##$CPDPRG8= <mlev>
##$CPDPRGB= <>
##$CPDPRGT= <>
##$D= (0..31)
0 1 0 0 0 0 0 0 0 0 0 0.03 2e-05 3e-06 0 0 0 0 0 0 0 0 0 0 0 0 0 0 0 0 
0 0 
##$DATE= 1612167557
##$DBL= (0..7)
120 120 120 11 120 120 24 19 
##$DBP= (0..7)
150 150 150 150 150 150 150 150 
##$DBP07= 0
##$DBPNAM0= <>
##$DBPNAM1= <>
##$DBPNAM2= <>
##$DBPNAM3= <>
##$DBPNAM4= <>
##$DBPNAM5= <>
##$DBPNAM6= <>
##$DBPNAM7= <>
##$DBPOAL= (0..7)
0.5 0.5 0.5 0.5 0.5 0.5 0.5 0.5 
##$DBPOFFS= (0..7)
0 0 0 0 0 0 0 0 
##$DE= 6
$$ [...]
##$SUBNAM3= <"">
##$SUBNAM4= <"">
##$SUBNAM5= <"">
##$SUBNAM6= <"">
##$SUBNAM7= <"">
##$SUBNAM8= <"">
##$SUBNAM9= <"">
##$SW= 369.568048894756
##$SWIBOX= (0..15)
0 1 3 0 0 0 0 0 0 0 0 0 0 0 0 0 
##$SW_h= 29940.119760479
##$TD= 32768
##$TD0= 1
##$TE= 0
##$TE2= 300
##$TE3= 300
##$TEG= 300
##$TL= (0..7)
0 120 53 12 22 120 120 120 
##$TP= (0..7)
150 150 150 150 150 150 150 150 
##$TP07= 0
##$TPNAME0= <>
##$TPNAME1= <>
##$TPNAME2= <>
##$TPNAME3= <>
##$TPNAME4= <>
##$TPNAME5= <>
##$TPNAME6= <>
##$TPNAME7= <>
##$TPOAL= (0..7)
0.5 0.5 0.5 0.5 0.5 0.5 0.5 0.5 
##$TPOFFS= (0..7)
0 0 0 0 0 0 0 0 
##$TUNHIN= 0
##$TUNHOUT= 0
##$TUNXOUT= 0
##$USERA1= <user>
##$USERA2= <user>
##$USERA3= <user>
##$USERA4= <user>
##$USERA5= <user>
##$V9= 5
##$VALIST= <valist>
##$VCLIST= <CCCCCCCCCCCCCCC>
##$VD= 0
##$VDLIST= <DDDDDDDDDDDDDDD>
##$VPLIST= <PPPPPPPPPPPPPPP>
##$VTLIST= <TTTTTTTTTTTTTTT>
##$WBST= 1024
##$WBSW= 4
##$XGAIN= (0..3)
0 0 0 0 
##$XL= 0
##$YL= 0
##$YMAX_a= 37839
##$YMIN_a= -9256
##$ZGOPTNS= <>
##$ZL1= 120
##$ZL2= 120
##$ZL3= 120
##$ZL4= 120
##$ABSF1= 182.463
##$ABSF2= -187.1042
##$ABSG= 5
##$ABSL= 3
##$ALPHA= 0
##$AQORDER= 0
##$ASSFAC= 0
##$ASSFACI= 0
##$ASSFACX= 0
##$ASSWID= 0
##$AUNMP= <proc_1d>
##$AZFE= 0.1
##$AZFW= 0.5
##$BCFW= 0
##$BC_mod= 2
##$BYTORDP= 0
##$COROFFS= 0
##$CY= -3
##$DATMOD= 1
##$DC= 0
##$DFILT= <>
##$DTYPP= 0
##$F1P= 0
##$F2P= 0
##$FCOR= 1
##$FTSIZE= 65536
##$FT_mod= 6
##$GAMMA= 0
##$GB= 0
##$INTBC= 1
##$INTSCL= 5.30512e-09
##$ISEN= 30
##$LB= 1
##$LEV0= 0
##$LPBIN= 0
##$MAXI= 10000
##$MC2= 0
##$MEAN= 0
##$ME_mod= 0
##$MI= 50
##$NCOEF= 0
##$NC_proc= -10
##$NLEV= 6
##$NOISF1= 182.463
##$NOISF2= 159.3651
##$NSP= 0
##$NTH_PI= 0
##$NZP= 0
##$OFFSET= 182.463
##$PC= 4
##$PHC0= -1693.002
##$PHC1= -24.39859
##$PH_mod= 1
##$PKNL= yes
##$PPARMOD= 0
##$PSCAL= 0
##$PSIGN= 0
##$REVERSE= no
##$SF= 81.014009
##$SI= 65536
##$SIGF1= 159.3651
##$SIGF2= -187.1042
##$SINO= 113.3802
##$SIOLD= 16384
##$SREGLST= <1H.CDCl3>
##$SSB= 0
##$STSI= 65536
##$STSR= 0
##$SW_p= 29940.119760479
##$SYMM= 0
##$S_DEV= 0
##$TDeff= 32768
##$TDoff= 0
##$TI= <>
##$TILT= no
##$TM1= 0
##$TM2= 0
##$TOPLEV= 0
##$USERP1= <user>
##$USERP2= <user>
##$USERP3= <user>
##$USERP4= <user>
##$USERP5= <user>
##$WDW= 1
##$XDIM= 65536
##$YMAX_p= 482478191
##$YMIN_p= -355223854
$$ End of Bruker specific parameters
$$ ---------------------------------
##NTUPLES= NMR SPECTRUM
##VAR_NAME=  FREQUENCY,     SPECTRUM/REAL,   SPECTRUM/IMAG
##SYMBOL=    X,             R,               I
##VAR_TYPE=  INDEPENDENT,   DEPENDENT,       DEPENDENT
##VAR_FORM=  AFFN,          ASDF,            ASDF
##VAR_DIM=   65536,         65536,           65536
##UNITS=     HZ,            ARBITRARY UNITS, ARBITRARY UNITS
##FACTOR=    0.456856943014862, 1,           1
##FIRST=     14782.0589164895, 0,            0
##LAST=      -15158.0608439895, 0,           0
##MIN=       -15158.0608439895, -355223854,  0
##MAX=       14782.0589164895, 482478191,    0
$$ Real data points
##PAGE= N=1
##DATA TABLE= (X++(R..R)), XYDATA
$$ [...]
43591C1643605k4941305J4155755L1330268J1417519j2692925j4124363J491699
$$ 31643605 6702300 20858055 52188323 63605842 50912917 36788554 38280253
43584C8280253J2347128J581679k7579580m5878120k6176474J1010924R345451
$$ 38280253 50627381 52209060 24629480 -21248640 -47425114 -36414190 -27068739
43577b7068739m4122242q2997222m1027990N4587725J12783861R0707800L1009221
$$ -27068739 -71190981 -154188203 -195216193 -140628468 -27844607 62863193 93872414
43570I3872414j0634715k5317691k5242031p583915K2794921L0107689p860010
$$ 93872414 83237699 57920008 32677977 25094062 47888983 77996672 70136662
43563G0136662n0650495l9915162J1203131K7501411j6711525n2432878j9305500
$$ 70136662 19486167 -20428995 -9225864 18275547 1564022 -50868856 -70174356
43556g0174356L5886368K6769688l6103175n6890094k573953M6043570K2426494
$$ -70174356 -34287988 -7518300 -43621475 -100511569 -103085522 -57041952 -34615458
43549c4615458k4729574j7635887K2892488J6122697m1226977o1286562P385516
$$ -34615458 -59345032 -76980919 -54088431 -37965734 -79192711 -140479273 -133093757
43542a33093757J06207674J40433452Q2394409j5098835p6071407o2999762q153334
$$ -133093757 -26886083 113547369 195941778 180842943 104771536 41771774 33618440
43535C3618440J4953183k4658193p1336863n4919713J1533989N4594893M7546157
$$ 33618440 48571623 23913430 -47423433 -102343146 -90809157 -36214264 11331893
43528A1331893L3314233M0374106M1429543J2949011k1449071l2566348k6337362
$$ 11331893 44646126 85020232 126449775 139398786 117949715 85383367 59046005
43521E9046005k0771215j8971483k0023340k2336790j1210187J8243356L1078827
$$ 59046005 38274790 19303307 -720033 -23056823 -34267010 -16023654 15055173
43514A5055173l108319m5433505l5691014K460814p685532n6882331n0232198
$$ 15055173 11946854 -33486651 -69177665 -66716851 -74402383 -131284714 -181516912
43507a81516912K7070034O4275484K747415n8292185j9832195N8021726O4848214
$$ -181516912 -154446878 -90171394 -87423979 -145716164 -165548359 -107526633 -42678419
43500d2678419K1369762K3851876O7461754O2477266l814266n2803343n1644074
$$ -42678419 -21308657 2543219 70004973 132482239 128667973 75864630 24220556
43493B4220556m4397478m6611745k2710896K1787944L1926541M295215j144962
$$ 24220556 -20176922 -66788667 -89499563 -67711619 -35785078 -31489863 -32634825
43486c2634825L0637178M3407432J4184241p736200M670414R544649k1118363
$$ -32634825 -1997647 41409785 55594026 47857826 52528240 62072889 40954526
43479D0954526n1599286n1887825m3485514l9676111j1358386M8058075Q9096646
$$ 40954526 -10644760 -62532585 -106018099 -145694210 -157052596 -108994521 -19897875
43472a9897875P7404616M0861796J3592657p379638k2004208j0626225J1940626
$$ -19897875 57506741 98368537 111961194 104581556 82577348 71951123 83891749
43465H3891749l491360n2494826o4444947j6815548J9742412O47211j3845429
$$ 83891749 80400389 27905563 -36539384 -53354932 -33612520 -32965309 -46810738
43458d6810738L3242258Q8116927P0490325J708947l9996112m1527310m2497789
$$ -46810738 -13568480 74548447 145038772 146747719 106751607 65224297 22726508
43451B2726508m2573034j3813445K3196416K4197297J749579p71516N992984j6975912
$$ 22726508 -19846526 -33659971 -10463555 13733742 15483321 14711805 20704789 3728877
43443C728877m5732443j9581254M7989581P5255213L2974412k5058383n7442891
$$ 3728877 -42003566 -61584820 -13595239 61659974 94634386 69576003 12133112
43436A2133112p4711687p2859729k0758484N7663839P7619609J4521350m5558309
$$ 12133112 -62578575 -135438304 -156196788 -98532949 -20913340 -6391990 -51950299
43429e1950299k9067210J9124946J6349432k6882956l3168567J5261922N4029146
$$ -51950299 -81017509 -61892563 -45543131 -72426087 -105594654 -90332732 -36303586
43422c6303586L7438135j720816q586685J9597877L8638772J8269177k0725843
$$ -36303586 1134549 -586267 -9172952 10424925 49063697 67332874 46607031
43415D6607031l1887265j850738K8262437J5810158k0679282k6475909K656661
$$ 46607031 14719766 12869028 41131465 56941623 36262341 9786432 12443093
43408A2443093Q561895l4088733o4185254k1958806N1574685O8053960K1963264
$$ 12443093 21004988 -13083745 -77268999 -99227805 -47653120 20400840 42364104
43401D2364104q540640J0028166J9813737j9637652n4018179k2170880L7085994
$$ 42364104 33823464 43851630 63665367 44027715 -9990464 -32161344 4924650
43394D924650M0915373q750627l4324668p961115J6701958N984720m020079J3371794
$$ 4924650 45840023 37089396 2764728 -5196387 11505571 17490291 13470212 26842006
43386B6842006K3371254N11751j6187767N764175K5225447k916788m0918825k6364921
$$ 26842006 50213260 50725011 34537244 40301419 65526866 62610078 21691253 -4673668
43378d673668K1554039L5593405J1945570J463572P859422j2906436n6102240
$$ -4673668 16880371 52473776 64419346 65882918 73742340 60835904 4733664
43371D733664o3149626k0165670K4138625M7240942P2208513Q9144726N3068102
$$ 4733664 -58415962 -78581632 -54443007 -7202065 65006448 154151174 207219276
43364B07219276k0487064n5233474l4381017k0757885l1430747q826363M4326107
$$ 207219276 186732212 131498738 97117721 76359836 44929089 36102726 80428833
43357H0428833L4789431n0367041q1638161P253329Q6586979L2361429o2333744
$$ 80428833 115218264 64851223 -16786938 -9533609 77053370 109414799 47081055
43350D7081055m0608625N0551564L8118083q4956561j46036100o3543210N3155439
$$ 47081055 6472430 57023994 95142077 10185516 -135850584 -199393794 -146238355
43343a46238355R4290828P4991244L7508734j8345689o1385050k5866060O3222907
$$ -146238355 -51947527 23043717 60552451 42206762 -19178288 -45044348 18178559
43336A8178559Q7259590J0775270n9556740m8237529j8900464m0424931o7182728
$$ 18178559 105438149 116213419 56656679 8419150 -10481314 -50906245 -118088973
43329a18088973m0005471N89645j450221j1720869J8523021N1531914L7868861
$$ -118088973 -158094444 -157504799 -158955020 -170675889 -152152868 -100620954 -62752093
43322f2752093J7133608L9356187N4645183l417920q0263601p1789792K084262
$$ -62752093 -45618485 -6262298 48382885 44964965 -35298636 -107088428 -105004166
43315a05004166K4501829k9336672n6542823M907330Q3860885R0623355L8132543
$$ -105004166 -80502337 -109839009 -166381832 -161474502 -77613617 13009738 51142281
43308E1142281m22718K514915J4595849N367145j6345097k1150117P04824K2796528
$$ 51142281 50719563 53234478 67830327 73197472 56852375 35702258 36407082 59203610
43300E9203610J5557983o709912j346681L2903043M4582295Q726641l1474872
$$ 59203610 74761593 68051681 66705000 99608043 144190338 152916979 121442107
43293A21442107l4873737k2709608k5753881k5200080k553794L928288l7207421
$$ 121442107 86568370 63858762 38104881 12904801 10351007 14279295 -22928126
43286b2928126p5498130m6688666J9587744M5315920K8158213K6946062M3272420
$$ -22928126 -98426256 -145114922 -125527178 -80211258 -52053045 -25106983 18165437
43279A8165437K1211212l5668669n1667755l045905L9235525K2535291j3236742
$$ 18165437 39376649 3707980 -47959775 -51005680 -11770155 10765136 -2471606
43272b471606j1842874J8787859M1252064M4167823K7505615j2308007n0382249
$$ -2471606 -14314480 4473379 45725443 89893266 117398881 105090874 54708625
43265E4708625m2142056K828158J2843112m1438821r0338931n9929564K3930462
$$ 54708625 12566569 15394727 28237839 -13200982 -103539913 -163469477 -139539015
43258a39539015P7403494O7379573K8367165j70456n647898P788373K0897477
$$ -139539015 -62135521 5244052 33611217 33440761 27792863 35581236 56478713
43251E6478713P816647k6924694m2998191k3478679p278570k6844884m8066429
$$ 56478713 64295360 37370666 -5627525 -29106204 -36384774 -63229658 -111296087
43244a11296087k1022908L4837015N2449261J3388984l1719949m0090902k5286813
$$ -111296087 -132318995 -97481980 -45032719 -31643735 -63363684 -103454586 -128741399
43237a28741399j7723150j7249719n722902J8653457M0890610N1651034N4843016
$$ -128741399 -146464549 -163714268 -169437170 -150783713 -109893103 -58242069 -3399053
43230c399053N5283719M6883046J8372328k5224172n3420063m0220949m785234
$$ -3399053 51884666 98767712 117140040 91915868 38495805 -1725144 -6510378
43223f510378K918149k9902467n2073177j6775094M3720900N2350415o020588
$$ -6510378 -3592229 -33494696 -85567873 -102342967 -58622067 -6271652 -12292240
43216a2292240n6067540l0664324L5210685M8857318j2265828o4997898l2206258
$$ -12292240 -68359780 -99024104 -63813419 -14956101 -27221929 -92219827 -124426085
43209a24426085M9808973Q0641668L3017119j9550048j8131767M664161k655336
$$ -124426085 -74617112 6024556 39041675 19491627 1359860 6024021 3368685
43202C368685k0415539k73646M2077375M8479967J3251450j5207294j9705393
$$ 3368685 -17046854 -17320500 24756875 73236842 86488292 71280998 51575605
43195E1575605k8367088m2823472k9034380O868240J0291237k8781899m7814492
$$ 51575605 23208517 -19614955 -48649335 -41781095 -31489858 -60271757 -108086249
43188a08086249j1688653K9502491K6525015P607556J3900644J9592516j5479151
$$ -108086249 -119774902 -90272411 -63747396 -56139840 -42239196 -22646680 -38125831
43181c8125831o0309376n3694121j396519L5881524L1682816J0164506q415464
$$ -38125831 -98435207 -152129328 -153525847 -117644323 -85961507 -75797001 -84212465
43174h4212465j9907339r998486K6137021N0150279K2704670k9923826m5354925
$$ -84212465 -104119804 -114118290 -87981269 -37830990 -15126320 -45050146 -90405071
43167i0405071j3735608J5633550J1337579p001096j1757727J92697J7571494
$$ -90405071 -104140679 -88507129 -77169550 -84170646 -95928373 -95735676 -78164182
43160g8164182K4162943P370399j6594045j1798362J5318266R275810l6791329
$$ -78164182 -54001239 -46630840 -63224885 -75023247 -59704981 -50429171 -87220500
43153h7220500m1624789L4445925R0571049K5076918q2112148o8281997N7165421
$$ -87220500 -128845289 -94399364 -3828315 21248603 -60863545 -129145542 -71980121
43146g1980121J17353399L7803528n3500595m1933703J5601926K4746611M136703
$$ -71980121 45373278 83176806 29676211 -12257492 3344434 28091045 32227748
43139C2227748L447631o218626m7979806n1270715K9418426R9195447N7794951
$$ 32227748 35675379 29456753 -18523053 -69793768 -40375342 58820105 116615056
43132A16615056k7597503k6871677L7560498L5400587m7735803r1336186l9304150
$$ 116615056 89017553 62145876 99706374 135106961 87371158 -3965028 -43269178
43125d3269178K9710685M4907990K5182578j019630l6522045n4301233j2098547
$$ -43269178 -13558493 31349497 56532075 55512445 18990400 -35310833 -47409380
43118d7409380M8071675L1142342n3379596q4983137j8128171M9918052M4946327
$$ -47409380 662295 31804637 -21574959 -106558096 -124686267 -74768215 -29821888
43111b9821888K1945548L8742117M7417461M68635m3033399j8968084K4493238
$$ -29821888 -7876340 30865777 78283238 78751873 35718474 16750390 41243628
43104D1243628J5991334j1431360Q829822M6928024L2449744j4478810k4299295
$$ 41243628 57234962 45803602 54633424 101561448 134011192 119532382 95233087
43097I5233087o788465k2206916n7654062m9784605p641226L494518j4272499
$$ 95233087 88444622 66237706 8583644 -41200961 -48842187 -45347669 -59620168
43090e9620168K28973M3051257M5925552L369569j5306791R807109K5517798J8396598
$$ -59620168 -59391195 -16339938 29585614 32955183 17648392 27455501 52973299 71369897
43082G1369897L3268977N7298083J2321061r3950752j34200478m6525124N7097655
$$ 71369897 104638874 161936957 174258018 80307266 -53893212 -100418336 -43320681
43075d3320681N1366090k4933140m6685121J2541038P2388506P6955956M1493472
$$ -43320681 8045409 -16887731 -63572852 -51031814 21356692 98312648 139806120
43068A39806120o278142n2690677p8790518p3396834n3881428l5196311m678061
$$ 139806120 133527978 80837301 2046783 -71350051 -125231479 -160427790 -165105851
43061a65105851L7871173N6352378L6898533K3600857M5592554N7779547J5209341
$$ -165105851 -127234678 -70882300 -33983767 -10382910 35209644 92989191 108198532
43054A08198532m0162402l8965667N917494K4781493o06960k8639474l6847235
$$ 108198532 68036130 29070463 34987957 59769450 59162490 30523016 -6324219
43047f324219l5466526j8257252K6279034O4553698N0291141J635452k1683303
$$ -6324219 -41790745 -60047997 -33768963 30784735 81075876 82711328 61028025
43040F1028025j2307012j7302826m8962459o4323977l9301559J144765L3467108
$$ 61028025 48721013 31418187 -17544272 -81868249 -121169808 -120025043 -86557935
43033h6557935N6181532N5952999J4159148m5356695p1390684n3094757k1087004
$$ -86557935 -30376403 25576596 39735744 -5620951 -77011635 -130106392 -151193396
43026a51193396J1947637N0528388O7832382L3942924j2542230o382985K9478776
$$ -151193396 -139245759 -88717371 -20884989 13057935 515705 -5867280 23611496
43019B3611496P317401p3316082j03305391l0072022N7339295O4972920K2956671
$$ 23611496 30928897 -42387185 -145692576 -175764598 -118425303 -53452383 -30495712
43012c0495712Q912218K2813484J7733049o902840k2172805l1413235m3682958
$$ -30495712 -21583494 1229990 18963039 12060199 -10112606 -41525841 -85208799
43005h5208799l1310791J7431629M9921401K4563870j1876639J820202L6519902
$$ -85208799 -116519590 -99087961 -49166560 -24602690 -36479329 -34659127 1860775
42998A860775K7556375p215267k005584L3448773L0903244r236404j7395734J4801480
$$ 1860775 29417150 22201883 20196299 53645072 84548316 75311912 57916178 72717658
42990G2717658J4477108l7973187o0563337l217839O1404857M5818214k1410297
$$ 72717658 87194766 49221579 -11341758 -14559597 46845260 92663474 71253177
42983G1253177m5882731n084154L6795118L1353490j508051k2601052k3985960
$$ 71253177 25370446 20286292 57081410 88434900 86926849 64325797 40339837
42976D0339837j7216537l938555K0204772M2909552L6243974q916054n6160112
$$ 40339837 23123300 19184745 39389517 82299069 118543043 109626989 53466877
42969E3466877n3847461j866945L6752714J3712157l8540985n2212922j5630788
$$ 53466877 -380584 -2247529 34505185 48217342 9676357 -42536565 -58167353
42962e8167353K4366131L8292250L9821989L7502483J6815460j7167194l0119609
$$ -58167353 -33801222 4491028 44313017 81815500 98630960 81463766 51344157
42955E1344157j2143460J689369j3427174l4695898l2216280j1049646R839005
$$ 51344157 39200697 40890066 27462892 -7233006 -39449286 -50498932 -40659927
42948d0659927K5933154L1511556J1277211k6521741m3475377k5501060q924163
$$ -40659927 -14726773 16784783 28061994 1540253 -41935124 -67436184 -76360347
42941g6360347k1430770l4345459j2525487K3580469L3267583K3786654K9179273
$$ -76360347 -97791117 -132136576 -144662063 -121081594 -87814011 -64027357 -34848084
42934c4848084M2457003K9134043k248344o888629J7170581K0735966j1119215
$$ -34848084 7608919 36742962 34494618 27605989 44776570 65512536 54393321
42927E4393321k8419181j782688J8821856j9115470p5718864o5244758J6073412
$$ 54393321 25974140 24191452 43013308 23897838 -51821026 -117065784 -100992372
42920a00992372P4002462M1593338l2712337n5276791j0475591L2011048K1071058
$$ -100992372 -26989910 14603428 -18108909 -73385700 -83861291 -51850243 -30779185
42913c0779185j3929895j8458143J0044057L3083964L6514232M2216631N6558441
$$ -30779185 -44709080 -63167223 -53123166 -20039202 16475030 58691661 115250102
42906A15250102N0123458O546367m0541372m7352008j7774376P945871J0993159
$$ 115250102 165373560 171919927 131378555 84026547 66252171 74198042 85191201
42899H5191201Q815434J4744922J5382249j561120k0914452j7610918J1203749
$$ 85191201 94006635 108751557 124133806 122572686 101658234 84047316 95251065
42892I5251065M2156038M5766264P846528n4490685r3658370o8786019M500606
$$ 95251065 137407103 183173367 191019895 136529210 42870840 -25915179 -21414573
42885b1414573N8811634M7211158l711222l3085902k2795368n983275p796903
$$ -21414573 37397061 84608219 80896997 47811095 25015727 19032452 11235549
42878A1235549j5569671j2853128o117149k096216Q532633K2788870J1721057
$$ 11235549 -4334122 -17187250 -23304399 -25400615 -16867982 5920888 17641945
42871A7641945l3827402o9807612n1165381J58752K4875507J4124930J4894377
$$ 17641945 -16185457 -85993069 -137158450 -136999698 -112124191 -97999261 -83104884
42864h3104884M4859070N9313390K5465828k0396906k6132275K500653K0955156
$$ -83104884 -38245814 21067576 46533404 26136498 4223 2504876 23460032
42857B3460032J1356461j1462788l6346835n4443050m0459999J3710897N7184286
$$ 23460032 34816493 23353705 -12993130 -67436180 -107896179 -94185282 -37000996
42850c7000996L0536574l7795426m8482307K9948135R7858138N0798163o9192868
$$ -37000996 -6464422 -44259848 -92742155 -62794020 35064118 85862281 16669413
42843A6669413j17079748l3860112P7117698Q9626847J4117437l7104254j2747359
$$ 16669413 -100410335 -134270447 -57152749 32474098 46591535 9487281 -3260078
42836c260078K5069263J6992723m573452J1010912L3455121L040914n3954640
$$ -3260078 21809185 38801908 34228456 45239368 78694489 81735403 27780763
42829B7780763n4259835M747814L5484336O351764o274756M1148134O9559180
$$ 27780763 -26479072 -21731258 13753078 20104842 13830086 54978220 124537400
42822A24537400Q862957o8885508n7121778Q354772J0099528m8375154m6214102
$$ 124537400 133400357 64514849 7393071 15747843 25847371 -22527783 -68741885
42815f8741885M4573149R7941197K8077215p8438876r4252622k0368304N1223961
$$ -68741885 -24168736 73772461 101849676 23410800 -70841822 -91210126 -39986165
42808c9986165O8952404M0596565j7148779p2983197p4732477j8079567K4261349
$$ -39986165 28966239 69562804 52414025 -20569172 -95301649 -113381216 -89119867
42801h9119867N329053j8466084J5229984N9610558L6046778k1456878j3357796
$$ -89119867 -83790814 -102256898 -87026914 -27416356 8630422 -12826456 -26184252
42794b6184252N6909166Q1577426J8892019m9533899n4662762k8666065k0329608
$$ -26184252 30724914 112302340 131194359 81660460 26997698 -1668367 -21997975
42787b1997975j6706149O12041L398658k0328841k1511215K8008408O9443145
$$ -21997975 -38704124 -38092083 -34693425 -55022266 -76533481 -48525073 20918072
42780B0918072M3395443q272628n861347L8010652L7311409l0460697q7698956
$$ 20918072 64313515 56040887 50179540 88190192 125501601 95040904 7341948
42773G341948o7905281M96561M3340697K9450633j1841793l3712381j6172548
$$ 7341948 -60563333 -60066772 -16726075 12724558 882765 -32829616 -49002164
42766d9002164J7401872K5553056J754201j2966145Q370604L0531663J0230885
$$ -49002164 -31600292 -6047236 -4293035 -17259180 -8888576 21643087 31873972
42759C1873972k5327066j4429702L3663108M1872109j3509313n9510401l8957430
$$ 31873972 6546906 -7882796 25780312 67652421 54143108 -5367293 -44324723
42752d4324723K895138k56211k4355502k46416O2454895Q1326063K7598401l0920601
$$ -44324723 -41429585 -41685796 -66041298 -66287714 -3832819 77493244 105091645 74171044
42744G4171044l1668192J042844O906964k4914029n7091172n9953587l3162913
$$ 74171044 42502852 43545696 50452660 25538631 -31552541 -91506128 -124669041
42737a24669041Q312669M3291694N3166211L9650451K1585926P491170o554926
$$ -124669041 -116356372 -73064678 -19898467 19751984 41337910 48829080 42274154
42730D2274154q598521K1888149O4824283O2826071K070416n3893002n0300618
$$ 42274154 33675633 55563782 120388065 183214136 185284552 131391550 81090932
42723H1090932j8915718j8289081l5375636j5590658L3748726N0559920K3837458
$$ 81090932 62175214 43886133 8510497 -7080161 26668565 77228485 101065943
42716A01065943R554532K7146951K1979785l4609531q0855737n3077108J5260782
$$ 101065943 110620475 137767426 159747211 125137680 44281943 -8795165 6465617
42709F465617M2413809R920245l2735437m9084548m2954816k0488152J6179514
$$ 6465617 48879426 58799671 26064234 -23020314 -65975130 -86463282 -70283768
42702g0283768L9854476J7469799l2968836n1271164j6264441K2616520J7473834
$$ -70283768 -30429292 -12959493 -45928329 -97199493 -113463934 -90847414 -73373580
42695g3373580r756081n849743K8821512L9093176N59611l7230192k0485900K4515998
$$ -73373580 -83129661 -88979404 -60157892 -21064716 -20505105 -57735297 -78221197 -53705199
42687e3705199K3126222l5930811p4343853l3487396L7457151M9249977k613235
$$ -53705199 -30578977 -66509788 -140853641 -174341037 -136883886 -87633909 -90247144
42680i0247144m0178523j8095396K6012298M1296622K5915056L155995j4806408
$$ -90247144 -130425667 -148521063 -122508765 -81212143 -55297087 -52141092 -66947500
42673f6947500j8386239K013358L0541923L5518187J7850973R387209J5221069
$$ -66947500 -85333739 -83320381 -52778458 -17260271 590702 9977911 25198980
42666B5198980Q198543j0621367p981847J0907164l03865l8582790m0361273N087426
$$ 25198980 33397523 22776156 14794309 25701473 25397608 -13185182 -53546455 -48459029
42658d8459029K3628077j1886109k0163908M3012482Q4129005K3391912n1634619
$$ -48459029 -24830952 -36717061 -56880969 -13868487 70260518 93652430 42017811
42651D2017811k2046515N2476557K6234081q0122475j06021987j7149397M7322663
$$ 42017811 19971296 72447853 98681934 18559459 -87462528 -104611925 -57289262
42644e7289262J7286229r146037L2371464N3375217j0048126o2112369j2078807
$$ -57289262 -40003033 -49149070 -16777606 36597611 26549485 -35562884 -47641691
42637d7641691N8517946L2360426m4917283n2023648l95395J459538n4451998
$$ -47641691 10876255 43236681 -1680602 -53704250 -54099645 -52640107 -107092105
42630a07092105o8668195r896980M3181178M2502978L0571176M0514301M1800055
$$ -107092105 -175760300 -185657280 -142476102 -99973124 -69401948 -28887647 12912408
42623A2912408J3958228j1773594j2770159p034294m580021J0132607L3461750
$$ 12912408 26870636 15097042 2326883 -4707411 -9287432 845175 34306925
42616C4306925L9846498L0085885K2990391M405560m2601336o6090043n48881
$$ 34306925 74153423 104239308 127229699 131635259 89033923 22943880 22394999
42609B2394999R9306416R3963223l3884185j22214581n0932645P8963195Q8426536
$$ 22394999 121701415 215664638 181780453 59565872 8633227 87596422 176022958
42602A76022958k6836592j06372543n9378262L0898840N1049588N436250k6752201
$$ 176022958 149186366 42813823 -16564439 14334401 65383989 70820239 44068038
42595D4068038j7089655p513666k6769989m3363593j6645447L4389002M6243382
$$ 44068038 26978383 19464717 -7305272 -50668865 -67314312 -32925310 13318072
42588A3318072k130784n0143206l3132029K3092250L5996539r757144l7914516
$$ 13318072 11187288 -38955918 -72087947 -48995697 -12999158 -22756302 -60670818
42581f0670818k125114L7505760J1777019m0993313l3434446K8393892N1958661
$$ -60670818 -62795932 -25290172 -13513153 -54506466 -87940912 -59547020 -7588359
42574g588359M990238l5806829q935947L8534412L1109607k0592699m7570078
$$ -7588359 -2598121 -38404950 -47340897 -8806485 22303122 1710423 -45859655
42567d5859655k8945406n557044j324682P568657L9083581O8387450O0884551
$$ -45859655 -74805061 -80362105 -81686787 -74118130 -35034549 33352901 94237452
42560I4237452J3985389m4071052p6038788n5978760N236134N3655948M2192819
$$ 94237452 108222841 64151789 -11886999 -67865759 -62629625 -8973677 33219142
42553C3219142r411152l7447473k0730771j405323o865983l993907L4388185O6592006
$$ 33219142 23807990 -13639483 -34370254 -35775577 -42641560 -46635467 -12247282 54344724
42545E4344724M0898305j5640542l2898535n898524L778015k4807511l7802337
$$ 54344724 95243029 79602487 46703952 40805428 44583443 19775932 -18026405
42538a8026405j081765L9828751L4133522L645203n162651k568404k6120627n6946360
$$ -18026405 -19108170 20720581 54854103 58499306 53336655 50768251 24647624 -32298736
42530c2298736l6331429L6181123Q5351352N8232553q748857m5706888l6599796
$$ -32298736 -68630165 -32449042 52902310 111134863 102386006 56679118 20079322
42523B0079322k0298320k5954087l9281486l0039592P142331M3892662M4959449
$$ 20079322 -218998 -26173085 -65454571 -95494163 -88351832 -44459170 500279
42516E00279N110257m1154025n4084544l2006471p528969M56628J0108890L8447108
$$ 500279 5610536 -35543489 -89628033 -121634504 -129163473 -128706845 -118597955 -80150847
42508h0150847O0144454L6011383k0137915m1527885L535535N4816572L3298809
$$ -80150847 -20006393 16004990 -4132925 -45660810 -42125275 12691297 45990106
42501D5990106m2634556p0794289p074221O6355086N6310424p437524k0428441
$$ 45990106 3355550 -67438739 -74512960 -8157874 48152550 40715026 20286585
42494B0286585M0329431Q8703338O0836335l302340l5260315k8495324j4200599
$$ 20286585 60616016 149319354 210155689 206853349 171593034 143097710 128897111
42487A28897111q20475J4793694J6026371n227719j8516891K259288L0872150
$$ 128897111 128076636 142870330 158896701 153668982 135152091 137411379 168283529
42480A68283529K5370718j0466810m1521840n3097377m9591539k8337289L651797
$$ 168283529 193654247 183187437 141665597 88568220 38976681 10639392 14291189
42473A4291189J5128544l069745r541346J9781888L4491954j2395925o5871979
$$ 14291189 29419733 26349988 16808642 36590530 71082484 58686559 -7185420
42466g185420l6510745N1879771Q1582474J2841457o2156489o1621284j7700068
$$ -7185420 -43696165 8183606 89766080 102607537 40451048 -21170236 -38870304
42459c8870304L609300K364788P086060N163325k1200298l7006702j825189N3161801
$$ -38870304 -35261004 -32896216 -25810156 -20646831 -41847129 -78853831 -80679020 -27517219
42451b7517219N8899744N763050m6026684m9024185j8966252N82052n679221j2879879
$$ -27517219 31382525 37145575 -8881109 -57905294 -76871546 -76289494 -81968715 -94848594
42443i4848594Q905861M9976232O1480107J8348419l3416929l0432926J7428946
$$ -94848594 -85942733 -35966501 25513606 43862025 10445096 -19987830 -2558884
42436b558884M3247134K6918474J5022159K6957610K1360171j4087711k4042688
$$ -2558884 40688250 67606724 82628883 109586493 130946664 116858953 92816265
42429I2816265J2970946K8347888j9906611n3836494M524960Q4795507O0584445
$$ 92816265 105787211 134135099 114228488 60391994 64916954 149712461 210296906
42422B10296906m6875163r1080229k2142776M7858479K8892631k3946719k9166577
$$ 210296906 163421743 72341514 50198738 98057217 126949848 103003129 73836552
42415G3836552j1595825l1733430o2976370l9914191J7338856K8647249j4203111
$$ 73836552 62240727 30507297 -32469073 -72383264 -55044408 -26397159 -40600270
42408d0600270l6489032n972109K0334218L096915o485431M1841189R1539180
$$ -40600270 -77089302 -83061411 -62727193 -59630278 -66115709 -24274520 67264660
42401F7264660M7781131o7797783j20184308m0200754P6004643R7628854L0620912
$$ 67264660 115045791 47248008 -72936300 -113137054 -37132411 60496443 91117355
42394I1117355j6712240l951783K368359l8145216o7644275l2254976K4230730
$$ 91117355 74405115 70453332 72821691 34676475 -32967800 -65222776 -40992046
42387d0992046L1052475k862143k0702708j3202832j1395745j5619036m499381
$$ -40992046 -9939571 -12801714 -33504422 -46707254 -58102999 -73722035 -78221416
42380g8221416P251823o873221j9548533J4880093O8604234O6759594Q489467
$$ -78221416 -70969593 -77842814 -97391347 -82511254 -13907020 52852574 61342041
42373F1342041k3368976R421693M5749231K9887182o728038j3963175o504829
$$ 61342041 37973065 47394758 93143989 123031171 116303133 102339958 95835129
42366I5835129k1386678m1247556k2646652K6175206N0551338K1578636l4312218
$$ 95835129 74448451 33200895 10554243 36729449 87280787 108859423 74547205
42359G4547205p0529527o2516761k5244221M69855m946222q659857K6842296P2587392
$$ 74547205 4017678 -58499083 -83743304 -83273449 -88219671 -96879528 -70037232 2550160
42351B550160O3907579M426512l0057409q435533J3678833K009066O831560N9787793
$$ 2550160 66457739 70884251 40826842 32391309 46070142 48079208 54910768 114698561
42343A14698561R0924074L3218106n5321690p1164601j9245807J4618804R283358
$$ 114698561 205622635 238840741 183519051 112354450 93108643 107727447 117010805
42336A17010805J5631391L8445429K7368431j3917830k2690861M733435J96027
$$ 117010805 132642196 171087625 198456056 184538226 161847365 166580800 166776827
42329A66776827m6333084n5698712O11368L9932233Q710028j9499033L1137323
$$ 166776827 120443743 64745031 65356399 105288632 113998660 94499627 125636950
42322A25636950J01876410Q7361726J061452n0695165k5285965K1640044L8256615
$$ 125636950 227513360 314875086 315936538 265241373 239955408 261595452 299852067
42315B99852067K5603995m792396m2637723n3715722j5304393K9560337K3321746
$$ 299852067 325456062 320663666 278025943 224310221 209005828 238566165 261887911
42308B61887911j1236431n706533L3247504L0969603k1337774m2271670J096874
$$ 261887911 250651480 244944947 278192451 309162054 287824280 245552610 246649484
42301B46649484L1572275q264569n5856066l1987697K9366756M1911648M969751
$$ 246649484 278221759 269957190 214101124 182113427 211480183 253391831 258361582
42294B58361582j3402756R84981j397147l2108261m3898542j8589681L243625
$$ 258361582 244958826 245943807 244546660 212438399 168539857 149950176 153193801
42287A53193801k908894r223355N054665J8370187J3457395L310179j1248996
$$ 153193801 150284907 141061552 146116217 164486404 177943799 181253978 170004982
42280A70004982n1000734r7096613q3185233O483527Q5566828O9762552o906038
$$ 170004982 119004248 21907635 -61277598 -54794071 30772757 100535309 93629271
42273I3629271m1661882k944066M2482526L1692188k2949541o5926568n7331234
$$ 93629271 51967389 49023323 91505849 123198037 100248496 34321928 -23009306
42266b3009306J816739O5895907P0614528O69480p5328193p9082838k3301069
$$ -23009306 -21192567 44703340 115317868 115987348 40659155 -38423683 -61724752
42259f1724752J1545111m354119j7366965J2919249M8911856L8390415q720421
$$ -61724752 -50179641 -54533760 -71900725 -58981476 -10069620 28320795 19600374
42252A9600374m6248393n5845576m5489619j5576930L1120231O6738768O4526079
$$ 19600374 -26648019 -82493595 -127983214 -143560144 -112439913 -45701145 18824934
42245A8824934L4511416L636029k2374156m8064836n9263893l9467582r36133
$$ 18824934 53336350 56972379 34598223 -13466613 -72730506 -112198088 -113134221
42238a13134221L1196127N0027412N3782977K6672611k7727759n8742647k5957539
$$ -113134221 -81938094 -31910682 21872295 48544906 20817147 -37925500 -63883039
42231f3883039L1885989M2603566N069722j6888307k954747j496968k8809179
$$ -63883039 -31997050 10606516 15676238 -1212069 -4166816 -5663784 -34472963
42224c4472963k6572134L2657750P0209262O742560j01961713j22382603k4627071
$$ -34472963 -61045097 -28387347 41821915 48564475 -53397238 -175779841 -200406912
42217b00406912P6954929P9635264J7613184o677606L3346824O7643695L6294957
$$ -200406912 -123451983 -43816719 -26203535 -32881141 465683 68109378 104404335
42210A04404335l3481087o9588601m5099116j556184J1451144l995303q586556
$$ 104404335 70923248 1334647 -43764469 -45320653 -33869509 -37864812 -46451368
42203d6451368J3153412L2205780J9788655j2260326l2375506l1393389k0642965
$$ -46451368 -33297956 -1092176 18696479 6436153 -25939353 -57332742 -77975707
42196g7975707k101169K8741521N3970085M1073343r689438n2150861m6984488
$$ -77975707 -80076876 -51335355 2634730 43708073 34018635 -18132226 -65116714
42189f5116714j1424335M375372j6413050l6277579j4889227L2159113M4238450
$$ -65116714 -76541049 -72165677 -88578727 -124856306 -139745533 -107586420 -63347970
42182f3347970q609321p5525843p4620574M971993Q0673808P6133904J6106448
$$ -63347970 -71957291 -147483134 -222103708 -217131715 -136457907 -60324003 -44217555
42175d4217555j5159047P871348K9163499R205216j4721081K915811L6994213
$$ -44217555 -59376602 -51505254 -22341755 -13136539 -27857620 -24941809 12052404
42168A2052404L2183601p503716k7621689j0296288O536568P15065j209631J7623401
$$ 12052404 44236005 36732289 9110600 -1185688 5350880 6065945 4856314 22479715
42160B2479715K5733052j378348k8293377q733041L8393125N3370420K4189998
$$ 22479715 48212767 46834419 18541042 9808001 48201126 101571546 125761544
42153A25761544k554715q44402j106322k8023424n0735270l1401147Q964939J7630180
$$ 125761544 123206829 122362427 121256105 93232681 42497411 11096264 20061203 37691383
42145C7691383j1962671l4002573k0973397J941675O362829Q500062L8656895
$$ 37691383 25728712 -8273861 -29247258 -27305583 -20942754 -12442692 26214203
42138B6214203Q1445353Q0870437J0147139q4659050j25592709q3318080o128175
$$ 26214203 107659556 188529993 198677132 114018082 -11574627 -94892707 -101020882
42131a01020882L4290095J7444220j5965496k3603845r791451m006990j1592137
$$ -101020882 -66730787 -49286567 -65252063 -88855908 -98647359 -102654349 -114246486
42124a14246486j1499333M302204J8276259J8570926J7710537K9006790M3398945
$$ -114246486 -125745819 -121443615 -103167356 -84596430 -66885893 -37879103 5519842
42117E519842M2961854K4353341j435980k1151603k4424805j0634420L957891
$$ 5519842 48481696 72835037 71399057 50247454 25822649 15188229 19146120
42110A9146120J910688r398311q835260p7075o370094j9341309J809850N6132420
$$ 19146120 21056808 11658497 2823237 2746162 -3623932 -22965241 -21155391 34977029
42102C4977029P5373277J7413126n6686347n9627908k047934L1541985J3827994
$$ 34977029 110350306 127763432 71077085 11449177 9401243 40943228 54771222
42095E4771222l08736J8170288K6013557n035460l2710182j7794048J1636195
$$ 54771222 54462486 72632774 98646331 93610871 60900689 43106641 54742836
42088E4742836J6799521J1133259J4144169k621110n9646629j05602035q2606327
$$ 54742836 71542357 82675616 96819785 94198675 34552046 -71049989 -153656316
42081a53656316k1739722L982908k942073J9392380O8696172O6938409q420249
$$ -153656316 -175396038 -171413130 -174355203 -154962823 -86266651 -19328242 -27748491
42074b7748491o8796366l4892455N0036676Q1444967K9864090l6521954m8826465
$$ -27748491 -96544857 -131437312 -81400636 44331 29908421 -6613533 -55439998
42067e5439998j3224607J2468893o102903l9303812l0750137K6442347P2079290
$$ -55439998 -68664605 -56195712 -62298615 -101602427 -132352564 -105910217 -33830927
42060c3830927N6507750R838414n609524Q961060j874145m8242511p1559011l6167449
$$ -33830927 22676823 32515237 26905713 35866773 33992628 -14249883 -85808894 -121976343
42052a21976343J7204264L7961831L2320336K8317287K0755955o082221l4557033
$$ -121976343 -104772079 -66810248 -34489912 -6172625 14583330 8501109 -26055924
42045b6055924l5016052r511360J8551077L8561734N0064772M6766669K5724540
$$ -26055924 -61071976 -70583336 -52032259 -13470525 36594247 83360916 109085456
42038A09085456o794978m9246661r3928045r7820354j7772178J05004136J57339868
$$ 109085456 102290478 53043817 -40884228 -138704582 -156476760 -51472624 105867244
42031A05867244R0077428j4452650n6328492m1264553l2932412m1393266l6295235
$$ 105867244 195944672 181492022 125163530 83898977 50966565 9573299 -26721936
42024b6721936k5918876l5357054l5127563J8505176Q8834811R4194795L1702405
$$ -26721936 -52640812 -87997866 -123125429 -104620253 -15785442 78409353 110111758
42017A10111758k1684160l0412558l2262116m1801919j8116736M3472304P5027972
$$ 110111758 88427598 58015040 25752924 -16048995 -34165731 9306573 84334545
42010H4334545L4305590k9365862n0276695k9980997o874997N277355J0232007
$$ 84334545 118640135 89274273 38997578 9016581 2141584 7418939 17650946
42003A7650946N961036O96573J0820594K1968889K250179k9723836j5734870L8760985
$$ 17650946 23611982 24308555 35129149 57098038 59348217 29624381 13889511 52650496
41995E2650496M9358040j8084592q1895754o6092025j1747785O869170P364050
$$ 52650496 102008536 83923944 2028190 -64063835 -75811620 -68942450 -61578400
41988f1578400M5881178R1441049O4950428j8194232n4525606o579224M6213919
$$ -61578400 -15697222 75743827 140694255 122500023 67974417 61395193 107609112
41981A07609112L2713244j5728757l0957768m989100J9145491J2292566j9576627
$$ 107609112 140322356 124593599 93635831 88646731 107792222 120084788 100508161
41974A00508161n2816112o1652903l6129125K403710K1236275J4796944K465680
$$ 100508161 47692049 -13960854 -50089979 -47686269 -26449994 -11653050 -9187370
41967i187370p794201k3283774l5237126j9651917K1592163N0848955M0369537
$$ -9187370 -16981571 -40265345 -75502471 -95154388 -73562225 -22713270 17656267
41960A7656267Q628093p51927L2209434P8100720P9175306J0359040p5396737
$$ 17656267 26284360 25532433 57741867 135842587 215017893 225376933 149980196
41953A49980196r1818608k6389151L4964958K1455781k6950016k7366781K2097016
$$ 149980196 58161588 31772437 66737395 88193176 61243160 33876379 55973395
41946E5973395N5426331M9724981M2490098M7124757L5913852J3386064K1438366
$$ 55973395 111399726 161124707 203614805 250739562 286653414 300039478 321477844
41939C21477844N1315719L4604687m2861330r6540130o1644713J1010170L4553927
$$ 321477844 372793563 407398250 364536920 267996790 206352077 217362247 251916174
41932B51916174M899223k2713315k9677214l7556160m6663024l8926485k4938736
$$ 251916174 256815397 234102082 204424868 166868708 120205684 81279199 56340463
41925E6340463k8255937l4656759j2343211K5638761L2727311M83928k9286899
$$ 56340463 28084526 -6572233 -18915444 6723317 39450628 39934556 10647657
41918A0647657k5446196J500275K9674719M6306382L6640963o548644n5579621
$$ 10647657 -14798539 -13298264 16376455 62682837 99323800 92775156 37195535
41911C7195535o5341760k6394330K6559006N9321157O1926918L3404192j7444160
$$ 37195535 -28146225 -54540555 -27981549 31339608 93266526 126670718 109226558
41904A09226558n5339676m5522945n033372J4140750J238158q95042K5809639
$$ 109226558 53886882 8363937 3330565 17471315 18709473 17814431 43624070
41897D3624070L8345263O942515k5161905o205722L7261951L9002320k306171
$$ 43624070 81969333 88911848 63749943 57544221 94806172 133808492 131502321
41890A31502321k4135927l624681Q407929k3610284n8269119m3707569j068664
$$ 131502321 107366394 103741713 112149642 88539358 30270239 -13437330 -14505994
41883a4505994R423286j9667215l8577230j9114036J3004097K8336036K9611050
$$ -14505994 -5082708 -24749923 -63327153 -82441189 -69437092 -41101056 -11490006
41876a1490006K4285764M175862k4809968k9625652L021053L6277948L3029133
$$ -11490006 12795758 16971620 -7838348 -37464000 -34442947 1835001 34864134
41869C4864134R910157K559084J294998k6890522o5112580n6845681L771377N1265283
$$ 34864134 44774291 47333375 48628373 21737851 -43374729 -100220410 -96449033 -45183750
41861d5183750M1302938J1260357J3586456L4076668K5044737j0916743k6864894
$$ -45183750 -3880812 7379545 20966001 55042669 80087406 69170663 42305769
41854D2305769r048085O506487j740016r396221M803954J8801134K615554l2569737
$$ 42305769 33257684 39764171 38024155 28627934 33431888 52233022 54848576 22278839
41846B2278839n0494658m1069575k6694656k1160413r975279J9184729M6668512
$$ 22278839 -28215819 -69285394 -95980050 -117140463 -127115742 -107931013 -61262501
41839f1262501M1514929O637994j7845644m705370K2881147K1100746j5269584
$$ -61262501 -19747572 -13109578 -30955222 -35660592 -12779445 8321301 -6948283
41832f948283m5560860l5925947L242263L9687997N5819193M8434812J5069261
$$ -6948283 -52509143 -88435090 -85192827 -45504830 10314363 58749175 73818436
41825G3818436l3219490n9130085l1402919K9712927O6214934M8539210P114014
$$ 73818436 40598946 -18531139 -49934058 -20221131 45993803 94533013 101647027
41818A01647027j0402292N968875K8320400K9276961M900653k9842880n1708051
$$ 101647027 91244735 97213610 125534010 154810971 159711624 129868744 78160693
41811G8160693m1781656m649190K7388707K5640280M46586j1935444L92291J0013367
$$ 78160693 36379037 31729847 59118554 84758834 85205420 73269976 73662267 83675634
41803H3675634m478942k2516814j3896409J1355942J8522056M736167J35000J0291238
$$ 83675634 79196692 56679878 42783469 54139411 72661467 77397634 77532634 87823872
41795H7823872K819766l1153353m7789340j7115684J9762595Q116959l2962243
$$ 87823872 90643638 59490285 11700945 -5414739 14347856 22464815 -10497428
41788a0497428l8522417K23572K5884874R589475r526328J116738J4466143M00495
$$ -10497428 -49019845 -48796273 -22911399 -13321924 -22848252 -21731514 -7265371 -6864876
41780f864876j5432965L490196L5952690L0782668j4996232n2346208m7196615
$$ -6864876 -22297841 -18807645 17145045 47927713 32931481 -19414727 -66611342
41773f6611342j3461842J6999936K5687347J1207884j1136558j5097637R589207
$$ -66611342 -80073184 -63073248 -37385901 -26178017 -37314575 -52412212 -42823005
41766d2823005L9799670M5851493K6725035J896390j6710188k3942781j1489742
$$ -42823005 -3023335 42828158 69553193 71449583 54739395 30796614 19306872
41759A9306872J4118172K1632641n055904l3417453k3405381J3193818L2640227
$$ 19306872 33425044 55057685 50001781 16584328 -6821053 6372765 39012992
41752C9012992K3325974O557095j2265907m1141328n9052785l5509994P748314
$$ 39012992 62338966 68896061 56630154 15488826 -43563959 -79073953 -71325639
41745g1325639J7852412k41632J3359232O4513558P8602716K1261115l3651006
$$ -71325639 -53473227 -53714859 -40355627 24157931 102760647 124021762 90370756
41738I0370756j8080316J8187957p593199o7112128o3272966R038354N2143039
$$ 90370756 72290440 90478397 82885198 15773070 -47499896 -38461542 13681497
41731A3681497J8107459l0749996l7329495k8210881l2427667j1603171N9833387
$$ 13681497 31788956 1038960 -36290535 -64501416 -96929083 -108532254 -48698867
41724d8698867J14548301P8251901p338554l6569951O977773L8193247P661382
$$ -48698867 65849434 144101335 136762781 100192830 107170603 145363850 153025232
41717A53025232l7064025m4996491l5563845m1071565m0387463j124170N5389624
$$ 153025232 115961207 70964716 35400871 -5670694 -46058157 -47182327 8207297
41710H207297Q1863517O9363247M0443609L304427m2504768p3538992o1735564
$$ 8207297 90070814 159434061 199877670 203182097 160677329 87138337 25402773
41703B5402773j8457853J7857198L0459235K8659388J6889229k943073r590727
$$ 25402773 6944920 24802118 55261353 83920741 100809970 97866897 88276170
41696H8276170J4764945M5104260L8463317l898043l9739452m8945210m9352727
$$ 88276170 103041115 148145375 186608692 182710649 142971197 94025987 44673260
41689D4673260m8932949l0926194M092492K7779629K9150929K6750226K3258709
$$ 44673260 -4259689 -35185883 -31093391 -3313762 25837167 52587393 75846102
41682G5846102l602646m6121875n4437304j0158587L4102429K6988691q826818
$$ 75846102 72243456 26121581 -28315723 -38474310 -4371881 22616810 13789992
41675A3789992j8361968L684916J9182073J1904875n02727p675017j6903986k6005190
$$ 13789992 -4571976 -887060 18295013 30199888 29697161 22022144 5118158 -20887032
41667b0887032k0284379K278936K6733348M1611319M6872820M4298555L2078090
$$ -20887032 -41171411 -38892475 -12159127 29452192 76325012 120623567 152701657
41660A52701657P438304k5704868m5523915k3989504K6288882L9530280k1373897
$$ 152701657 160139961 134435093 88911178 64921674 91210556 130740836 109366939
41653A09366939q9472733p0640612J1700546M0871343j1513841l9161280J9288369
$$ 109366939 19894206 -50746406 -39045860 1825483 -9688358 -48849638 -29561269
41646b9561269P2275448L0239878l8419305k2953673M0941445L6470241l3173036
$$ -29561269 42714179 72954057 34534752 11581079 52522524 88992765 55819729
41639E5819729n7892015j2337834J3909749j7742833l8577626p441369K3734220
$$ 55819729 -2072286 -14410120 -500371 -18243204 -56820830 -64262199 -40527979
41632d0527979J6543468O715579J7078181J3261139j0074410J248688N5596637
$$ -40527979 -23984511 -17268932 -190751 13070388 2995978 4244666 59841303
41625E9841303P5033257J6300882n5694489p3717312o2291013o2520616m6513879
$$ 59841303 134874560 151175442 95480953 21763641 -40527372 -103047988 -149561867
41618a49561867J6916703Q1136986Q6721129N3858274L7231505L7322080K4678402
$$ -149561867 -132645164 -51508178 35212951 89071225 126302730 163624810 188303212
41611A88303212O019417l46054j2228941m4547116o5271663m9069646k9588033
$$ 188303212 194322629 193976575 181747634 137200518 71928855 22859209 -6728824
41604f728824l9917642n0003207k4901531N788815L010107q476622P556703K4385444
$$ -6728824 -46646466 -96649673 -121551204 -115762389 -112752282 -121228904 -113672201 -89286757
41596h9286757O456753j1955832J4997208N3928962M7587438J8604007K3871031
$$ -89286757 -82830004 -94785836 -79788628 -25859666 21727772 40331779 64202810
41589F4202810M2580944J2114983m9083342n8077276L365108O8458154Q6053158
$$ 64202810 106783754 118898737 69815395 11738119 15103227 83561381 169614539
41582A69614539N9536645K977642n6643760n7275093K5073238J05517217R1328138
$$ 169614539 229151184 232128826 175485066 118209973 143283211 248800428 340128566
41575C40128566K4219103R518480L6650250R471101o3733453p4104319j5061299
$$ 340128566 364347669 373866149 410516399 419987500 356254047 282149728 267088429
41568B67088429o479173p5497206r1986766L5653N8983128k8824596j46965618
$$ 267088429 260609256 185112050 93125284 93160937 152144065 123319469 -23646149
41561b3646149j20252912J9719084J00280387O7153422J5652025M87945k4212617
$$ -23646149 -143899061 -124179977 -23899590 43253832 58905857 59393802 35181185
41554C5181185p2074670p3725010L399310Q6502702R4294875L5491332k4534452
$$ 35181185 -36893485 -110618495 -107219185 -20716483 73578392 109069724 84535272
41547H4535272m4844588k7639748N789312L0812712L1261701J1451914r617437
$$ 84535272 39690684 12050936 17840248 48652960 79914661 91366575 81749138
41540H1749138j4750730J706433K3235979J0594737n3266584j12919387q7011558
$$ 81749138 66998408 68704841 91940820 102535557 49268973 -63650414 -150661972
41533a50661972J5361576Q4801315N3234906j6746650l3537851m652553M986541
$$ -150661972 -135300396 -50499081 2735825 -14010825 -47548676 -52201229 -47214688
41526d7214688j0839931r438837R360132Q869804m882484P832014L8389882L4478939
$$ -47214688 -58054619 -67493456 -58133324 -49263520 -54146004 -46313990 -7924108 26554831
41518B6554831j0288574m0981937k4657371R806983K4632165J6159875j205100
$$ 26554831 16266257 -24715680 -49373051 -39566068 -14933903 1225972 20872
41511B0872j1420519K544883L5941883M9670462K0166769j6638807j6362391M816457
$$ 20872 -11399647 -8854764 27087119 76757581 96924350 80285543 63923152 68739609
41503F8739609O350361l089974M026385K990064l8950608p3739037k9562967N5237775
$$ 68739609 75089970 71999996 76026381 79016445 40065837 -33673200 -63236167 -7998392
41495g998392O8116219k230678m5352580q064893K9401866L855667k5412617L458627
$$ -7998392 60117827 57887149 12534569 4469676 33871542 37727209 12314592 15773219
41487A5773219L6176546J269944n3858649l5422790M1142235P6440352L9292478
$$ 15773219 51949765 53219709 -638940 -36061730 5080505 81520857 120813335
41480A20813335n495292r914822L917822L619873j2855102m1557785p7717551
$$ 120813335 115318043 105403221 109321043 112940916 100085814 58528029 -19189522
41473a9189522r2024588n3701504J7480328O5157474O4588868M0924999K2991136
$$ -19189522 -111214110 -164915614 -147435286 -82277812 -17688944 23236055 46227191
41466D6227191J4025223M982076j1812375l5335765m3869584j3700531L1090231
$$ 46227191 60252414 65234490 53422115 18086350 -25783234 -39483765 -8393534
41459h393534K9776482k1581240m2854905J0720964O2061507K5265873m8244458
$$ -8393534 21382948 -198292 -43053197 -32332233 29729274 54995147 6750689
41452F750689m3632839L0899640N8436657Q519490j9975148K0545857M0803060
$$ 6750689 -36882150 -5982510 52454147 60973637 40998489 61544346 102347406
41445A02347406k4328282r0050965n3492339L8928711O6474897J6826771j8698209
$$ 102347406 78019124 -12031841 -65524180 -26595469 39879428 56706199 38007990
41438C8007990J414616K9515513L1569483K9201534L2237391J5082903k2631283
$$ 38007990 39422606 68938119 100507602 129709136 161946527 177029430 154398147
41431A54398147m2676967l3292575k5229067k6895904o289113M0447483O2629061
$$ 154398147 111721180 78428605 53199538 26303634 20014521 60462004 123091065
41424A23091065K7459235l1239328o5247052o5142989l4932640L0369620J02306708
$$ 123091065 150550300 119310972 54063920 -11079069 -46011709 -15642089 86664619
41417H6664619J10077063L1961670m6124015k9642209N5136959J01080953P1730865
$$ 86664619 196741682 228703352 182579337 152937128 208074087 309155040 380885905
41410C80885905L3172763L3371985L5047538j149114m1386036m0156086k3750908
$$ 380885905 414058668 447430653 482478191 481329077 439943041 399786955 376036047
41403C76036047m7218894r8796946j14931340p8504283l6109346j5576332P156519
$$ 376036047 328817153 230020207 115088867 36584584 475238 -15101094 -7944575
41396g944575M0323733M1229971r390282n0544567j8643932M9592032O0541518
$$ -7944575 32379158 73609129 64218847 13674280 -4969652 44622380 105163898
41389A05163898n86124m9218382k7779193J6625916J4594585k3000798l6300867
$$ 105163898 104577774 55359392 27580199 44206115 58800700 35799902 -500965
41382e00965j1957903J1527962J4279637J2453856J0858194o623846l3891553
$$ -500965 -12458868 -930906 13348731 25802587 36660781 30036935 -3854618
41375c854618l9431554j7726696J014817N817381K2636479N6856627O7226864
$$ -3854618 -43286172 -61012868 -59998051 -54180670 -31544191 25312436 92539300
41368I2539300L0396742j2592301j7667443p876846k8338645n9747640m3779559
$$ 92539300 122936042 110343741 92676298 84799452 56460807 -3286833 -47066392
41361d7066392J4068429L7850004q024606o2937360n6112575r67555L7754598
$$ -47066392 -32997963 4852041 -3172565 -66109925 -122222500 -123190055 -85435457
41354h5435457L8987622L9219718O2341418Q0301289N4431091r062597o0450633
$$ -85435457 -46447835 -7228117 55113301 135414590 189845681 180783084 120332451
41347A20332451n7501669q963926L4004405L1934432j247507k1027809j2759154
$$ 120332451 62830782 53866856 87871261 119805693 118558186 97530377 84771223
41340H4771223o622799k5287248m4466972l0036991M361367J2248969j5250972
$$ 84771223 78148424 52861176 8394204 -21642787 -17281420 -5032451 -20283423
41333b0283423k9685449Q561328O9121229Q2400909K4285515n3103549q0623309
$$ -20283423 -49968872 -41407544 27713685 110114594 134400109 81296560 673251
41326F73251m7004127l064756K595586k2897317l3940047p926492K6922453L1248748
$$ 673251 -46330876 -49395632 -46800046 -69697363 -103637410 -111563902 -84641449 -53392701
41318e3392701Q167396l418972J1130421J6793524j4949846m6685046j6519383
$$ -53392701 -45225305 -48644277 -37513856 -20720332 -35670178 -82355224 -98874607
41311i8874607N9758082Q3746578N940921q5500198p0763491L2472277Q8166675
$$ -98874607 -39116525 44630053 50570974 -34929224 -105692715 -73220438 14946237
41304A4946237L3923639l7272506k5912446L0110165L5293946m395298m193768
$$ 14946237 48869876 11597370 -14315076 15795089 51089035 46693737 42499969
41297D2499969M6581664O4049721R250331n1336239n4902037k6755242j2643168
$$ 42499969 89081633 153131354 162381685 111045446 56143409 29388167 16744999
41290A6744999j721908K6594255M0750761Q552688l4590747l7063538j6160125
$$ 16744999 15023091 41617346 82368107 90920795 56330048 19266510 3106385
41283C106385k1399234l9993528j8302935L4188393M7972294J0848952j627376
$$ 3106385 -18292849 -58286377 -76589312 -42400919 5571375 16420327 14792951
41276A4792951N1603369R5797189M0918856q0377649j44700042r5808946p889221
$$ 14792951 66396320 162193509 203112365 122734716 -21965326 -117774272 -125663493
41269a25663493K0676493j3590285l7752453r510122L7707593N2919589L1610421
$$ -125663493 -104987000 -118577285 -156329738 -165839860 -128132267 -75212678 -43602257
41262d3602257O204185j99135J2343563L4629162N0367368L7865342k270862l2627468
$$ -43602257 -37398072 -37597207 -25253644 9375518 59742886 97608228 95337366 62709898
41254F2709898k3079104L186985N807319m499381J3428016M8845251M4918335
$$ 62709898 39630794 42817779 48625098 44125717 57553733 106398984 151317319
41247A51317319k856586k8245148k476774J5187061j8287169m9227794j8862997
$$ 151317319 148460733 120215585 117738811 132925872 114638703 65410909 46547912
41240D6547912K8546921J5017159l9625646n0645535o193950K4157351P915648
$$ 46547912 75094833 90111992 50486346 -159189 -6353139 17804212 25719860
41233B5719860j6048446k1170080k2283937j6103579J8572020N0532663J7856277
$$ 25719860 9671414 -11498666 -33782603 -49886182 -31314162 19218501 37074778
41226C7074778n9770897q2973890j7649752N2996169N9899740L7632546L0144899
$$ 37074778 -22696119 -105670009 -123319761 -70323592 -10423852 27208694 57353593
41219E7353593L724674o7805816j13193378n7741683M6413160Q3303681L4317432
$$ 57353593 61078267 -6727549 -119920927 -177662610 -131249450 -47945769 -13628337
41212a3628337j5709284j2997595J3302505K6190530K6165364J7868642J90704
$$ -13628337 -29337621 -42335216 -29032711 -2842181 23323183 41191825 41382529
41205D1382529n214735K3690323N5680255L4844042l2599869p8862194o9181891
$$ 41382529 36167794 59858117 115538372 150382414 117782545 38920351 -30261540
41198c0261540l7374570j5990095P709822M2470029N4929792J8336822l5205165
$$ -30261540 -67636110 -83626205 -75916383 -33446354 21483438 39820260 4615095
41191D615095m7277320k520284N5721353O9492330J8845874n7294176r3290770
$$ 4615095 -42662225 -45182509 10538844 80031174 98877048 41582872 -51707898
41184e1707898o3766456j0058357J6870772J9428707K8947582M2201593L0432607
$$ -51707898 -115474354 -125532711 -108661939 -89233232 -60285650 -18084057 12348550
41177A2348550j173397j6754094r286906m494180o237841O871475K8080466K4611202
$$ 12348550 11175153 -5578941 -14865847 -19360027 -25597868 -18726393 9354073 33965275
41169C3965275K79623n181234J0437241N766151k1155547j8690330K1875461L5252365
$$ 33965275 34244898 29063664 39500905 45267056 24111509 5421179 27296640 62549005
41161F2549005q390632m1757011r566083L3635361J3455940l7841656l8284056
$$ 62549005 54158373 12401362 2835279 36470640 49926580 12084924 -26199132
41154b6199132N103304J8715493j469883J2459294O6259549P6662696O011924
$$ -26199132 -21095828 -2380335 -3850218 8609076 74868625 151531321 157543245
41147A57543245o9541782o9580142j4034887K7314630K8791648N288534l1863647
$$ 157543245 88001463 18421321 4386434 31701064 60492712 65781246 33917599
41140C3917599o4495974n5984666j425209M4390967L7198148R681416J7260666
$$ 33917599 -30578375 -86563041 -87988250 -43597283 -6399135 3282281 20542947
41133B0542947M6590287L7182702k1544108p3967693p6039538l8105009J0303172
$$ 20542947 67133234 104315936 82771828 8804135 -67235403 -105340412 -95037240
41126i5037240M8892070N4837131J3008039m5932737o0680919j4670638L7802105
$$ -95037240 -46145170 8691961 21700000 -24232737 -84913656 -99584294 -61782189
41119f1782189M2902008J3492555j482700J3690162L4392816L9480260K9149098
$$ -61782189 -18880181 -5387626 -6870326 6819836 41212652 80692912 109842010
41112A09842010Q007231j9098379l6241277k8184404o114467P75811j4911262
$$ 109842010 117849241 98750862 62509585 34325181 28210714 28986525 14075263
41105A4075263k7789493j8151616k456456p409668k5082374j9079457K1584599
$$ 14075263 -13714230 -31865846 -34322302 -41731970 -66814344 -85893801 -64309202
41098f4309202N8969917N3581799J8595391q95040L728273n023280m0719485n5401308
$$ -64309202 -5339285 48242514 66837905 65942865 69671138 64647858 23928373 -31472935
41090c1472935q719200N3930686M6188707m1008265j19122414j12222027m1171536
$$ -31472935 -40192135 13738551 59927258 18918993 -100203421 -212425448 -253596984
41083b53596984K2897655M5726286L8934372J8541028l018237m285307K4692511
$$ -253596984 -230699329 -184973043 -146038671 -127497643 -130515880 -134801187 -110108676
41076a10108676N8329206O3028817L8340831M309334l3718573p3346355q7178544
$$ -110108676 -51779470 11249347 49590178 53899512 20180939 -53165416 -140343960
41069a40343960n1949211L279463K5150731J0623475O309137K9834792M2580506
$$ -140343960 -192293171 -189013708 -163862977 -153239502 -146930365 -117095573 -74515067
41062g4515067J6345761j8778173j8654225J5993231M8941094N1910524K1511274
$$ -74515067 -58169306 -76947479 -95601704 -79608473 -30667379 21243145 42754419
41055D2754419k2869830m5485336k4993992J2238581K1057034N375519J3165338
$$ 42754419 19884589 -25600747 -50594739 -38356158 -17299124 -11923605 1241733
41048A241733N1363092O1934057J3983199l6008521k6134387J3345735P021925
$$ 1241733 52604825 114538882 128522081 92513560 66379173 79724908 86746833
41041H6746833m9071759q5043804o1396843j3503503J1182331P809895l439696
$$ 86746833 37675074 -47368730 -108765573 -122269076 -111086745 -103276850 -106716546
41034a06716546p191871N486214L1827168M7125624K9144829n672160j9770679
$$ -106716546 -113908417 -108422203 -76595035 -29469411 -324582 -5996742 -25767421
41027b5767421n589201J3036737K4039430L1594066K2427197k2075069p4142262
$$ -25767421 -31356622 -18319885 5719545 37313611 59740808 37665739 -36476523
41020c6476523p3415528j1983902M2118389L3780727q524177k4060196n184924
$$ -36476523 -109892051 -121875953 -79757564 -45976837 -54501014 -78561210 -83746134
41013h3746134J0602907Q995346J1728781K8107587L5950886J9205000l901189
$$ -83746134 -73143227 -64147881 -52419100 -24311513 11639373 30844373 26943184
41006B6943184m560656J8931365M0221523L7641633J7583575L55404j0584888
$$ 26943184 22382528 41313893 81535416 119177049 136760624 137116028 126531140
40999A26531140l0313396o0724179p7778310o4882262l8800899j9551131M630134
$$ 126531140 96217744 35493565 -42284745 -107167007 -145967906 -165519037 -160888903
40992a60888903M7831762P9176398N3067160j5840911n8396544m1169774l394221
$$ -160888903 -113057141 -33880743 19186417 3345506 -55051038 -96220812 -99615033
40985i9615033J1796287J4480545K9883602M7037217M2045449K1645379Q595659
$$ -99615033 -87818746 -73338201 -43454599 3582618 45628067 67273446 75869105
40978G5869105P569036J4416465L2099692M7303029K3350560m3288672q8418326
$$ 75869105 83438141 97854606 129954298 177257327 200607887 157319215 68900889
40971F8900889n3076482K6195869N4945563M292927n6665848n9202981j6331645
$$ 68900889 15824407 42020276 96965839 101258766 44592918 -14610063 -30941708
40964c0941708J3742311O305844j6377890k6985356j9429789j106158J9328523
$$ -30941708 -17199397 -10893553 -27271443 -54256799 -73686588 -74792746 -55464223
40957e5464223L3990447L6147359K4234868N336377q534313j2199092j3254388
$$ -55464223 -21473776 14673583 38908451 44244828 35710515 23511423 10257035
40950A0257035j8903479k1582430j2091300j529006n839067j0819622J1836759
$$ 10257035 -8646444 -30228874 -42320174 -43849180 -49688247 -60507869 -48671110
40943d8671110M6612421L7456197k6892702p5725594m5092651L2051495P3120669
$$ -48671110 -2058689 35397508 8504806 -67220788 -112313439 -80261944 -7141275
40936g141275N4827782J9663947l966561k3128114l1516016q288960K8832190
$$ -7141275 47686507 67350454 63383893 40255779 8739763 450803 29282993
40929B9282993L3694431P378733J217722K6698351K8444259k2577168p2766276
$$ 29282993 62977424 70356157 71573879 98272230 126716489 104139321 31373045
40922C1373045o6547650k7923493r332358o929930J2265406L6903459L3806323
$$ 31373045 -35174605 -63098098 -72430456 -79360386 -67094980 -30191521 3614802
40915C614802J9074898L4481939O4484952N0273120j0992172n1980236l5344870
$$ 3614802 22689700 57171639 121656591 171929711 160937539 108957303 73612433
40908G3612433k952204o59630j4119102j3498524q107404j3191103q137404K1656462
$$ 73612433 70660229 70000599 55881497 42382973 34275569 21084466 12947062 34603524
40900C4603524L9023756R021920l0198534j7057042K9216919K9168397k9270214
$$ 34603524 73627280 82649200 52450666 35393624 64610543 93778940 64508726
40893F4508726o2430599j7234650M5876104M5606973j178594j9246447K550329
$$ 64508726 2078127 -15156523 30719581 76326554 75147960 55901513 58451842
40886E8451842O400954k6944423m5090753j5795543J7053636P598061j4537815
$$ 58451842 64852796 37908373 -7182380 -22977923 -5924287 1673774 -12864041
40879a2864041N552138N2111807N4917969m342779n9643521n0965743k505549
$$ -12864041 -7311903 44799904 99717873 95375094 35731573 -15234170 -17739719
40872a7739719K0150726K554116q813721J8667696N8735852O7668892M1075194
$$ -17739719 2411007 4965123 -3848598 14819098 73554950 141223842 182299036
40865A82299036O199435k3197581n2321545p2429170o0499046k2212146J2451
$$ 182299036 188498471 165300890 112979345 40550175 -19948871 -42161017 -42148566
40858d2148566j4522645k8237099j788268L6510040K5989754l0134977n8948593
$$ -42148566 -56671211 -84908310 -86696578 -50186538 -24196784 -54331761 -113280354
40851a13280354j9304997M2076021O1422558M0739565K2752121J7524410K241859
$$ -113280354 -132585351 -90509330 -29086772 11652793 34404914 51929324 54171183
40844E4171183k2658876k6551601R00012L0826569L5279942J8529740n27413j4838097
$$ 54171183 31512307 4960706 5860718 36687287 71967229 90496969 89969556 75131459
40836G5131459k7091390l5684978l3374230j6295008O498509J2740386j1402072
$$ 75131459 48040069 12355091 -21019139 -37314147 -30815638 -18075252 -29477324
40829b9477324m3172532l6774304J7867185O9820301O6057291J9096780j4660325
$$ -29477324 -72649856 -109424160 -91556975 -21736674 44320617 63417397 48757072
40822D8757072r942784J0361211K2403799K2006591J121640m7523439r3844107
$$ 48757072 38814288 49175499 71579298 93585889 94707529 47184090 -46660017
40815d6660017q6988828k7615418K0020243J3058896j3957175r526669J7511861
$$ -46660017 -133648845 -161264263 -141244020 -128185124 -142142299 -151668968 -134157107
40808a34157107K3985896O467662o99587J3200405K3964643J8306323Q724672
$$ -134157107 -110171211 -103703549 -104403136 -91202731 -67238088 -48931765 -40207093
40801d0207093K820216l966106m615340J2042608K8913176J7510973q191161k534642
$$ -40207093 -37386877 -41352983 -45968323 -33925715 -5012539 12498434 4307273 1772631
40793A772631L4727911M6087593Q007236k1203565P408410M3984235J1267210
$$ 1772631 36500542 82588135 90595371 69391806 76800216 120784451 132051661
40786A32051661o5054937q2691406j6932809L9596365J6896361l3826070l2524107
$$ 132051661 66996724 -15694682 -32627491 6968874 23865235 -9960835 -42484942
40779d2484942M520926M712778l5161757m5834505p1187M4247469L0759646k0575490
$$ -42484942 -37964016 -33251238 -68412995 -114247500 -114318687 -70071218 -39311572 -59887062
40771e9887062m7959967k1041692L7297217P6230535N7427542l763590m0344464
$$ -59887062 -107847029 -128888721 -91591504 -15360969 42066573 38302983 -2041481
40764b041481j0170141L8436892K5566448m1592353p3595343l1226757K1077098
$$ -2041481 -12211622 26225270 51791718 10199365 -63395978 -94622735 -73545637
40757g3545637K3189980M840686J2645177K1251393r936178m3017549j0831294
$$ -73545637 -50355657 -45514971 -32869794 -11618401 -21554579 -64572128 -75403422
40750g5403422O7174326J02986346O4544317N146413k9959876n0836738o7235907
$$ -75403422 -8229096 94757250 159301567 164447980 134488104 83651366 16415459
40743A6415459n7157120j4703398K5522057L5060075K0391076o276444l8728066
$$ 16415459 -40741661 -55445059 -29923002 5137073 25528149 19251705 -19476361
40736a9476361n1463854j7379396L5562671M2882173j868612l1227367q058490
$$ -19476361 -70940215 -88319611 -52756940 -9874767 -11743379 -42970746 -51029236
40729e1029236J9731144P728897q482231J5213489L9810905J279405p3122412
$$ -51029236 -31298092 -23569195 -32051426 -16837937 22972968 24252373 -48870039
40722d8870039r1979246l5271641J8306744J2796000r035068J4330212O3031441
$$ -48870039 -140849285 -176120926 -157814182 -145018182 -154053250 -139723038 -76691597
40715g6691597O8254503J7950842k5118022j3710551J8943577Q719234m7911537
$$ -76691597 -8437094 9513748 -15604274 -29314825 -10371248 -1652014 -49563551
40708d9563551q6753029o0820611P0482L3348495K3664281P971633J1823119J8046236
$$ -49563551 -136316580 -197137191 -197066709 -163718214 -140053933 -132082300 -120259181 -102212945
40700a02212945M877941j6372679j8579619M877017L6495143N6819690N8692863
$$ -102212945 -97335004 -113707683 -132287302 -127410285 -90915142 -34095452 24597411
40693B4597411M4017936J3674722l3379716q1636564q7525611k0808930P1684971
$$ 24597411 68615347 82290069 48910353 -32726211 -120251822 -141060752 -69375781
40686f9375781R1069257J1687707o4631335l7259671N0982400P9261143K7092526
$$ -69375781 21693476 33381183 -31250152 -68509823 -17527423 61733720 88826246
40679H8826246j3555264K448877J7148572m642549j0095032K8626299M2860594
$$ 88826246 75270982 77719859 94868431 90225882 80130850 108757149 151617743
40672A51617743j6127222p9776883o9237589k3393522k2186336m6067388k1711996
$$ 151617743 135490521 55713638 -13523951 -36917473 -59103809 -105171197 -126883193
40665a26883193L7367141N1366180J0984636j6877767q821467n496889j6800615
$$ -126883193 -89516052 -38149872 -27165236 -44043003 -52864470 -58361359 -75161974
40658g5161974r175457J0621297J508556j6072141K1248309Q9026312P9659743
$$ -75161974 -84337431 -73716134 -72207578 -88279719 -67031410 21994902 101654645
40651A01654645k4418329r7641431n2801778K9101438L2534127j7674519j7373122
$$ 101654645 77236316 -20405115 -73206893 -44105455 -11571328 -29245847 -46618969
40644d6618969M1922295P2003166L7097349o53736R805454L6581395K3757945
$$ -46618969 -4696674 67306492 104403841 103750105 113555559 150136954 173894899
40637A73894899l3042660r0952651j04394013n5429984K9663240Q8275409P3617846
$$ 173894899 140852239 49899588 -54494425 -109924409 -80261169 8014240 81632086
40630H1632086M778993n5025818o7403502m4717114j5139992Q314651K3762592
$$ 81632086 86411079 31385261 -36018241 -80735355 -95875347 -87560696 -63798104
40623f3798104L2926945M2727122N4123708M8394998P181943n0308132p4473583
$$ -63798104 -30871159 11855963 65979671 114374669 121556612 71248480 -3225103
40616c225103m1506947J4632456M0035874J9372116j6828149l4504149k7286994
$$ -3225103 -44732050 -30099594 9936280 29308396 12480247 -22023902 -49310896
40609d9310896n825164K3002896N2129981O2444962L7474204r741672m3615428
$$ -49310896 -55136060 -32133164 19996817 82441779 119915983 110174311 66558883
40602F6558883m4261544k2992649O67339J5040329R058218j8051298l3452093
$$ 66558883 22297339 -695310 -27971 15012358 24070576 6019278 -27432815
40595b7432815l72861N2244414M4474067l4209721q0039680j4647472Q2971805
$$ -27432815 -27805676 24438738 68912805 34703084 -45336596 -59984068 22987737
40588B2987737P5996926k8202320q4313525j9168219P4371484Q4294443K1124196
$$ 22987737 98984663 70782343 -13531182 -32699401 41672083 125966526 147090722
40581A47090722l7773273o1165258n7894629k6159739K0823239K9932809k1485738
$$ 147090722 109317449 48152191 -9742438 -35902177 -15078938 14853871 -6631867
40574f631867o9517800m2551560L7458563R2958754R5343717O8481091K3119901
$$ -6631867 -76149667 -118701227 -81242664 11716090 107059807 175540898 198660799
40567A98660799l8156668p5007966m7381007J0131810K5054160o279329k0254343
$$ 198660799 160504131 85496165 38115158 48246968 73301128 67021799 46767456
40560D6767456N944286K2854845k046649l4926529m0243969l3416882l6790570
$$ 46767456 52711742 75566587 73519938 38593409 -1650560 -35067442 -71858012
40553g1858012l3507093k649983L4799375L9570897L283290m5894886o8252693
$$ -71858012 -105365105 -108015088 -73215713 -33644816 -30361526 -76256412 -144509105
40546a44509105l7185712L2541814P7738623M6412497k7864888n5855464j0378001
$$ -144509105 -181694817 -149153003 -71414380 -25001883 -52866771 -108722235 -119100236
40539a19100236L7633106K6642278p405665K342074M3665267M7619664J784002
$$ -119100236 -81467130 -54824852 -62230517 -59888443 -16223176 31396488 33180490
40532C3180490k7159429Q003776O8269368Q3255861L6573541k9946630p3329745
$$ 33180490 6021061 14024837 82294205 165550066 202123607 172176977 98847232
40525I8847232q1866534o2531181k6714142O739114J6008677j516605j9784505
$$ 98847232 16980698 -45550483 -72264625 -65525511 -49516834 -51033439 -70817944
40518g0817944j0347959K3000710M6006334L1426473j2794360n2257018n4803982
$$ -70817944 -81165903 -58165193 -12158859 19267614 6473254 -45783764 -100587746
40511a00587746j4076221M1430393O4783460L5401068j1151698k1268570N661888
$$ -100587746 -114663967 -73233574 -8450114 26950954 15799256 -5469314 192574
40504A92574J6249080j5482093m6060147l0899048L877736M726695k1055393j8759452
$$ 192574 16441654 959561 -45100586 -75999634 -72121898 -67395203 -88450596 -107210048
40496a07210048K2282661N2522722M3622669K7224662L3123064M1962650L0421203
$$ -107210048 -84927387 -32404665 11218004 38442666 71565730 113528380 143949583
40489A43949583J8897751L3324777N0663139K7831565l0287244p3019045p0194990
$$ 143949583 162847334 196172111 246835250 274666815 244379571 171360526 101165536
40482A01165536m2852716k5478543k4331058k1676660n413665J5153190K0198978
$$ 101165536 58312820 32834277 8503219 -13173441 -18587106 -3433916 16765062
40475A6765062N164934p563165N645488L2573240L4912445L293928k3697736j5642749
$$ 16765062 21929996 14366831 20012319 52585559 87498004 90791932 67094196 51451447
40467E1451447P22686j6451438n0810579m5655155L084866K6256599j7888612
$$ 51451447 52174133 35722695 -15087884 -60743039 -57658173 -31401574 -49290186
40460d9290186o7497875l4035305O5085470J14603864N2440290m5861662o8821255
$$ -49290186 -116788061 -150823366 -85737896 28865968 81306258 35444596 -33376659
40453c3376659j0358640M3824571M4177889K3621186J6554162K796456l8043003
$$ -33376659 -43735299 89272 44267161 67888347 84442509 87238965 49195962
40446D9195962p2309037n9075769j6351030O943932K278128j376996M888006L607785
$$ 49195962 -23113075 -82188844 -98539874 -91595942 -89317814 -90694810 -85806804 -82199019
40438h2199019m952114J380866K5837393M6699224N2793871M9133236L0489680
$$ -82199019 -87151133 -85770267 -59932874 -13233650 39560221 88693457 119183137
40431A19183137j0056837m8516783n1511821l1010446k6825128l1475019L845522
$$ 119183137 109126300 60609517 9097696 -21912750 -48737878 -80212897 -76367375
40424g6367375P0610410Q3062720K487220q1351685o1366639L4341813P9510019
$$ -76367375 -5756965 77305755 79792975 -1558710 -62925349 -28583536 50926483
40417E0926483K3551027n1303689n5572434k904695L6367532L5940885K0424573
$$ 50926483 74477510 23173821 -32398613 -35303308 1064224 37005109 57429682
40410E7429682M845124j8799415m2197770l5690300N144115M0566036L4315302
$$ 57429682 62274806 43475391 1277621 -34412679 -29268564 11297472 45612774
40403D5612774j82216k2513139j9343700j0254985q421038o746267l950483j0630274
$$ 45612774 45430558 22917419 3573719 -6681266 -15102304 -21848571 -25799054 -36429328
40395c6429328j8781612L24704M7087861P4564346M8818333J502798j4441919
$$ -36429328 -55210940 -54886236 -7798375 66765971 115584304 117087102 102645183
40388A02645183N51615M999245j3446419k8988595l0526735l2397484l3253530
$$ 102645183 103196798 108196043 94749624 65761029 35234294 2836810 -30416720
40381c0416720j5609047R118727P201278j6487020j7300749J5032495L5705427
$$ -30416720 -46025767 -36907040 -29705762 -46192782 -63493531 -48461036 -12755609
40374a2755609J8959773k426178M58531O151081n107503o511924K1782635M1641297
$$ -12755609 6204164 3777986 4236517 10387598 5280095 -1231829 20550806 62192103
40366F2192103J3663163l2585144m1722377j6782812l829973j5474975k5591480
$$ 62192103 75855266 43270122 1547745 -15235067 -19065040 -34540015 -60131495
40359f0131495k2506518j3550836Q321253M9285569P8686994O0454929J0031894
$$ -60131495 -82638013 -96188849 -87867596 -38582027 40104967 100559896 110591790
40352A10591790k8256057m4558635n2071065l5142773K2309676P1059518M0915997
$$ 110591790 82335733 37777098 -14293967 -49436740 -27127064 43932454 84848451
40345H4848451m5531886q5315046l8549295J9974837K1729467j016616J1783814
$$ 84848451 39316565 -45998481 -84547776 -64572939 -42843472 -43860088 -32076274
40338c2076274M6633194M8622698J0780121k6862786l9497327l1386386j1132208
$$ -32076274 14556920 63179618 73959739 47096953 7599626 -23786760 -34918968
40331c4918968P186470K036691k1830569k5365506O141876L1174971J6783854
$$ -34918968 -27732498 -25695807 -47526376 -72891882 -66750006 -35575035 -18791181
40324a8791181n423104K329521J1544161k0335509n9208205l8064607K4806007
$$ -18791181 -24214285 -21884764 -10340603 -30676112 -89884317 -127948924 -103142917
40317a03142917M1813887n419222l5589212j097134L6831965J4642842k8688136
$$ -103142917 -61329030 -66748252 -102337464 -103434598 -66602633 -51959791 -80647927
40310h0647927k1720928K0158735K5028426j6925700m4217750k3240903J4630383
$$ -80647927 -102368855 -82210120 -57181694 -74107394 -118325144 -141566047 -126935664
40303a26935664L6780433M5806596M2566520J2874240l0003163m2393899j3992762
$$ -126935664 -90155231 -44348635 -1782115 11092125 -18911038 -61304937 -75297699
40296g5297699J1297033L125961j2289145o330671J673612j1484764k0436879
$$ -75297699 -64000666 -60874705 -73163850 -79494521 -77820909 -89305673 -109742552
40289a09742552O484736M3890871M3647444J1815787l951630R960384K4486192
$$ -109742552 -103257816 -59366945 -15719501 -3903714 -7855344 2105040 26591232
40282B6591232K4269527J6932559n226463n1040810q1107188m1278739M5852689
$$ 26591232 50860759 67793318 62566855 11526045 -69581143 -110859882 -65007193
40275f5007193R1480134N9133779M878292k0647577l3817298m8594959k8374656
$$ -65007193 26472941 85606720 90485012 69837435 36020137 -12574822 -40949478
40268d0949478L5596177P0690686K2107138n0708796n6688474o779993J9806866
$$ -40949478 -5353301 65337385 87444523 36735727 -19952747 -26732740 -6925874
40261f925874N694828k058906M490002j1269414l7906303j8439775M1695112O2195726
$$ -6925874 -1231046 -3289952 1200050 -10069364 -47975667 -66415442 -24720330 37475396
40253C7475396R766721m9008906m8740558o869593K9102034M7217755M6682179
$$ 37475396 47242117 -1766789 -50507347 -57376940 -28274906 18942849 65625028
40246F5625028J3279930l8072256n4389991k0521405J1735668J0257622J4601552
$$ 65625028 78904958 40832702 -13557289 -34078694 -22343026 -12085404 2516148
40239B516148N1487139O6983304J4287898m8808502l7434619K4929580M3128348
$$ 2516148 54003287 120986591 135274489 86465987 49031368 73960948 117089296
40232A17089296J487786k1173712R789721K8163638k0642731q8043791r1072183
$$ 117089296 118577082 97403370 107193091 135356729 114713998 26670207 -64401976
40225f4401976k3948618M5153274O1120253K9567932o507827j2179351R537699
$$ -64401976 -88350594 -43197320 17922933 47490865 40983038 28803687 38341386
40218C8341386K2924542L936485k4566470k4397961k217577m45310k5265280l0393508
$$ 38341386 61265928 65202413 40635943 16237982 14020405 13575095 -11690185 -42083693
40210d2083693P761818M3488478K5741542k4555462m5145466k0439413Q471912
$$ -42083693 -34321875 9166603 34908145 10352683 -34792783 -55232196 -46760284
40203d6760284J4569259J6223925K8627706K9171475j784695l5598530k6179622
$$ -46760284 -32191025 -15967100 12660606 41832081 40047386 4448856 -21730766
40196b1730766K5102439O6917957O0133401J7197698k4273564m3360577m0920009
$$ -21730766 3371673 70289630 130423031 147620729 123347165 79986588 39066579
40189C9066579k2975116L189857K5330065L3197462K6842692J3074665N26030
$$ 39066579 16091463 19281320 44611385 77808847 104651539 117726204 118252234
40182A18252234j421982N789475j377308m2167301q6399663p2836955L183005
$$ 118252234 116830252 122619727 121242419 79075118 -7324545 -80161500 -76978495
40175g6978495N9586351K8456376m3866180n6349872L703906M6540178J3008108
$$ -76978495 -17392144 11064232 -32801948 -89151820 -85447914 -38907736 -25899628
40168b5899628m7310490n5670776n499762M9831601O8899974M8734704J0860651
$$ -25899628 -73210118 -128880894 -134380656 -84549055 -15649081 33085623 43946274
40161D3946274j2348985l754070J1071311m361327l1341458j3332294M5794193
$$ 43946274 31597289 27843219 38914530 34553203 3211745 -10120549 35673644
40154C5673644O7152041J4149399m4297242l9390346o164813j3528908m7074764
$$ 35673644 102825685 116975084 72677842 33287496 27122683 13593775 -33480989
40147c3480989m4425652o335460J6647709K0867151M1289796O3440441L8119768
$$ -33480989 -77906641 -84242101 -67594392 -46727241 -5437445 58002996 96122764
40140I6122764k0223918m3366757k2410459j7893834m4577083m3768387K021374
$$ 96122764 75898846 32532089 10121630 -7772204 -52349287 -96117674 -94096300
40133i4096300K4227339j5948503n4233603k5219016L5714930N8104660M2285882
$$ -94096300 -69868961 -85817464 -140051067 -165270083 -129555153 -71450493 -29164611
40126b9164611K9133442J5305021k4304017o4628046n7885201j4280771J2974410
$$ -29164611 -31169 15273852 -9030165 -73658211 -131543412 -145824183 -132849773
40119a32849773J2149937J9616342M6292123N6483470K7388448j5952082l5493610
$$ -132849773 -120699836 -101083494 -54791371 1692099 29080547 13128465 -22365145
40112b2365145j9078004J8524756M8271490M3966147R910416j6729923j2211172
$$ -22365145 -41443149 -22918393 25353097 69319244 79229660 62499737 50288565
40105E0288565J512335m222804j6265747n393274J9311384K3654206K786746j9049738
$$ 50288565 51800900 47578096 31312349 25919075 45230459 68884665 71671411 52621673
40097E2621673l1957712m0681576l2357475P038433M8090970M1374672r334237
$$ 52621673 20663961 -20017615 -52375090 -45336657 2754313 44128985 34794748
40090C4794748m5123440l2784304k429269Q265436K532555k015045p737767j9417407
$$ 34794748 -10328692 -43112996 -45542265 -37276829 -34744274 -36759319 -44497086 -63914493
40082f3914493k3825663j1495332N889585J9656470M0319289O9430977Q0274959
$$ -63914493 -87740156 -99235488 -93345903 -73689433 -33370144 36060833 116335792
40075A16335792N0480915m245714m8812292o4912073n3939263k4916692L112261
$$ 116335792 166816707 162570993 113758701 48846628 -5092635 -30009327 -26897066
40068b6897066P975991o789395r807394J2687582L2028841K0677351l055049m087668
$$ -26897066 -18921075 -25710470 -35517864 -22830282 9198559 29875910 26820861 22733193
40060B2733193J4516148K0478874L926786j6138393l0723462m8826243o4883504
$$ 22733193 37249341 57728215 61655001 45516608 14793146 -34033097 -98916601
40053i8916601n3670057q327348M2564139O6529681N6509894K4463143j1013176
$$ -98916601 -152586658 -160914006 -118349867 -51820186 4689708 29152851 18139675
40046A8139675k5626826n908442K2946204J2717545m5029608r4232249p7328131
$$ 18139675 -7487151 -13395593 9550611 22268156 -22761452 -116993701 -194321832
40039a94321832q086121M5274587M2435834J0131481j659593K0274278M5628140
$$ -194321832 -202407953 -157133366 -114697532 -104566051 -106225644 -85951366 -40323226
40032d0323226M2213954J3809805n961799J998624J2683702j0129504n2768755
$$ -40323226 1890728 15700533 9738734 11737358 24421060 14291556 -38477199
40025c8477199n5903987K170343N9722722M6357873j8764894n1635333j6756383
$$ -38477199 -94381186 -92210843 -32488121 13869752 -4895142 -56530475 -73286858
40018g3286858L7696887O0214960N3555898L5608236J304311m2995800n7325209
$$ -73286858 -35589971 24624989 78180887 113789123 115093434 72097634 14772425
40011A4772425k3594489J6647467K3458144J6676987K2738361R512810n3499910
$$ 14772425 -8822064 7825403 31283547 47960534 70698895 80211705 26711795
40004B6711795j06060840o2290387M5516097Q8981146K5092700m2873130k4147069
$$ 26711795 -79349045 -141639432 -96123335 -7142189 17950511 -24922619 -49069688
39997d9069688L2427124L3680807j1182859k3701852J0407370L0115615M247785
$$ -49069688 -16642564 17038243 5855384 -17846468 -7439098 22676517 26924302
39990B6924302l0623479l8498789k7607526j7484908j0959144p770505q250073
$$ 26924302 -3699177 -42197966 -69805492 -87290400 -98249544 -106020049 -114270122
39983a14270122N57467K8307352N1408318L5844359q738124l3238810j1728895
$$ -114270122 -113712655 -85405303 -33996985 1847374 -6890750 -40129560 -51858455
39976e1858455L1172067N8796432N9452925M2557083K4227128J7574201J5058236
$$ -51858455 -20686388 38110044 97562969 140120052 164347180 181921381 196979617
39969A96979617j1763456o7974268j04457721p0191605J2030257O4924271N0326863
$$ 196979617 185216161 117241893 12784172 -57407433 -45377176 19547095 69873958
39962F9873958J437546l7157696n3411759m5584569p289757M5084500O9642027
$$ 69873958 71311504 34153808 -19257951 -64842520 -72132277 -27047777 42594250
39955D2594250M5916031j967529l8770451m6152132j7156418L6158022O6753085
$$ 42594250 88510281 86542752 47772301 1620169 -15536249 20621773 87374858
39948H7374858L4202234k7587635l8255710J6310008N6946295K3881692m1518282
$$ 87374858 121577092 93989457 55733747 72043755 128990050 152871742 111353460
39941A11353460o5432585l9109013l247242J7668668J6874548j5556278o3228150
$$ 111353460 45920875 6811862 3564620 21233288 38107836 22551558 -40676592
39934d0676592p2959850k7695302J0816519p527720l1102955J6218737J01374524
$$ -40676592 -113636442 -141331744 -130515225 -138042945 -169145900 -152927163 -51552639
39927e1552639J18265955M6021215k3521181k4740734M930032J0016693m812392
$$ -51552639 66713316 112734531 89213350 64472616 69402648 79419341 74606949
39920G4606949j9070319m4975953q1333134p8933832j1296445O2453041O6112434
$$ 74606949 55536630 10560677 -70772457 -149706289 -161002734 -98549693 -32437259
39913c2437259J1232000k3513121k092290L4320885L9329179J8135788R53341
$$ -32437259 -21205259 -44718380 -46810670 -12489785 26839394 44975182 45928523
39906D5928523l781699q349071j5270859r395234J6530874L8402145J9826085
$$ 45928523 42146824 33797753 18526894 9131660 25662534 64064679 83890764
39899H3890764l5527230o9044977l3615279L4811386N4353178R094612k7797045
$$ 83890764 48363534 -20681443 -54296722 -19485336 34867842 43962454 16165409
39892A6165409m351180L1863465J1747497m3330829n4283014p533122K9233458
$$ 16165409 11814229 43677694 55425191 12094362 -42188652 -49721774 -20488316
39885b0488316J7623020J829937K4869321N3999170L6148335j4904440m1715085
$$ -20488316 -2865296 -1035359 23833962 77833132 113981467 99077027 57361942
39878E7361942l0393064j9222687k8298700l4978345k5454700j9771758k6266795
$$ 57361942 26968878 7746191 -20552509 -55530854 -80985554 -100757312 -127024107
39871a27024107j5722045K8344622O8472115O0480036J8152823r085054n715020
$$ -127024107 -142746152 -114401530 -45929415 14550621 32703444 23618390 17903370
39864A7903370M956087J1685962K1639217K1379425j2494405n6903036n4506021
$$ 17903370 22859457 34545419 56184636 77564061 65069656 8166620 -46339401
39857d6339401j369244L4597370J1849399k5057493k3944442n454861q643140
$$ -46339401 -47708645 -13111275 -1261876 -26319369 -50263811 -55718672 -64361812
39850f4361812r974751K6588257N8281129J5990877o8189122q5423448j0029308
$$ -64361812 -74336563 -47748306 10532823 26523700 -41665422 -127088870 -137118178
39843a37118178O1144544N5351759J8123704J6106482L0419378J3546217j3326319
$$ -137118178 -75973634 -20621875 -2498171 13608311 44027689 57573906 44247587
39836D4247587o15806L2613604K4041712k7065253n4800374k5488221K0216471
$$ 44247587 43631781 76245385 100287097 73221844 18421470 -7066751 13149720
39829A3149720L2080792P712424k6278935n0922263n8274021m5769099j9856005
$$ 13149720 45230512 52942936 26664001 -24258262 -82532283 -128301382 -148157387
39822a48157387R144799L6684586N7243009N9303437M4600083L6817831M7618729
$$ -148157387 -139012588 -102328002 -45084993 14218444 58818527 95636358 143255087
39815A43255087N0225050J5165708m2229052q0403722q3511827o3029325k4562633
$$ 143255087 193480137 208645845 166416793 86013071 2501244 -60528081 -85090714
39808h5090714K6415716N7353401L3652512k8290082p1880769o6292168k9295721
$$ -85090714 -58674998 -1321597 32330915 4040833 -67839936 -134132104 -163427825
39801a63427825J0575089L6811413L5166451N048005j8724950O76938M3844203
$$ -163427825 -152852736 -116041323 -80874872 -75826867 -94551817 -93874879 -50030676
39794e0030676N4115434J8416497j7677409k1569547r649299j333934Q585609
$$ -50030676 4084758 22501255 4823846 -16745701 -26395000 -27728934 -19143325
39787a9143325J4437934p237116m3638206m0986620J1569609M7636677J8287455
$$ -19143325 -4705391 -11942507 -55580713 -96567333 -84997724 -37361047 -19073592
39780a9073592k7432767j2769503N1857518Q5290419M7089600k3012208o6328619
$$ -19073592 -46506359 -59275862 -7418344 77872075 124961675 101949467 35620848
39773C5620848n8508325j0837896L8307305M1679977o698602m8917920l0189318
$$ 35620848 -22887477 -33725373 4581932 46261909 39563307 -9354613 -39543931
39766c9543931K4015567M2728434J0510561j8854205q406473J6704468K0593559
$$ -39543931 -15528364 27200070 37710631 18856426 10449953 27154421 47747980
39759D7747980M370447j5623056l5693764m8474080l3051692J2409510N1649465
$$ 47747980 52118427 36495371 801607 -47672473 -80724165 -68314655 -16665190
39752a6665190M7877957O749314l3471193m2941618k2011937O304828J9246818
$$ -16665190 31212767 37962081 4490888 -38450730 -60462667 -54157839 -34911021
39745c4911021J7411731K0950744L2349127K0549798l0568810p5796505n6009623
$$ -34911021 -17499290 3451454 35800581 56350379 25781569 -50014936 -106024559
39738a06024559J2449474M8092005J4548146l0504221j9223509L9032701Q5006931
$$ -106024559 -93575085 -45483080 -30934934 -61439155 -80662664 -41629963 43376968
39731D3376968Q6250500N1368305j203691m9585179o5064837l9746120m896139
$$ 43376968 129627468 180995773 179792082 130206903 65142066 25395946 20499807
39724B0499807O588212R34680J590292P029870P37571j4503890k2826327j9369255
$$ 20499807 27088019 28022699 29612991 36642861 37380432 22876542 50215 -19319040
39716a9319040j821276L6669488P3384320M9283612n0701761j37667433j08691663
$$ -19319040 -21140316 15529172 88913492 138197104 87495343 -50172090 -158863753
39709a58863753J1210168R0112393N9600900r048033k1122195K1174295N5186357
$$ -158863753 -147653585 -57541192 2059708 -6988325 -28110520 -6936225 48250132
39702D8250132N3420991K9351698o654129m0050413l4723703J8609212O1287823
$$ 48250132 101671123 131022821 124368692 84318279 49594576 68203788 129491611
39695A29491611L3128781l6819647o5503409l1852507L608288o367726m2373914
$$ 129491611 162620392 125800745 60297336 28444829 32053117 25685391 -16688523
39688a6688523o7174313o9505750m5752338N325555N0716270M2454315o182723
$$ -16688523 -83862836 -153368586 -199120924 -193795369 -143079099 -100624784 -106807507
39681a06807507k0536066K6941490O6770885L6460218k1775846k8508525J3433361
$$ -106807507 -127343573 -100402083 -33631198 2829020 -18946826 -47455351 -34021990
39674c4021990L9505620L0901082K1461226J5850898j3603683n0494176m0747988
$$ -34021990 5483630 36384712 57845938 73696836 60093153 9598977 -31149011
39667c1149011J1097521L3652762O38124k8299730j3144166k39393l2030257o2999296
$$ -31149011 -20051490 13601272 14239396 -14060334 -27204500 -27443893 -59474150 -122473446
39659a22473446l4894576K0911270L4433623J0024203O718953L1524369L5299049
$$ -122473446 -157368022 -136456752 -102023129 -91998926 -85279973 -53755604 -18456555
39652a8456555N056317j7650472j1575195N80352P533088K2910465L8162813K7791099
$$ -18456555 -13400238 -31050710 -42625905 -42045553 -34512465 -11602000 26560813 54351912
39644E4351912Q827917K5587924O2869255N0384126k1459222o7955931l3276984
$$ 54351912 63179829 88767753 151637008 202021134 180561912 112605981 79328997
39637G9328997K3837072K1581416k8077633n7042852m7555866l2283318k1546440
$$ 79328997 103166069 124747485 96669852 39627000 -7928866 -40212184 -61758624
39630f1758624J12838K3642806K4693817J2646990J6237494K9525829K2390253
$$ -61758624 -61645786 -38002980 -13309163 -662173 15575321 45101150 67491403
39623F7491403l900670j9601996j6352684q312948M725763K6095145K6831329
$$ 67491403 63590733 43988737 27636053 19323105 24048868 50144013 76975342
39616G6975342k1556504q4756568r5415781m6322059M036123K1865755L1513704
$$ 76975342 55418838 -29337730 -124753511 -171075570 -167039447 -145173692 -113659988
39609a13659988M8611740M6725304J6127514l234096J7867151N0264271N1276191
$$ -113659988 -65048248 -18322944 -2195430 -5429526 12437625 62701896 113978087
39602A13978087J8501324k6845888o8664402q2806446m2254241L1490385O7040724
$$ 113978087 132479411 105633523 36969121 -45837325 -88091566 -56601181 10439543
39595A0439543L1196362k2397854l0749230m160908J2803848J7405021K8625563
$$ 10439543 41635905 19238051 -11511179 -15672087 -2868239 14536782 43162345
39588D3162345K9433379l826740m0331494l2800792k84121j485785l3180691l0697074
$$ 43162345 72595724 68768984 28437490 -4363302 -4647423 -6133208 -39313899 -70010973
39580g0010973K3813234O7208813N0640830M982196j8201679j6323721j2380614
$$ -70010973 -46197739 21011074 71651904 76634100 58432421 42108700 29728086
39573B9728086q497050j178956o480291l1454823m8516560l3819438o989948K087336
$$ 29728086 21231036 20052080 13571789 -17883034 -66399594 -100219032 -107208980 -105121644
39565a05121644L899746K8000073O5130297P0500530K4042257m1945119p7565222
$$ -105121644 -101221898 -73221825 -8091528 62409002 86451259 44506140 -33059082
39558c3059082n8382801K446436O3642393P8918806L2928087l9051484p9857084
$$ -33059082 -91441883 -88995447 -25353054 53565752 86493839 47442355 -32414729
39551c2414729o4494261j9287890J3702264K2612907K8594257M4328051M4807584
$$ -32414729 -96908990 -116196880 -102494616 -79881709 -51287452 -6959401 37848183
39544C7848183O72069o1710354p1208289o975987N4094952L2368418l8309789
$$ 37848183 38520252 -23190102 -94398391 -101374378 -47279426 -14911008 -53220797
39537e3220797n5383897J818143M7548451K8239244l191975R131489L2814460
$$ -53220797 -108604694 -106786551 -59238100 -30998856 -34190831 -25059342 7755118
39530G755118K3597006J5040670M5323719N9289920q076496r4741708q3522299
$$ 7755118 31352124 46392794 91716513 151006433 142929937 48188229 -35334070
39523c5334070P418387M1479261j8985555n4047870R963020P5489336L6473598
$$ -35334070 -27915683 13563578 -5421977 -59469847 -49506827 25982509 62456107
39516F2456107m8463323n6905968N466551L6626809R457454j3419874q262560
$$ 62456107 13992784 -42913184 -37446633 -819824 8637630 -4782244 -13044804
39509a3044804j1526326k0630395Q152769N3629899L6608548m0894324p3778431
$$ -13044804 -24571130 -45201525 -37048756 16581143 53189691 12295367 -61483064
39502f1483064j5455104M1997546J3103632m6592034l5135950L5768164P0781218
$$ -61483064 -76938168 -34940622 -21836990 -68429024 -103564974 -67796810 2984408
39495B984408L8826617l885930j8250756k0808222k1283395j536600L2319415
$$ 2984408 41811025 37925095 19674339 -1133883 -22417278 -23953878 8365537
39488H365537M2217921J7784597q939306j8782511k4575725k7074359p851027
$$ 8365537 50583458 68368055 59428749 40646238 16070513 -11003846 -18854873
39481a8854873J9771629J1685120l1071063m5238442P54325M9352166L6697587
$$ -18854873 916756 12601876 -18469187 -63707629 -62953304 -13601138 23096449
39474B3096449j2511811k9517261o856530O328721k958916O358105M9175991P7950498
$$ 23096449 10584638 -18932623 -25789153 -19460432 -22419348 -16061243 33114748 111065246
39466A11065246N0492846r038502m4724722l6903951j1405053O28242p857128
$$ 111065246 161558092 152519590 107794868 70890917 59485864 60114106 52256978
39459E2256978j9571762j1132284J7854723L2833189K055653n1941877o8999543
$$ 52256978 32685216 21552932 39407655 72240844 74296497 22354620 -46644923
39452d6644923k9784033J6980509K6357538J9526711L7502277O2379522L8714141
$$ -46644923 -76428956 -59448447 -33090909 -13564198 23938079 86317601 125031742
39445A25031742l4495574q8498220p3548564j8218860K0339120K7308918K3141923
$$ 125031742 90536168 2037948 -71510616 -89729476 -69390356 -42081438 -18939515
39438a8939515J6316039N17601j6476460j6838175j202127J4343741K4815327
$$ -18939515 -2623476 -2105875 -18582335 -35420510 -36622637 -22278896 2536431
39431B536431L2772380K4583557j4350427n8070798n3692367N576770N5441556
$$ 2536431 35308811 59892368 45541941 -12528857 -66221224 -60644454 -5202898
39424e202898L7985042k0359467m4818421j2386311K6508738K7055188O470821
$$ -5202898 32782144 12422677 -32395744 -44782055 -18273317 8781871 15252692
39417A5252692J786165P205458j0030349m7438482o0840377k3863197L6177694
$$ 15252692 17038857 24244315 14213966 -33224516 -94064893 -117928090 -81750396
39410h1750396P3088284P0099456M0359722O51528l4426769m7089341l1928416
$$ -81750396 -8662112 61437344 101797066 102448594 68021825 20932484 -10995932
39403a0995932j2175849j5435175l3125234k9137122O510421L8789259L4379775
$$ -10995932 -23171781 -38606956 -71732190 -100869312 -94358891 -55569632 -21189857
39396b1189857M721325j3721560l881392K3530393M8063821M8674874J5180669
$$ -21189857 -16468532 -30190092 -34071484 -10541091 37522730 86197604 101378273
39389A01378273k8093029l3159471Q530820L8876355R150976m0897335l7390730
$$ 101378273 73285244 40125773 48656593 87532948 96683924 55786589 18395859
39382A8395859Q059924Q613689n7058681r5725419l2644960P5167768J18939272
$$ 18395859 26455783 35069472 -21989209 -117714628 -150359588 -75191820 43747452
39375D3747452P8949549J6040247l5238092q0796959r8112488m8547308L6210719
$$ 43747452 122697001 138737248 103499156 22702197 -75410291 -123957599 -87746880
39368h7746880O8096399K6085707j2584129L996767K5880815k406564m1388930
$$ -87746880 -19650481 6435226 -6148903 -2152136 23728679 21322115 -20066815
39361b0066815k4777664K3515617K5856860k0818527l9413668N266243N6118058
$$ -20066815 -44844479 -21328862 4527998 -16290529 -55704197 -50437954 5680104
39354E680104N2782060Q559981k7417333l5415817k3643245j027905J8545066
$$ 5680104 58462164 67022145 39604812 4188995 -19454250 -20482155 -1937089
39347a937089J5094969p162401j4382047P725568K6048347Q278035k6885996l9176698
$$ -1937089 13157880 5995479 -8386568 -661000 25387347 33665382 6779386 -32397312
39339c2397312k4302459p249989L433604J5286689J8842578p97690k3021804q348798
$$ -32397312 -56699771 -63949760 -60516156 -45229467 -26386889 -27184579 -50206383 -58555181
39331e8555181L7184097N8061410K5652124k0755798l2309901j5304923o833869
$$ -58555181 -21371084 36690326 62342450 41586652 9276751 -6028172 -12862041
39324a2862041j3044207r708106R213013K0226323O140097k2832774m3561858
$$ -12862041 -25906248 -35614354 -26401341 -6175018 -34921 -22867695 -66429553
39317f6429553l7861516k787829L8792836M9994183K4656253M566271K2051712
$$ -66429553 -104291069 -107078898 -68286062 -18291879 6364374 10930645 32982357
39310C2982357M3440958J3741820n3246063q5575205n7703950k3532186k5025617
$$ 32982357 76423315 90165135 36919072 -48656133 -106360083 -129892269 -154917886
39303a54917886k8828757P451599N7454513O6351625L2757627k805132k3624917
$$ -154917886 -183746643 -176295044 -118840531 -52488906 -19731279 -22536411 -46161328
39296d6161328l7190416l3837894m152554J9025356j148998l4718393j8793335
$$ -46161328 -83351744 -117189638 -121342192 -102316836 -103465834 -138184227 -156977562
39289a56977562L9550224O5576816L1913417k572981O710503K2603533l047l4845034
$$ -156977562 -117427338 -51850522 -19937105 -22510086 -15799583 6803950 6800903 -28044131
39281b8044131l1464041M350266L0897777L5887068L0850252J2444403j9218017
$$ -28044131 -59508172 -55157906 -24260129 11626939 42477191 54921594 35703577
39274C5703577l3197698j2562790K098491k5698598n1035414p986376O7345202
$$ 35703577 2505879 -10056911 -7958420 -33657018 -84692432 -92678808 -25333606
39267b5333606O5414841l1135700j01395489n1612992M7155338N7866191l0291940
$$ -25333606 40081235 8945535 -92449954 -144062946 -96907608 -39041417 -69333357
39260f9333357r2431728m4008450N2073973Q2041591K8067191l1193125l8109381
$$ -69333357 -161765085 -205773535 -153699562 -71657971 -43590780 -74783905 -112893286
39253a12893286j4024448K257237J5400736M1361172N7365570L3915895o828385
$$ -112893286 -126917734 -124660497 -109259761 -67898589 -10533019 23382876 16554491
39246A6554491k0215299j4035076l0941323n8604486l4295616M2472082Q4222318
$$ 16554491 -3660808 -17695884 -48637207 -107241693 -141537309 -99065227 -14842909
39239a4842909M4471387o458416L374044L0492806p06155n7951816n0164250J9358084
$$ -14842909 29628478 23170062 26544106 57036912 56330757 -1621059 -51785309 -32427225
39231c2427225O1004613M4376926K3048106J6678733j3549509n7525816m5591100
$$ -32427225 28577388 72954314 96002420 112681153 99131644 41605828 -3985272
$$ [...]
##END NTUPLES=NMR SPECTRUM
##END=
