##TITLE=31Pdec_SR_32_2ex
 CDCl3, 24 sc
 1.2.2021
##JCAMPDX= 6.0         $$ Bruker NMR JCAMP-DX V2.0
##DATA TYPE= NMR SPECTRUM
##DATA CLASS= NTUPLES
##ORIGIN= UXNMR, Bruker Analytische Messtechnik GmbH
##OWNER= root
$$ XWIN-NMR		Version 3.5
$$ Mon Feb  1 12:33:05 2021 Russian Standard Time (UT+4h)  she@DPX200
##.OBSERVE FREQUENCY= 81.013821
##.OBSERVE NUCLEUS= ^31P
##.ACQUISITION MODE= SIMULTANEOUS
##.ACQUISITION SCHEME= undefined
##.AVERAGES= 24
##.DIGITISER RES= 17
##SPECTROMETER/DATA SYSTEM= spect
##.PULSE SEQUENCE= zgpg30
##.SOLVENT NAME= CDCl3
##.SHIFT REFERENCE= (INTERNAL, CDCl3, 0, 182.463)
##AUDIT TRAIL= $$ (NUMBER, WHEN, WHO, WHERE, WHAT)
$$ ##TITLE= Audit trail, XWIN-NMR		Version 3.5
$$ ##JCAMPDX= 5.01
$$ ##ORIGIN= Bruker BioSpin GmbH
$$ ##OWNER= she
$$ F:/spectra/data/she/nmr/P31/1/pdata/1/auditp.txt
$$ ##AUDIT TRAIL=  $$ (NUMBER, WHEN, WHO, WHERE, WHAT)
(   1,<2021-02-01 12:30:42.53 +0400>,<she>,<DPX200>,
      <created by zg, POWCHK disabled, PULCHK disabled
       configuration hash MD5:
       00 E9 B6 7A A2 85 ED C7 34 08 36 98 17 FE 4E 26
       data hash MD5: 32K
       1C 98 6F 76 E8 35 5C 8F 26 94 C0 91 25 68 D7 44>)
(   2,<2021-02-01 12:30:45.04 +0400>,<she>,<DPX200>,
      <Start of raw data processing
       efp BC_mod = 2 LB = 1 FT_mod = 6 PKNL = 1 PHC0 = -1693.002 PHC1 = -24.39859 SI = 64K 
       data hash MD5: 64K
       C3 BF AF AC 25 A2 E0 A7 99 D4 68 2A 29 87 EF 55>)
(   3,<2021-02-01 12:31:08.15 +0400>,<she>,<DPX200>,
      <pk PHC0 = -2.483747 PHC1 = 0 
       data hash MD5: 64K
       76 2C 5A 02 63 D0 7F 21 4A 24 2D F0 85 33 5A 9A>)
(   4,<2021-02-01 12:32:29.68 +0400>,<she>,<DPX200>,
      <pk PHC0 = -1.200001 PHC1 = 0 
       data hash MD5: 64K
       6C 34 82 2E 55 DA BB B0 D0 97 73 EB 15 35 8E 69>)
(   5,<2021-02-01 12:32:33.00 +0400>,<she>,<DPX200>,
      <abs ABSG = 5 
       data hash MD5: 64K
       4C 3F 80 65 44 A7 D8 39 65 62 77 CC 26 55 F3 01>)
$$ ##END=
$$ 
$$ hash MD5
$$ 91 ED 26 CC 14 7D 7B B6 BA 79 97 36 1E 34 9B CC
##$RELAX= 
##$RELAX= 
##$RELAX= 
##$RELAX= 
##$RELAX= 
##$RELAX= 
##$RELAX= 
##$RELAX= 
$$ Bruker specific parameters
$$ --------------------------
##$DU= <F:/spectra>
##$EXPNO= 1
##$NAME= <P31>
##$PROCNO= 1
##$TYPE= <nmr>
##$USER= <she>
##$AMP= (0..31)
100 100 100 100 100 100 100 100 100 100 100 100 100 100 100 100 100 100 
100 100 100 100 100 100 100 100 100 100 100 100 100 100 
##$AQSEQ= 0
##$AQ_mod= 1
##$AUNM= <au_zg>
##$AUTOPOS= <>
##$BF1= 81.014009
##$BF2= 200.13
##$BF3= 200.13
##$BF4= 200.13
##$BF5= 200.13
##$BF6= 200.13
##$BF7= 200.13
##$BF8= 200.13
##$BYTORDA= 1
##$CFDGTYP= 0
##$CFRGTYP= 5
##$CHEMSTR= <none>
##$CNST= (0..31)
1 1 145 1 1 1 1 1 1 1 1 1 1 1 1 1 1 1 1 1 1 1 1 1 1 1 1 1 1 1 1 1 
##$CPDPRG= <waltz16>
##$CPDPRG1= <>
##$CPDPRG2= <waltz16>
##$CPDPRG3= <>
##$CPDPRG4= <mlev>
##$CPDPRG5= <mlev>
##$CPDPRG6= <mlev>
##$CPDPRG7= <mlev>
##$CPDPRG8= <mlev>
##$CPDPRGB= <>
##$CPDPRGT= <>
##$D= (0..31)
0 1 0 0 0 0 0 0 0 0 0 0.03 2e-05 3e-06 0 0 0 0 0 0 0 0 0 0 0 0 0 0 0 0 
0 0 
$$ [...]
##$SUBNAM3= <"">
##$SUBNAM4= <"">
##$SUBNAM5= <"">
##$SUBNAM6= <"">
##$SUBNAM7= <"">
##$SUBNAM8= <"">
##$SUBNAM9= <"">
##$SW= 369.568048894756
##$SWIBOX= (0..15)
0 1 3 0 0 0 0 0 0 0 0 0 0 0 0 0 
##$SW_h= 29940.119760479
##$TD= 32768
##$TD0= 1
##$TE= 0
##$TE2= 300
##$TE3= 300
##$TEG= 300
##$TL= (0..7)
0 120 53 12 22 120 120 120 
##$TP= (0..7)
150 150 150 150 150 150 150 150 
##$TP07= 0
##$TPNAME0= <>
##$TPNAME1= <>
##$TPNAME2= <>
##$TPNAME3= <>
##$TPNAME4= <>
##$TPNAME5= <>
##$TPNAME6= <>
##$TPNAME7= <>
##$TPOAL= (0..7)
0.5 0.5 0.5 0.5 0.5 0.5 0.5 0.5 
##$TPOFFS= (0..7)
0 0 0 0 0 0 0 0 
##$TUNHIN= 0
##$TUNHOUT= 0
##$TUNXOUT= 0
##$USERA1= <user>
##$USERA2= <user>
##$USERA3= <user>
##$USERA4= <user>
##$USERA5= <user>
##$V9= 5
##$VALIST= <valist>
##$VCLIST= <CCCCCCCCCCCCCCC>
##$VD= 0
##$VDLIST= <DDDDDDDDDDDDDDD>
##$VPLIST= <PPPPPPPPPPPPPPP>
##$VTLIST= <TTTTTTTTTTTTTTT>
##$WBST= 1024
##$WBSW= 4
##$XGAIN= (0..3)
0 0 0 0 
##$XL= 0
##$YL= 0
##$YMAX_a= 12071
##$YMIN_a= -17841
##$ZGOPTNS= <>
##$ZL1= 120
##$ZL2= 120
##$ZL3= 120
##$ZL4= 120
##$ABSF1= 182.463
##$ABSF2= -187.1042
##$ABSG= 5
##$ABSL= 3
##$ALPHA= 0
##$AQORDER= 0
##$ASSFAC= 0
##$ASSFACI= 0
##$ASSFACX= 0
##$ASSWID= 0
##$AUNMP= <proc_1d>
##$AZFE= 0.1
##$AZFW= 0.5
##$BCFW= 0
##$BC_mod= 2
##$BYTORDP= 0
##$COROFFS= 0
##$CY= -3
##$DATMOD= 1
##$DC= 0
##$DFILT= <>
##$DTYPP= 0
##$F1P= 0
##$F2P= 0
##$FCOR= 1
##$FTSIZE= 65536
##$FT_mod= 6
##$GAMMA= 0
##$GB= 0
##$INTBC= 1
##$INTSCL= 5.30512e-09
##$ISEN= 30
##$LB= 1
##$LEV0= 0
##$LPBIN= 0
##$MAXI= 10000
##$MC2= 0
##$MEAN= 0
##$ME_mod= 0
##$MI= 50
##$NCOEF= 0
##$NC_proc= -7
##$NLEV= 6
##$NOISF1= 182.463
##$NOISF2= 159.3651
##$NSP= 0
##$NTH_PI= 0
##$NZP= 0
##$OFFSET= 182.463
##$PC= 4
##$PHC0= -1696.686
##$PHC1= -24.39859
##$PH_mod= 1
##$PKNL= yes
##$PPARMOD= 0
##$PSCAL= 0
##$PSIGN= 0
##$REVERSE= no
##$SF= 81.014009
##$SI= 65536
##$SIGF1= 159.3651
##$SIGF2= -187.1042
##$SINO= 113.3802
##$SIOLD= 16384
##$SREGLST= <1H.CDCl3>
##$SSB= 0
##$STSI= 65536
##$STSR= 0
##$SW_p= 29940.119760479
##$SYMM= 0
##$S_DEV= 0
##$TDeff= 32768
##$TDoff= 0
##$TI= <>
##$TILT= no
##$TM1= 0
##$TM2= 0
##$TOPLEV= 0
##$USERP1= <user>
##$USERP2= <user>
##$USERP3= <user>
##$USERP4= <user>
##$USERP5= <user>
##$WDW= 1
##$XDIM= 65536
##$YMAX_p= 262905944
##$YMIN_p= -27803890
$$ End of Bruker specific parameters
$$ ---------------------------------
##NTUPLES= NMR SPECTRUM
##VAR_NAME=  FREQUENCY,     SPECTRUM/REAL,   SPECTRUM/IMAG
##SYMBOL=    X,             R,               I
##VAR_TYPE=  INDEPENDENT,   DEPENDENT,       DEPENDENT
##VAR_FORM=  AFFN,          ASDF,            ASDF
##VAR_DIM=   65536,         65536,           65536
##UNITS=     HZ,            ARBITRARY UNITS, ARBITRARY UNITS
##FACTOR=    0.456856943014862, 1,           1
##FIRST=     14782.0589164895, 0,            0
##LAST=      -15158.0608439895, 0,           0
##MIN=       -15158.0608439895, -27803890,   0
##MAX=       14782.0589164895, 262905944,    0
$$ Real data points
##PAGE= N=1
##DATA TABLE= (X++(R..R)), XYDATA
$$ [...]
42294d688236M25632R94984J157841Q63009K80265M8840P98714J755293R90869
42285B627211j792418l977359l167255n30952R53028O59175L70170Q48790J099765
42276b909845Q71234J024555J198171M9393j650294j318378J028318J978462K7485
42267B99101j639134j82552K129630J686859l02750J81881K857512K850199j740251
42258F140495o192749n248716m9745L647763K695464o22744k555907k259983j468357
42249e914479j405431j559459j152964l16468P23913K367131M377470M894158
42241B013871K563827p38977j611242K16558J451811L15017q48744R8482J032745
42232D493348r39981l978708l654662M2949K154610j08903l488998l561140n09179
$$ y = [-4688236, -4262604, -3267620, -2109779, -1246770, -966505, -917665, -118951, 1636342, 2627211, 834793, -3142566, -6309821, -6840773, -5887745, -5228570, -4858400, -4009610, -2909845, -2038611, -1014056, 184115, 233508, -1416786, -2735164, -1706846, 271616, 299101, -1340033, -1522585, 607045, 2293904, 1991154, 2173035, 5030547, 7880746, 6140495, -52254, -5300970, -5350715, -1702952, 992512, 369768, -2186139, -4446122, -5914479, -7319910, -8879369, -10032333, -10348801, -9624888, -7257757, -2880287, 2013871, 4577698, 3838721, 2227479, 2444037, 3895848, 4210865, 3362121, 3460603, 4493348, 3553367, -425341, -4080003, -4037054, -1882444, -1991347, -5480345, -9041485, -9550664]
42223i550664J995960J564636j109968l549173l127736Q21813N191688N453734
42215b309710J399840j868902p45686J879696J558593n12367O0555K786439K497797
42206D746255j947234n018983k850796Q26639P23794j917927j867174J790164
42198e515262M672217L633297J68424k602783k935169n12209L219004M716343
42190D843862J661610l086175m168238q24102K193049J562406o15477j267502
42182B99433q12481p16082j37886J752197K921970J499912m83489M838K025514
42173F353926K246898K04739j713219k526580l069517k836442n29961K290488
42165D20332K182818r36579l167204k094655M56936K055456K703885K999948K380158
$$ y = [-9550664, -7554704, -5990068, -7100036, -10649209, -13776945, -12955132, -7763444, -2309710, -909870, -2778772, -3524458, -1644762, -86169, -598536, -537981, 2248458, 4746255, 2799021, -2219962, -5070758, -4244119, -3520325, -5438252, -7305426, -5515262, -843045, 2790252, 2958676, 355893, -2579276, -3091485, 127519, 4843862, 6505472, 3419297, -748941, -1573043, 620006, 2182412, 1566935, 299433, -513048, -1229130, -1367016, 385181, 3307151, 4807063, 4323574, 4328412, 6353926, 8600824, 8805563, 7092344, 4565764, 1496247, -1340195, -1870156, 420332, 2603150, 1666571, -1500633, -3595288, -3138352, -1082896, 1620989, 4620937, 7001095]
42156G001095P94571m41622q57051j509339k433567k102286n66139j97181j821731
42147b133250l000894j838297L28591J748004K728774L339887J938977j407118
42139A704674l184015j204472J711148K117392J140290J437595J736931p42807
42131D716736m291244m470399j136423J497993J782393K413732M480492M808714
42123I801994J341191k904211l927058j949507l6838L56441J27534K38182O52838
42114C700566Q23278J64975j220661k034879j261305r5197m73390j699157j129473
42105c225243J334576K505664Q40036j052079q07549j93726j668028l489769k062816
42096g818934K042333M354296K789165J60557l47876Q55424J691742J669339J253517
$$ y = [7001095, 7795666, 7354044, 6496993, 4987654, 2554087, 451801, -114338, -311519, -2133250, -5134144, -6972441, -6643850, -4895846, -2167072, 1172815, 3111792, 1704674, -1479341, -2683813, -972665, 1144727, 2285017, 3722612, 5459543, 4716736, 425492, -4044907, -5181330, -3683337, -1900944, 512788, 4993280, 9801994, 11143185, 8238974, 4311916, 2362409, 2325571, 2682012, 2809546, 3047728, 3700566, 4523844, 4688819, 3468158, 1433279, 171974, 76777, -396613, -2095770, -3225243, -1890667, 614997, 1455033, 402954, -404595, -598321, -2266349, -5756118, -7818934, -5776601, -1422305, 1366860, 1527417, 1179541, 2034965, 3726707, 5396046, 6649563]
42087F649563j8396k339496l775362k334160M96995J071642j203121k778841j268961
42078e500137R05043M04976j722329j821015N77574K396602K136981J543852J634739
42069E56286R43613q81978j458547J95862J296706k05605j882443q90505J062414
42060a264197Q23305m54064O62517L603604M599818L127382K294100K529350L30070
42051A6251885n123948r037021p359312k303233J372251K455574K525379J708140
42043D89715r81553m197127m705995j531683K646985M727518M299531K978945
42035C726336J732503j684k452268l920454k578770L10988J255784n13850j612592
42026d054007O6023J496200n08521l195861j690719K682261L768279J25233k917127
$$ y = [6649563, 6631167, 4291671, 516309, -1817851, -1320856, -249214, -1452335, -4231176, -5500137, -4595094, -4190118, -5912447, -7733462, -7155888, -4759286, -2622305, -1078453, 556286, 1499899, 617921, -840626, -644764, 651942, 446337, -1436106, -2326611, -1264197, -440892, -894956, -232439, 3371165, 7970983, 11098365, 13392465, 15921815, 16251885, 11127937, 2090916, -5268396, -7571629, -6199378, -3743804, -1218425, 489715, -491838, -4688965, -9394960, -10926643, -8279658, -3552140, 747391, 3726336, 5458839, 5457155, 3004887, -915567, -3494337, -3183349, -1927565, -2441415, -4054007, -3987984, -2491784, -3000305, -6196166, -7886885, -5204624, -1436345, -1311112, -4228239]
42017d228239j864074K91685K69221l44409N59889J152365l53801j439258M76272
42008e480349K867828J923068j003306j528616Q56722K553124J558753n39251
42000A207973j706120j317303N26815K781524L389340J836661M85966J021988
41992H226844J483564l21985k595618k295106k86779J95646j104928j676712p75551
41983H49375K05235J024489K253587K475086R2996k620334j833597J574765K699238
41974F720840j987k595983j946431K84496J386357J301885O79868j120656l745140
41965I63249m555261k157266R70990J678159K83496n30326L19894J406038J263369
41956c57658L65799M96941K345333L812076J814542l318180o813620m795094O18099
$$ y = [-4228239, -6092313, -5800628, -5531407, -5875816, -5315927, -4163562, -4517363, -5956621, -5480349, -2612521, -689453, -1692759, -3221375, -2364653, 188471, 1747224, 1207973, -498147, -1815450, -1288635, 1492889, 4882229, 6718890, 7204856, 8226844, 9710408, 9388423, 6792805, 4497699, 4210920, 4406566, 3301638, 1624926, 849375, 1054610, 2079099, 4332686, 6807772, 6900768, 4280434, 2446837, 4021602, 6720840, 6718853, 4122870, 2176439, 2460935, 3847292, 5149177, 5829045, 4708389, 963249, -3592012, -5749278, -4778288, -3100129, -2816633, -3346959, -3027065, -1621027, -357658, 8141, 505082, 2850415, 6662491, 8477033, 5158853, -1654767, -6449861, -5831762]
41947e831762L984017L198522O77209j077506j675135j085403P27979K285022
41939A202943J862716L92512J70709J011635R29089R0278K69164Q33739l21044
41930F441741k022478r57345K128574K782787M00410l26112K537156M405481J505968
41921A6896182l151531m782724l444482j839602l85350J523070K542956J515104
41913H873623r2516r63112k130404l602722k668473R57900K529834p48471m163149
41904b007490k241610K448383L366768K25034j505750J74952J751405J056884
41896C268576k2342j79896n26211j017774l4745J577693P49327k446634m092989
41887b724995k370721p0790J96487o65500j209573j851987k418163r21600K834234
$$ y = [-5831762, -1847745, 1350777, 2027986, 950480, -724655, -1810058, -1082079, 1202943, 3065659, 3458171, 3628880, 4640515, 5569604, 5659882, 5929046, 6762785, 6441741, 4419263, 3461918, 5590492, 8373279, 8773689, 8447577, 10984733, 15390214, 16896182, 13744651, 8961927, 5517445, 3677843, 3292493, 4815563, 7358519, 8873623, 8781107, 7817995, 5687591, 2084869, -583604, 374296, 2904130, 2155659, -2007490, -4249100, -1800717, 1566051, 1791085, 285335, 460287, 2211692, 3268576, 3246234, 3066338, 2540127, 1522353, 1487608, 3065301, 3814628, 1367994, -2724995, -5095716, -5166506, -4970019, -5635519, -6845092, -8697079, -11115242, -12036842, -9202608]
41878i202608N457104M331631J439237L24629J089241R52966j252989l458732
41870c19521l104098j47261K924278L721398K405766J059963O40035K0731j264563
41861E936728j573961k50142K29925j902079l865391k198983J164721J440090
41853a019092j133204j313745K646572N822589L847970j088998l999885l391509
41845C70698j257805M50158R04506M1415r72743o82372K16160l08354j656689
41836b895026p12085K746430M391192J421363k928817l824838j254493R07049
41828b149225L16572k045198l953513l566558m80904L031730L659466J502608
41820c685022M93708K578372M482899K886367k55588j040913L29618Q71574J76268
$$ y = [-9202608, -3745504, 586127, 2025364, 2349993, 3439234, 4392200, 3139211, -319521, -3423619, -3570880, -646602, 3074796, 5480562, 6540525, 7180560, 7201291, 5936728, 4362767, 4112625, 4342550, 2440471, -1424920, -3623903, -2459182, -1019092, -2152296, -3466041, -819469, 5003120, 8851090, 7762092, 3762207, 370698, -887107, -436949, 467557, 508972, -463771, -1146143, -929983, -1238337, -2895026, -3607111, -860681, 3530511, 4951874, 2023057, -1801781, -3056274, -2149225, -1832653, -3877851, -7831364, -11397922, -11878826, -8847096, -5187630, -3685022, -3191314, -612942, 3869957, 6756324, 6500736, 5459823, 5789441, 6661015, 6837283]
41811F837283M5301Q6182j698329m347903m391475j185003K011278K825602K196264
41802B379200J426110K55369j132882j335618l09391q5615j531055k720131j936677
41793d990690j92369P37292R26216J339762J811030J691220J419687J763707K137071
41784F642926J207179r76882k609435k084735J94593K104188J787171n51551k837314
41775B876140l218755j790417r6570O54406N50159N63189J453064K612676K097017
41766E700909j040750m359230l916431M95043M074642K765347j537314l900909
41758a718693k942279j427044j153935q50146M95008J520429R81311j24485l71124
41749e590958k009J70252M78650J603747L024579L443068K264703J02749j670995
$$ y = [6837283, 6882584, 6968766, 5270437, 922534, -3468941, -4653944, -2642666, 182936, 2379200, 3805310, 4060679, 2927797, 1592179, 1282788, 1197173, -333882, -3054013, -4990690, -5183059, -4445767, -3519551, -2179789, -368759, 1322461, 2742148, 4505855, 6642926, 7850105, 6873223, 4263788, 2179053, 2373646, 4477834, 6265005, 5713454, 2876140, -342615, -2133032, -2229602, -1575196, -1025037, -461848, 991216, 3603892, 5700909, 4660159, 300929, -3615502, -3120459, 954183, 3719530, 2182216, -1718693, -4660972, -6088016, -7241951, -8092097, -7597089, -6076660, -5095349, -5219834, -5590958, -5592967, -5422715, -4944065, -3340318, -315739, 3127329, 5392032, 5494781, 3823786]
41740C823786j818141n12235M35052k45707j249541m92085J392479J645194k91890
41731B686912j609085k34446K272576L328146K701999J580826J63680j693004
41723I197604k874898k364239j260774j193002j386833K13941L012428L514223
41715F858450q2084m877823o244154k993211J557361L443455K101696L11431N59104
41706F34225K168253K463845L42125k307859k929183j108155J453815K975689
41698C692755K864772J561364K3889q58178j017775j214731j821694k006366q28489
41689C95547J130515K114437J248438m80760j577945j776164j878184k180669
41681c004785j893942m58702J242003J804980J108801J51658p12213j832087k384979
$$ y = [3823786, 2005645, 1493410, 1928462, 1682755, 433214, -58871, 1333608, 2978802, 2686912, 1077827, 843381, 3115957, 6444103, 9146102, 10726928, 10890608, 9197604, 6322706, 3958467, 2697693, 1504691, 117858, 331799, 3344227, 6858450, 6776366, 1898543, -4345611, -7338822, -5781461, -2338006, -236310, 75121, 634225, 2802478, 5266323, 5608448, 3300589, 371406, -736749, 717066, 3692755, 6557527, 8118891, 8142780, 7284602, 6266827, 5052096, 3230402, 1224036, 395547, 1526062, 3640499, 4888937, 4408177, 2830232, 1054068, -824116, -3004785, -4898727, -5357429, -4115426, -2310446, -1201645, -1049987, -1762200, -3594287, -5979266]
41672e979266o56429K607675L507053R3521l673478k484252K741405N759623L510025
41663E425877m85001k225430k342377k781614k414137L22117L166086K687700
41655A353221k17036j498124L6373J625098J327807L10827p5253k51288n40791
41646B070834j17126J029654J343741J07065j246816j253997k70122O06032R21138
41637C190403N20884o27333j713839j780331j453226k046391k673166q53462L154518
41628d281943N510595L908443Q57491l01651j51607j141183k825199k666337n47168
41619a638559J036918J032893Q15535R36877J22318j623276j909956L39963K356382
41610A469095R25303k873581m596463j968177K296581L861870J930714j45243
$$ y = [-5979266, -6635695, -4028020, -520967, -427446, -4100924, -6585176, -3843771, 1915852, 5425877, 4940876, 2715446, 373069, -2408545, -4822682, -4500565, -1334479, 1353221, 1136185, -361939, -325566, 1299532, 2627339, 2938166, 2862913, 2611625, 2070834, 1953708, 2983362, 4327103, 4434168, 3187352, 1933355, 1663233, 2269265, 3190403, 3711287, 3083954, 1370115, -410216, -1863442, -3909833, -6582999, -7436461, -4281943, 1228652, 5137095, 5994586, 5692935, 5541328, 4400145, 1574946, -1091391, -1638559, -601641, 431252, 1246787, 2183664, 2305982, 682706, -1227250, -887287, 1469095, 2394398, -479183, -5075646, -7043823, -4747242, -885372, 1045342, 900099]
41602I00099O20493L081908L880987K209683L95235l34424j708816m513015n726337
41593a194187k588852K383571M157982K027438k20498o72450j419178l500390
41585a026564m215666j756275J086694Q72837j333343j861961J96986K478829
41577e558463L140262K526840J580308O61879l05350j722858l586977m220017
41569g484376j571399L138647N574208L886197J419107J364175J764917n59239
41561G532237l918701m317148k190160j287774j913081r73807J468109J761033
41553c839292m29877q96821J619720K749896K11096j553491J339287N152984L977333
41544H330835j213347m393434l187582n77285P03844O30207m82726k321177k887526
$$ y = [900099, 1520592, 4602500, 8483487, 10693170, 11088405, 10753981, 9045165, 4532150, -1194187, -3783039, -1399468, 2758514, 4785952, 4565454, 3893004, 2473826, -1026564, -5242230, -6998505, -5911811, -5038974, -6372317, -8234278, -8037292, -5558463, -2418201, 108639, 1688947, 2350826, 2045476, 322618, -3264359, -7484376, -9055775, -5917128, -342920, 3543277, 4962384, 6326559, 8091476, 7532237, 3613536, -703612, -2893772, -4181546, -6094627, -7068434, -5600325, -3839292, -4269169, -5165990, -3546270, -796374, -585278, -2138769, -799482, 4353502, 8330835, 7117488, 2724054, -463528, -1040813, -336969, 293238, -189488, -2510665, -5398191]
41535e398191n25090K575768K703797K22024j085119j51637J88644j315424k130779
41526d916007p10352O04331k49080j331178O839K553482L066547J228637k46333
41517F886N8202N45616l89532j745323j495904K71939J339847N56925l69858N66304
41507f54898K277115J812811j070563l104553k174629k38207R4774n51246k12407
41498c821803Q09666J126342J201402J891584J739837n69735k528102r09513K412744
41489A352422K609970m80848k140598n80933O41705n66956j305086N03389K058046
41480B091111R28169l74795P54427J765748m78426l208484j515512L358276N300874
41471H621388K271595j394487j927770n28851K77379M62199P36106J97274j819436
$$ y = [-5398191, -5923281, -3347513, -643716, -421692, -1506811, -1658448, -1469804, -2785228, -4916007, -5626359, -5022028, -5271108, -6602286, -6595447, -4041965, -975418, 253219, 6886, 65088, 610704, 221172, -1524151, -3020055, -2748116, -1408269, -851344, -1221202, -654898, 1622217, 3435028, 2364465, -740088, -2914717, -3152924, -3058150, -3609396, -3821803, -3012137, -1885795, -684393, 1207191, 2947028, 2377293, -150809, -1060322, 1352422, 3962392, 3481544, 1340946, 760013, 1401718, 834762, -470324, 33065, 2091111, 3019280, 2644485, 3398912, 5164660, 4686234, 1477750, -37762, 3320514, 8621388, 10892983, 9498496, 7570726, 7041875, 7319254, 7781453, 8517559, 8714833, 6895397]
41462F895397l456123k275182J123997L143792J178756l072118n011081k357602
41454c830164J701129K161712j149713l135093n71835L216665L167334l91694
41446A168341k643756j076032J875887K640846L51779l005440m307369j695839
41438f691583K888488M631836J494009k429287j989812J894661L725453J211436
41430D735201k366490l467113k032401M37148K662218K740419n30806m353601
41422b175425l910905P61822L869540J952783j196160p91546J605560J336131
41414A451800j501028k564441n24901J226714M18398r58131o16436M82875M71728
41405b113422j74737J11199J236593J971324K000766J609360L66323j850895l253918
$$ y = [6895397, 3439274, 1164092, 2288089, 5431881, 6610637, 3538519, -1472562, -3830164, -2129035, 32677, -1117036, -4252129, -4823964, -1607299, 1560035, 1168341, -1475415, -2551447, -675560, 1965286, 2317065, -688375, -4995744, -6691583, -3803095, 828741, 2322750, -106537, -2096349, -201688, 3523765, 4735201, 2368711, -1098402, -3130803, -2693655, -31437, 2708982, 2178176, -2175425, -6086330, -5324508, -1454968, 497815, -698345, -1489891, 115669, 1451800, -49228, -2613669, -3138570, -1911856, -1493458, -2451589, -3068025, -2585150, -2113422, -2288159, -2176960, -940367, 1030957, 3031723, 4641083, 5007406, 3156511, -97407]
41396i7407j879276J177305K564893J100589q95836j450829j542251k242124j898242
41387e163178R38786L689388K638889j149795k886190j056656Q95086P07064N20867
41378h65739J999903K746056P76472j349468q88649p4016k161894m924532l608518
41369h350385J026115L360180J360335j084271q17935P17496J477615J943947
41361c66903K482442J719608l66529j260434J38718J486771P77543q02177j528166
41352B280873j692158j807440j255180m02208r58558k531032k232129L67719J703065
41343f527048Q0916r76461J411430M199736L275043K88737l60652J080359Q00385
41334C272445j543025k482733j119065m64282j700249j914013Q11772L903585
$$ y = [-97407, -1976683, -799378, 1765515, 2866104, 1970268, 519439, -1022812, -3264936, -5163178, -4224392, -535004, 2103885, 954090, -1932100, -2988756, -2093670, -1386606, -865739, 1134164, 3880220, 4656692, 3307224, 2418575, 2344559, 182665, -4741867, -8350385, -7324270, -3964090, -2603755, -3688026, -4505961, -3788465, -2310850, -366903, 2115539, 3835147, 3468618, 2208184, 2346902, 3833673, 4611216, 3809039, 2280873, 588715, -1218725, -2473905, -2876113, -3834671, -6365703, -8597832, -8230113, -6527048, -6446132, -7422593, -6011163, -1811427, 1463616, 1752353, 1391701, 2472060, 3272445, 1729420, -753313, -1872378, -2336660, -4036909, -5950922, -5139150, -1235565]
41326a235565L973604J298402j258236j882466q65044N43103J152680O55671j8927
41317B363222M7054L22067j94616j003023p65394L49472P94650J8073j018472
41308I13033j558415j577743q71476M92276J125143r3471j589627p72051J744563
41299b187768K412439J2981k169046j008754J944275K815172P98885j245053j130108
41290B43023K8225J12501p14071m78995J278876K309311O58387k173268k744662
41281a480673j52207K842180L548768K319154Q92667l10067j707086k819961k771799
41272C60976j663734j61759J339146K125883J141069j229345k859636k644528
41264c591928j820213j302385q0535K011707K757506J280305L47927J736963K380293
$$ y = [-1235565, 2738039, 4036441, 2778205, 895739, 30695, 573798, 1726478, 2382149, 2363222, 2410276, 2732343, 2537727, 1534704, 769310, 1118782, 1913432, 1931505, 913033, -645382, -2223125, -3094601, -2602325, -1477182, -1570653, -3160280, -3932331, -2187768, 224671, 237652, -1931394, -2940148, -995873, 1819299, 2618184, 1373131, 243023, 271248, 383749, -330322, -809317, 469559, 2778870, 3437257, 1263989, -1480673, -1632880, 1209300, 4758068, 7077222, 7969889, 7659822, 5952736, 3132775, 360976, -1302758, -1464517, -125371, 2000512, 3141581, 1912236, -947400, -3591928, -5412141, -6714526, -6795061, -4783354, -2025848, -745543, -397616, 1339347, 3719640]
41255C719640o10972l957728k701213J361079K067474j154676k559934K29176
41247c607154K706191J505589m96938j10785P75474m82865k192643j666450J1595
41238c557986N59429O79821J735432K114596J00126j950782o17329K956013M493290
41229F512610K592957l61802k401504l504447l514760k027633l31358m50788k011742
41220e498467k510615q86887J296404K324038K038759R83772m00676j454552j468077
41211e576301m27712J022107K070196J925677N42395n25702L42856J911745J043684
41202B328945k275385l721198o31579L459934L403428m28291l096526j988253
41194b948925Q02148K490536K694687K316456J872921J322407J03571k170893
$$ y = [3719640, 3108668, -849060, -3550273, -2189194, -121720, -1276396, -3836330, -3607154, -900963, 604626, 107688, -3097, 772377, 289512, -1903131, -3569581, -3557986, -2998557, -2318736, -583304, 1531292, 1631418, -319364, -936693, 2019320, 6512610, 9105567, 8743765, 6342261, 2837814, -676946, -2704579, -3035937, -3486725, -5498467, -8009082, -8895969, -7599565, -5275527, -3236768, -2252996, -2653672, -4108224, -5576301, -6004013, -4981906, -2911710, -986033, -443638, -969340, -626484, 1285261, 2328945, 53560, -3667638, -4299217, -839283, 2564145, 2135854, -960672, -2948925, -2146777, 343759, 3038446, 5354902, 7227823, 8550230, 8653801, 6482908]
41186F482908l974858k599616J516115L627722Q98290k632931j472257K806847
41178D652220L621712q30116n385803n830866l507501q94012J907889M138199
41170b128278L083624r66802k935334M7999L608263K406847j619926k303424J395892
41161E88861M360940L136467j53613k293707l075615l452169l029284j415684
41153e333804K47524R46068J248049J601777R84396r41843j987363j76378K630952
41144g80622K579791q15511l777107l281137m72711K004779L508415M248020L059226
41135F273143m54051l009223r21072L793047M761613j06668n231318m828379m03958
41126a26866K298266J210509r37168j780251j605728r64668L58293J669769J554990
$$ y = [6482908, 2508050, -91566, 1424549, 5052271, 5950561, 3317630, 1845373, 4652220, 8273932, 7443816, 2058013, -3772853, -7280354, -8174366, -6266477, -2128278, 955346, -11456, -2946790, -2898791, 709472, 3116319, 1496393, -807031, 588861, 4949801, 8086268, 7932655, 5638948, 2563333, -888836, -3918120, -5333804, -5086280, -4140212, -2892163, -1290386, -305990, -1247833, -3235196, -3411574, -780622, 1799169, 983658, -2793449, -6074586, -6547297, -4542518, -1034103, 3213917, 6273143, 5819092, 2809869, 1888797, 5681844, 10443457, 10336789, 5105471, 277092, -126866, 2171400, 3381909, 2444741, 664490, -941238, -1905906, -1547613, 122156, 1677146]
41117A677146K38356n17662j29510K65157K5536k87659l40668j34537R32863K826754
41107D555776L316415N63534l097513l348227j3733K509759J532269q18348j760621
41098C439311j505231j231882q50132n74011j459504k467601m95536M217070O325537
41089E398021K407825l318045m344847o48929K274541J634509o9459k66544L42107
41080C409179L47268l1187k82255o34147q42871j94307O08400k02407k417247
41071b39574l309774j255678J864728L106506J932638K7344j250332j799474j686069
41062b609685n74088J351777K686191J956359l52309j772351o98468J392707J891063
41053C271196O43514m22483r25282k283565l806435k271507K516453N341551K246695
$$ y = [1677146, 1915502, 1397840, 1268330, 1533487, 1559023, 1271364, 930696, 796159, 1729022, 4555776, 7872191, 8435725, 5338212, 1989985, 1976252, 4486011, 6018280, 5199932, 3439311, 1934080, 702198, -147934, -721945, -2181449, -4649050, -5144586, -927516, 5398021, 7805846, 4487801, 142954, -505975, 1768566, 3403075, 3333616, 3067072, 3409179, 3756447, 3725260, 3443005, 2808858, 1965987, 1771680, 2380080, 2177673, -239574, -3549348, -4805026, -2940298, 166208, 2098846, 2126190, 875858, -923616, -2609685, -3183773, -1831996, 854195, 2810554, 2458245, 685894, -12574, 1380133, 3271196, 3914710, 3492227, 2566945, 283380, -3523055, -5794562, -3278109, 2063442, 4310137]
41044D310137l127182m129495k11876L234217L105955J507861M73438q37466k409364
41035A916225j900565P69176J721834j000793l559031j837456K134786L258872
41027A503048P75257j563034j557533o81708l65647L3337Q90456J005950k07247
41018a67121j363527j044366L23831J280979R55700m64145j899096j999566o15199
41009d992510O64922O33458M18188J500151K546103R70418k404730l557502j163846
41000e385348R98262l27541k679074j504676K763828N048566K717872j204141
40992D27748k721641j806198r96761j147568q39690O91499K044539J464247q16624
40983c700449k668484k377551n09284Q95823Q94425N79882J029130J446260N94296
$$ y = [4310137, 1182955, -2946540, -3158416, 75801, 3181756, 4689617, 5163055, 4325589, 1916225, 15660, 784836, 2506670, 1505877, -2053154, -3890610, -1755824, 1503048, 2278305, 715271, -842262, -1523970, -1889617, -1856280, -965824, 40126, -167121, -1530648, -2575014, -2251183, -970204, -14504, -478649, -2377745, -4377311, -4992510, -4327588, -3694130, -3275942, -1775791, 770312, 1740730, -664000, -4221502, -5385348, -4387086, -4714627, -7393701, -8898377, -6134549, -1085983, 1631889, 427748, -2293893, -4100091, -5096852, -6244420, -7084110, -6392611, -4348072, -2883825, -3700449, -6368933, -8746484, -9255768, -8359945, -7465520, -6885638, -5856508, -4410248, -3815952]
40974c815952q49339j252671q49894j221045j860571j35223M140954O818720M408643
40965E383622q60927l674043k309040O8990M55043m88435o19241K65521O31165
40956a147345k29612j124568m42571J731714L306939K432097j13508j851301j983484
40947E78361k049928k579545j578740J776211M337958K871891r07057k606666
40939a57515j341696J09379N69614J529419K904202K374038l0905j152077j12750
40930D691709j11150k589640m020845j687980J311902Q92635j365170r83892K145698
40921a716733L998198K739431M08859j153471k020055k035315p30660N45892j24078
40912h7932j679136j127437J515159K707193O04079k263161k718003q70577R09011
$$ y = [-3815952, -4665291, -5917962, -6767856, -7988901, -9849472, -9984695, -5843741, 974979, 5383622, 4522695, 848652, -1460388, -1391398, -936355, -1424790, -2044031, -1778510, -1147345, -1376957, -2501525, -2944096, -1212382, 2094557, 4526654, 4413146, 2561845, 578361, -1471567, -4051112, -5629852, -3853641, 484317, 3356208, 2449151, -157515, -1499211, -1389832, -820218, 709201, 3613403, 5987441, 5956536, 4804459, 4691709, 4580559, 1990919, -2029926, -3717906, -2406004, -1513369, -2878539, -3862431, -1716733, 2281465, 5020896, 5429755, 4276284, 2256229, 220914, -509746, 36146, -87932, -1767068, -2894505, -1379346, 1327847, 1931926, -331235, -3049238, -3919815, -3010804]
40903c010804J031105l25639j812393j898379m20242R33675R38697Q06414J917984
40894a839582K754822J000169k107672l064670j484327l18349m99221K80804K391241
40885b886785K469330r03564l823603k581802O63186J455295o6339j3089K607260
40876c080111M223719K112933j636564k892356n44207K547834L196089J462765
40868E390102K8155L12784O91611n33012k089351j824562m87901l80316j085471
40859B2039l54615J006562k66268l634631m113070K1110L683530K308516j544519
40850b871346k748137r87054Q53510K351869M434294N123644K109251j866727
40842F399304j903680J360353K520107o8858k124381p64904J314554R43333p79668
$$ y = [-3010804, -1979699, -2305338, -4117731, -6016110, -6436352, -5502677, -4563980, -3757566, -1839582, 915240, 1915409, -192263, -3256933, -4741260, -5059609, -5558830, -5278026, -2886785, -417455, -1321019, -5144622, -7726424, -7063238, -5607943, -5674282, -5687371, -3080111, 1143608, 3256541, 1619977, -1272379, -1816586, 731248, 3927337, 5390102, 5418257, 5731041, 6422652, 5889640, 3800289, 1975727, 1487826, 1107510, 22039, -332576, 673986, 407718, -3226913, -7339983, -7318873, -3635343, -1326827, -2871346, -5619483, -6606537, -5753027, -3401158, 1033136, 6156780, 8266031, 6399304, 4495624, 5855977, 8376084, 8307226, 6182845, 5417941, 6732495, 7675828, 6896160]
40833F896160j386022j104671j275060j307371J31537K503660L910799L194082
40825A1563114O71871j976564k505650o49785M71848j864759n293683n072364
40817d655972j323449J048303K92023J87442K563349L376536k1298l226921j669578
40808c429565J479488Q05033j515847P36993O188666O544781l05016o214965m716305
40799d26737K53651J891430N50624M44302J111089p71995l647636k526964K221804
40790i00432M331386J075528k709198k357221O8591L55888r23824m09609J889665
40781D20774L041624K298406J384194M95659j587914l571374k438669J021595
40773A064295K059378q59337l064101p58277K784934K190045j678883l293506
$$ y = [6896160, 5510138, 4405467, 3130407, 1823036, 1954573, 4458233, 8369032, 11563114, 12234985, 10258421, 7752771, 7102986, 7574834, 5710075, 416392, -4655972, -5979421, -4931118, -4639095, -4451653, -1888304, 1488232, 1466934, -1759987, -3429565, -1950077, -1145044, -2660891, -1923898, 4264768, 10809549, 10504533, 4289568, -426737, -173086, 1718344, 2268968, 2713270, 3824359, 3052364, -595272, -3122236, -900432, 3430954, 4506482, 1797284, -559937, -491346, -135458, -1059282, -1468891, 420774, 3462398, 5760804, 7144998, 7640657, 6052743, 2481369, 42700, 1064295, 3123673, 2264336, -799765, -1558042, 1226892, 3416937, 1738054, -1555452]
40765a555452j007695J187666N58699p20130k91585L19269r85994k615584j590884
40756f701690J534613L135034J422453j468144k465245j051889P00941Q98903
40748c995024J79713R12371L640760N302545K775556k322592n078827l791261
40740b376759j755850j405976n86054K532813M568320J650843l301446l736341
40732d410450P17344L536442J307798j528385n36870J619203L54184k716813k475551
40723d133098J119446L052935J287140q20700q02683n70180j812060k493524p41207
40714e913931J430139J553194R76893K060246L338830J618925k333151m347751
40706a616606k756209M5012J891707K884231K794357N87218k292621k269510P35247
$$ y = [-1555452, -2563147, -1375481, -816782, -1536912, -1828497, -1509228, -2495222, -5110806, -6701690, -5167077, -2032043, -609590, -2077734, -4542979, -5594868, -4893927, -3995024, -3815311, -2902940, 737820, 6040365, 8815921, 6493329, 1414502, -2376759, -4132609, -5538585, -6124639, -3591826, 976494, 2627337, -674109, -4410450, -3693106, -156664, 1151134, -377251, -914121, 705082, 1059266, -1657547, -4133098, -3013652, 39283, 1326423, 505723, -296960, -867140, -2679200, -5172724, -5913931, -4483792, -2930598, -1953705, 106541, 3445371, 5064296, 2731145, -1616606, -4372815, -4327803, -2436096, 448135, 3242492, 3829710, 1537089, -732421, 2826]
40697B826J984821r12329l343710l91630M767958M667725j395068n966393l914912
40688d500712J017212K536933L72660j104617l9798J376444J497424J284648J352855
40679C793049L29286k306924m151015k851477J25069J156249m08125j317422O18576
40670e012734L021429K386579n64296j852398j73388J301646p6833k487311k528968
40661e986274L4803K634650L515543K736790P22806j753133k873172j439940J162717
40652a245210K679197K927404K861452J833741j098488l850516l141306J15202
40644A081476J212178j487887l946229k546878P45984J910902O00101p21199j136685
40635d288237j449545j393252O5346K216738L118839K373544J245718L52472p49713
$$ y = [2826, 1987647, 1075318, -2268392, -2660022, 2107936, 6775661, 5380593, -585800, -4500712, -3483500, -946567, -573907, -1678524, -1718322, -341878, 1155546, 2440194, 3793049, 4122335, 1815411, -2335604, -5187081, -5062012, -3905763, -4313888, -5631310, -5012734, -1991305, 395274, -169022, -2021420, -2194808, -893162, -969995, -3457306, -5986274, -5951471, -3316821, 198722, 2935512, 3658318, 1905185, -967987, -2407927, -1245210, 1433987, 4361391, 7222843, 9056584, 7958096, 4107580, 966274, 1081476, 2293654, 805767, -3140462, -5687340, -4941356, -3030454, -2430353, -3151552, -4288237, -5737782, -7131034, -7065688, -4848950, -1730111, 643433, 1889151, 2241623, 1491910]
40626A491910j900153k093349r20627R86078K682596L218947K057451J41422o48697
40617E015578j69991n08302k394291l213567p97948K741021L749561K013984j3241
40608F422804j449389k872894l152696n81155L095656L943031J524569n21515
40600F408411j73674N94671P2528n06881j10296j11395j401014k437625k136301
40591A98424j745691j941732j139713J133275K336819R86639l71401P67705K601859
40582B826184K180010L64723n9427P75246P50278m5059K0022M80580k81682j480257
40572E530618j266812o48552j739893k895129n98287L788290M603400M36605l102107
40563D108133j472482K462142L276019N50885j887945j770883n7956J509901J693748
$$ y = [1491910, -408243, -2501592, -3422219, -2436141, 246455, 3465402, 5522853, 5664275, 5015578, 4845587, 4337285, 1942994, -1270573, -2068521, 672500, 4422061, 6436045, 6422804, 4973415, 2100521, -1052175, -1633330, 1462326, 5405357, 6929926, 6408411, 6234737, 6829408, 6901936, 6395055, 6284759, 6173364, 4772350, 2334725, 198424, -1547267, -3488999, -4628712, -3495437, -1158618, -171979, -543380, 224325, 2826184, 5006194, 5370917, 5311490, 6086736, 6837014, 6791955, 6811977, 7292557, 7010875, 5530618, 4263806, 3615254, 1875361, -1019768, -1618055, 2170235, 6773635, 7210240, 4108133, 2635651, 5097793, 8373812, 8924697, 7036752, 5265869, 5207913, 6717814, 8411562]
40554H411562j30004k866332l979084k683683j236051j325857j357196M70532
40546d696113K701656L089432K413003K489231K195237n46144l947508l946360
40538b47566n35290J757504M84861j495998q68579J416306K326285J190110l14395
40529C713238j083250j473889k025548k668493k808488j658490P77308K840471
40521d387141K519533J7431k107130j760353O50846L011088L262715P53005k704895
40512g44901l655633q17245K583760K805922J119702J681377M138495L325590
40504A0437067k174706o376166m226093P03115J596809j519427k632982O27388
40496c564995L844324K767698j228262m050283l803360j270478J855098L662525
$$ y = [8411562, 8281558, 5415226, 1436142, -1247541, -2483592, -3809449, -5166645, -4696113, -1994457, 1094975, 3507978, 5997209, 8192446, 7646302, 3698794, -247566, -782856, 974648, 1459509, -36489, -905068, 511238, 2837523, 4027633, 3713238, 2629988, 1156099, -869449, -3537942, -6346430, -8004920, -7227612, -4387141, -1867608, -1850177, -3957307, -5717660, -5066814, -2055726, 1206989, 1959994, -744901, -4400534, -5217779, -2634019, 171903, 1291605, 2972982, 7111477, 10437067, 8262361, 1886195, -2339898, -1636783, -39974, -1559401, -4192383, -3564995, 279329, 3047027, 1818765, -2231518, -6034878, -7305356, -5450258, -1787733]
40488a787733K894572M78099j087885n70890R15881J744353J174751r00135l599813
40479g38800m442583j496939L291950N234577K351773k180545m018664k362442
40471d361673L49861J839747J750040J009432N81444N33608J43578o45042n35105
40462F65890J136083K574079J653866p82584k147301k075734k230615k446229
40454c652545p55499K227360K945143M00347j713938m97221J933381K242509Q27897
40445C957434L7014R4597p266J91168J130999J012571j510481m082543l632393
40436b808900j218777k32525q93242m68908J593137K731655J607072r7395o10488
40427c98371R3720J558821L171443L280991Q95091j827867j803842L55774J160693
$$ y = [-1787733, 1106839, 1584938, 497053, -73837, 842044, 2586397, 3761148, 2861013, -738800, -5181383, -6678322, -3386372, 1848205, 4199978, 2019433, -1999231, -4361673, -4011812, -2172065, -422025, 587407, 1168851, 1702459, 1846037, 1200995, 665890, 1801973, 4376052, 6029918, 5247334, 3100033, 1024299, -1206316, -3652545, -4408044, -2180684, 764459, 1164806, -549132, -1046353, 887028, 3129537, 3957434, 3994448, 4089045, 4081779, 4272947, 5403946, 6416517, 4906036, 823493, -2808900, -4027677, -4260202, -5153444, -5622352, -4029215, -1297560, 309512, 212117, -398371, -304651, 1254170, 4425613, 7706604, 8601695, 6773828, 4969986, 5325760, 6486453]
40418F486453m19266k002880k263615k339571k259609l40041K597610K868139
40410B327220j56413j997379K79067L179487K010926k104346m286063k751515
40402c499016J51498K155122K701322J492535j130620k916132j734668J392969
40394a386990L447425K883414J96194l433100n881083m512996J68581L313350
40386e205205J712533j031317K80563L956659L899305k55356k271372M57937K776435
40377D320182O41224k309104j410327J264618J346439J20332J551893M131433
40369I656690K758127k189236m565651j853361J339523Q01096j690455k641852
40361A614881k037646j383247m13627J134150J542679j25090j925979k300619
$$ y = [6486453, 6067187, 4064307, 1800692, -538879, -2798488, -3138529, -540919, 2327220, 2170807, 173428, 452495, 3631982, 5642908, 3538562, -747501, -3499016, -3347518, -1192396, 1508926, 3001461, 1870841, -1045291, -2779959, -1386990, 2060435, 4943849, 5140043, 1706943, -4174140, -8687136, -8518555, -5205205, -3492672, -4523989, -4243426, -286767, 3612538, 3357182, 1085810, 1543747, 4320182, 4961406, 2652302, 1241975, 2506593, 3853032, 3973364, 5525257, 9656690, 12414817, 10225581, 5659930, 3806569, 5146092, 5947188, 4256733, 1614881, -422765, -1806012, -2219639, -1085489, 457190, 332100, -1593879, -3894498]
40353c894498k572553l459930k408661J934284N654083M510550O14016p92489
40345d15198N36312M05872k085112l250666j461887N81577J231235K198935L947420
40336A688488L907225J403644m13528M1073J03279j774369k740112r63474L33908
40327A586134j580017l605079j823919J748104K672631J332317J077772J578325
40319B986268K2102k616828k551503K82843K215099J888408J084477J46479j892214
40310A565131l151832q62271K697939K565440m25522m71684L062979M053496K83748
40301I317424k384682l72030R41372l298618p950889n358661K275804N961846
40293h68434K913397j058502j246480O96408J627903J317714O38627m11422j421486
$$ y = [-3894498, -6467051, -9926981, -12335642, -10401358, -4747275, -236725, 377291, -415198, 121114, 526986, -1558126, -4808792, -6270679, -5689102, -4457867, -2258932, 1688488, 5595713, 6999357, 6585829, 6626902, 6730181, 4955812, 2215700, 1252226, 1586134, 6117, -3598962, -5422881, -3674777, -1002146, 330171, 1407943, 2986268, 3008370, 391542, -2159961, -1877118, 337981, 2226389, 3310866, 3457345, 1565131, -1586701, -2448972, 248967, 2814407, 2388885, 1917201, 4980180, 9033676, 9317424, 6932742, 6560712, 7502084, 4203466, -3747423, -9106084, -6830280, -868434, 2044963, 986461, -260019, 436389, 2064292, 3382006, 4020633, 3609211, 2187725]
40284B187725j200943L33760J916406K700546K513182R61713j678177l486361
40276D247851k927106j015087L78747J008070J114342j58475k623590l496644
40268c471892j196469J331242P38222j232907o20765K030291K694705P09793n33281
40259D48939L46788R61012J816p86126l90466j5498J75700J591697L363186K255483
40249G952531j945199m957317l865302q92829O13387N26079J93096l18480q75455
40240c569489j43974J778983K280492J74644j803034r38811J329559J821790J87449
40231A117609j487895k015455j642673o16025O56400J159405P01314N54556J328744
40222b44020J803721J146252L23172o6918j045044k623065k462070N49257L643246
$$ y = [2187725, 986782, 1320542, 3236948, 5937494, 8450676, 9412389, 7734212, 4247851, 1320745, 305658, 684405, 1692475, 2806817, 2648342, 24752, -3471892, -4668361, -3337119, -2598897, -3831804, -4452569, -2422278, 272427, 982220, 448939, 795727, 1756739, 1758555, 972429, 581963, 566465, 742165, 2333862, 5697048, 7952531, 6007332, 1050015, -2815287, -3708116, -3094729, -2568650, -2375554, -2694034, -3569489, -3713463, -1934480, 346012, 520656, -1282378, -2221189, -891630, 930160, 1117609, -370286, -2385741, -4028414, -4644439, -3988039, -2828634, -2127320, -1572764, -244020, 1559701, 2705953, 3029125, 2962207, 1917163, -705902, -3167972, -2618715, 1024531]
40213A024531L653985J234868q37437j605938j651427r33815K68316K43564j350481
40204D6166j654706J072891L525659J900703j509442j349119K165821L338967
40196G536940P5474k869385j569924J242197J110036j302149k080595l33577J221611
40187C030628Q73544j21276j15035O81402R00829k39965k074410k908801j726508
40178a699592L30520J181573P55253J087471K682294K799098o93981n152014n504530
40169d213908p03613M452998M701167N5706m686294n211752j547667K773458M409460
40160B9555L007106Q94789L72546J424762K171766J367671r8832m79482M95030
40151I184911J228525K73940j842476l185488k540588o65160M67557m28238k508804
$$ y = [1024531, 4678516, 5913384, 5075947, 3470009, 1818582, 884767, 1153083, 1396647, 46166, -1608540, -535649, 2990010, 4890713, 3381271, 2032152, 4197973, 7536940, 7612414, 4743029, 3173105, 4415302, 5525338, 4223189, 2142594, 1809017, 3030628, 3904172, 3782896, 3667861, 4349263, 5250092, 5010127, 2935717, 26916, -1699592, -1369072, -187499, 567754, 1655225, 4337519, 7136617, 6442636, 1290622, -4213908, -4917521, -464523, 4236644, 4292350, -393944, -5605696, -7153363, -4379905, 29555, 3036661, 3931450, 4303996, 5728758, 7900524, 9268195, 9169363, 8689881, 9184911, 10413436, 10687376, 8844900, 5659412, 3118824, 2453664, 2921221, 2492983, -15821]
40142a5821l238773r64244K639076L694849O58743l151011l104804J040516M829150
40133B387681M639236J562868j002862j701196j555188j293148n00176P43102
40125C280317J227898K72041j017101r59571N10064J531286M62781j945387l160029
40116B02299j871869L32019R80015k68055j654410j817052q76642O21039K200341
40107b152315K912813K010841L95414k26475J84942J33635o62125p88738K03700
40098B011692J050868J338741K163738L235650K321157p76050k750210j617565
40090F978021n6212j026151k890909k584564j159508j611921k853774j129345
40082f334363K958991M259129Q78562k681301k142967Q62761K227828J180237
$$ y = [-15821, -3254594, -4218838, -1579762, 2115087, 2773830, -377181, -3481985, -2441469, 2387681, 7026917, 8589785, 7586923, 5885727, 4330539, 3037391, 2537215, 3280317, 4508215, 4780256, 3763155, 2803584, 3313648, 4844934, 5307715, 3362328, 202299, -1669570, -1337551, -357536, -625591, -2280001, -4097053, -4973695, -4352656, -2152315, 760498, 2771339, 3166753, 2940278, 3125220, 3258855, 2596730, 1807992, 2011692, 3062560, 4401301, 6565039, 9800689, 12121846, 11345796, 8595586, 6978021, 6921809, 5895658, 3004749, 420185, -739323, -2351244, -5205018, -6334363, -3375372, 883757, 1762319, -918982, -3061949, -2199188, 28640, 1208877]
40074A208877k22765r52677j294198q35978Q62781K313521J393674j383718k829088
40065a739571q09287L011509M699018K150853k448754m636362k530530R99395
40057a303729K022635N05418l36822Q94573K097873J499887L06082Q2694p6189
40048E692422j623163l466021l196955o14884K048251L031498K444675J048749
40040E364572o52718j975542k093334r41175O78739K021994K807234K812187J902036
40031I923993N59490l80085p88876j401290k510295l111785k148141l47496L64585
40022A60100l04663j59183K149287M122055K274782k251463m193891j387433J845083
40013B254674R34379k257094k640501K70491K240184J246402j79518K6747N48920
$$ y = [1208877, 986112, 33435, -1260763, -2096741, -1233960, 1079561, 2473235, 1089517, -1739571, -2548858, 462651, 5161669, 7312522, 4863768, 227406, -2303124, -1303729, 718906, 1224324, 887502, 1782075, 3879948, 5379835, 5685917, 5768611, 5692422, 4069259, 603238, -2593717, -3208601, -1160350, 1871148, 4315823, 5364572, 4711854, 2736312, 642978, -298197, 380542, 2402536, 5209770, 8021957, 9923993, 10483483, 10103398, 9314522, 7913232, 5402937, 2291152, 143011, -204485, 160100, -144563, -303746, 1845541, 5967596, 8242378, 5990915, 1797024, 409591, 2254674, 3189053, 931959, -1708542, -1438051, 802133, 2048535, 1869017, 1895764, 2444684]
40004B444684J24594l1516R04564J469035R49477J199149L075986L984046J740904
39995A5860923j566476k603763j644849j252928j756458j451213l01859q541o81416
39986D593420n47757Q42043J771859J180239J21583j92482m6733k55735q39640
39977F626797j276202j324760j300588j789928k729335k654091r4231L671841
39969h70497M972890K232825j508261k399195o46041O20992J5700j270322k386899
39960a238808l473213l581750j119794K952563M986944K903776j115204l124168
39952b809654j423387K316785M741304L502842m53236l328002k429020P31857
39944H49489K751156K783380K345871J579941q49413l986666m473715j479959
$$ y = [2444684, 2569278, 2537762, 3442326, 4911361, 5860838, 7059987, 10135973, 14120019, 15860923, 14294447, 11690684, 10045835, 8792907, 7036449, 5585236, 5283377, 5274836, 4593420, 4045663, 4887706, 6659565, 7839804, 7961387, 7768905, 7722172, 7466437, 6626797, 5350595, 4025835, 2725247, 935319, -1794016, -4448107, -4542338, -870497, 4102393, 6335218, 4826957, 2427762, 1781721, 2402713, 2418413, 1148091, -1238808, -4712021, -8293771, -9413565, -6461002, -1474058, 1429718, 314514, -2809654, -4233041, -1916256, 2825048, 6327890, 5874654, 2546652, 117632, 849489, 3600645, 6384025, 8729896, 10309837, 9460424, 5473758, 1000043, -479916]
39936d79916J555192J881925J089805J537141K051413L78220k172272k246060
39928C595448L21275K327000K076579J136622P97917l9502k136723l626805k462928
39919A988883L22645J793977Q43605r49231j845544j655474p58451R71945L307247
39910D019602M686975L468564J63467k530954k307205N68597L691907M539154
39902A6300107K102389k353310n615029m784023m17451L319263L005396m6906
39894A1510436j727676o22081O64692L0787q46443N23828L054427L281227M54204
39885A6323401k176807j819352J69823N08078j304047k427156p91498J961796
39877A0444238K608663M96744j781447j833925l29315K99675p45560j684301o90656
$$ y = [-479916, 1075276, 2957201, 4047006, 5584147, 7635560, 8013780, 5841508, 3595448, 3916723, 6243723, 8320302, 9456924, 10254841, 10215339, 8078616, 4451811, 1988883, 2311528, 4105505, 4949110, 3999879, 2154335, 498861, -259590, 712355, 4019602, 8706577, 12175141, 12338608, 9807654, 7500449, 8069046, 11760953, 16300107, 18402496, 16049186, 10434157, 5650134, 5232683, 8551946, 11557342, 11510436, 9782760, 9160679, 9825371, 9856158, 9009715, 9533543, 12587970, 15869197, 16323401, 14146594, 12327242, 12497065, 13005143, 11701096, 9273940, 8482442, 10444238, 13052901, 13549645, 11768198, 9934273, 9604958, 9904633, 9159073, 7474772, 6784116]
39868F784116J575394K701334J528590m19427r83363k97495n64110k662721m300173
39859C362145k824618Q82864L211344K542490J125994J437491K626076K248279
39851A4612065J83201j326451j042439o3473L89089P71632K064567L858366M453450
39842B3900007K694468n52877k846577k442638j09557K093847L779404O322835
39834C2838912R413290R825451N665494J18347j794215P09534M073159N609142
39826F6459114N587586M472975J937913n96146j83305L177116N457785M041922
39818I0354960J402488R81494K102211J999744P09020L22455O89183l82341k955694
39809I5223520m362158l060451m16478J667509K529949K042854O39209K80129
$$ y = [6784116, 8359510, 11060844, 12589434, 12170007, 11186644, 10889149, 10325039, 7662318, 3362145, 537527, 1420391, 4631735, 7174225, 8300219, 9737710, 12363786, 14612065, 14795266, 13468815, 12426376, 12362903, 12751992, 13523624, 15588191, 19446557, 23900007, 26594475, 26041598, 23195021, 20752383, 20642826, 22736673, 26516077, 32838912, 42252202, 52077653, 57743147, 57861494, 56067279, 56776813, 60849972, 66459114, 72046700, 76519675, 78457588, 77861442, 77678137, 80855253, 86313038, 90354960, 91757448, 92738942, 94841153, 96840897, 97549917, 97872372, 98561555, 98179214, 95223520, 90861362, 87800911, 87384433, 89051942, 91581891, 93624745, 94263954, 94544083]
39801I4544083K696690O063417O162621J954188k536102l300699j033720R29672
39793A05480150J210380P64173K57755n30143j437513j962307k082370j707884
39785I9992241k12325K145563L527529K867399J643442J488400J598847R18257
39777A13969353J140015M034250O976931N562956N97688k241193o40489J319335
39769A30718846K92750j187771l7987J513519J66746j901944n19975K703708K470863
39760A34218755j155479k403958Q48729L808815K882419J096300K039811L481633
39752A44817025J599238k024133k678922J80603K631535K442852J499596K134802
39744A50602596M210789O091725O295695M300386J459643M21617J847001K867176
$$ y = [94544083, 97240773, 103304190, 109466811, 111420999, 108884897, 105584198, 104550478, 105480150, 106690530, 107454703, 107712458, 107182315, 105744802, 103782495, 101700125, 99992241, 99779916, 101925479, 105453008, 108320407, 109963849, 111452249, 113051096, 113969353, 115109368, 119143618, 126120549, 131683505, 132281193, 130040000, 129399511, 130718846, 131011596, 129823825, 129785838, 131299357, 131466103, 129564159, 129044184, 131747892, 134218755, 133063276, 130659318, 131508047, 135316862, 138199281, 139295581, 141335392, 144817025, 146416263, 144392130, 141713208, 141893811, 144525346, 146968198, 148467794, 150602596, 154813385, 160905110, 167200805, 171501191, 172960834, 173382451, 175229452, 178096628]
39736A78096628R82157j884424k044145L29777J549630j7100k057742k211345
39728A72743436q36169P00234J879019K432566K070450J494760J910110L158575
39720A85552981M002887M258427M827815N834350O746601P950102R795000J0547727
39712B39515890Q252181M495787K984053L985855L672178j10982m869652p672415
39704B50252895r036616j0664953j2218304j2733331j2990599j3990192j4682662
39697A63936238j3466384j0810563q591137p765377q016583q621971q597826p195712
39689I0870685n169896m258438m755220n180158m875377m916534n745999o115942
39681D9853121n292653m132320l176304k069387j503802k779871m598106l816511
$$ y = [178096628, 179078785, 177194361, 175150216, 175479993, 177029623, 177012523, 174954781, 172743436, 171907267, 172607501, 174486520, 176919086, 178989536, 180484296, 182394406, 185552981, 189555868, 193814295, 198642110, 204476460, 211223061, 219173163, 228968163, 239515890, 247768071, 252263858, 255247911, 259233766, 262905944, 262794962, 257925310, 250252895, 241216279, 230551326, 218333022, 205599691, 192609092, 178618900, 163936238, 150469854, 139659291, 131068154, 123302777, 115286194, 106664223, 98066397, 90870685, 85700789, 81442351, 76687131, 71506973, 66631596, 61715062, 55969063, 49853121, 44560468, 40428148, 37251844, 35182457, 33678655, 30898784, 26300678, 22484167]
39673B2484167p16620M41311j949162l953854k579476o16053j167531j779620
39665A0163162P63407L452652J285206l740752m780396o52963K574692J211520
39657A0276528j220544p75198Q39648J58672k125227k775539j128973O26328J043752
39648D919447P75771P88600Q81833J12380j777488l405480k821968j59316J853439
39639A167218J267730m24282p08012K86227P99541O88428P69886J94656k024065
39630B017327l724829j869042K115181L533601J428363j5753J696106L486172
39622H667126J941863j248776k202792p29048p8458j921555m162353l665003J02908
39613c296088M137498M588016J036619k581494k729849p38814p2225n53716O50260
$$ y = [22484167, 21767547, 22208858, 20259696, 16305842, 13726366, 13110313, 11942782, 10163162, 10926569, 14379221, 15664427, 11923675, 7143279, 6490316, 9065008, 10276528, 9055984, 8280786, 9120434, 9279106, 7153879, 4378340, 3249367, 3875695, 4919447, 5695218, 6483818, 7365651, 7478031, 5700543, 2295063, -526905, -686221, 1167218, 2434948, 2010666, 1302654, 1588881, 2388422, 3076850, 3846736, 4041392, 2017327, -1707502, -3576544, -1461363, 2072238, 3500601, 3484848, 5180954, 8667126, 10608989, 9360213, 7157421, 6428373, 6349915, 4428360, 266007, -3398996, -3296088, 841410, 5429426, 6466045, 3884551, 1154702, 415888, 343663, -210053, 440207]
39604D40207K864177J958145k296258m268332o98730L639839K486232k938693
39596A186587n916314l331440J382976L668725K702872P50178Q4649R40582J515558
39587B984373L65931j073709j47273K480044K878638j76353k655876j190447J654816
39578E120144J478935j167472k215279n85373J063230J214343R28183O61899l78584
39569F120026j515493r34359P22691N97522j678910k866466j082952J079926L37167
39560G79152k598126m215160k747664L68161K846059L740840L335499J927867
39552C436628n56573l504516m740274k299285K291311M415448J815361j993834
39544a135734k244056N35703J881092N81796J75752K476404M060225J740690j953478
$$ y = [440207, 3304384, 5262529, 2966271, -1302061, -2000791, 1639048, 4125280, 1186587, -4729727, -8061167, -6678191, -3009466, -306594, 443584, 528233, 1468815, 2984373, 3350304, 2276595, 2129322, 4609366, 7488004, 7311651, 4655775, 3465328, 5120144, 6599079, 5431607, 3216328, 2630955, 3694185, 4908528, 5836711, 6498610, 6120026, 4604533, 3670174, 4392865, 4990387, 3311477, 445011, -637941, 441985, 779152, -1818974, -6034134, -8781798, -8413637, -5567578, -1826738, 1508761, 3436628, 2880055, -624461, -5364735, -7664020, -5372709, -957261, 858100, -1135734, -3379790, -2844087, -962995, -381199, -205447, 2270957, 6331182, 8071872, 6118394]
39535F118394k404168J06719J075100j262130l578977k712835J3412J326148N61824
39526g56513l65793k58970K02838J61971l24341r41914j494616j441093k82745
39517e501176J287344J786460R21680M8631J39358M82197J19429o25757r67048
39508b308882q47114l90400N06749J057039j30383k194294j775137J924502M242953
39499H5033R69909m650929n643131j264299K237906J318630k86708J293892L934667
39490b005030L976669K199455J166771L65635j456341k211013K85991L290315
39482E612452K523405r47617k411957j097967o39642k162916k472203j43173J658623
39473h0995M57654j560147j347364L75213R38209R390m52560O44494K302125K832890
$$ y = [6118394, 3714226, 3820945, 4896045, 3633915, 54938, -2657897, -2644485, -1318337, -756513, -1122306, -1381276, -1178438, -1016467, -1340808, -2282722, -3777338, -5218431, -5501176, -4213832, -2427372, -1505692, -1457061, -1317703, -835506, -716077, -1341834, -2308882, -3155996, -3546396, -3039647, -1982608, -2112991, -4307285, -6082422, -4157920, 85033, 1054942, -3595987, -9239118, -10503417, -8265511, -6946881, -7233589, -5939697, -2005030, 1971639, 4171094, 5337865, 5703500, 4247159, 2036146, 2322137, 5612452, 8135857, 7188240, 4776283, 3678316, 3038674, 875758, -1596445, -1739618, -80995, 376659, -1183488, -2530852, -2155639, -1217430, -1208040, -1660600, -1016106, 1286019, 4118909]
39463D118909J524661o26217j660877q80868L0675o86811k100368j912542n079
39454b198517J521673J515772O50417o12339k344715l461529k475342k82112M89052
39445g197640n99606j154655J98196K006929K738810K617647J899924J78845j472929
39436g84479o33787K512577M023080J132190l666930n590753l150146J018257
39428e139991L624870L386997J183279j074418k190615k678801l207455k654642
39420h750776J54304L182552K900010k12227j477829J231763M180111L463777
39412D671685O54874l99118L18878n1261j831975k412937r46256O7965j413933
39403a342078l911283m124790p13919L965694N651447K400338k630927m023329
$$ y = [4118909, 5643570, 5017353, 3356476, 2475608, 2506283, 1819472, -280896, -2193438, -2198517, -676844, 838928, 1489345, 877006, -1467709, -4929238, -7404580, -7686692, -7197640, -7797246, -8951901, -8753705, -6746776, -4007966, -1390319, 509605, 688450, -784479, -1418266, 1094311, 5117391, 6249581, 2582651, -3008102, -6158248, -5139991, -1515121, 1871876, 3055155, 1980737, -209878, -2888679, -6096134, -8750776, -8596472, -5413920, -2513910, -2726137, -4203966, -2972203, 1207908, 4671685, 5326559, 4927441, 5246319, 5195058, 3363083, 950146, 3890, 71855, -1342078, -5253361, -9378151, -10092070, -6126376, -474929, 1925409, -705518, -4728847]
39395d728847m69223L400763K786098j447775m374515k962498J380911N005958
39387a409128N067593J518380k399391k861688M222J933654L10210k158124j847983
39378a842255Q7560p1430k240492k530445N10339L507830L092281J85023j933061
39369a234650j783852m57600N31076P99828Q52758J000059P96762j20178q29588
39360d45385N2628J982821K464540L36595k461578l588608l088590k013975j88777
39351f950329K479748M116457L033746P61997J96679J341344J598927J9531j435384
39342E162716j112912J36990N56411l51859j708893k271500j526134m52494o02336
39333b170011j784177j938990k62269J338845J347392J083733J975774K580211
$$ y = [-4728847, -5198070, -1797307, 988791, -458984, -4833499, -7795997, -6415086, -1409128, 3658465, 5176845, 2777454, -84234, -80012, 1853642, 2163852, 5728, -1842255, -1754695, -1826125, -4066617, -6597062, -6086723, -2578893, 513388, 698411, -1234650, -3018502, -3476102, -2945026, -2145198, -1292440, -292381, 504381, 384203, -445385, -392757, 1590064, 4054604, 4391199, 1929621, -1658987, -4747577, -6761552, -6950329, -4470581, -354124, 2679622, 3441619, 3638298, 4979642, 6578569, 6598100, 5162716, 4049804, 4186794, 4743205, 4391346, 2682453, 410953, -1115181, -1567675, -2170011, -3954188, -5893178, -6155447, -4816602, -3469210, -2385477, -409703, 2170508]
39325B170508J122929q97544r01840N08639R43119N38376J101312J967868Q50832
39316G404199j623409k347148p21436O63221N01811J36716J59688n41198j795893
39307A836551j843201o63686k41688r68794j074420K1940J080519J762203K495114
39298B404538K067587n70486k816662j648535M46559j152897m431533k964140
39290h665569K490667L624237j586957m296979R00823O350358L507098l204060
39282h80382m065397M23654K209678p9436o10118J708723J710355j315364j633618
39273b531905K352126M765563K400581j80083N29369P23153l168164p085562n452118
39264g647040j46901K624023J490576L27018J152104J819558O51360o69454J71216
$$ y = [2170508, 3293437, 2395893, 1494053, 2002692, 2945811, 3484187, 4585499, 6553367, 7404199, 5780790, 3433642, 2712206, 3375427, 3877238, 4013954, 4173642, 3632444, 1836551, -6650, -670336, -912024, -1880818, -2955238, -2933298, -1852779, -90576, 2404538, 4472125, 3901639, 1084977, -563558, -116999, -1269896, -5701429, -8665569, -6174902, -2550665, -4137622, -8434601, -7533778, -1183420, 2323678, -880382, -4945779, -4522125, -2312447, -2391883, -3002001, -1293278, 417077, -898287, -2531905, -179779, 4585784, 6986365, 6806282, 7335651, 8058804, 4890640, -2194922, -7647040, -7793941, -5169918, -3679342, -3352324, -2200220, -380662, 270698, -398756, -227540]
39255b27540K653212L740058J335799k707967l884886n95792K821819J347527
39247D482230l387601n003920j529566K132138J981198J18318j33995M99540J70335
39238f71323p1050R58805J341163l23515j319451P04998K693438P02897l038727
39229I77235l299804l57805Q18274q38875j206294J192618K481370N24691r86270
39220f94860J321634M772457M735179J249392k016718l091063k609317j156955
39212B509749R78468K354025J561997m97641j683720j521150j201147j220176
39204A280405r29117k00539J60378k67693r81077j268043o66818Q10498K078378
39195A6372J449961j050978k692008j056300K358181L487363Q44523k460166k644637
$$ y = [-227540, 2425672, 6165730, 7501529, 4793562, 908676, 312884, 3134703, 4482230, 1094629, -3909291, -5438857, -3306719, -1325521, -1207203, -1341198, -841658, -671323, -742373, 216432, 1557595, 1234080, -85371, 619627, 3313065, 4015962, 977235, -2322569, -2680374, -1862100, -2700975, -3907269, -2714651, -233281, 291410, -694860, 626774, 5399231, 10134410, 11383802, 9367084, 6276021, 3666704, 2509749, 3488217, 5842242, 7404239, 6906598, 5222878, 3701728, 2500581, 1280405, 351288, 150749, 311127, 43434, -937643, -2205686, -2872504, -2062006, 16372, 1466333, 415355, -2276653, -3332953, -974772, 2512591, 3357114, 896948, -1747689]
39186a747689O5358J895538K58943l076880m037559j078715K869899L830149J490844
39177D69888p67837m47561J218296J710816P72306p2787l18204p30781j288768
39168E45368r52900L48988J271670J012133K59196k60097p51142j258060j014907
39159g99751J62247R92759L91024q34820j159236n90956l82767p78686n73792
39150c573978P54473J810759J099128o73777j270833J97277K108680K412595J049902
39141C914226m09895r66145r98272j072656j111701j010990j009030r19373J4652
39132c569184J746415K792637J957677M6153j158700j082796m70634J73623R86750
39123A421941J800482J974909J198329l10176k074560l109928k216236K45931
$$ y = [-1747689, -1682331, 213207, 472150, -2604730, -6642289, -7721004, -4851105, -1020956, 469888, -297949, -745510, 472786, 2183602, 2955908, 2883121, 2564917, 1834136, 545368, -407532, -58544, 1213126, 2225259, 2484455, 2224358, 1473216, 215156, -799751, -637504, 355255, 746279, -88541, -1247777, -1838733, -2221500, -3000186, -3573978, -2819505, -1008746, 90382, -583395, -1854228, -1656951, 451729, 2864324, 3914226, 3504331, 2538186, 1539914, 467258, -644443, -1655433, -2664463, -3583836, -3569184, -1822769, 969868, 2927545, 2973698, 1814998, 732202, 261568, 435191, 1421941, 3222423, 5197332, 6395661, 6085485, 4010925, 900997, -1315239, -1069308]
39115a069308J762582N76624j525014j409917R55284K706990K435734J464749
39107E897724O75378o36178j968093j261862J068137J366685j532958l304862
39099C03971l98772L658725K914506j857107m035924r47411K699366K558105Q63605
39090E759064J879658M732535M869774J075423k922626l901216l011407l020455
39082E460750l890540l207240l13741K240032K168753O93410N29691J561983J063431
39073F306529j677668l833855l289213j619727q85264j88775J692474K734107
39065g61392O97866j917656o82612L524752N043289J730929k160693k834752j853802
39056G85929j776561j403029J013398L292642K300396q16937k398433j739140
$$ y = [-1069308, 693274, 1269898, -255116, -1665033, -709749, 1997241, 4432975, 5897724, 6573102, 5936924, 3968831, 2706969, 3775106, 5141791, 3608833, 303971, -94801, 3563924, 6478430, 4621323, 585399, -362012, 2337354, 4895459, 5759064, 7638722, 12371257, 17241031, 18316454, 15393828, 11492612, 8481205, 5460750, 1570210, -1637030, -1950771, 289261, 2458014, 3151424, 3681115, 5243098, 6306529, 4628861, 795006, -2494207, -4113934, -4999198, -5187973, -3495499, -761392, -63526, -1981182, -2663794, 860958, 5904247, 7635176, 5474483, 2639731, 785929, -990632, -2393661, -1380263, 1912379, 4212775, 3395838, 997405, -741735]
39048g41735r70907o59497N03029K115342K064330L23041o86564j16914J6692
39039A846817j500210k878993k109398J81869J995253K444677J805425N10341
39031B295781p04404p81719L56171J255497O44951q54390j516759o11607R15051
39022I98572J641017J108461Q5014m61217m89916o61709j065644r92097k67281
39013a04800K20145j1321j30088M97057J024140O11047M6581K79215L90580r36948
39003A885608k690305k566157m07802J689712K576823K955937K991583J631626
38995H067025r80963k772447k464376j133075j39232N62328J010031J27138k470860
38986a94431n013680n350391l196003K19575L431072M959750L960481J615021
$$ y = [-741735, -1712642, -2372139, -1869110, 246232, 2310562, 2633603, 1947039, 1830125, 1846817, 346607, -2532386, -4641784, -4459915, -2464662, -19985, 1785440, 2295781, 1591377, 809658, 1165829, 2421326, 3066277, 2211887, 695128, 83521, 998572, 2639589, 3748050, 3833064, 3371847, 2881931, 2220222, 1154578, 162481, -104800, 115345, 104024, -26064, 470993, 1495133, 2106180, 2152761, 2431976, 2822556, 1885608, -804697, -3370854, -3778656, -2088944, 487879, 3443816, 6435399, 8067025, 7086062, 4313615, 1849239, 716164, 576932, 1139260, 2149291, 2276429, -194431, -5208111, -10558502, -13754505, -13534930, -10103858, -5144108, -1183627, 431394]
38978D31394J74695k32839j649786m077000m157234k52602M014834M468159K253081
38969I72702J146572R52390j480139n435398o133017k278286J419773J397495
38961i437908K00713J245883K856281J787004m77787q9945K245678K167674q24373
38952c26780k100806P03542L758314K807726q11127k782162j758292L11876J845711
38943A648002K497166J624685r67826l203523k424844R37501L460640K640098
38935F211899q26501m312119n200022k308837K433945M400505J057022l930077
38927b474185m469664r0575L345450J970195r06467l24504K892592L870459J060513
38918D873814k028651k229677n26122L41807k62670q06373k99497K96213l82103
$$ y = [431394, 606089, 373250, -1276536, -5353536, -9510770, -9763372, -5748538, -1280379, 972702, 2119274, 3071664, 1591525, -3843873, -9976890, -12255176, -10835403, -9437908, -9237195, -7991312, -5135031, -3348027, -3825814, -3915759, -1670081, 497593, -326780, -2427586, -1724044, 2034270, 4841996, 4030869, 1248707, -509585, -197709, 1648002, 4145168, 5769853, 4802027, 1598504, -826340, 111161, 3571801, 6211899, 5385398, 1073279, -4126743, -6435580, -4001635, 398870, 1455892, -2474185, -6943849, -7034424, -3688974, -1718779, -2625246, -2949750, -57158, 3813301, 4873814, 2845163, 615486, 89364, 431171, 168501, -637872, -937369, -641156, -1023259]
38909a023259j683841j176104J899217M496145L172033p92224k536592l64709
38901A990666J914143Q50489j760142k376623j189475p77459j467612j702698
38893d518711j518949j920201j867290K98574L116790L518861J730299Q65884
38885b94743J742818J977282M97045q85704r79455o83375m01581M00054O33181
38876B005522j379732l703776k215185K537900M811673K063629j108558l92053
38868B619420J732090R83827j418064j505608L91137P52178p07083r08515R94289
38859B933671K491295K099565R78879L4890j258100k901597l928619l896742k705947
38850f152705J88599L950137N207621K008047k354991l249468j330460q19986
$$ y = [-1023259, -2707100, -3883204, -1983987, 2512158, 5684191, 4891967, 2355375, 1990666, 3904809, 4755298, 2995156, 618533, -570942, -1348401, -2816013, -4518711, -6037660, -7957861, -9825151, -9526577, -6409787, -2890926, -1160627, -294743, 1448075, 3425357, 3922402, 3036698, 2057243, 1373868, 972287, 1372341, 2005522, 625790, -3077986, -5293171, -2755271, 2056402, 4120031, 3011473, 2619420, 4351510, 5335337, 3917273, 2411665, 2802802, 3554980, 2847897, 1939382, 2933671, 5424966, 7524531, 8503410, 8538300, 7280200, 4378603, 449984, -3446758, -6152705, -5964106, -2013969, 3193652, 5201699, 2846708, -402760, -1733220, -2553206]
38842b553206j926816m85164M148759O557611L118234k267421l745217j405061
38834A441719K00638q39315k164217j748778o16409n37755j334470j393089J23985
38825f867691K230683L166948K355271R28852K1816n97423j278598j094086M97976
38816f36252J659982L94182j890666k051739k07020M08097j147794k105637r30615
38807f507462L87810O57265J827473M371748M527426M1213m764979m382460j30134
38798c972100K261562J353286P01848J548671Q41382k442763m503891k558338
38790f770343Q75117K232014J871716J864518J904557Q13225k25636M60031J512032
38781D537231M91289j687234j911916O370J097901K90717r7913J063208J393273
$$ y = [-2553206, -4480022, -4965186, -816427, 5741184, 8859418, 6591997, 2846780, 1441719, 1642357, 803042, -1361175, -3109953, -3726362, -4264117, -5598587, -6991676, -6867691, -4637008, -1470060, 885211, 1814063, 1835879, 1238456, -40142, -1134228, -636252, 1023730, 1417912, -472754, -2524493, -2731513, -2323416, -3471210, -5576847, -6507462, -6119652, -5462387, -3634914, 736834, 5264260, 5305473, 540494, -3841966, -3972100, -1710538, -357252, 344596, 1893267, 2734649, 291886, -4212005, -6770343, -5895226, -3663212, -1791496, 73022, 1977579, 2790804, 2565168, 3025199, 4537231, 5028520, 3341286, 1429370, 1435740, 2533641, 2824358, 2726445, 3789653, 5182926]
38772E182926o34746k204011k15137L263495L400055l17832l272382k458216l94486
38763B349666n81979k076623j546192R69485J938916n7750j924977o35384K223751
38754F58913K787463N32512j136977J5263J842605R44919k568820n233427m552909
38745f710458j479404J424921K737372K596655J694722P60116K88885M5848n62773
38736G95884j187819o51631R59717J722683O76111k73311P52860K081083P13415
38727E588992k511046l445069p77691J904191J609391Q9184J32746P08483q62281
38718B436900l843450m839284k673626P49790L766485N826540N556375J753217
38710H732947l214978m602040j192131K777954K952005k98802l588528m617440
$$ y = [5182926, 4548180, 2344169, 2129032, 5392527, 8792582, 8474750, 5202368, 2744152, 2349666, 1767687, -308936, -1855128, -885643, 1053273, 995523, -929454, -1564838, 658913, 3446376, 3978888, 2841911, 2857174, 4699779, 5644698, 3075878, -2157549, -6710458, -8189862, -6764941, -4027569, -1430914, 263808, 1023924, 1312809, 1358657, 795884, -391935, -1043566, -83849, 1638834, 2314945, 2041634, 2794494, 4875577, 5588992, 3077946, -367123, -1144814, 759377, 2368768, 2457952, 2590698, 3299181, 2436900, -1406550, -6245834, -8919460, -8169670, -4403185, 1423355, 6979730, 8732947, 5517969, 915929, -276202, 2501752, 5453757, 5154955, 1566427, -3051013]
38702c051013l075213K05137L147153L397346J209666l10393N46480J542597J12167
38693C723927k500906l248971j779022p4209J133416K406826K831955P54242k562301
38684F84957l398140o55732K347499K447010N47830o09012m65474l76778p70093
38675b47933q04927k75058K0302k99040p16518o92174o6603J105031K186750J920904
38665B130734r660j727166r91296J614252K839546O72426l112516n039065l642944
38656g265689l83701K289260K904073J656703N2890n00449k56576n63613j301252
38647c368354l99063K717547M820331K594654k123137m003295j352757J722628
38639F08554J441148o74182j195233l25247p06906k404973k796963j004772R20376
$$ y = [-3051013, -6126226, -5921089, -2773936, 623410, 1833076, 1522683, 2069163, 3611760, 3723927, 1223021, -2025950, -3804972, -3879181, -2745765, -338939, 2493016, 3247258, 684957, -2713183, -3368915, -1021416, 1425594, 1973424, 1364412, 898938, 522160, -247933, -1052860, -1327918, -1307616, -1606656, -2323174, -3015348, -3081951, -1976920, 209830, 2130734, 2121074, 393908, -597388, 1016864, 3856410, 4528836, 1416320, -3622745, -7265689, -7649390, -5360130, -2456057, -799354, -746464, -1246913, -1503489, -2067102, -3368354, -3767417, -1049870, 3770461, 6365115, 4241978, 238683, -1114074, 608554, 2049702, 1375520, 180287, -144960, -851866, -3256839, -6053802, -7058574, -6138198]
38630f138198J437168J192617P49507n72973k561323l193760j299698J514109
38622h872551K848041K154373M88329j037080j565216n02452J678075L454374
38614a354107L854900L325488K628415J892618J121542M73180l82564j961637
38606I597835l611370l752962j904185P97804L244132M896525M636338J450675
38598A5354792k986861m907848l024217l75296m7357j152371r96009O60462J841472
38589D366767J517952K90488j080839j871754j162965O93029J506266J09263j450098
38580B918109p55161J187807J535741m5486j422582j685647j835870k059104j270128
38571c432321M45034J588134J729597J786769J688842M16604j347677j509808
$$ y = [-6138198, -4701030, -3508413, -2758906, -3331879, -5893202, -9086962, -10386660, -8872551, -6024510, -3870137, -3381808, -4418888, -5984104, -6486556, -4808481, -1354107, 2500793, 5826281, 8454696, 10347314, 11468856, 11942036, 11559472, 9597835, 5986465, 2233503, 329318, 1127122, 4371254, 9267779, 13904117, 15354792, 12367931, 7460083, 4435866, 4060570, 4013213, 2860842, 1864833, 2525295, 4366767, 5884719, 6175207, 5094368, 3222614, 2059649, 2752678, 4258944, 4368207, 2918109, 2162948, 3350755, 4886496, 4841010, 3418428, 1732781, -103089, -2162193, -3432321, -2987287, -1399153, 330444, 2117213, 3806055, 4222659, 2874982, 1365174]
38563A365174j82686l1894j813975k508851J79810L871383M441398J351882k208590
38554D463651l499710k539462r59360l85043j531710l345484l374413m37593L307754
38545h301370M390063K113960p11797j383286l25138K69363j57614O4494J925944
38536b115381L625020K574245j002444m010374m225941k565791r67151L09718
38528h378099J862560L045553K695772J243375J59696k49019o66223r09444l20886
38519a516715M04850R7549m63080L78242J732925R48577j670551k365417M05751
38510b047869L041255J804747j905602l984849l208239j457267K128J253472J730130
38501d772094P53552k48389Q71717L247165L541488P75093k096059k434057j319418
$$ y = [1365174, 1182488, 1150594, -663381, -3172232, -2992422, 878961, 5320359, 6672241, 4463651, 963941, -1575521, -2534881, -2919924, -4451634, -7797118, -11171531, -11609124, -8301370, -3911307, -1797347, -2509144, -3892430, -4217568, -3948205, -4105819, -4041325, -2115381, 1509639, 4083884, 3081440, -928934, -5154875, -7720666, -8687817, -8378099, -6515539, -3469986, -774214, 469161, 628857, 379838, -286385, -1195829, -1516715, -1111865, -1014316, -1477396, -1099154, 633771, 1582348, -88203, -2453620, -2047869, 993386, 2798133, 892531, -3092318, -6300557, -7757824, -7755696, -6502224, -4772094, -4018542, -4266931, -3395214, -148049, 3393439, 4168532, 2072473, -361584, -1681002]
38492a681002j173646j922043j570122L65213J988170J568948l46580j727354
38484d498416j347000P7119R58782Q05297N98505J015583J190391K72200n85820
38475a513359L83121K372034K474388j1570k083687j297403O16303O26612q71741
38466F94698j250529m84443j000476k641121j976235J818374M328093K067029
38458A555390j797859j765663J943379M092804K383685J4813k05703J53112j195213
38449E178745l177772l358270j596843M43997J605330J385198k96126k022443
38441a838184j717975L4698R0440k219500l299303q93969J955467J882665P38745
38432e266916J781923L315819J652399j617862j621144J387497K282985O3028
$$ y = [-1681002, -2854648, -4776691, -6346813, -5981600, -3993430, -2424482, -2771062, -4498416, -5845416, -5768297, -4809515, -4004218, -3405713, -2390130, -1199739, -927539, -1513359, -1130238, 1241796, 3716184, 3704614, 1620927, 323524, 939827, 1566439, 694698, -555831, -1040274, -2040750, -4681871, -6658106, -4839732, -511639, 1555390, -242469, -2008132, -64753, 4028051, 6411736, 6426549, 6220846, 6373958, 5178745, 2000973, -1357297, -2954140, -2510143, -904813, 480385, 184259, -1838184, -3556159, -3521461, -3431021, -5650521, -8949824, -9843793, -7888326, -6005661, -5266916, -3484993, -169174, 1483225, -134637, -1755781, -368284, 1914701, 1977729]
38424A977729l55376K909504M759793J527820k580165k092377J243141J881651
38416I271720p47660k408802j350475k50034j146588k625410k561307p90965J330917
38407a278604K091380M16180k509092l373121n22515L199872L636142O77488j893223
38398D44507j535697M04788J200726j25372k410001l582968k215581R40163L130095
38389c749340K468778K97749m78942J023799K987788L406799K045743P5710j218444
38380F859640j383317r88510p47093n35592l4860L2493j134815k429001j981874
38371b342929l77659l4548r89951o15394J445702J873743p99697l069513j711098
38362f621344J332267K654383K620060K974787K454777m42015k942044j628632
$$ y = [1977729, 1622353, 4531857, 9291650, 10819470, 8239305, 6146928, 7390069, 9271720, 8524060, 6115258, 4764783, 4514749, 3368161, 742751, -1818556, -2609521, -1278604, 812776, 1228956, -1280136, -4653257, -5175772, -1975900, 1660242, 2337730, 444507, -1091190, -686402, 514324, 388952, -2021049, -5604017, -7819598, -6879435, -3749340, -1280562, -982813, -1461755, -437956, 2549832, 5956631, 8002374, 8078084, 6859640, 5476323, 4487813, 3740720, 3205128, 3170268, 3202761, 2067946, -361055, -2342929, -2720588, -2755136, -3745087, -4360481, -2914779, -1041036, -1840733, -4910246, -6621344, -5289077, -2634694, -14634, 2960153, 5414930, 4972915, 2030871, 402239]
38354D02239J274170Q68911k383218l399921o63562K230868L230104M031404M932351
38345A0523346L458652l11626k582279j946067j463355k539603k113678J173947
38337D199337L235515Q32605k742709k627606L86429J973339R27143o07982j469990
38328D106081j884821j136883J174619K681744Q11994k905934m513882l082792
38320d749874j252995n95282K95064K567705M622336L963113K77617l931657n337217
38311d141190k773246J279476L018571J574715l44479m55435N08296J107339J598679
38302A372726K319126K042467K10087j209850n31043P82486N86102l64546j09408
38293E098147P97066L40349j302988k164554j684302q09452R9989Q25406J27066
$$ y = [402239, 1676409, 2545320, 162102, -3237819, -3901381, -1670513, 1559591, 5590995, 10523346, 13981998, 13670372, 11088093, 9142026, 7678671, 5139068, 3025390, 4199337, 7434852, 8267457, 5524748, 2897142, 3283571, 5256910, 6184053, 5576071, 4106081, 2221260, 1084377, 2258996, 4940740, 5752734, 2846800, -1667082, -4749874, -6002869, -6598151, -6303087, -3735382, 886954, 4850067, 5127684, 1196027, -4141190, -6914436, -5634960, -2616389, -1041674, -1386153, -1841588, -1333292, -225953, 1372726, 3691852, 5734319, 5944406, 4734556, 4203513, 4985999, 5572101, 5207555, 5098147, 5895213, 6235562, 4932574, 2768020, 1083718, 274266, 374255, 1199661, 1326727]
38284A326727j979288k432647O82085L756514K103431k301415l060255P00656
38276a204192K798862j08203l319536j994525J252359J375126o84765l62545K214095
38267c3324K447383p34495k870799j013203K047310K664278J579570J452234J975506
38258G514460R02818j538967k721639j764530n60123l63329k06431M34228K26284
38249A922771j097051j026351J902791M635906L374035m31461j905348k19813
38241G155479M00721j938601l375763q80902K150601J024428k721726l815912
38233b001675j383472N96828K18296j80781Q72613J622025J089653J016306J916063
38224C765856J220575k107191m569279k849473J072598K760868J347451m99932
$$ y = [1326727, -652561, -3085208, -2403123, 1353391, 3456822, 1155407, -1904848, -1204192, 1594670, 1486467, -1833069, -3827594, -2575235, -1200109, -1884874, -2247419, -33324, 2414059, 1679564, -1191235, -2204438, -157128, 2507150, 4086720, 5538954, 7514460, 8417278, 6878311, 4156672, 2392142, 1832019, 1468690, 1262259, 1696487, 1922771, 825720, -200631, 1702160, 6338066, 9712101, 9280640, 7375292, 7155479, 7556200, 5617599, 2241836, 1360934, 3511535, 4535963, 1814237, -2001675, -3385147, -2788319, -2570023, -2750804, -1878191, -256166, 833487, 1849793, 3765856, 4986431, 2879240, -1690039, -4539512, -3466914, -706046, 641405, 141473]
38216A41473j175596j342425j294790l65869J003572J260789J31742j027789j425700
38207d094593j505534j395892o52084K80234K97583l37843j20764J118899J748904
38198d661090J101710O18017J162587J284070k11765j759117j264679M27750P60950
38189b541567n51676j362024p26711r556K2563M22387J372678J084615p87664
38180c076955j269369J572346M418565K619124k580495n000784k151871J410829
38172d058610J156982r78847n60616J863997J843094j392946l229414o09927L215589
38163b750698L313306n3514k214763p55385J703519J810600J2969q35414R6231
38154C26851Q16915n5265j240513j038047M3731L73812j63012l79989p1666k06043
$$ y = [141473, -1034123, -2376548, -3671338, -4037207, -3033635, -1772846, -1641104, -2668893, -4094593, -5600127, -6996019, -7648103, -7367869, -7070286, -7408129, -7528893, -6409994, -4661090, -3559380, -2941363, -1778776, -494706, -706471, -2465588, -3730267, -3302517, -2541567, -3093243, -4455267, -5181978, -5191534, -5168971, -4746584, -3373906, -2289291, -3076955, -4346324, -2773978, 1644587, 4263711, 1683216, -3317568, -5469439, -4058610, -2901628, -3880475, -4441091, -2577094, -734000, -2126946, -5356360, -5966287, -2750698, 562608, 509094, -1705669, -2461054, -757535, 1053065, 1066034, 230620, 326851, 1143766, 1088501, -152012, -1190059, -1146328, -772516, -935528, -1315517, -1387183, -1593226]
38144a593226r61329j381909j129893q86729q30309m26908J13646P5649L8799
38135f982209J132076K235949Q47661k399765l386422m25616K714479K282560
38127c981287O7937Q3906K123006K683432R50918l46702K63300J078513M37178
38118C360201j069141j991043j439565P60599L347879L793332J434237p23890
38110G472609k9675J493333L27250k528784l158072j393387p55230j875030j557120
38101b004106P90079J540553n03162j448643R22058K942505J255478j416521j093500
38092I84741O84552r8969k810661l291574p29999J338530N56221j536974k408717
38083g312850j382897M57369J368826M14241j036074o92249Q68083N14169j855173
$$ y = [-1593226, -2554555, -3936464, -5066357, -5953086, -6783395, -7210303, -7096657, -7021008, -6982209, -5850133, -3614184, -2766523, -5166288, -8552710, -8978326, -6263847, -3981287, -3913350, -3829444, -1706438, 976994, 1927912, 1581210, 1844510, 2923023, 3360201, 2291060, 300017, -1139548, -378949, 2968930, 6762262, 8196499, 7472609, 7442934, 8936267, 9263517, 6734733, 3576661, 2183274, 1428044, -446986, -2004106, -1214027, 326526, -176636, -1625279, -703221, 2239284, 3494762, 2078241, 984741, 1669293, 1570324, -1240337, -4531911, -5261910, -3923380, -3367159, -4904133, -7312850, -8695747, -8238378, -6869552, -6455311, -7491385, -8183634, -7315551, -6801382, -8656555]
38074h656555j881378K194936N186140K223425l183454m156970r08402O20321
38066h561937q00922k90247L509002N108247J319034k794181j450181L086696
38058h74489M254160Q10964k232581j227041J686984K104928j226338n274591
38050a978004o043164k762315J270771K549698J429604Q11950J480563J477696
38042a763201K16575p8674J736642L380535K585247M80384n50708l54706j14455
38033E537639K75058J434590K302347J240320j205995k808291k681489k014715
38025B079464j883854j951540j549229q01751k04319K49923J010225K058170K377775
38016A384864R96844j239859k090643j007943l33575j645014k567296k57590L118107
$$ y = [-8656555, -10537933, -8342997, -3156857, -933432, -4116886, -8273856, -9182258, -8561937, -9362859, -9653106, -6144104, -1035857, 283177, -2511004, -3961185, -874489, 3379671, 4190635, 1958054, 731013, 2417997, 4522925, 3296587, -1978004, -8021168, -10783483, -9512712, -6963014, -5533410, -4721460, -3240897, -1763201, -1546626, -1625300, 111342, 3491877, 6077124, 6557508, 6006800, 5652094, 5537639, 5812697, 7247287, 9549634, 10789954, 9583959, 6775668, 4094179, 2079464, 195610, -1755930, -3305159, -4106910, -4311229, -4061306, -3051081, -992911, 1384864, 2381708, 1141849, -948794, -1956737, -2290312, -3935326, -6502622, -6760212, -3642105]
38007c642105K624708j726197m287664k106863R32755Q42674l21393R98569L115476
37998c570040K038795j354072k569562o78347J042159J165384J560535K464525
37990I9377J344592j917250l407627r66643K306766K895242J868884K094670L176271
37981G494282K620398L55627j321306j563954j763894k667493l214254k577640
37973b638234j454913p75980m10101L41125J690156K982790L003603J091395j496437
37964B333404k179591j39381J965745J025473k159223l621805j692329N40503
37956c927204l34510k951116k993620M67465L385731K396598m78934r54717J376653
37947d013654L079810K522746J857275K426116J886021j463765m414337k895977
$$ y = [-3642105, -1017397, -2743594, -7031258, -9138121, -8205366, -7362692, -7684085, -6685516, -3570040, -1531245, -2885317, -5454879, -6133226, -5091067, -3925683, -2365148, 99377, 1443969, -473281, -3880908, -4847551, -2540785, 354457, 2223341, 4318011, 7494282, 10114680, 10470307, 9149001, 7585047, 5821153, 3153660, -60594, -2638234, -4093147, -4869127, -5279228, -4938103, -3247947, -265157, 2738446, 3829841, 2333404, 153813, 14432, 1980177, 3005650, 846427, -2775378, -4467707, -3927204, -4261714, -7212830, -10206450, -9738985, -6353254, -3956656, -4435590, -5390307, -4013654, -933844, 1588902, 3446177, 5872293, 7758314, 6294549, 1880212, -1015765]
37939a015765J230421K070095j622101m397955k211928J869629K883054J180406
37931a4144L92290P66572m35721k782714k222695K158948N473873L489809j556891
37922E269327m444433l811994k300903j498977m57672J060236J352485k97786
37914e129717j981126j659560L99865K591937L728542K994175Q8041l227500l592032
37905e787375o6396L677097L471947K5732k339158j726228n01266q85103j765109
37896e895859j158882N42607J509135J061727j10700r75887l27009K336619M868615
37887A850366L628504j446188n147309l218321J550151L034398M10167j271871
37879f10103Q31109L306503K127839j495949l473134k349571J93143K421374L495728
$$ y = [-1015765, 214656, 2284751, 662650, -3735305, -5947233, -4077604, -1194550, -14144, 378146, 1144718, 708997, -2073717, -4296412, -2137464, 3336409, 6826218, 5269327, 824894, -2987100, -5288003, -6786980, -7244652, -6184416, -4831931, -5129717, -7110843, -8770403, -8370538, -5778601, -2050059, 944116, 1032157, -2195343, -5787375, -5853771, -2176674, 1295273, 1321005, -1018153, -2744381, -3245647, -4130750, -5895859, -7054741, -6512134, -5002999, -3941272, -4051972, -5027859, -5354868, -3018249, 1850366, 5478870, 4032682, -1114627, -4332948, -2782797, 251601, 661768, -610103, 221006, 3527509, 5655348, 4159399, 686265, -1663306, -1470163, 951211, 4446939]
37870D446939K715502L85070j371922q76403N85392L83792j852595l979774m147637
37861c711636k270196O58572L020820K979807L02280k550289k829406p31527J193074
37852c938501J308649O3920j361032j846667n60684J741822K599427J124399Q6925
37843g81742J903245L980579K086033k402400l632170j88976K538544Q51859j780597
37834B574375j212294K78407j530596m708371l741064J289878M312391K345848
37826c91426n52618K737K665707L527821J986570M55133J73685J28023o17272
37817G378360j622691k047592j708775j067442o40087m53221k06748j35699r59561
37808a463456k297417k278021j45503J885843J438730l12981l77288J209763J490907
$$ y = [4446939, 7162441, 7547511, 6175589, 5299186, 5884578, 6268370, 4415775, 436001, -3711636, -5981832, -5323260, -2302440, 677367, 979647, -1570642, -4400048, -5131575, -3938501, -2629852, -2565932, -3926964, -5773631, -6334315, -4592493, -1993066, -868667, -781742, 1121503, 5102082, 7188115, 4785715, 1153545, 964569, 3503113, 4354972, 2574375, 1362081, 1640488, 109892, -4598479, -8339543, -7049665, -2737274, -391426, -944044, -941307, 1724400, 5252221, 7238791, 7693924, 7867609, 7995632, 7378360, 5755669, 3708077, 1999302, 931860, 291773, -161448, -368196, -503895, -1463456, -3760873, -6038894, -6184397, -4298554, -2859824, -3172805, -3550093, -2340330, -849423]
37799h49423m00551j869803j348925o17621j056508r56312J097294L063695K571701
37790c66453R65099J091086K662138L020183J484632j53441q72210j235276j264092
37781E331666k90985R79922P81746r74940k326706j961341o01870L93440K42546
37772A573478j182739k751114k101043J479353M688255L524442j073824m006613
37764A50195k872083o22473j61761M5887K376505M956427L855034q39140m579895
37755B308696m025333o09308J868896J281218j578824m143212l941979o02831
37747i442677L418374M899078K989614k32029k185509j927977j31932J776214
37739h36844K287025R08534r22201j147534J58465O00064j094157k744352j421836
$$ y = [-849423, -1249974, -3119777, -4468702, -5086323, -6142831, -7099143, -6001849, -2938154, -366453, 598646, 1689732, 4351870, 7372053, 8856685, 8703244, 7831034, 6595758, 5331666, 5040681, 6020603, 6802349, 5827409, 3500703, 1539362, 937492, 1330932, 1573478, 390739, -2360375, -4461418, -2982065, 1706190, 5230632, 4156808, 150195, -2721888, -3344361, -3506122, -3460235, -1083730, 3872697, 7727731, 6888591, 2308696, -1716637, -2325945, -457049, 824169, -754655, -4897867, -8839846, -9442677, -6024303, -1125225, 1864389, 1632360, -553149, -2481126, -2613058, -836844, 1450181, 2358715, 1436514, 288980, 447445, 1047509, -46648, -2791000, -4212836]
37730d212836K288036M660368L427978J84752k170034k615506j884147q97950
37722a219339n67027j603708k940370j772100K704128O768722O113816J699652
37714I183774j425532j156457o02164k307142l942157k276668J380129L029925
37706A883708J685610o7676m23548j09265J12561P72148J871044K005330L84078
37697H113990j662650k173958r06262L99684m220j672834k126224q7208J976500
37688A856818O93727k802432l606464m54666J543468j392941n044382l049835
37680a2256707L095035N806689K329340k142177k781250q58850M94929J172755
37672e140236K171276K711889J930926O30984m42952j349347j044565J683532
$$ y = [-4212836, -1924800, 2735568, 6163546, 6348298, 4178264, 1562758, -321389, -1219339, -1786366, -3390074, -6330444, -8102544, -5398416, 1370306, 7484122, 9183774, 7758242, 6601785, 5999621, 3692479, -249678, -2526346, -1146217, 1883708, 3569318, 3501642, 3078094, 2968829, 3081390, 3853538, 5724582, 7729912, 8113990, 6451340, 4277382, 3371120, 3770804, 3766584, 2093750, -32474, -119682, 1856818, 2550545, -251887, -3858351, -4313017, -2769549, -4162490, -9206872, -12256707, -9161672, -3354983, -1025643, -3167820, -5949070, -6807920, -6312991, -5140236, -2968960, -257071, 1673855, 2304839, 1861887, 512540, -532025, 1151507]
37664A151507M477557L125788j495135l397102p64821N55853l315240p051268
37656f712861m195528K351077M867500K453430N64011R35184Q1213k370744j865965
37647c892683K791385O162114M111641l13303k160463j413425j135612k076183
37639B073471k604539j912670m16853J540165L232012L217195J291037n77767
37631E842051q68748p32941j973497l923768m056782j277338K572559M462754
37623D4290L103827L14433q25955L87423J434667L07405j413173j160987M11674
37614B603604P17538k64640k65833P99439M37766j842928l211349j834622P23104
37605b137921K537690L564471L646862J686229j527246k910262j519376l52339
$$ y = [1151507, 5629064, 8754852, 7259717, 3862615, 3097794, 3653647, 338407, -6712861, -10908389, -8557312, -3689812, -1236382, -672371, 262813, 344026, -2026718, -3892683, -1101298, 5060816, 9172457, 8859154, 6698691, 5285266, 4149654, 2073471, -531068, -2443738, -2860591, -1320426, 1911586, 5128781, 6419818, 5842051, 4973303, 4240362, 2266865, -1656903, -5713685, -6991023, -4418464, 44290, 3148117, 3462550, 2636595, 3024018, 4458685, 4766090, 3352917, 2191930, 2603604, 3321142, 3056502, 2790669, 3590108, 4027874, 2184946, -1026403, -2861025, -2137921, 399769, 3964240, 7611102, 9297331, 7770085, 4859823, 3340447, 2988108]
37597B988108j548504k834733j435443J183125J616094l66284k002241j482584
37589c882462P62001L419206M831574L633280P65439q38951l28745m06417k645312
37580E309613m167898k059683J489579K246918J76029j394675j300315j037717
37572g38149r19068j30082J89858j434983k612378L45580N358412N669134l58039
37563E370285n794396m385382J162795L856179K007409k38079o0986Q84676L49369
37554C151870j089458j521489n73475L78303J64508o13338j51268K064676L747380
37545E557709K197784j696955l809758j979091J108321J731358M3132r45680j3754
37536B193066J211148J412646J242777J377597J004839o96272k841334l715092
$$ y = [2988108, 1439604, -1395129, -2830572, -1647447, -31353, -397637, -2399878, -3882462, -3120461, 298745, 5130319, 8763599, 9529038, 8690087, 8361342, 7954925, 5309613, 1141715, -917968, 571611, 2818529, 2994558, 1599883, 299568, -738149, -1657217, -1787299, -1597441, -3032424, -5644802, -5299222, 59190, 5728324, 5370285, -424111, -4809493, -3646698, 209481, 2216890, 1978811, 1917825, 2802501, 3151870, 2062412, 540923, -32552, 345751, 510259, -103079, -254347, 1810329, 5557709, 7755493, 6058538, 2248780, 269689, 1378010, 3109368, 3152500, 2206820, 2193066, 3404214, 4816860, 6059637, 7437234, 8442073, 7745801, 4904467, 1189375]
37528A189375k764754r36222O02903J391922J469217R08627o1825o97346r7982
37519A003915J654774L053783K532016K53460k069698l088136k779733j620865
37511a060484r077J223722J130599J98806J87918J368862J410891j288990m409205
37502a246958m176637m98361K885413L391474K135584R78857j41612j509017j792546
37493B6197j57161J562640J251466j66080l02917P70697R61318o1883n12346J29230
37483C501161L99791j23432j37108L74263l69549k337510k892555j184693J11442
37474b658190m59947m28209J567040K033008j572216m768536j845847M371470
37466c761427N571159M07895l423550j013561K970622K539975p96458k106897
$$ y = [1189375, -1575379, -2511601, -1908698, -516776, 952441, 1861068, 1799243, 1101897, 1003915, 2658689, 5712472, 8244488, 8497948, 6428250, 3340114, 560381, -1060484, -1069561, 154161, 1284760, 1483566, 1671484, 3040346, 4451237, 3162247, -1246958, -5423595, -5921956, -3036543, 354931, 2490515, 3469372, 3327760, 1818743, 26197, -130964, 1431676, 2683142, 2517062, 2214145, 2984842, 3946160, 3884277, 3371931, 3501161, 3900952, 3777520, 3640412, 4014675, 3645126, 1307616, -1584939, -2769632, -2658190, -3118137, -3546346, -1979306, 53702, -1518514, -6287050, -8132897, -3761427, 1809732, 2217627, -1205923, -2219484, 751138, 3291113, 2494655, 387758]
37458C87758j073330n12103k53649J746892M092458L230981o22881l547638l657364
37449b08876k606070j482614N27188K802918K625359o83662l941311l994535j323562
37440h285165J395147K470177J935168P53415K80411J305731K921614L284242
37432F060740J794835l74546j840529k053624j119419J67331M83967n35191j507034
37423A076530j291463q13422j176473j206600N94317K586024J638207j950269
37415e43149m361967l439391r76044P19541J525654J823868J076567l78225n31264
37406e084410J559706L994766M420636K708114K18013j975397l135098k785261
37398g8931j619154j061873j242699r69048j12407L5162o75355p05800L31760
$$ y = [387758, -685572, -1197675, -1451324, 295568, 4388026, 7619007, 6996126, 3448488, -208876, -2814946, -4297560, -3770372, -967454, 1657905, 974243, -2967068, -6961603, -8285165, -6890018, -4419841, -2484673, -1731258, -1450847, -145116, 2776498, 6060740, 7855575, 7481029, 5640500, 3586876, 2467457, 2634788, 3118755, 2583564, 1076530, -214933, -1028355, -2204828, -3411428, -2817111, -231087, 1407120, -543149, -4905116, -8344507, -9320551, -8601010, -7075356, -5251488, -4174921, -4553146, -5084410, -3524704, 470062, 4890698, 7598812, 7816825, 5841428, 2706330, -78931, -1698085, -2759958, -4002657, -4971705, -5084112, -5048950, -5724305, -6430105, -6098345]
37389f098345Q38195L22982O01817K330818L071815R77261j908617k466879p87743
37380c118696P78191J303505J560398J745550J220714j31020j873936l477156
37372a992450l756295j476180K216846L963282K382530l2932q54526q65891j154920
37363a570536l37713K049915K629288q68719m355705k554968K278878L054311
37355C24751j174823l648442n50309L331417K554984r09002j766755M66717K068740
37346F97278J308265l69939j886585l296421l752018k099680P09124K410301K320991
37337c958684J346284n6146j543218j496136J137969M151340M234860J637773
37329E454042l53100m89095o73716j653359j525021J12675M68182j587586k567162
$$ y = [-6098345, -5260150, -4937168, -4335351, -2004533, 1067282, 2044543, 135926, -2330953, -3118696, -2340505, -1037000, 523398, 2268948, 3489662, 3358642, 1484706, -1992450, -5748745, -7224925, -5008079, -1044797, 1337733, 1304801, 450275, -415616, -1570536, -1908249, 141666, 2770954, 1902235, -2453470, -5008438, -2729560, 324751, -850072, -4498514, -5048823, -1717406, 837578, -71424, -1838179, -1371462, 697278, 2005543, 1635604, -250981, -3547402, -7299420, -9399100, -8689976, -6279675, -3958684, -2612400, -2668546, -4211764, -5707900, -4569931, -418591, 3816269, 5454042, 5100942, 4611847, 3938131, 2284772, 759751, 872426, 1340608, -246978, -2814140]
37320b814140L47075L977058L318689r07625l528548k695898j378814j171199
37312d853402j8404K545388L101282j0734l112200k637135m69632J3158j50889
37303e592568J690065L735358K131059j829188k765932M79594L124375J928408
37295B901171p60338j976717k274661k719311k217815n26348R8382q54080j92794
37286h522511L287988N083303J368124m086565m636419l54860K658954J637429
37278c564557Q8129R21792K037700P59558j500160j828666m16658K61762n21350
37269c762450j036313o6867J297111J363130L74876K72382J683216K318045p0289
37260B372841l682655m164144o21576K688968K201668k10459o82492R06838J724430
$$ y = [-2814140, -2467065, 1509993, 4828682, 3921057, 392509, -2303389, -3682203, -4853402, -4871806, -2326418, 774864, 764130, -2348070, -4985205, -5454837, -5441679, -5592568, -3902503, -167145, 1963914, 134726, -2631206, -2151612, 972763, 2901171, 2140833, 164116, -2110545, -4829856, -7047671, -7574019, -7475637, -8329717, -8522511, -5234523, -151220, 1216904, -2869661, -7506080, -7860940, -5201986, -3564557, -3476428, -2554636, -516936, 242622, -1257538, -3086204, -3502862, -3241100, -3762450, -4798763, -4865630, -3568519, -2205389, -1830513, -1558131, 125085, 2443130, 2372841, -1309814, -5473958, -6095534, -3406566, -1204898, -1415357, -2097849, -1191011, 533419]
37251E33419P41124n84254j256688j373968p65235K96192K70390j061170r95753
37242d195943J857544L977115J856075j601430j071523K334970K760635l48128
37234E569315j378459J148456J409006l340757o734120k980885L401284M130578
37226A224418o59700l772352k096006N61435J066504Q82350J511758J389197o61967
37217e54363k600949k038596K88721J673264Q19674r86681j421362M77220L045886
37208a297186L629543J949915O21036J417129K742514K330049N80405r06965k265713
37199H800727m055853m639193k297963R51133J352457j005113k227262m87137
37191c608204J740278K061145J229949M93613p76307k772495l406676j307436
$$ y = [533419, 1274543, 690289, -566399, -1940367, -2705602, -2409410, -2139020, -3200190, -4195943, -2338399, 1638716, 3494791, 1893361, 821838, 3156808, 5917443, 5569315, 4190856, 5339312, 6748318, 3407561, -3326559, -6307444, -2906160, 1224418, 564718, -3207634, -5303640, -4742205, -3675701, -2793351, -1281593, 107604, -554363, -3155312, -5193908, -4905187, -3231923, -2412249, -3398930, -4820292, -4343072, -1297186, 2332357, 4282272, 4903308, 6320437, 9062951, 11393000, 11973405, 11066440, 8800727, 4744874, 105681, -2192282, -1241149, 111308, -893805, -3121067, -3608204, -1867926, 193219, 1423168, 1916781, 1140474, -1632021, -5038697, -6346133]
37183f346133J384105J775441K55938p04934m69310k22059o922J118122K163816
37174a051936P12260k888340m799052k749561O02872J479778J55672l58571O51711
37165h245167J240492R05744J304833K383170J654934j083162k040860R14662
37157b965354M138782L271912j96181j673155q07983j046700k790979k616874
37149d686532J70753J679400j16423j876876l96976K400581K883500R46452r56665
37140D7214j374029r8986K484841M234276K437666j738148l450274j121779R13344
37131B334125l81866j699810J81395J867069p01033l873762j434826M404611N468797
37122F164700L79828l488485j774163J104876M37525j594250j011827J224963
$$ y = [-6346133, -4962028, -3186587, -2930649, -3635583, -4104893, -4326952, -4333874, -3215752, -1051936, -339676, -3228016, -8027068, -10776629, -10173757, -8693979, -8538307, -8896878, -8245167, -7004675, -6098931, -4794098, -2410928, -755994, -1839156, -3880016, -2965354, 1173428, 4445340, 4249159, 2576004, 1768021, 721321, -2069658, -4686532, -4515779, -2836379, -2952802, -4829678, -5226654, -2826073, 57427, 1003879, 47214, -1326815, -1425801, 1059040, 5293316, 7730982, 5992834, 2542560, 1420781, 2334125, 1952259, 252449, 433844, 2300913, 1599880, -2273882, -3708708, 695903, 6164700, 6544528, 3056043, 1281880, 2386756, 2824281, 1230031, 218204, 1443167]
37114A443167J854274P27354k61315o62256p64572j19466O48955n63200l442152
37105a139211m028149k40868M192314M439483Q50850k471443l300158k462352
$$ y = [1443167, 3297441, 4024795, 3763480, 3101224, 2336652, 2217186, 2866141, 2302941, -1139211, -5167360, -5408228, -1215914, 3223569, 4074419, 1602976, -1697182, -4159534]
$$ [...]
##END NTUPLES=NMR SPECTRUM
##END=
