##TITLE=31Pdec_SR_137_rm1cl
 , 24 sc
 28.7.2022
##JCAMPDX= 6.0         $$ Bruker NMR JCAMP-DX V2.0
##DATA TYPE= NMR SPECTRUM
##DATA CLASS= NTUPLES
##ORIGIN= UXNMR, Bruker Analytische Messtechnik GmbH
##OWNER= root
$$ XWIN-NMR		Version 3.5
$$ Thu Jul 28 14:25:05 2022 Russian Standard Time (UT+4h)  she@DPX200
##.OBSERVE FREQUENCY= 81.013821
##.OBSERVE NUCLEUS= ^31P
##.ACQUISITION MODE= SIMULTANEOUS
##.ACQUISITION SCHEME= undefined
##.AVERAGES= 24
##.DIGITISER RES= 16
##SPECTROMETER/DATA SYSTEM= spect
##.PULSE SEQUENCE= zgpg30
##.SOLVENT NAME= DMSO
##.SHIFT REFERENCE= (INTERNAL, DMSO, 0, 248.564)
##AUDIT TRAIL= $$ (NUMBER, WHEN, WHO, WHERE, WHAT)
$$ ##TITLE= Audit trail, XWIN-NMR		Version 3.5
$$ ##JCAMPDX= 5.01
$$ ##ORIGIN= Bruker BioSpin GmbH
$$ ##OWNER= she
$$ F:/spectra/data/she/nmr/P31/1/pdata/1/auditp.txt
$$ ##AUDIT TRAIL=  $$ (NUMBER, WHEN, WHO, WHERE, WHAT)
(   1,<2022-07-28 14:24:01.95 +0400>,<she>,<DPX200>,
      <created by zg, POWCHK disabled, PULCHK disabled
       configuration hash MD5:
       00 E9 B6 7A A2 85 ED C7 34 08 36 98 17 FE 4E 26
       data hash MD5: 32K
       0A 26 B9 E6 0A 0D 86 06 9C 71 65 8B A6 CF 0C 11>)
(   2,<2022-07-28 14:24:04.35 +0400>,<she>,<DPX200>,
      <Start of raw data processing
       efp BC_mod = 2 LB = 1 FT_mod = 6 PKNL = 1 PHC0 = -10377.19 PHC1 = 330.0567 SI = 64K 
       data hash MD5: 64K
       15 BA 23 E0 77 73 CC 11 79 45 98 4A C4 50 75 E3>)
(   3,<2022-07-28 14:24:21.03 +0400>,<she>,<DPX200>,
      <pk PHC0 = 1.242496 PHC1 = -10.6 
       data hash MD5: 64K
       0E 66 47 29 29 8C 6E 82 A2 83 07 1B 40 7A 0F 1D>)
(   4,<2022-07-28 14:24:28.54 +0400>,<she>,<DPX200>,
      <abs ABSG = 5 
       data hash MD5: 64K
       F0 1E C6 96 02 1A BE 1E 65 6C EC EE 2F 44 07 8D>)
$$ ##END=
$$ 
$$ hash MD5
$$ D9 A4 D1 87 1C FF 7C C2 F2 DE B3 CA F8 83 17 82
##$RELAX= 
##$RELAX= 
##$RELAX= 
##$RELAX= 
##$RELAX= 
##$RELAX= 
##$RELAX= 
##$RELAX= 
$$ Bruker specific parameters
$$ --------------------------
##$DU= <F:/spectra>
##$EXPNO= 1
##$NAME= <P31>
##$PROCNO= 1
##$TYPE= <nmr>
##$USER= <she>
##$AMP= (0..31)
100 100 100 100 100 100 100 100 100 100 100 100 100 100 100 100 100 100 
100 100 100 100 100 100 100 100 100 100 100 100 100 100 
##$AQSEQ= 0
##$AQ_mod= 1
##$AUNM= <au_zg>
##$AUTOPOS= <>
##$BF1= 81.014009
##$BF2= 200.13
##$BF3= 200.13
##$BF4= 200.13
##$BF5= 200.13
##$BF6= 200.13
##$BF7= 200.13
##$BF8= 200.13
##$BYTORDA= 1
##$CFDGTYP= 0
##$CFRGTYP= 5
##$CHEMSTR= <none>
##$CNST= (0..31)
1 1 145 1 1 1 1 1 1 1 1 1 1 1 1 1 1 1 1 1 1 1 1 1 1 1 1 1 1 1 1 1 
##$CPDPRG= <waltz16>
##$CPDPRG1= <>
##$CPDPRG2= <waltz16>
##$CPDPRG3= <>
##$CPDPRG4= <mlev>
##$CPDPRG5= <mlev>
##$CPDPRG6= <mlev>
##$CPDPRG7= <mlev>
##$CPDPRG8= <mlev>
##$CPDPRGB= <>
##$CPDPRGT= <>
##$D= (0..31)
0 1 0 0 0 0 0 0 0 0 0 0.03 2e-05 3e-06 0 0 0 0 0 0 0 0 0 0 0 0 0 0 0 0 
0 0 
##$DATE= 1659003841
##$DBL= (0..7)
120 120 120 11 120 120 24 19 
##$DBP= (0..7)
150 150 150 150 150 150 150 150 
##$DBP07= 0
##$DBPNAM0= <>
##$DBPNAM1= <>
##$DBPNAM2= <>
$$ [...]
##$SUBNAM3= <"">
##$SUBNAM4= <"">
##$SUBNAM5= <"">
##$SUBNAM6= <"">
##$SUBNAM7= <"">
##$SUBNAM8= <"">
##$SUBNAM9= <"">
##$SW= 501.771253377433
##$SWIBOX= (0..15)
0 1 3 0 0 0 0 0 0 0 0 0 0 0 0 0 
##$SW_h= 40650.406504065
##$TD= 32768
##$TD0= 1
##$TE= 0
##$TE2= 300
##$TE3= 300
##$TEG= 300
##$TL= (0..7)
0 120 53 12 22 120 120 120 
##$TP= (0..7)
150 150 150 150 150 150 150 150 
##$TP07= 0
##$TPNAME0= <>
##$TPNAME1= <>
##$TPNAME2= <>
##$TPNAME3= <>
##$TPNAME4= <>
##$TPNAME5= <>
##$TPNAME6= <>
##$TPNAME7= <>
##$TPOAL= (0..7)
0.5 0.5 0.5 0.5 0.5 0.5 0.5 0.5 
##$TPOFFS= (0..7)
0 0 0 0 0 0 0 0 
##$TUNHIN= 0
##$TUNHOUT= 0
##$TUNXOUT= 0
##$USERA1= <user>
##$USERA2= <user>
##$USERA3= <user>
##$USERA4= <user>
##$USERA5= <user>
##$V9= 5
##$VALIST= <valist>
##$VCLIST= <CCCCCCCCCCCCCCC>
##$VD= 0
##$VDLIST= <DDDDDDDDDDDDDDD>
##$VPLIST= <PPPPPPPPPPPPPPP>
##$VTLIST= <TTTTTTTTTTTTTTT>
##$WBST= 1024
##$WBSW= 4
##$XGAIN= (0..3)
0 0 0 0 
##$XL= 0
##$YL= 0
##$YMAX_a= 9954
##$YMIN_a= -14012
##$ZGOPTNS= <>
##$ZL1= 120
##$ZL2= 120
##$ZL3= 120
##$ZL4= 120
##$ABSF1= 248.5645
##$ABSF2= -253.2056
##$ABSG= 5
##$ABSL= 3
##$ALPHA= 0
##$AQORDER= 0
##$ASSFAC= 0
##$ASSFACI= 0
##$ASSFACX= 0
##$ASSWID= 0
##$AUNMP= <proc_1d>
##$AZFE= 0.1
##$AZFW= 0.5
##$BCFW= 0
##$BC_mod= 2
##$BYTORDP= 0
##$COROFFS= 0
##$CY= -3
##$DATMOD= 1
##$DC= 0
##$DFILT= <>
##$DTYPP= 0
##$F1P= 0
##$F2P= 0
##$FCOR= 1
##$FTSIZE= 65536
##$FT_mod= 6
##$GAMMA= 0
##$GB= 0
##$INTBC= 1
##$INTSCL= 5.30512e-09
##$ISEN= 30
##$LB= 1
##$LEV0= 0
##$LPBIN= 0
##$MAXI= 10000
##$MC2= 0
##$MEAN= 0
##$ME_mod= 0
##$MI= 50
##$NCOEF= 0
##$NC_proc= -8
##$NLEV= 6
##$NOISF1= 182.463
##$NOISF2= 159.3651
##$NSP= 0
##$NTH_PI= 0
##$NZP= 0
##$OFFSET= 248.5645
##$PC= 4
##$PHC0= -10375.95
##$PHC1= 319.4567
##$PH_mod= 1
##$PKNL= yes
##$PPARMOD= 0
##$PSCAL= 0
##$PSIGN= 0
##$REVERSE= no
##$SF= 81.014009
##$SI= 65536
##$SIGF1= 159.3651
##$SIGF2= -187.1042
##$SINO= 113.3802
##$SIOLD= 16384
##$SREGLST= <1H.CDCl3>
##$SSB= 0
##$STSI= 65536
##$STSR= 0
##$SW_p= 40650.406504065
##$SYMM= 0
##$S_DEV= 0
##$TDeff= 32768
##$TDoff= 0
##$TI= <>
##$TILT= no
##$TM1= 0
##$TM2= 0
##$TOPLEV= 0
##$USERP1= <user>
##$USERP2= <user>
##$USERP3= <user>
##$USERP4= <user>
##$USERP5= <user>
##$WDW= 1
##$XDIM= 65536
##$YMAX_p= 438628803
##$YMIN_p= -311414278
$$ End of Bruker specific parameters
$$ ---------------------------------
##NTUPLES= NMR SPECTRUM
##VAR_NAME=  FREQUENCY,     SPECTRUM/REAL,   SPECTRUM/IMAG
##SYMBOL=    X,             R,               I
##VAR_TYPE=  INDEPENDENT,   DEPENDENT,       DEPENDENT
##VAR_FORM=  AFFN,          ASDF,            ASDF
##VAR_DIM=   65536,         65536,           65536
##UNITS=     HZ,            ARBITRARY UNITS, ARBITRARY UNITS
##FACTOR=    0.620285442955139, 1,           1
##FIRST=     20137.2065510759, 0,            0
##LAST=      -20513.1999529892, 0,           0
##MIN=       -20513.1999529892, -311414278,  0
##MAX=       20137.2065510759, 438628803,    0
$$ Real data points
##PAGE= N=1
##DATA TABLE= (X++(R..R)), XYDATA
$$ [...]
$$ plain form
41751 8129248 7209550 972125 -2514829 52350 2972657 1626946 -548556 806587
41743 806587 3001738 1317819 -2127196 -1367987 3545902 6624776 5578637 4516035
41735 4516035 5762704 5666629 1550254 -2967907 -3761474 -2493582 -2348311 -1743954 1950733
41726 1950733 5846313 5262134 1727179 290586 395541 -2775490 -8122332 -8304220 -1440331
41717 -1440331 4784803 4101306 -52403 -1285986 695011 2520713 3582597 4902374
41709 4902374 5419760 4120291 2659674 1938945 -280704 -4378393 -5717468 -1350649
41701 -1350649 4095476 4802401 2546132 2991703 6108126 7073612 5003295 3828453 4877740
41692 4877740 4984406 2614807 498328 1031083 3204424 4973085 5440465 4485916 3033996
$$ packed form
41751H129248r19698o237425l486954K567179K920307j345711k175502J355143
41743H06587K195151j683919l445015P59209M913889L078874j046139j062602
41735D516035J246669r6075m116375m518161p93567J267892J45271O04357L694687
41726A950733L895580n84179l534955j436593J04955l171031n346842j81888O863889
41717a440331O225134o83497m153709j233583J980997J825702J061884J319777
41709D902374N17386j299469j460617p20729k219649m097689j339075M366819
41701a350649N446125P06925k256269M45571L116423R65486k070317j174842J049287
41692D877740J06666k369599k116479N32755K173341J768661M67380r54549j451920
$$ plain form
41683 3033996 3181139 5364016 6686907 4958762 2342908 1511495 903441 -1503379 -2444308
41674 -2444308 2468826 10407167 13670068 9968662 4356051 1113357 -230112 -670378
41666 -670378 286920 1613530 1258354 233375 892917 1356780 -1934182 -6094155 -3937135
41657 -3937135 4358622 9769720 7428906 3306586 3905785 6780378 6799623 5363035 6668861
41648 6668861 9583273 10161226 8928698 8978036 9242700 6332631 1720656 598183 3624152
41639 3624152 5615357 3406699 147033 88642 2890479 5235805 5487655 4429095 2801529
41630 2801529 374525 -2503083 -3922521 -2167225 1587767 3634119 1909439 -1062860
41622 -1062860 -1046994 2757718 7542208 11329593 14697246 17727430 18313486 14971101 9295121
$$ packed form
41683C033996J47143K182877J322891j728145k615854q31413o08054k406820r40929
41674b444308M913134P938341L262901l701406n612611l242694j343469m40266
41666f70378R57298J326610l55176j024979O59542M63863l290962m159973K157020
41657c937135Q295757N411098k340814m122320N99199K874593J9245j436588J305826
41648F668861K914412N77953j232528M9338K64664k910069m611975j122473L025969
41639C624152J991205k208658l259666n8391K801837K345326K51850j058560j627566
41630B801529k427004k877608j419438J755296L754992K046352j724680k972299
41622a062860J5866L804712M784490L787385L367653L030184N86056l342385n675980
$$ plain form
41613 9295121 4321041 1847228 1809099 2421065 709009 -4626731 -10304464 -11017387 -5758649
41604 -5758649 854224 4284976 4413661 3468275 2844818 3304909 5204954 6886326 5846673
41595 5846673 3210210 3675377 8650259 12755302 10424440 3457792 -1536638 -1352395
41587 -1352395 1838388 5419333 9161058 12949977 15073839 14170741 11311535 9114849
41579 9114849 9282667 11150248 12319198 10971244 7794249 5119152 4124954 3894938 3476209
41570 3476209 3600741 5520027 8777489 10901321 9490951 4880404 564306 -233435
41562 -233435 1385919 1405996 -939281 -1551437 1938759 5675579 5563418 4421369 7587830
41553 7587830 13487119 15158861 10702861 5608471 4077513 4449875 4702736 6259324
$$ packed form
41613I295121m974080k473813l8129O11966j712056n335740n677733p12923N258738
41604e758649O612873L430752J28685r45386o23457M60091J900045J681372j039653
41595E846673k636463M65167M974882M105043k330862o966648m994430J84243
41587a352395L190783L580945L741725L788919K123862r03098k859206k196686
41579I114849J67818J867581J168950j347954l176995k675097r94198k30016m18729
41570C476209J24532J919286L257462K123832j410370m610547m316098p97741
41562b33435J619354K0077k345277o12156L490196L736820j12161j142049L166461
41553G587830N899289J671742m456000n094390j530958L72362K52861J556588
$$ plain form
41545 6259324 9928355 13486530 15905592 19202188 23873229 27440872 29744050 34374087
41537 34374087 42190497 48685203 50680299 50274365 49067955 44379722 35305540 26982443
41529 26982443 24058066 24660713 25136938 25467956 25277666 20560024 10858766 4369319 8154253
41520 8154253 17033353 20013095 15040458 9598307 8506955 9028862 7752234 5456406
41512 5456406 4475274 6096621 10381527 14694708 14154156 7848888 2083145 2563931 6532092
41503 6532092 8323605 8778657 11552235 13624459 9054617 607839 -2348088 2308666
41495 2308666 7161911 7573295 6738974 6862711 5162605 1739525 1911115 6351457 7688994
41486 7688994 2204872 -3196871 -1859614 2231782 2146732 -366542 573429 3526741 2149817
$$ packed form
41545F259324L669031L558175K419062L296596M671041L567643K303178M630037
41537C4374087P816410O494706J995096m05934j206410m688233r074182q323097
41529B6982443k924377O02647M76225L31018j90290m717642r701258o489447L784934
41520H154253Q879100K979742m972637n442151j091352N21907j276628k295828
41512E456406r81132J621347M284906M313181n40552o305268n765743M80786L968161
41503F532092J791513M55052K773578K072224m569842q446778k955927M656754
41495B308666M853245M11384q34321J23737j700106l423080J71590M440342J337537
41486G688994n484122n401743J337257M091396q5050k513274R39971K953312j376924
$$ plain form
41477 2149817 -3119183 -4763916 202446 5844885 6290864 3385235 2663767 5334423
41469 5334423 7219380 4394212 -1967427 -6574511 -5689294 -1296625 1550143 1016327
41461 1016327 -383781 -1008705 -2726702 -6603901 -9444674 -7683977 -2592180 1241914
41453 1241914 1125060 -2284340 -6961119 -10420236 -10055855 -5254939 1290676 5979866
41445 5979866 7365614 6119570 3645042 1829473 2270738 4329696 5499173 4584139
41437 4584139 2635110 321210 -2784343 -5551934 -5313056 -1788243 2397314 6170517
41429 6170517 10784531 14934573 14676953 10811006 10141577 15109833 18394021 13916030
41421 13916030 7544966 8860740 16411310 20332041 17404866 14019054 14706417 17187110
$$ packed form
41477B149817n269000j644733M966362N642439M45979k905629p21468K670656
41469E334423J884957k825168o361639m607084Q85217M392669K846768n33816
41461A016327j400108o24924j717997l877199k840773J760697N091797L834094
41453A241914j16854l409400m676779l459117L64381M800916O545615M689190
41445E979866J385748j246044k474528j815569M41265K058958J169477r15034
41437D584139j949029k313900l105553k767591K38878L524813M185557L773203
41429F170517M614014M150042k57620l865947o69429M968256L284188m477991
41421A3916030o371064J315774P550570L920731k927175l385812O87363K480693
$$ plain form
41413 17187110 19758376 24362201 29768119 30159618 24242803 18513621 17455127 17280152
41405 17280152 13910414 10468794 10985416 12248557 8771041 2168245 -995004 1558770
41397 1558770 6217063 9052616 8231786 3346062 -2729186 -3972101 1430005 6537368
41389 6537368 4428346 -1167296 -1163081 4908565 8640963 6192949 3000776 3248811 3247154
41380 3247154 -857498 -5973647 -7522538 -6374280 -5475289 -4409935 -2282336 -1599484
41372 -1599484 -3924891 -5517676 -3034995 -198061 -2324653 -6675302 -5429343 2452726
41364 2452726 9269958 9273560 5387353 3603071 5514687 8477843 9452070 6759415 956463
41355 956463 -4496145 -5814288 -3106465 68205 1366156 1198886 33080 -2071437
$$ packed form
41413A7187110K571266M603825N405918L91499n916815n729182j058494j74975
41405A7280152l369738l441620N16622J263141l477516o602796l163249K553774
41397A558770M658293K835553q20830m885724o075248j242915N402106N107363
41389F537368k109022n595642M215O071646L732398k448014l192173K48035j657
41380C247154m104652n116149j548891J148258Q98991J065354K127599O82852
41372a599484k325407j592785K482681K836934k126592m350649J245959P882069
41364B452726O817232L602l886207j784282J911616K963156R74227k692655n802952
41355I56463n452608j318143K707823L174670J297951j67270j165806k104517
$$ plain form
41347 -2071437 -3021943 11649 5839576 9664639 9365694 7468580 5840785 3150644
41339 3150644 -453504 -1156641 2752880 7186177 8068755 7059775 7398060 7811507 5737748
41330 5737748 3661581 6071292 11370792 12942322 8465192 2772709 449143 490594
41322 490594 149052 -210254 1031668 2865758 2741255 324240 -2126323 -2671021 -1505375
41313 -1505375 -149644 128730 -896147 -2578666 -4069481 -4770382 -4458848 -3692730 -3989949
41304 -3989949 -6279210 -8767588 -7993855 -3044569 2775616 5727414 5556184 4221008
41296 4221008 2599460 703781 -309685 880202 3428246 5344028 6197603 6514940
41288 6514940 5403004 1733389 -2718584 -4538502 -3339786 -2114579 -2311230 -1701487
$$ packed form
41347b071437r50506L033592N827927L825063k98945j897114j627795k690141
41339C150644l604148p03137L909521M433297Q82578j008980L38285M13447k073759
41330E737748k076167K409711N299500J571530m477130n692483k323566M1451
41322D90594l41542l59306J241922J834090j24503k417015k450563n44698J165646
41313a505375J355731K78374j024877j682519j490815p00901L11534P66118k97219
41304c989949k289261k488378P73733M949286N820185K951798j71230j335176
41296D221008j621548j895679j013466J189887K548044J915782Q53575L17337
41288F514940j111936l669615m451973j819918J198716J225207j96651O09743
$$ plain form
41280 -1701487 1512201 5356516 6991669 6832453 7215724 8230316 7676505 4961403 2360629
41271 2360629 1541940 984438 -1373341 -4309082 -4701128 -2444756 -968092 -1869790 -2199455
41262 -2199455 580332 3875928 3968812 2458064 3642819 6656267 6310992 2093716 -358338
41253 -358338 1293460 1953934 -1926427 -5551076 -3171715 2924966 6792181 7821943
41245 7821943 8839038 8960627 5784685 2143359 2935630 6656517 7579612 5300924 4293053
41236 4293053 4636909 1935593 -2867666 -2724575 3965668 9472968 8125589 4125115
41228 4125115 3650466 5950026 7339262 8125430 9919584 10788941 8628100 5568980 4130539
41219 4130539 2722603 -288958 -2038446 104474 3053698 2928735 1981828 4397163
$$ packed form
41280a701487L213688L844315J635153j59216L83271J014592n53811k715102k600774
41271B360629q18689n57502k357779k935741l92046K256372J476664r01698l29665
41262b199455K779787L295596R2884j510748J184755L013448l45275m217276k452054
41253c58338J651798O60474l880361l624649K379361O096681L867215J029762
41245G821943J017095J21589l175942l641326P92271L720887R23095k278688j007871
41236D293053L43856k701316m803259J43091O690243N507300j347379m000474
41228D125115m74649K299560J389236P86168J794154Q69357k160841l059120j438441
41219D130539j407936l011561j749488K142920K949224j24963r46907K415335
$$ plain form
41211 4397163 8118225 7682759 3242569 -169889 -1156413 -2637213 -4391890 -2260041
41203 -2260041 4089152 9256380 10107255 10016194 12634097 16402515 18161945 17958127 17146813
41194 17146813 15359995 12670049 11721768 14134460 17003614 16477433 13181690 10615886
41186 10615886 9316528 6486752 1476380 -2105788 -1302260 1798086 3018906 2212310
41178 2212310 3548399 9273456 15692112 17243302 13159234 7678843 4380807 3311374
41170 3311374 3833249 6586120 10807655 12921902 10761902 7135081 6235623 8229531
41162 8229531 10442598 12090356 13969130 14823837 12729053 9764874 10261713 13531687
41154 13531687 13389763 7022138 -234125 -2116591 401193 2225166 2487827 4676034
$$ packed form
41211D397163L721062m35466m440190l412458r86524j480800j754677K131849
41203b260041O349193N167228Q50875r1061K617903L768418J759430k03818q11314
41194A7146813j786818k689946r48281K412692K869154n26181l295743k565804
41186A0615886j299358k829776n010372l582168Q03528L100346J220820q06596
41178B212310J336089N725057O418656J551190m084068n480391l298036j069433
41170C311374N21875K752871M221535K114247k160000l626821q99458J993908
41162H229531K213067J647758J878774Q54707k094784k964179M96839L269974
41154A3531687j41924o367625p256263j882466K517784J823973K62661K188207
$$ plain form
41146 4676034 9477526 12651935 11006878 6633937 3471183 2527513 2658738 3834180
41138 3834180 6636484 9394874 9122565 6158721 5210743 9641473 16330785 19153045
41130 19153045 17087676 15341606 17495381 20389562 19598636 16666732 16326862 18422380
41122 18422380 18329678 15385058 14669885 18303205 20771605 17005359 10559174 8440806
41114 8440806 10862235 12152469 10316025 9280760 11404261 13756922 13599015 12571791
41106 12571791 12966793 13842499 13590775 13067562 13371085 13314779 11860193 10440121 10036509
41097 10036509 8615628 4806297 1703042 3003848 7010982 8670344 6655599 4297179
41089 4297179 3871202 4086532 3549456 3021665 3490514 4936755 7350623 10091284 10363772
$$ packed form
41146D676034M801492L174409j645057m372941l162754r43670J31225J175442
41138C834180K802304K758390k72309k963844r47978M430730O689312K822260
41130A9153045k065369j746070K153775K894181p90926k931904l39870K095518
41122A8422380r2702k944620p15173L633320K468400l766246o446185k118368
41114H440806K421429J290234j836444j035265K123501K352661j57907j027224
41106A2571791L95002Q75706k51724n23213L03523n6306j454586j420072m03612
41097A0036509j420881l809331l103255J300806M007134J659362k014745k358420
41089D297179m25977K15330n37076n27791M68849J446241K413868K740661K72488
$$ plain form
41080 10363772 5877802 -770246 -4205790 -3315258 -2127315 -2849744 -2690054 558137
41072 558137 4465127 6435430 8082772 11443023 14217129 13041268 9133658 6460332
41064 6460332 5900293 5313572 4385007 5391471 9190221 13514981 15503623 13995350 9802429
41055 9802429 5389646 3287576 3212367 2291761 -218566 -919142 2444278 6373478 6120725
41046 6120725 2846826 1922873 5167197 9150604 10809625 10554980 9743231 8929598 8951516
41037 8951516 10285340 11137793 9549955 7357136 8305439 12091977 14470278 14069045 14766247
41028 14766247 19490545 25405657 27717630 25570814 21763265 18561641 16001912 13132107
41020 13132107 9292248 4887826 1693034 1488449 3943867 6741362 7857424 6846952
$$ packed form
41080A0363772m485970o648048l435544Q90532J187943p22429J59690L248191
41072E58137L906990J970303J647342L360251K774106j175861l907610k673326
41064F460332n60039n86721r28565J006464L798750M324760J988642j508273m192921
41055I802429m412783k102070p5209r20606k510327p00576L363420L929200k52753
41046F120725l273899r23953L244324L983407J659021k54645q11749q13633K1918
41037H951516J333824Q52453j587838k192819R48303L786538K378301m01233O97202
41028A4766247M724298N915112K311973k146816l807549l201624k559729k869805
41020A3132107l839859m404422l194792k04585K455418K797495J116062j010472
$$ plain form
41012 6846952 4407640 1991790 1207678 2173779 3268384 3755696 5054573 7715857 9450792
41003 9450792 8763873 8020212 9434335 10586030 8351513 4965663 4847296 7179322 7579948
40994 7579948 5854969 5589256 6882701 6705537 6230990 9704089 15139218 14933283 8240446
40985 8240446 3986002 7587204 13025547 13362730 11227826 12111585 14098047 12300149
40977 12300149 8414142 7519364 8930919 8298104 6159190 6457930 8352920 7381912 3883174
40968 3883174 2634840 4266501 4497109 2618812 3453987 8990758 14553329 15931238
40960 15931238 14726326 13609165 11429192 7020715 3786753 5653309 10639929 13004763
40952 13004763 10992329 8426791 8368294 8915449 7090826 4260290 4641090 9223417 14427288
$$ packed form
41012F846952k439312k415850p84112R66101J094605M87312J298877K661284J734935
41003I450792o86919p43661J414123J151695k234517l385850j18367K332026M00626
40994G579948j724979k65713J293445j77164m74547L473099N435129k05935o692837
40985H240446m254444L601202N438343L37183k134904Q83759J986462j797898
40977A2300149l886007q94778J411555o32815k138914K98740J894990r71008l498738
40968C883174j248334J631661K30608j878297Q35175N536771N562571J377909
40960A5931238j204912j117161k179973m408477l233962J866556M986620K364834
40952A3004763k012434k565538n8497N47155j824623k830536L80800M582327N203871
$$ plain form
40943 14427288 17403443 19356061 21653413 22001554 18297094 13876884 13832187 17195200
40935 17195200 18468834 16713251 16563421 19130612 19229388 14751284 11614792 14371647
40927 14371647 18127777 16136624 10302687 6924137 6129686 3732246 813892 2485566
40919 2485566 7910354 10410067 8421335 8123514 12894818 17621025 17095957 13886307
40911 13886307 13365572 15599887 16927639 16341693 15625555 15132519 13732743 12109459 12504273
40902 12504273 15162052 17609900 17732237 15775953 13224370 11389827 11537756 14774468
40894 14774468 20430324 25154528 25400635 21564431 18320765 19335717 22571620 23038681
40886 23038681 19775384 17179456 18860103 23191856 26351092 27003933 26111433 24518413
$$ packed form
40943A4427288K976155J952618K297352L48141l704460m420210m4697L363013
40935A7195200J273634j755583j49830K567191R8776m478104l136492K756855
40927A4371647L756130j991153n833937l378550p94451k397440k918354J671674
40919B485566N424788K499713j988732k97821M771304M726207n25068l209650
40911A3886307n20735K234315J327752n85946p16138m93036j399776j623284L94814
40902A2504273K657779K447848J22337j956284k551583j834543J47929L236712
40894A4774468N655856M724204K46107l836204l243666J014952L235903M67061
40886B3038681l263297k595928J680647M331753L159236O52841q92500j593020
$$ plain form
40878 24518413 22855026 21792393 20547013 17398413 13496112 13245493 18355401 24430941
40870 24430941 26687154 26271434 27059446 28689495 27597923 23654033 20867704 21607090
40862 21607090 24173587 26264731 27262061 26844420 24749457 22670769 23695490 28824262
40854 28824262 35432922 39334134 37588458 30457464 21939825 16901584 16182583 16270594
40846 16270594 14891277 13804418 14226462 13761251 11491652 11870633 18235079 25692677
40838 25692677 26674668 21468291 16725994 14856894 12021529 6704072 3087317 4079540
40830 4079540 6921835 8287267 9135729 11892143 16301240 20306416 22348986 21319089
40822 21319089 16793495 10531977 5610531 3509514 3943985 6959500 12290657 17201606
$$ packed form
40878B4518413j663387j062633j245380l148600l902301k50619N109908O075540
40870B4430941K256213m15720P88012J630049j091572l943890k786329P39386
40862B1607090K566497K091144R97330m17641k094963k078688J024721N128772
40854B8824262O608660L901212j745676p130994q517639n038241p19001Q8011
40846A6270594j379317j086859M22044m65211k269599L78981O364446P457598
40838B5692677R81991n206377m742297j869100k835365n317457l616755R92223
40830D079540K842295J365432Q48462K756414M409097M005176K042570j029897
40822B1319089m525594o261518m921446k101017M34471L015515N331157M910949
$$ plain form
40814 17201606 18466431 16531710 14675873 14440419 15074398 16577190 19229792 20680756
40806 20680756 18059902 13134302 10997798 13170590 16052768 16624666 15600612 14419193
40798 14419193 13170713 12257587 12372292 12144139 9266501 4448005 1131510 1364785 4873922
40789 4873922 10981535 17589861 20072738 16400943 11912835 12887316 16477072 14205946
40781 14205946 5270788 -1666404 -1172191 2619864 4851766 7005877 10917751 12851742
40773 12851742 9225191 3308233 844643 2510868 5177867 7505636 10084161 12456085
40765 12456085 13586437 13566812 12653884 10739995 9047659 9300609 10145781 8280698 4420111
40756 4420111 3614637 7801325 12818850 15198330 16981033 20595945 23515918 22023892
$$ packed form
40814A7201606J264825j934721j855837k35454O33979J502792K652602J450964
40806B0680756k620854m925600k136504K172792K882178N71898j024054j181419
40798A4419193j248480r13126J14705k28153k877638m818496l316495K33275L509137
40789D873922O107613O608326K482877l671795m488108R74481L589756k271126
40781A4205946q935158o937192M94213L792055K231902K154111L911874J933991
40773A2851742l626551n916958k463590J666225K666999K327769K578525K371924
40765A2456085J130352j9625r12928j913889j692336K52950Q45172j865083l860587
40756D420111q05474M186688N017525K379480J782703L614912K919973j492026
$$ plain form
40748 22023892 17089893 12987088 12377578 14988531 18478270 19065821 14621118 8559623
40740 8559623 7040341 11112174 15653723 17010992 17084411 18963082 23403362 30058784
40732 30058784 36910883 39668058 39623602 50303308 83318221 125081947 142409755 119537333
40724 119537333 77613246 47734227 36140711 28561073 18215510 11767886 11947747
40717 11947747 11932672 8099895 4710043 3975945 2988732 2264578 6285004 13216499 14795754
40708 14795754 9621133 6322544 9433317 12007936 7789181 1722537 1355281 5046354
40700 5046354 6574128 5988361 7463758 9773665 7509948 997148 -2486467 1436272
40692 1436272 8706110 12998360 13262612 12692565 13047197 13010662 11264980 8717249 7307568
$$ packed form
40748B2023892m933999m102805o09510K610953L489739N87551m444703o061495
40740H559623j519282M071833M541549J357269P3419J878671M440280O655422
40732C0058784O852099K757175m4456J0679706L3014913M1763726J7327808k2872422
40724A19537333m1924087k9879019j1593516p579638j0345563o447624J79861
40717A1947747j5075l832777l389852p34098r87213p24154M020426O931495J579255
40708A4795754n174621l298589L110773K574619m218755o066644l67256L691073
40700E046354J527774n85767J475397K309907k263717o512800l483615L922739
40692A436272P269838M292250K64252n70047L54632l6535j745682k547731j409681
$$ plain form
40683 7307568 8060577 10963072 15630020 20911666 24502702 24520598 21508453 17603860 13904856
40674 13904856 10325940 7863082 8517623 12295858 16637553 19854434 22937721 26878708
40666 26878708 30529724 32441747 32598732 31160302 28048421 25030033 25106728 28001414
40658 28001414 29474941 27460162 25567178 27507437 31196592 32160959 30318137 29212891
40650 29212891 30106964 30907660 30230664 28974507 27995817 26914553 25283946 23268213 21393088
40641 21393088 20317605 19815801 18020472 13997518 10882843 12705040 17740171 19846372
40633 19846372 17443272 15367067 15943367 15276272 11961213 11629106 16809771 19739461
40625 19739461 13670267 5376407 6301210 15128526 20086472 16904801 13354081 15274359
$$ packed form
40683G307568P53009K902495M666948N281646L591036J7896l012145l904593l699004
40674A3904856l578916k462858O54541L778235M341695L216881L083287L940987
40666B6878708L651016J912023J56985j438430l111881l018388P6695K894686
40658B8001414J473527k014779j892984J940259L689155R64367j842822j105246
40650B9212891Q94073Q00696o76996j256157r78690j081264j630607k015733j875125
40641B1393088j075483n01804j795329m022954l114675J822197N035131K106201
40633A9846372k403100k076205N76300o67095l315059l32107N180665K929690
40625A9739461o069194q293860R24803Q827316M957946l181671l550720J920278
$$ plain form
40617 15274359 18553779 17836888 14566043 12531995 12069921 12312890 13845671 15981833
40609 15981833 16009854 13714869 12442625 13713363 15047816 14738626 14171544 13797401 11838859
40600 11838859 9116629 9951011 15262488 19485527 17970841 13585235 12156778 14547020
40592 14547020 17222804 18345360 19154240 20251492 19932642 16548367 10928416 6218376
40584 6218376 5375205 8053639 10490342 10130185 9499518 12661160 18360426 20555105 16350418
40575 16350418 9538828 4995365 3424116 3608284 5925815 10290866 13400547 12044715
40567 12044715 8008159 6143020 7778728 9144532 7022662 3480972 3284565 7701908
40559 7701908 12757041 13877593 10998111 8228002 9274089 14229864 20157817 23421990
$$ packed form
40617A5274359L279420p16891l270845k034048m62074K42969J532781K136162
40609A5981833K8021k294985j272244J270738J334453l09190n67082l74143j958542
40600A1838859k722230Q34382N311477M223039j514686m385606j428457K390242
40592A4547020K675784J122556Q08880J097252l18850l384275n619951m710040
40584F218376q43171K678434K436703l60157o30667L161642N699266K194679m204687
40575A6350418o811590m543463j571249J84168K317531M365051L109681j355832
40567A2044715m036556j865139J635708J365804k121870l541690j96407M417343
40559G701908N055133J120552k879482k770109J046087M955775N927953L264173
$$ plain form
40551 23421990 22120086 18130417 16262722 19112658 23355927 24162262 22603463 24074794
40543 24074794 28856077 30052778 23848323 16612327 17030860 24580911 31023893 31485805
40535 31485805 29136215 29383445 33323298 37264248 36683607 31027996 25428858 25665869
40527 25665869 30507906 32360081 27217568 19916381 16810510 17682728 18833079 19868046
40519 19868046 22086383 23267209 20063293 14245522 11476437 14338874 20235927 25312959
40511 25312959 27375460 26180235 23652795 22604912 23356361 23574811 22792397 24182390
40503 24182390 30582461 41944955 56808274 71332562 77280639 68676814 51743444
40496 51743444 39774319 36463571 34086440 29795158 30532815 37645861 42193584 43354718
$$ packed form
40551B3421990j301904l989669j867695K849936M243269Q06335j558799J471331
40543B4074794M781283J196701o204455p235996M18533P550051O442982M61912
40535C1485805k349590K47230L939853L940950n80641n655611n599138K37011
40527B5665869M842037J852175n142513p301187l105871Q72218J150351J034967
40519A9868046K218337J180826l203916n817771k769085K862437N897053N077032
40511B5312959K062501j195225k527440j047883P51449K18450p82414J389993
40503B4182390O400071J1362494J4863319J4524288N948077q603825j6933370
40496E1743444j1969125l310748k377131m291282P37657P113046M547723J161134
$$ plain form
40488 43354718 54628630 79258679 95707447 84695152 57739434 40189967 37186956
40481 37186956 36691252 35950799 41535380 49960744 52289373 53476061 63780502 76473360
40473 76473360 80690480 91187806 131613980 186074159 203713733 163625865 103544866
40466 103544866 67988371 57064917 46970091 34075314 30799317 35631994 36239429
40459 36239429 33753347 39826839 53959121 63030249 60544734 51549652 41975865 35065867
40451 35065867 33746950 36907126 39729764 44907351 62326845 88703509 101973511 88994188
40443 88994188 65084186 51723842 49547068 49948232 56852630 74629418 88749807 85448535
40435 85448535 80688975 99811252 132868959 141004199 109247660 64890143 37827157
$$ packed form
40488D3354718J1273912K4630049J6448768j1012295k6955718j7549467l003011
40481C7186956m95704p40453N584581Q425364K328629J186688J0304441J2692858
40473G6473360M217120J0497326M0426174N4460179J7639574m0087868o0080999
40466A03544866l5556495j0923454j0094826j2894777l275997M832677O07435
40459C6239429k486082O073492J4132282R071128k485515q995082r573787o909998
40451C5065867j318917L160176K822638N177587J7419494K6376664J3270002j2979323
40443H8994188k3910002j3360344k176774M01164O904398J7776788J4120389l301272
40435H5448535m759560J9122277L3057707Q135240l1756539m4357517k7062986
$$ plain form
40428 37827157 28461641 23549274 20175777 20969545 22883361 23400006 25918726 30776043
40420 30776043 32796191 33448324 41484248 55141237 58585103 44286505 25073481 15085659
40412 15085659 12150970 8745618 7036820 10934381 14420642 11109159 7106931 11561234
40404 11561234 20874871 24541544 21588391 19366704 19668761 17600107 12459054 9176828
40396 9176828 9001214 7635294 3665324 1781745 5922799 14064965 21121835 23748543
40388 23748543 21773934 17434329 13659255 11987422 12365045 14543974 17597982 18739834
40380 18739834 16329447 13954207 16958556 24557972 30664186 33252964 36454702 41288644
40372 41288644 41488974 33069922 22389539 19032547 24019572 29895535 30127492 24451573
$$ packed form
40428C7827157r365516m912367l373497P93768J913816N16645K518720M857317
40420C0776043K020148O52133Q035924J3656989L443866j4298598j9213024r987822
40412A5085659k934689l405352j708798L897561L486261l311483m002228M454303
40404A1561234R313637L666673k953153k221687L02057k068654n141053l282226
40396I176828j75614j365920l969970j883579M141054Q142166P056870K626708
40388B3748543j974609m339605l775074j671833L77623K178929L054008J141852
40380A8739834k410387k375240L004349P599416O106214K588778L201738M833942
40372D1288644K00330q419052j0680383l356992M987025N875963K31957n675919
$$ plain form
40364 24451573 16908457 12032568 11687137 13473599 13593886 11961053 11732405 13274168
40356 13274168 12745984 8368036 3982684 3816186 6866830 8889538 7523515 3876004
40348 3876004 1289256 3061250 8542154 11734402 7741112 306939 -2075012 2362236
40340 2362236 6957218 7093156 5663884 6028876 6260462 3990947 1412139 1416778 3034229
40331 3034229 4084807 4531599 4547156 3310913 2020617 3666432 7606024 9153544 6831733
40322 6831733 5003871 7136424 12031621 18833221 28767204 38453643 39266297 29406692
40314 29406692 20455305 24679846 39586059 51347948 50625502 39523310 25792925 15781539
40306 15781539 11425211 9794835 6768391 3203120 4155773 10030789 13890243 11198171
$$ packed form
40364B4451573p543116m875889l45431J786462J20287j632833k28648J541763
40356A3274168n28184m377948m385352j66498L050644K022708j366023l647511
40348C876004k586748J771994N480904L192248l993290p434173k381951M437248
40340B362236M594982J35938j429272L64992K31586k269515k578808M639J617451
40331C034229J050578M46792J5557j236243j290296J645815L939592J547520k321811
40322F831733j827862K132553M895197O801600R933983R686439Q12654r859605
40314B9406692q951387M224541J4906213J1761889p22446j1102192j3730385j0011386
40306A5781539m356328j630376l026444l565271R52653N875016L859454k692072
$$ plain form
40298 11198171 6532480 5700317 6826743 5465109 3448746 5193402 8885799 9147026
40290 9147026 6181268 4910730 6451434 7294995 6097336 5051844 5110320 5422654 6762435
40281 6762435 10167397 13092157 12257896 9445134 9169936 11554404 12923674 12520619 12777947
40272 12777947 13412441 11351044 6965149 4846857 7465735 12586130 17353441 20577850
40264 20577850 21117445 18803578 16898289 18653828 21589964 20641710 16876948 16611274
40256 16611274 20925649 23070324 18860004 13101369 11753305 13242908 12448599 9087433
40248 9087433 6885032 7360435 9607681 14078175 21092376 26559627 24788718 16354958
40240 16354958 8646527 7077736 9524734 11382779 12366140 14837773 18033281 18727661
$$ packed form
40298A1198171m665691q32163J126426j361634k016363J744656L692397K61227
40290I147026k965758j270538J540704Q43561j197659j045492N8476L12334J339781
40281F762435L404962K924760q34261k812762k75198K384468J369270m03055K57328
40272A2777947O34494k061397m385895k118292K618878N120395M767311L224409
40264B0577850N39595k313867j905289J755539K936136r48254l764762k65674
40256A6611274M314375K144675m210320n758635j348064J489603p94309l361166
40248I087433k202401M75403K247246M470494P014201N467251j770909q433760
40240A6354958p708431j568791K446998J858045R83361K471633L195508O94380
$$ plain form
40232 18727661 17196172 17741074 21815414 24555286 20846932 12044427 3646028 -1336900
40224 -1336900 -3124140 -1347820 4812591 13211964 19851721 23520841 25386965 24303174
40216 24303174 17673747 7841023 2140584 4211594 9739904 13397209 15612687 19204319
40208 19204319 23282055 24653873 22751607 19523185 16308217 13685245 12478590 12408022
40200 12408022 11724049 10227328 10238683 12697913 15240517 16131576 16702845 17679318 17058873
40191 17058873 14473144 13448461 15810722 17982189 16845556 15124009 16288226 18175568
40183 18175568 17136994 15038751 16139101 19683170 21629893 21589040 22091773 22816250 21531004
40174 21531004 19291880 18802610 18905866 16566942 13087159 12247525 13241108 11758658 7633427
$$ packed form
40232A8727661j531489N44902M074340K739872l708354q802505q398399m982928
40224a336900j787240J776320O160411Q399373O639757L669120J866124j083791
40216B4303174o629427r832724n700439K071010N528310L657305K215478L591632
40208A9204319M077736J371818j902266l228422l214968k622972j206655p0568
40200A2408022o83973j496721J1355K459230K542604Q91059N71269R76473o20445
40191A7058873k585729j024683K362261K171467j136633j721547J164217J887342
40183A8175568j038574k098243J100350L544069J946723m0853N02733P24477j285246
40174B1531004k239124m89270J03256k338924l479783q39634R93583j482450m125231
$$ plain form
40165 7633427 5191773 6127660 8052127 10062437 13573094 17283600 17453374 13998015
40157 13998015 10729520 8964877 6502533 3339752 2320654 3267547 2638129 260781
40149 260781 276159 3743356 6319723 5347847 3602929 3796992 4703169 4936526 5441579
40140 5441579 6123550 5050988 2849493 2621757 3861928 2369724 -1845980 -3165299
40132 -3165299 422373 3566616 2699061 2018827 5453570 9034791 7374206 2658593
40124 2658593 786436 2439038 4202391 5455933 8098163 11637576 13954294 15260615
40116 15260615 16889591 18050991 17530286 16067141 13621484 7981457 274968 -2560985
40108 -2560985 3458213 11956372 14042167 10341289 8120232 9196548 8956541 6158256
$$ packed form
40165G633427k441654R35887J924467K010310L510657L710506J69774l455359
40157A3998015l268495j764643k462344l162781j019098R46893o29418k377348
40149B60781J5378L467197K576367r71876j744918J94063R06177K33357N05053
40140E441579O81971j072562k201495k27736J240171j492204m215704j319319
40132c165299L587672L144243q67555o80234L434743L581221j660585m715613
40124B658593j872157J652602J763353J253542K642230L539413K316718J306321
40116A5260615J628976J161400n20705j463145k445657n640027p706489k835953
40108b560985O019198Q498159K085795l700878k221057J076316k40007k798285
$$ plain form
40100 6158256 5151897 7787545 10765207 12282597 14273741 16445816 15076355 10236827
40092 10236827 7738535 10556425 13882778 12456132 8099715 5983939 7192905 8998729
40084 8998729 9707903 9742439 10061001 12050142 16577409 21110239 20893200 15350996 9906547
40075 9906547 8709655 9323720 8036210 6321068 7203800 8790314 7555338 5764334
40067 5764334 8752949 15627427 19688205 18560573 16855133 17210612 16196388 12602756
40059 12602756 12393742 19279819 26123372 23761279 15043806 11232300 15416124 18732203
40051 18732203 14649589 8188038 6828486 9738435 11980689 13627591 17379363 20879248
40043 20879248 19365068 14411453 12471611 14909072 16585938 15020186 13881483 15624190
$$ packed form
40100F158256j006359K635648K977662J517390J991144K172075j369461m839528
40092A0236827k498292K817890L326353j426646m356417k115776J208966J805824
40084H998729P09174L4536L18562J989141M527267M532830k17039n542204n444449
40075I906547j196892O14065j287510j715142Q82732J586514j234976j791004
40067E764334K988615O874478M060778j127632j705440L55479j014224l593632
40059A2602756k09014O886077O843553k362093q717473l811506M183824L316079
40051A8732203m082614o461551j359552K909949K242254J646902L751772L499885
40043B0879248j514180m953615j939842K437461J676866j565752j138703J742707
$$ plain form
40035 15624190 17436476 17276723 17574477 19514322 20072352 19301075 24010198 37415721
40027 37415721 50261558 50636926 39849199 30069815 27598841 27428167 24829032 22905171
40019 22905171 25166811 28337001 27829326 25113577 24281177 25058590 24457126 22615026 21795991
40010 21795991 21359347 18875958 15492438 15262777 18821517 22019030 21887471 20254353
40002 20254353 19753411 19421424 16931425 13395978 12879548 17050416 22427693 24042083
39994 24042083 21013266 17215773 16274483 17290397 16920952 14815026 14269218 16707845
39986 16707845 18417906 15470548 10177658 8932567 13657123 19172111 20578951 19957712
39978 19957712 22706173 29229415 34272763 34442959 32546047 32929505 35635712 37827627
$$ packed form
40035A5624190J812286j59753K97754J939845N58030p71277M709123J3405523
40027C7415721J2845837L75368j0787727r779384k470974j70674k599135j923861
40019B2905171K261640L170190n07675k715749q32400P77413o01464j842100q19035
40010B1795991m36644k483389l383520k29661L558740L197513j31559j633118
40002B0254353n00942l31987k489999l535447n16430M170868N377277J614390
39994B4042083l028817l797493r41290J015914l69445k105926n45808K438627
39986A6707845J710061k947358n292890j245091M724556N514988J406840o21239
39978A9957712K748461O523242N043348J70196j896912L83458K706207K191915
$$ plain form
39970 37827627 38733838 39492368 39169735 35446115 29909738 28065589 31643871 34942557
39962 34942557 32813276 29209675 32247735 41904477 48791255 46318897 38670966 34144933
39954 34144933 35061270 37687146 38453345 35922010 29176827 19290845 11499786 11096427
39946 11096427 16447864 19658399 15376647 6498329 140479 6095 3926665 7665741
39938 7665741 9848030 12823127 18354481 23185022 21527688 13019921 4961728 3867122
39930 3867122 7706835 10398439 11067838 13100843 15867114 15067981 12112791 15092193
39922 15092193 26550131 36758524 34859027 22572896 11009342 6641082 6587545 6494580
39914 6494580 6594334 8633804 11497878 12467624 10732733 7987188 6493770 7133943 8626233
$$ packed form
39970C7827627R06211P58530l22633l723620n536377j844149L578282L298686
39962C4942557k129281l603601L038060R656742O886778k472358p647931m526033
39954C4144933R16337K625876P66199k531335o745183r885982p791059m03359
39946A1096427N351437L210535m281752q878318o357850j34384L920570L739076
39938G665741K182289K975097N531354M830541j657334q507767q058193j094606
39930C867122L839713K691604O69399K033005K766271p99133k955190K979402
39922A5092193J1457938J0208393j899497j2286131j1563554m368260n3537r2965
39914F494580R9754K039470K864074R69746j734891k745545j493418O40173J492290
$$ plain form
39905 8626233 8709200 6735729 4527371 3971382 4785223 5567509 5810205 5744173 5526525
39896 5526525 5819422 7792463 11278769 14278712 15273666 14384604 11684823 7060478 2689851
39887 2689851 2103606 4967890 6658874 5376881 5163489 8503105 11160716 9570347
39879 9570347 8247084 12572992 18201125 16649192 9351274 6159832 9751332 11808175
39871 11808175 7244069 2492978 4743164 10952872 13883461 13073921 12990406 14286604
39863 14286604 13658536 10374470 7285470 6091868 5662576 4540143 2460415 342945
39855 342945 340287 3802939 7851849 7277249 1842710 -2201902 -679888 2656857 2641093
39846 2641093 922150 2537032 7289802 10335974 9852088 8805291 9713497 12168731
$$ packed form
39905H626233Q2967j973471k208358n55989Q13841P82286K42696o6032k17648
39896E526525K92897J973041L486306K999943R94954q89062k699781m624345m370627
39887B689851n86245K864284J690984j281993k13392L339616K657611j590369
39879I570347j323263M325908N628133j551933p297918l191442L591500K056843
39871A1808175m564106m751091K250186O209708K930589q09540q3515J296198
39863A4286604o28068l284066l089000j193602m29292j122433k079728k117470
39855C42945k658L462652M048910n74600n434539m044612J522014L336745j5764
39846B641093j718943J614882M752770L046172m83886j046797R08206K455234
$$ plain form
39838 12168731 15119176 17594436 17693717 14707268 11728267 12401014 15557716 16811678
39830 16811678 15059069 13629526 15204277 19273971 24442324 29388295 31472406 28529784
39822 28529784 22960089 20340393 22537680 25233951 23898944 19631728 16992708 17615833
39814 17615833 18239974 15225762 9965251 8621791 15452698 26928254 34697380 34789913
39806 34789913 31163084 29136849 28883903 27880668 26344538 26316404 27467564 27679928 26412803
39797 26412803 24301281 21146305 17501145 16081113 17946175 19646838 18352202 17317110
39789 17317110 21279012 28717733 34383758 37538604 41182119 44468395 43194683 37615344
39781 37615344 32470486 28891705 23823691 18316264 18050017 23507409 28310246 30907730
$$ packed form
39838A2168731K950445K475260R9281k986449k979001O72747L156702J253962
39830A6811678j752609j429543J574751M069694N168353M945971K084111k942622
39822B8529784n569695k619696K197287K696271j335007m267216k639020O23125
39814A7615833O24141l014212n260511j343460O830907J1475556P769126R2533
39806C4789913l626829k026235k52946j003235j536130k8134J151160K12364j267125
39797B6412803k111522l154976l645160j420032J865062J700663j294636j035092
39789A7317110L961902P438721N666025L154846L643515L286276j273712n579339
39781C7615344n144858l578781n068014n507427k66247N457392M802837K597484
$$ plain form
39773 30907730 38885172 55515237 69808913 68381025 52603265 35944481 27231589
39766 27231589 24127982 21374590 17854804 15113540 14582319 17104327 21349532 22984999
39758 22984999 19204136 13429440 11644551 14841598 19114852 22167861 24749635 25914102
39750 25914102 22532786 15167612 9814173 11111608 16690923 20586197 20230169 18071714
39742 18071714 17575045 19189701 19797010 15850858 7903011 1523500 1925124 7888082
39734 7888082 13202960 14231596 13522429 15199721 19275870 22234008 21757920 19062961
39726 19062961 16948214 16791133 17832793 19224176 22073414 28040198 35603693 40049091
39718 40049091 39044039 36097456 35426086 35134281 29940102 20230076 13177509 13444408
$$ packed form
39773C0907730P977442J6630065J4293676j427888j5777760j6658784q712892
39766B7231589l103607k753392l519786k741264n31221K522008M245205J635467
39758B2984999l780863n774696j784889L197047M273254L053009K581774J164467
39750B5914102l381316p365174n353439J297435N579315L895274l56028k158455
39742A8071714m96669J614656O07309l946152p947847o379511M01624N962958
39734G888082N314878J028636p09167J677292M076149K958138m76088k694959
39726A9062961k114747j57081J041660J391383K849238N966784P563495M445398
39718D0049091j005052k946583o71370k91805n194179r710026p052567K66899
$$ plain form
39710 13444408 17545553 19938576 20230097 20592438 19887152 15653483 10032729 8327171
39702 8327171 11887292 16817109 19812724 21225488 22155241 22754648 24069678 27226604
39694 27226604 29681963 26877962 19522329 14537513 15908476 19113491 18515588 15979296
39686 15979296 16793490 20220554 20589284 16545866 12869449 12835715 14346138 14593952 13663682
39677 13663682 12227066 10086644 8388826 9222865 11787653 12959505 12557610 13437426
39669 13437426 15394290 14595100 10957447 9843461 13189921 15335946 12321213 9120923
39661 9120923 11311837 14954102 12715739 6273576 3765431 6893548 9691637 9687546 10910765
39652 10910765 14340525 14551613 9569081 6227419 10494817 18416467 22359591 21655611
$$ packed form
39710A3444408M101145K393023K91521L62341p05286m233669n620754j705558
39702H327171L560121M929817K995615J412764R29753N99407J315030L156926
39694B7226604K455359k804001p355633m984816J370963L205015n97903k536292
39686A5979296Q14194L427064L68730m043418l676417l3734J510423K47814r30270
39677A3663682j436616k140422j697818Q34039K564788J171852m01895Q79816
39669A3437426J956864p99190l637653j113986L346460K146025l014733l200290
39661I120923K190914L642265k238363o442163k508145L128117K798089m091J223219
39652A0910765L429760K11088m982532l341662M267398P921650L943124p03980
$$ plain form
39644 21655611 20967596 21475196 20386583 17789994 17508107 20548700 22920305 21630352
39636 21630352 18929225 18381177 19595279 19567852 17598533 15980124 16188313 17045754 17380126
39627 17380126 18298820 21088038 24158260 24374367 21228118 17623648 16215653 16757150
39619 16757150 17395267 16675150 13881025 9676318 7086462 9191409 14581144 17829577
39611 17829577 16278565 13727367 15183168 20443302 25494833 28101025 29170800 30268483
39603 30268483 32223884 34563565 34509049 29131099 20533553 15414246 16643072 19218638
39595 19218638 18192665 16057079 17314391 20477921 22172148 24957768 32643598 40711592
39587 40711592 41077455 35327128 33169247 37203332 39500434 35498391 30950734 30762605
$$ packed form
39644B1655611o88015N07600j088613k596589k81887L040593K371605j289953
39636B1630352k701127n48048J214102k7427j969319j618409K08189Q57441L34372
39627A7380126R18694K789218L070222K16107l146249l604470j407995N41497
39619A6757150O38117p20117k794125m204707k589856K104947N389735L248433
39611A7829577j551012k551198J455801N260134N051531K606192J069775J097683
39603C0268483J955401K339681n4516n377950q597546n119307J228826K575566
39595A9218638j025973k135586J257312L163530J694227K785620P685830Q067994
39587D0711592L65863n750327k157881M034085K297102m002043m547657j88129
$$ plain form
39579 30762605 30455615 25061687 18817741 18589010 23108884 26138507 26580618 28435338
39571 28435338 32823757 36153786 35523648 31771871 27777347 26225767 27602716 28950701
39563 28950701 27358169 25605508 29634043 38530673 43115021 38290231 30755428 29285965
39555 29285965 33336511 38060571 44860034 57320039 69692275 70254861 57025866 41343984
39547 41343984 33781113 34069551 37434852 42940171 50565911 56347417 57373592 58251918
39539 58251918 65493943 76689190 82671270 81898677 85340543 101666599 122331013 129590697
39531 129590697 118803983 104045594 98305546 96436036 85320214 65173682 49735732
39524 49735732 46344911 47313220 44449016 42060721 48434122 60989469 68457487 65209638
$$ packed form
39579C0762605l06990n393928o243946k28731M519874L029623M42111J854720
39571B8435338M388419L330029o30138l751777l994524j551580J376949J347985
39563B8950701j592532j752661M028535Q896630M584348m824790p534803j469463
39555B9285965M050546M724060O799463J2460005J2372236N62586j3228995j5681882
39547D1343984p562871K88438L365301N505319P625740N781506J026175Q78326
39539E8251918P242025J1195247N982080p72593L441866J6326056K0664414P259684
39531A29590697j0786714j4758389n740048j869510j1115822k0146532j5437950
39524D9735732l390821R68309k864204k388295O373401J2555347P468018l247849
$$ plain form
39516 65209638 56288355 49137037 46448320 47374378 50268900 52254668 49743027 42211201
39508 42211201 34210015 31414855 34429011 37969981 37582185 36123851 40254080 49705265
39500 49705265 54754373 48141564 35446016 27803879 27316828 27037331 23698513 21646525
39492 21646525 23564271 25916841 25775788 24661086 23618027 22078399 23266105 31783204
39484 31783204 43180799 45787934 37052850 28134630 27390809 30231507 31786104 37317872
39476 37317872 49872859 58683352 53144494 40379623 35166466 38518757 40273600 37873710
39468 37873710 37423478 39096826 37040503 33042354 35460737 44073207 50320552 53602399
39460 53602399 62112317 74586187 77024738 63856945 48380836 43803123 45573400 41970465
$$ packed form
39516F5209638q921283p151318k688717R26058K894522J985768k511641p531826
39508D2211201q001186k795160L014156L540970l87796j458334M130229R451185
39500D9705265N049108o612809j2695548p642137m87051k79497l338818k051988
39492B1646525J917746K352570j41053j114702j043059j539628J187706Q517099
39484C1783204J1397595K607135q735084q918220p43821K840698J554597N531768
39476C7317872J2554987Q810493n538858j2764871n213157L352291J754843k399890
39468C7873710m50232J673348k056323l998149K418383Q612470O247345L281847
39460E3602399Q509918J2473870K438551j3167793j5476109m577713J770277l602935
$$ plain form
39452 41970465 32675867 26482006 27083916 30679102 33379354 33381264 29578351 24338383 23663491
39443 23663491 28924717 32948465 30117998 25499217 27224561 34141424 38557710 38121091
39435 38121091 37023370 36887493 34210261 27473337 20695064 18139077 19227464 20112398
39427 20112398 18295617 15287189 15504479 21379155 28977325 31201760 26664700 21830151
39419 21830151 22137476 25059555 25396182 23452360 23120090 24762358 25476927 24813404 24872525
39410 24872525 25410734 23981323 21143677 20780215 24078209 27149010 26495594 23914131
39402 23914131 23547151 25588523 25508492 20035107 12493274 10290182 16418763 25423508
39394 25423508 30236331 31450448 35392455 42982677 46446165 40201948 29923293 25391111
$$ packed form
39452D1970465r294598o193861O01910L595186K700252J910l802913n239968o74892
39443B3663491N261226M023748k830467m618781J725344O916863M416286m36619
39435C8121091j097721j35877k677232o736924o778273k555987J088387Q84934
39427B0112398j816781l008428K17290N874676P598170K224435m537060m834549
39419B1830151L07325K922079L36627j943822l32270J642268P14569o63523N9121
39410B4872525N38209j429411k837646l63462L297994L070801o53416k581463
39402B3914131l66980K041372q0031n473385p541833k203092O128581R004745
39394B5423508M812823J214117L942007P590222L463488o244217j0278655m532182
$$ plain form
39386 25391111 27429177 28291832 24029271 19783425 21271060 26630929 30207294 30830150
39378 30830150 32038548 35438669 37901220 36042802 30814342 26114480 24248460 24487542
39370 24487542 25568348 27514629 30212161 31973233 31617428 31432544 35499339 44171212
39362 44171212 52392273 55468547 55052753 56539844 60896865 62700605 57763313 49316891
39354 49316891 43419951 40769657 37727717 34056817 33456737 35846442 36050837 32863334
39346 32863334 32428692 38443237 46767485 55977637 73607574 100448532 117672951 108117797
39338 108117797 87369906 91499033 128763218 164572674 165503512 139428927 115968696
39331 115968696 103403530 87261071 62376503 41540887 32857023 29758218 27042925
$$ packed form
39386B5391111K038066Q62655m262561m245846J487635N359869L576365O22856
39378C0830150J208398L400121K462551j858418n228460m699862j866020K39082
39370B4487542J080806J946281K697532J761072l55805j84884M066795Q671873
39362D4171212Q221061L076274m15794J487091M357021J803740m937292q446422
39354D9316891n896940k650294l041940l670900o00080K389705K04395l187503
39346C2863334m34642O014545Q324248R210152J7629937K6840958J7224419r555154
39338A08117797k0747891M129127L7264185L5809456R30838k6074585k3460231
39331A15968696j2565166j6142459k4884568k0835616q683864l098805k715293
$$ plain form
39324 27042925 29107074 36839893 41329956 37370985 31567394 31133160 34766560 39298958
39316 39298958 45039518 49802028 48155233 41896302 40901408 47919660 53357846 52182003
39308 52182003 55014742 72746796 98871275 118018278 126219050 132281214 142480591
39301 142480591 152729225 154124734 140384862 112788521 82570082 63986423 59992650
39294 59992650 59774382 54940888 50754601 54679049 62397063 66038912 70382168 87812081
39286 87812081 118413692 146352890 157354495 151805138 140257306 133713552 139178872
39279 139178872 157857282 185977392 221049039 264707000 312672568 345308224 340205348
39272 340205348 297488718 243502632 203884668 179181348 152694906 116819681 82704824
$$ packed form
39324B7042925K064149P732819M490063l958971n803591m34234L633400M532398
39316C9298958N740560M762510j646795o258931r94894P018252N438186j175843
39308E2182003K832739J7732054K6124479J9147003Q200772O062164J0199377
39301A42480591J0248634J395509j3739872k7596341l0218439j8583659l993773
39294E9992650k18268m833494m186287L924448P718014L641849M343256J7429913
39286H7812081L0601611K7939198J1001605n549357j1547832o543754N465320
39279A39178872J8678410K8120110L5071647M3657961M7965568L2635656n102876
39272C40205348m2716630n3986086l9617964k4703320k6486442l5875225l4114857
$$ plain form
39265 82704824 64048127 59320627 55186866 44498217 34299937 34138840 41951315 47196108
39257 47196108 45178575 40725179 37753634 33999217 29593362 32588195 48570900 69252045
39249 69252045 79001708 71384872 53865815 37733059 28747598 26803055 29093614 31997631
39241 31997631 32710554 30605456 26915968 23752558 22954356 23701560 21944266 15637203
39233 15637203 9494700 9487167 13743750 15949759 16928285 23125575 32732677 35316053 29098937
39224 29098937 25964922 33050577 42524479 48003759 56622112 72980934 87002386 95514812
39216 95514812 120506699 178807369 240882973 251742211 198011373 127262135 90318713
39209 90318713 87780904 87953411 75987166 62714125 56903402 53197145 46579486 40727813
$$ packed form
39265H2704824j8656697m727500m133761j0688649j0198280j61097P812475N244793
39257D7196108k017533m453396k971545l754417m405855K994833J5982705K0681145
39249F9252045R749663p616836j7519057j6132756q985461j944543K290559K904017
39241C1997631P12923k105098l689488l163410p98202P47204j757294o307063
39233A5637203o142503p533M256583K206009R78526O197290R607102K583376o217116
39224B9098937l134015P085655R473902N479280Q618353J6358822J4021452Q512426
39216I5514812K4991887N8300670O2075604J0859238n3730838p0749238l6943422
39209I0318713k537809J72507j1966245j3273041n810723l706257o617659n851673
$$ plain form
39201 40727813 38833993 38073356 36446100 36772120 41186489 47445450 52193020 53509050
39193 53509050 50138031 42587050 34747106 30226759 27605004 23495321 19428906 20638082
39185 20638082 27781638 34750771 36068869 32649898 28531415 25101066 20983012 15876121
39177 15876121 12053487 12003578 15430558 18763534 17962892 12486434 6266822 3862640
39169 3862640 5694440 8100153 8221762 7483269 9240708 13954588 18448403 19925223
39161 19925223 18806170 16896685 14805955 12707530 11674440 12051019 12350342 12335590 14792172
39152 14792172 20578147 24862780 23998970 23522673 31105225 42449314 44396637 34038862
39144 34038862 24034325 24294706 28873813 28104474 23922903 23531845 25832639 25241729
$$ packed form
39201D0727813j893820p60637j627256L26020M414369O258961M747570J316030
39193E3509050l371019p550981p839944m520347k621755m109683m066415J209176
39185B0638082P143556O969133J318098l418971m118483l430349m118054n106891
39177A5876121l822634m9909L426980L332976q00642n476458o219612k404182
39169C862640J831800K405713J21609p38493J757439M713880M493815J476820
39161A9925223j119053j909485k090730k098425j033090L76579K99323j4752K456582
39152A4792172N785975M284633q63810m76297P582552J1344089J947323j0357775
39144C4038862j0004537K60381M579107p69339m181571l91058K300794n90910
$$ plain form
39136 25241729 23117242 24007055 25054118 20690573 14368383 13998497 18677238 21904973
39128 21904973 25119197 34427601 45271557 45226843 33439733 23159780 22190816 24300878
39120 24300878 23505653 23158174 25880011 27884814 29707884 39553850 57796397 70010999
39112 70010999 65169507 51110043 42356663 41323081 41396712 40558402 41085971 41624445 39616796
39103 39616796 37249537 36956888 36024174 32785252 31976642 36737448 42645930 47397327
39095 47397327 57499577 76155049 95048973 110450784 135912087 181213659 227428529
39088 227428529 244748288 231356595 211576082 195614365 167077016 117796102 70181337
39081 70181337 49190762 49626667 48924225 39917534 32336117 30043332 26508104 20662194
$$ packed form
39136B5241729k124487Q89813J047063m363545o322190l69886M678741L227735
39128B1904973L214224R308404J0843956m4714j1787110j0279953r68964K110062
39120B4300878p95225l47479K721837K004803J823070R845966J8242547J2214602
39112G0010999m841492j4059464q753380j033582P3631q38310N27569N38474k007649
39103C9616796k367259k92649r32714l238922q08610M760806N908482M751397
39095D7397327J0102250J8655472J8893924J5401811K5461303M5301572M6214870
39088B27428529J7319759j3391693j9780513j5961717k8537349m9280914m7614765
39081G0181337k0990575M35905p02442r006691p581417k292785l535228n845910
$$ plain form
39073 20662194 19844056 25162597 27773419 23043997 17309193 16718981 18790259 19450861
39065 19450861 20499612 24866653 30477659 34141756 37586351 45218939 58288114 73508377
39057 73508377 84406040 83022346 65675122 39986504 21097284 16798567 20305167
39050 20305167 21055418 17472500 14224441 12334490 9388331 6340574 6555163 9746535
39042 9746535 13526691 18983911 27627746 35033232 35989460 34397500 38453875 46739600
39034 46739600 49911832 46534283 45078230 48689940 52128921 57548249 76722453 109498441
39026 109498441 137561038 153299298 178330820 232803104 297159278 328182446 309023252
39019 309023252 261169076 209095472 157979746 109902542 76364650 62101902 54525534
$$ packed form
39073B0662194q18138N318541K610822m729422n734804n90212K071278O60602
39065A9450861J048751M367041N611006L664097L444595P632588J3069175J5220263
39057G3508377J0897663j383694j7347224k5688618j8889220m298717L506600
39050B0305167P50251l582918l248059j889951k946159l047757K14589L191372
39042I746535L780156N457220Q643835P405486R56228j591960M056375Q285725
39034D6739600L172232l377549j456053L611710L438981N419328J9174204L2775988
39026A09498441K8062597J5738260K5031522N4472284O4356174L1023168j9159194
39019C09023252m7854176n2073604n1115726m8077204l3537892j4262748p576368
$$ plain form
39012 54525534 42572976 32504501 32971875 37180947 33510469 23977600 18564427 18686460
39004 18686460 19015120 19401951 22509048 24564130 20476702 14367483 13858686 17211406
38996 17211406 16893106 12901310 11567504 13209914 11892317 6701928 3331683 4584365
38988 4584365 8073112 12855974 19701061 25138718 23916130 17676455 13420814 13344242
38980 13344242 13716379 13343288 14882336 17577100 17010257 13188917 11457128 14311703
38972 14311703 19107046 24253907 30388599 34856749 32801642 25243871 19240991 18891624
38964 18891624 22681092 29717073 40391549 49848750 49718896 39232508 27061174 19464445
38956 19464445 14119879 8439308 5820587 9245978 15516556 20400065 23745635 25702839
$$ packed form
39012E4525534j1952558j0068475M67374M209072l670478r532869n413173J22033
39004A8686460L28660L86831L107097K055082m087428o109219n08797L352720
38996A7211406l18300l991796j333806J642410j317597n190389l370245J252682
38988D584365L488747M782862O845087N437657j222588o239675m255641p6572
38980A3344242L72137l73091J539048K694764n66843l821340j731789K854575
38972A4311703M795343N146861O134692M468150k055107p557771o002880l49367
38964A8891624L789468P035981J0674476R457201j29854j0486388j2171334p596729
38956A9464445n344566n680571k618721L425391O270578M883509L345570J957204
$$ plain form
38948 25702839 23939564 18880949 16314506 20754710 30839394 43589946 56798981 64721304
38940 64721304 60035703 45250732 33930920 33722134 35606954 28143943 15417254 10479393
38932 10479393 15760398 21725115 23261175 25625549 32486819 38148844 35850009 26964271
38924 26964271 17713189 11452712 7898273 6378323 6237679 6136554 5730528 6719539 10261856
38915 10261856 14405816 15845060 13984577 12255359 14992344 22698714 30412694 31747272
38907 31747272 25172393 15490651 8748259 7017648 8619411 11321613 13667279 14528825
38899 14528825 13168686 9521858 4178896 -970141 -2766780 6514 3728113 3722848
38891 3722848 1127068 1504576 5628580 7281132 3119970 -1015669 1356933 7125671
$$ packed form
38948B5702839j763275n058615k566443M440204J0084684J2750552J3209035P922323
38940F4721304m685601j4784971j1319812k08786J884820p463011j2726689m937861
38932A0479393N281005N964717J536060K364374O861270N662025k298835q885738
38924B6964271r251082o260477l554439j519950j40644j01125m06026R89011L542317
38915A0261856M143960J439244j860483j729218K736985P706370P713980J334578
38907C1747272o574879r681742o742392j730611J601763K702202K345666Q61546
38899A4528825j360139l646828n342962n149037j796639K773294L721599n265
38891C722848k595780L77508M124004J652552m161162m135639K372602N768738
$$ plain form
38883 7125671 8220528 3611297 -65800 1307080 4866096 6606272 6241918 5364796
38875 5364796 4995418 5835781 7802826 9213448 9135746 9472344 11475912 12129381 8520843
38866 8520843 3988377 4230664 8462432 10818854 9999152 10260574 12336662 11418697 6457703
38857 6457703 3590165 6362984 9534059 7543450 3104813 1776953 3173585 3666189
38849 3666189 3539244 5039644 6633205 5554100 3461600 3557945 4602308 3826757 3070812
38840 3070812 5193884 6860482 2842615 -3874685 -4863771 938941 5942887 6530459
38832 6530459 7951350 13752120 18916554 18200362 14173611 11660186 10226723 7895265
38824 7895265 7001049 9956115 13271139 12385108 9552245 10551610 15591123 19648079 20600746
$$ packed form
38883G125671J094857m609231l677097J372880L559016J740176l64354q77122
38875E364796l69378Q40363J967045J410622p7702L36598K003568O53469l608538
38866H520843m532466K42287M231768K356422q19702K61422K076088r17965m960994
38857F457703k867538K772819L171075j990609m438637j327860J396632M92604
38849C666189j26945J500400J593561j079105k092500R6345J044363p75551p55945
38840C070812K123072J666598m017867o717300r89086N802712N003946N87572
38832F530459J420891N800770N164434p16192m026751k513425j433463k331458
38824G895265q94216K955066L315024q86031k832863R99365N039513M056956R52667
$$ plain form
38815 20600746 21090602 22664601 23526184 22794984 22791862 25897764 31375327 35436332 33570826
38806 33570826 25050712 16697288 18232761 30468696 42182097 43234859 36387384 30216585
38798 30216585 25350572 16806556 6978967 5203536 13823650 24822600 32346228 38752373
38790 38752373 44862890 44488488 35297168 27078574 30571166 42474547 49402284 44432234
38782 44432234 33195041 24824618 22530898 23060059 21509676 16334517 11289955 11325155
38774 11325155 15863689 19310957 19398379 20196282 24114260 26577262 23741051 20609101
38766 20609101 24516452 33551557 39105500 38830827 39336170 44991772 50929743 50091782
38758 50091782 42433733 33717714 28108922 25145481 22601717 19789555 18098365 19365293
$$ packed form
38815B0600746M89856J573999Q61583p31200l122L105902N477563M061005j865506
38806C3570826q520114q353424J535473J2235935J1713401J052762o847475o170799
38798C0216585m866013q544016r827589j775431Q620114J0998950P523628O406145
38790C8752373O110517l74402r191320q218594L492592J1903381O927737m970050
38782D4432234j1237193q370423k293720N29161j550383n175159n044562L5200
38774A1325155M538534L447268Q7422P97903L917978K463002k836211l131950
38766B0609101L907351R035105N553943k74673N05343N655602N937971q37961
38758E0091782p658049q716019n608792k963441k543764k812162j691190J266928
$$ plain form
38750 19365293 23780455 29216970 32751138 32816509 30249595 28114671 30000900 36497022
38742 36497022 43149238 44138967 38450154 30064215 22057950 14246029 7464040 5269496
38734 5269496 8523522 12444779 12739036 11197200 11314899 11878060 9824072 6655583 6264442
38725 6264442 7933411 7359770 4234439 3132039 6048969 8983015 7724697 3459439
38717 3459439 646501 1658111 5026838 7413888 6283085 1717018 -3698563 -7047353
38709 -7047353 -6921343 -3347621 2362992 7188648 8182619 5989350 4352680 4899629 5239619
38700 5239619 3835337 3195177 5457651 8150167 7977661 6204912 6388889 8743687 10570503
38691 10570503 10854699 10984608 11910174 13256532 14185218 13467486 10750519 9074228 12801903
$$ packed form
38750A9365293M415162N436515L534168O5371k566914k134924J886229O496122
38742C6497022O652216R89729n688813q385939q006265p811921o781989k194544
38734E269496L254026L921257K94257j541836J17699N63161k053988l168489l91141
38725F264442J668969n73641l125331j102400K916930K934046j258318m265258
38717C459439k812938J011610L368727K387050j130803m566067n415581l348790
38709g047353J26010L573722N710613M825656R93971k193269j636670N46949L39990
38700E239619j404282o40160K262474K692516j72506j772749J83977K354798J826816
38691A0570503K84196J29909R25566J346358R28686p17732k716967j676291L727675
$$ plain form
38682 12801903 21150979 27683010 28461588 26158155 23545729 18865263 11898454 8514763
38674 8514763 12997998 20563740 24008333 24157837 27709835 37922026 52383621 65872308
38666 65872308 70937994 61771701 43459827 30764908 30814108 34296834 31509675 27869308
38658 27869308 32597187 41158989 42989950 39324021 38345614 40239076 44750487 65517816
38650 65517816 112511670 162416956 173703873 137278797 88981326 63816692 60217192
38643 60217192 59869268 58946737 61634847 60974097 48024871 30279845 22245394 23931070
38635 23931070 24057422 19048663 14858775 14602523 16790343 21466103 27202427 27097030
38627 27097030 18145192 8940885 8065047 11508899 11875552 11881832 16601389 20676314 17368816
$$ packed form
38682A2801903Q349076O532031P78578k303433k612426m680466o966809l383691
38674H514763M483235P565742L444593J49504L551998J0212191J4461595J3488687
38666F5872308N065686r166293j8311874j2694919M9200L482726k787159l640367
38658B7869308M727879Q561802J830961l665929r78407J893462M511411K0767329
38650F5517816M6993854M9905286J1286917l6425076m8297471k5164634l599500
38643F0217192l47924r22531K688110o60750j2949226j7745026q034451J685676
38635B3931070J26352n008759m189888k56252K187820M675760N736324j05397
38627B7097030q951838r204307q75838L443852L66653O280M719557M074925l307498
$$ plain form
38618 17368816 12848565 16272012 22751571 22850189 22135819 32147151 47805799 56445895
38610 56445895 66053345 97385019 144157132 169177487 153054127 123723861 119125357
38603 119125357 136927543 142500538 117700653 80275472 56041256 49877579 49446023
38596 49446023 45829461 41766450 42769320 47450534 50853596 55847974 73319946 104509847
38588 104509847 129062072 123193355 89974564 58786539 50706467 56390366 54704667
38581 54704667 41366196 28263306 22739773 20731466 17474695 13555223 10138387 6769609
38573 6769609 4955271 7480033 13061473 16652010 16031303 14352074 15494683 19632808
38565 19632808 23531166 23354751 17950688 10948631 8067846 10711676 14384686 15282486
$$ packed form
38618A7368816m520251L423447O479559R8618p14370J0011332J5658648Q640096
38610E6445895R607450L1331674M6772113K5020355j6123360k9330266m598504
38603A19125357J7802186N572995k4799885l7425181k4234216o163677m31556
38596D9446023l616562m063011J002870M681214L403062M994378J7471972L1189901
38588A04509847K4552225n868717l3218791l1188025q080072N683899j685699
38581E4704667j3338471j3102890n523533k008307l256771l919472l416836l368778
38573F769609j814338K524762N581440L590537o20707j679229J142609M138125
38565A9632808L898358j76415n404063p002057k880785K643830L673010Q97800
$$ plain form
38557 15282486 15626791 19687987 26905174 32255743 32469247 30013955 31961813 44790171
38549 44790171 66641340 84014264 81598296 58743882 32046022 18276862 18872581
38542 18872581 24369497 28112242 29322948 27324564 21299864 14770506 13149586 16486648
38534 16486648 20289870 23691958 30864554 42814263 52855785 53171042 43372409 30704933
38526 30704933 23268702 23747392 28243971 30574172 28238607 23737853 19941342 16564589
38518 16564589 12765081 10466332 12111278 16756790 21113589 23165963 22910076 21838694
38510 21838694 23684907 32023164 43716187 48735169 41636441 30080636 26021308 31033393
38502 31033393 37264806 40913482 45998403 54087861 59142732 56463812 50500573 48968626
$$ packed form
38557A5282486L44305M061196P217187N350569K13504k455292J947858J2828358
38549D4790171K1851169J7372924k415968k2854414k6697860j3769160N95719
38542A8872581N496916L742745J210706j998384o024700o529358j620920L337062
38534A6486648L803222L402088P172596J1949709J0041522L15257r798633j2667476
38526C0704933p436231M78690M496579K330201k335565m500754l796511l376753
38518A6564589l799508k298749J644946M645512M356799K052374k55887j071382
38510B1838694J846213Q338257J1693023N018982p098728j1555805m059328N012085
38502C1033393O231413L648676N084921Q089458N054871k678920n963239j531947
$$ plain form
38494 48968626 52811300 55995644 53314762 45776315 39336638 39127321 43786325 46503942
38486 46503942 43880385 41165929 44245089 49379032 48211212 41460044 38594435 43567953
38478 43567953 51011809 58635529 71466319 87845380 92877543 76272579 48904578
38471 48904578 30315292 24987618 22393426 16558036 12553336 14075669 16896496 17161144
38463 17161144 16493915 15925633 13040909 8183113 6088944 8403445 11453345 14022313
38455 14022313 19837070 28915686 34102484 31033464 24864674 21899878 21075004 20046900
38447 20046900 23468729 36469408 53141096 60392128 53212544 39640836 30225951 27970365
38439 27970365 29384021 30490042 29647946 27298365 25148910 25258975 29482271 38947771
$$ packed form
38494D8968626L842674L184344k680882p538447o439677k09317M659004K717617
38486D6503942k623557k714456L079160N133943j167820o751168k865609M973518
38478D3567953P443856P623720J2830790J6379061N032163j6604964k7368001
38471D8904578j8589286n327674k594192n835390m004700J522333K820827K64648
38463A7161144o67229n68282k884724m857796k094169K314501L049900K568968
38455A4022313N814757R078616N186798l069020o168790k964796q24874j028104
38447B0046900L421829J3000679J6671688P251032p179584j3571708r414885k255586
38439B7970365J413656J106021q42096k349581k149455J10065M223296R465500
$$ plain form
38431 38947771 51818167 61347903 59892329 47210298 32102592 23407807 21778217 22351660
38423 22351660 22161274 21621852 21509602 22528357 26553710 34958028 45902065 54754958
38415 54754958 56979848 51891414 46268278 51488026 70212068 87251554 83665448 61389496
38407 61389496 42304796 39278608 42416491 41944846 48087834 71881525 99119573 105898081
38399 105898081 94497015 89807282 99453540 101662073 80276651 50451938 36326876
38392 36326876 38914515 41520635 36357122 29752038 26612178 24711679 23381721 26083094
38384 26083094 32786702 37875373 38103812 38216369 46493751 65326537 85710555 92409661
38376 92409661 78617927 55012446 38878791 34836317 33517968 28630870 24827034 26859260
$$ packed form
38431C8947771J2870396R529736j455574j2682031j5107706q694785j629590N73443
38423B2351660j90386n39422j12250J018755M025353Q404318J0944037Q852893
38415E4754958K224890n088434n623136N219748J8724042J7039486l586106k2275952
38407F1389496j9084700l026188L137883m71645O142988K3793691K7238048O778508
38399A05898081j1401066m689733R646258K208533k1385422k9824713j4125062
38392C6326876K587639K606120n163513o605084l139860j900499j329958K701373
38384B6083094O703608N088671K28439J12557Q277382J8832786K0384018O699106
38376I2409661j3791734k3605481j6133655m042474j318349m887098l803836K032226
$$ plain form
38368 26859260 32988681 43699422 64006715 89020663 99549139 84003821 55940954
38361 55940954 37613412 33221785 31080574 25720818 22611637 23655903 23018108 18478418
38353 18478418 14898098 14451705 13355660 10186847 8757669 10869624 13634553 15223709
38345 15223709 16550219 16848864 14368291 11491031 12271271 15015964 14290908 9963911
38337 9963911 6970583 6452439 4896814 2141971 2210974 5412061 7248100 6187294 5296218
38328 5296218 5407905 4079124 2110480 3314702 6547469 5879864 680402 -1994706
38320 -1994706 2420477 10058826 15032956 15560651 12030990 5470028 -228607 -779528
38312 -779528 2188594 3233811 2044478 3248295 6774120 6752928 1784783 -2123057 -1451837
$$ packed form
38368B6859260O129421J0710741K0307293K5013948J0528476j5545318k8062867
38361E5940954j8327542m391627k141211n359756l109181J044266o37795m539690
38353A8478418l580320m46393j096045l168813j429178K111955K764929J589156
38345A5223709J326510K98645k480573k877260P80240K744693p25056m326997
38337I963911k993328n18144j555625k754843O9003L201087J836039j060806q91076
38328E296218J11687j328781j968644J204222L232767o67605n199462k675108
38320a994706M415183P638349M974130N27695l529661o560962n698635n50921
38312g79528K968122J045217j189333J203817L525825k1192m968145l907840O71220
$$ plain form
38303 -1451837 148800 -7290 958719 4404199 6447312 5465410 5909581 10405292 15078709
38294 15078709 16825743 18102741 20321458 19909603 15690435 12922300 14867113 17301370
38286 17301370 16499563 15383859 16181831 14680471 8581139 4288001 7460622 13014523
38278 13014523 12920980 8753934 7809223 10928092 13002523 12678310 13080133 14553837 14174927
38269 14174927 11565673 9167014 7902729 7564065 9362006 13100374 14546014 11052337
38261 11052337 7065834 8369695 13505519 16757534 17067460 17820913 20093077 22605729
38253 22605729 26647792 34325104 42641553 45536573 41981803 37096079 35118291 35337703
38245 35337703 34800023 31644309 26088245 20315018 16164512 12001550 5353352 -289538
$$ packed form
38303a451837J600637j56090R66009L445480K043113r81902M44171M495711M673417
38294A5078709J747034J276998K218717m11855m219168k768135J944813K434257
38286A7301370q01807j115704P97972j501360o099332m293138L172621N553901
38278A3014523r3543m167046r44711L118869K074431l24213M01823J473704l78910
38269A4174927k609254k398659j264285l38664J797941L738368J445640l493677
38261A1052337l986503J303861N135824L252015L09926P53453K272164K512652
38253B2605729M042063P677312Q316449K895020l554770m885724j977788K19412
38245C5337703n37680l155714n556064n773227m150506m162962o648198n642890
$$ plain form
38237 -289538 2656541 14109467 23344236 22828883 18125594 17569426 19393006 17871777
38229 17871777 15766558 19775436 28177243 34690469 41446668 55280093 72046966 77983665
38221 77983665 68788861 55572614 48343680 44287147 37311097 29736485 27665194 30856716
38213 30856716 33414705 31081029 24107049 16131751 12434045 15609819 21518043 23523306
38205 23523306 21331057 20553460 23158600 24915702 23913141 24612521 30135822 36365725
38197 36365725 37579030 33676033 29003740 28112209 34458989 47947499 61141408 63480975
38189 63480975 52982274 39417409 32825155 33386867 35562343 36741649 37192775 35882446
38181 35882446 31855048 27396852 25392984 25098280 23836661 21569645 21507534 27362463
$$ packed form
38237b89538K946079J1452926R234769n15353m703289n56168J823580j521229
38229A7871777k105219M008878Q401807O513226O756199J3833425J6766873N936699
38221G7983665r194804j3216247p228934m056533o976050p574612k071291L191522
38213C0856716K557989k333676o973980p975298l697706L175774N908224K005263
38205B3523306k192249p77597K605140J757102j002561O99380N523301O229903
38197C6365725J213305l902997m672293q91531O346780J3488510J3193909K339567
38189F3480975j0498701j3564865o592254N61712K175476J179306M51126j310329
38181C5882446m027398m458196k003868k94704j261619k267016o2111N854929
$$ plain form
38173 27362463 40345975 55950674 63911585 56758475 39984619 28054544 27949878 32826071
38165 32826071 34933562 36846232 43449361 49741733 46251364 33560459 22161122 18374244
38157 18374244 18343310 16516243 12812871 9576743 7438555 6788053 8959469 13565801
38149 13565801 17802508 19903300 20569161 20608370 20677680 23377272 30657476 38150462 38053947
38140 38053947 30678616 27253383 35846889 48801403 51106048 39211023 24221120 16683045
38132 16683045 15882347 16089926 15724633 15590159 14027194 10319845 9118234 14417561 21249084
38123 21249084 20746683 13063503 8103403 12604860 23184978 33396990 40359951 41876821
38115 41876821 34860910 21790601 12583946 13919342 20887426 24562252 23597471 22701261
$$ packed form
38173B7362463J2983512J5604699P960911p153110j6773856j1930075j04666M876193
38165C2826071K107491J912670O603129O292372l490369j2690905j1399337l786878
38157A8374244l0934j827067l703372l236128k138188o50502K171416M606332
38149A3565801M236707K100792O65861L9209O9310K699592P280204P492986r6515
38140C8053947p375331l425233Q593506J2954514K304645j1895025j4989903p538075
38132A6683045q00698K07579l65293j34474j562965l707349j201611N299327O831523
38123B1249084n02401p683180m960100M501457J0580118J0212012O962961J516870
38115D1876821p015911j3070309r206655J335396O968084L674826r64781q96210
$$ plain form
38107 22701261 23878548 25701680 27950493 30697156 32123480 33417608 41324242 57971105
38099 57971105 73027506 76528471 75787117 86157306 105717540 114505254 102908985 86011239
38091 86011239 81253830 84290551 79238755 64508067 53785031 54036243 56657957 53079204
38083 53079204 47924684 50295471 58730362 62646119 56579203 46033780 38340147 33798437
38075 33798437 29469399 26783002 28839265 32885206 34273867 37721615 53479462 78426206
38067 78426206 93164045 86747563 73223560 70856548 74892809 68783539 55777337 56263335
38059 56263335 73093362 83824787 75663051 66192410 75172915 93144556 95992828 79056261
38051 79056261 58339496 45176127 37611778 33165948 33466695 36861977 40063891 46507353
$$ packed form
38107B2701261J177287J823132K248813K746663J426324J294128P906634J6646863
38099E7971105J5056401L500965p41354J0370189J9560234Q787714j1596269j6897746
38091H6011239m757409L036721n051796j4730688j0723036K51212K621714l578753
38083E3079204n154520K370787Q434891L915757o066916j0545423p693633m541710
38075C3798437m329038k686397K056263M045941J388661L447748J5757847K4946744
38067G8426206J4737839o416482j3524003k367012M036261o109270j3006202M85998
38059E6263335J6830027J0731425q161736r470641Q980505J7971641K848272j6936567
38051G9056261k0716765j3163369p564349m445830L00747L395282L201914O443462
$$ plain form
38043 46507353 60532030 74199304 73262336 57279091 41427753 36181829 36406066 33313976
38035 33313976 26596982 20697388 17727316 18019167 21127841 24446069 27444195 36842932
38027 36842932 57987488 80570894 84854459 66015759 41464548 28704325 26285232
38020 26285232 23359715 17794832 14885660 15248448 14902508 13869008 15206102 17232533
38012 17232533 14881487 8248360 3009791 2288905 3720571 4869591 6542058 9600426
38004 9600426 12175264 11647992 7770228 3156820 1159951 2668348 4937697 5119035
37996 5119035 4588684 6860401 11277873 13021350 10439518 7762457 8545502 11023519
37988 11023519 12551807 13920580 15851393 15724914 11968183 7877424 6841592 7303890
$$ packed form
38043D6507353J4024677J3667274r36968j5983245j5851338n245924K24237l092090
38035C3313976o716994n899594k970072K91851L108674L318228K998126R398737
38027C6842932K1144556K2583406M283565j8838700k4551211j2760223k419093
38020B6285232k925517n564883k909172L62788l45940j033500J337094K026431
38012A7232533k351046o633127n238569p20886J431666J149020J672467L058368
38004I600426K574838n27272l877764m613408j996869J508397K269349J81338
37996E119035n30351K271717M417472J743477k581832k677061P83045K478017
37988A1023519J528288J368773J930813j26479l756731m090759j035832M62298
$$ plain form
37980 7303890 6650527 6307943 8249952 10185439 9532473 8621148 10079279 10558566 6000568
37971 6000568 288033 660443 6085372 8636353 6123617 4581989 7008266 8397904
37963 8397904 5018092 785261 143564 1234031 1043393 1540681 4961996 7641232 4970263
37954 4970263 -442181 -1748463 2732030 8626976 12713386 15423563 16735218 15267035
37946 15267035 12197910 11102887 12459251 12586130 9783792 7551224 9329371 13471306
37938 13471306 16358333 17755145 19657558 21720011 21554864 18844052 15881620 14208587
37930 14208587 13432284 13040015 12476416 9815948 4020490 -1262112 -516039 5589721 9509935
37921 9509935 6958516 3306505 5474280 11149944 12177628 6746554 1348065 602156
$$ packed form
37980G303890o53363l42584J942009J935487o52966r11325J458131M79287m557998
37971F000568n712535L72410N424929K550981k512736j541628K426277J389638
37963H397904l379812m232831o41697J090467j90638M97288L421315K679236k670969
37954D970263n412444j306282M480493N894946M086410K710177J311655j468183
37946A5267035l069125j095023J356364J26879k802338k232568J778147M141935
37938A3471306K887027J396812J902413K062453j65147k710812k962432j673033
37930A4208587p76303l92269n63599k660468n795458n282602P46073O105760L920214
37921I509935k551419l652011K167775N675664J027684n431074n398489p45909
$$ plain form
37913 602156 1983478 2380931 3510779 7471871 12056516 14459562 15546878 16392500 14451011
37904 14451011 8009310 1409073 529594 4971483 9652105 12390954 14597242 15813132
37896 15813132 13714780 9592760 7950190 9544370 10081543 7434222 5213881 6853014
37888 6853014 10455714 12357118 12252995 11719499 10425315 7078937 2523780 -695877
37880 -695877 -873646 2214427 7737945 13570750 17182299 18061455 18059000 18722674 19663671
37871 19663671 19530397 16849395 10726748 3373069 396273 4248744 8836291 6802651
37863 6802651 1386103 2761547 11625135 16520988 11498207 5864595 9175999 16438791
37855 16438791 18387439 18078239 24814101 38263306 53069062 73924065 108101782 144281118
$$ packed form
37913F02156J381322L97453J129848L961092M584645K403046J087316Q45622j941489
37904A4451011o441701o600237q79479M441889M680622K738849K206288J215890
37896A5813132k098352m122020j642570J594180N37173k647321k220341J639133
37888F853014L602700J901404j04123n33496j294184l346378m555157l219657
37880f95877j77769L088073N523518N832805L611549Q79156k455O63674R40997
37871A9663671j33274k681002o122647p353679k976796L852471M587547k033640
37863F802651n416548J375444Q863588M895853n022781n633612L311404P262792
37855A6438791J948648l09200O735862J3449205J4805756K0855003L4177717L6179336
$$ plain form
37847 144281118 158706888 146540077 128318369 118165963 104890557 76818911 47213530
37840 47213530 36343958 40632759 40340771 30476870 22922859 21809782 18840388 13356788
37832 13356788 15411166 25008008 28854351 24033652 24604483 35923225 43426774 39535400
37824 39535400 40181696 56938982 75007329 85379364 118803825 207301244 316780487
37817 316780487 362684577 306852550 204286066 133556156 110455313 97398134 72574486
37810 72574486 50466429 42918333 39321846 31456773 27920010 32952554 34188968 24008831
37802 24008831 14131159 15479850 19684399 15464793 9635904 14769030 26057375 28638772
37794 28638772 21923558 18778252 23227347 26116439 23200765 21635746 25869877 31715620
$$ packed form
37847A44281118J4425770j2166811j8221708j0152406j3275406k8071646k9605381
37840D7213530j0869572M288801k91988r863901p554011j113077k969394n483600
37832A3356788K054378R596842L846343m820699N70831J1318742P503549l891374
37824C9535400O46296J6757286J8068347J0372035L3424461Q8497419J09479243
37817C16780487M5904090n5832027j02566484p0729910k3100843j3057179k4823648
37810G2574486k2108057p548096l596487p865073l536763N032544J236414j0180137
37802B4008831r877672J348691M204549m219606n828889N133126J1288345K581397
37794B8638772o715214l145306M449095K889092k915674j565019M234131N845743
$$ plain form
37786 31715620 39145905 57255983 88192335 116044212 121492988 102702057 74732546
37779 74732546 52323235 39509458 32958001 28559941 24322811 20446455 17792588 16268560
37771 16268560 15534819 16266208 18534074 20511934 21767598 25228375 31516243 34972601
37763 34972601 31934524 29044508 34153153 42639802 44954788 44828561 53811156 68775035
37755 68775035 77125309 89763893 140861187 234490104 313331361 311930841 233959009
37748 233959009 147423757 104342986 94487924 83447515 64295491 52288862 50725511
37741 50725511 48230220 41351426 37521582 37568977 33385693 24114148 19532729 23875024
37733 23875024 28519395 25533556 18588404 14849997 14171813 12838160 11711384 13237023
$$ packed form
37786C1715620P430285J8110078L0936352K7851877N448776j8790931k7969511
37779G4732546k2409311j2813777o551457m398060m237130l876356k653867j524028
37771A6268560p33741P31389K267866J977860J255664L460777O287868L456358
37763C4972601l038077k890016N108645Q486649K314986j26227Q982595J4963879
37755F8775035Q350274J2638584N1097294R3628917P8841257j400520p7971832
37748B33959009q6535252m3080771r855062j1040409j9152024j2006629j563351
37741E0725511k495291o878794l829844M7395m183284r271545m581419M342295
37733B3875024M644371k985839o945152l738407o78184j333653j126776J525639
$$ plain form
37725 13237023 14443168 10660537 4360449 2838840 7066874 9783087 6357064 1222183
37717 1222183 236782 2163957 2573800 1858510 3109885 4768251 2665569 -1376431 -580979
37708 -580979 6021660 11107828 9864277 6518780 6574847 9074969 11183539 14131061 18829325
37699 18829325 21734724 22394249 29309317 48466843 69523694 74486585 59843821 40165814
37691 40165814 29035948 26225496 25656873 25753782 26987484 27243318 25614459 25290527 27710970
37682 27710970 28771719 25450443 21451247 21378547 23483743 23245101 20583816 18354298
37674 18354298 16535800 13191725 9339131 7967849 9122766 9934873 9011655 7709803
37666 7709803 7520469 8489638 9655335 9625228 7859395 6197016 7054725 9341549 9090391
$$ packed form
37725A3237023J206145l782631o300088j521609M228034K716213l426023n134881
37717A222183r85401J927175M09843p15290J251375J658366k102682m042000P95452
37708e80979O602639N086168j243551l345497N6067K500122K108570K947522M698264
37699A8829325K905399O59525O915068J9157526K1056851M962891j4642764j9678007
37691D0165814j1129866k810452n68623R6909J233702K55834j628859l23932K420443
37682B7710970J060749l321276l999196p2700K105196k38642k661285k229518
37674A8354298j818498l344075l852594j371282J154917Q12107r23218j301852
37666G709803j89334R69169J165697l0107j765833j662379Q57709K286824k51158
$$ plain form
37657 9090391 5402761 2446124 3726267 7628511 10655938 11807934 11570033 9884972
37649 9884972 7530377 6462754 6757329 6481707 6149559 8919912 14356806 17250397 15671693
37640 15671693 14531266 16931656 17837457 12276439 4932581 4413871 11081752 17522038
37632 17522038 18970247 16706364 12911426 8994206 8169196 13029127 20243906 23168086
37624 23168086 20103621 15342585 12214881 9973348 7664952 6285325 6264328 6489132
37616 6489132 6369615 6182563 5898099 6189772 8939760 13637874 15609304 11753155 5605388
37607 5605388 2311870 1408431 -190574 -1238010 1029662 3648756 1524134 -2799626
37599 -2799626 -1336284 6995816 14206884 14700668 11498203 9317540 8598068 8682453 10270612
$$ packed form
37657I090391l687630k956637J280143L902244L027427J151996k37901j685061
37649I884972k354595j067623K94575k75622l32148K770353N436894K893591j578704
37640A5671693j140427K400390R05801n561018p343858n18710O667881O440286
37632A7522038J448209k263883l794938l917220q25010M859931P214779K924180
37624B3168086l064465m761036l127704k241533k308396j379627k0997K24804
37616F489132j19517j87052k84464K91673K749988M698114J971430l856149o147767
37607E605388l293518r03439j599005j047436K267672K619094k124622m323760
37599b799626J463342Q332100P211068M93784l202465k180663p19472Q4385J588159
$$ plain form
37590 10270612 12038960 10717645 6839150 4706615 4945671 3542293 101999 -396876
37582 -396876 3075757 4472085 1108931 -509852 5040176 13060248 16738327 18049150
37574 18049150 22614418 28219981 27364302 19249694 11139015 8077453 7946841 7132880
37566 7132880 5484439 4523971 4735669 5632314 6164083 5380971 4535280 6715911 11880249
37557 11880249 14812344 11664777 6200479 5176250 9279477 13241846 13616107 11636179
37549 11636179 9237407 7241916 7233538 10199297 12890938 10448690 3826313 104394
37541 104394 3531228 10039575 12958550 11085335 8423275 8083781 9307683 9635089 7722745
37532 7722745 4033806 211325 -1829183 -953568 2180849 4840301 3754773 -1551161
$$ packed form
37590A0270612J768348j321315l878495k132535K39056j403378l440294m98875
37582c96876L472633J396328l363154j618783N550028Q020072L678079J310823
37574A8049150M565268N605563q55679q114608q110679l061562j30612q13961
37566G132880j648441r60468K11698Q96645N31769p83112q45691K180631N164338
37557A1880249K932095l147567n464298j024229M103227L962369L74261j979928
37549A1636179k398772j995491q378K965759K691641k442248o622377l721919
37541A04394L426834O508347K918975j873215k662060l39494J223902L27406j912344
37532G722745l688939l822481k040508Q75615L134417K659452j085528n305934
$$ plain form
37524 -1551161 -6975966 -7361967 -2523544 2352223 3519083 3346791 5900403 10171367
37516 10171367 11286582 7548315 2636602 484118 881866 1098734 -192867 -1696590
37508 -1696590 -1133773 2418686 7264765 10444988 11071867 11506572 14029730 17275750 17761827
37499 17761827 14576783 10777394 9919185 12351725 15251446 15858382 14572941 14447417
37491 14447417 16906902 19033437 17308734 13232335 11530057 12613251 11618938 6669091
37483 6669091 2815901 4190523 7042812 5647592 1241473 -920121 -408938 -709931
37475 -709931 -1430512 992946 5234816 5491851 1138337 -1302484 1731385 5249057 3603214
37466 3603214 -1403922 -4089937 -2343070 1968920 6377414 8467961 6573418 2602156
$$ packed form
37524a551161n424805l86001M838423M875767J166860j72292K553612M270964
37516A0171367J115215l738267m911713k152484L97748K16868j291601j503723
37508a696590N62817L552459M846079L180223O26879M34705K523158L246020M86077
37499A7761827l185044l799389q58209K432540K899721O06936j285441j25524
37491A4447417K459485K126535j724703m076399j702278J083194r94313m949847
37483F669091l853190J374622K852289j395220m406119k161594N11183l00993
37475g09931p20581K423458M241870K57035m353514k440821L033869L517672j645843
37466C603214n007136k686015J746867M311990M408494K090547j894543l971262
$$ plain form
37458 2602156 747892 1073843 -1320558 -7972813 -12974594 -11312963 -6454894 -4452271
37450 -4452271 -4814329 -3357449 -541038 65715 -783359 457441 2456415 530002 -4266639
37441 -4266639 -5313625 -980795 2308398 54971 -3880092 -4242682 -2002030 -754393
37433 -754393 -222356 1829308 4463994 5006425 3455370 1535888 -800847 -4214980 -6749720
37424 -6749720 -5289004 425504 7620433 13209330 14865885 11592853 5841594 2862145
37416 2862145 4810392 7421404 5757696 1150458 -1372672 -489372 1258530 3181251
37408 3181251 6804083 10786052 11109500 7386510 4025444 3578687 3534989 1691905 176445
37399 176445 1206669 2678734 1579077 -863495 -1000076 1997072 5870693 9028628
$$ packed form
37458B602156j854264L25951k394401o652255n001781J661631M858069K002623
37450d452271l62058J456880K816411O06753q49074J240800J998974j926413m796641
37441d266639j046986M332830L289193k253427l935063l62590K240652J247637
37433g54393N32037K051664K634686N42431j551055j919482k336735l414133k534740
37424f749720J460716N714508P194929N588897J656555l273032n751259k979449
37416B862145J948247K611012j663708m607238k523130Q83300J747902J922721
37408C181251L622832L981969L23448l722990l361066m46757m3698j843084j515460
37399A76445J030224J472065j099657k442572j36581K997148L873621L157935
$$ plain form
37391 9028628 11716944 14190704 16098159 17330630 17862327 17283211 15650939 13906283
37383 13906283 12422935 10306238 7118404 4013999 2309339 2338072 4163500 7291074
37375 7291074 9158633 6864703 1636137 -1509541 -167375 2628400 3703489 3868687
37367 3868687 4177193 2623285 -1367447 -3424860 -500657 2987949 1554471 -1777879
37359 -1777879 217911 6702925 9186049 4607101 -215952 622323 4323007 5814061
37351 5814061 5544526 6435494 8016419 8174832 7042993 5212743 1639418 -2853310 -3688939
37342 -3688939 1344948 7185160 7506885 3277922 501082 1393172 2971931 3234895 3345801
37333 3345801 3673399 2687962 871568 1508283 5718690 9708658 9032831 3885490 -1431437
$$ packed form
37391I028628K688316K473760J907455J232471N31697n79116j632272j744656
37383A3906283j483348k116697l187834l104405j704660K8733J825428L127574
37375G291074J867559k293930n228566l145678J342166K795775J075089J65198
37367C868687L08506j553908l990732k057413K924203L488606j433478l332350
37359a777879J995790O485014K483124m578948m823053Q38275L700684J491054
37351E814061k69535Q90968J580925J58413j131839j830250l573325m492728q35629
37342c688939N033887N840212L21725m228963k776840Q92090J578759K62964J10906
37333C345801L27598r85437j816394O36715M210407L989968o75827n147341n316927
$$ plain form
37324 -1431437 -3371661 -2488254 -2344847 -5432996 -10162653 -12480859 -10500998 -6079932
37316 -6079932 -1513679 2847307 6393466 6697503 3030982 -837211 -915308 1420955 1823882
37307 1823882 -184073 -1035122 507103 1351840 -520950 -2584713 -1552535 2139063
37299 2139063 5463258 6436479 5173086 2961349 1539502 2120340 4407396 7431196
37291 7431196 11038857 15000057 17341159 16056898 12215689 8724434 6329690 3954730
37283 3954730 2631570 4917251 9773687 12435354 10882169 8253065 7001009 5201163
37275 5201163 1387472 -1528946 -1019470 361222 -489286 -1446362 986745 4918803 5869183
37266 5869183 4263708 4049548 5103811 3516175 -745186 -2915824 -956103 2082508
$$ packed form
37324a431437j940224Q83407J43407l088149m729657k318206J979861M421066
37316f079932M566253M360986L546159L04037l666521l868193p8097K336263M02927
37307A823882k007955q51049J542225Q44737j872790k063763J032178L691598
37299B139063L324195R73221j263393k211737j421847N80838K287056L023800
37291G431196L607661L961200K341102j284261l841209l491255k394744k374960
37283C954730j323160K285681M856436K661667j553185k629104j252056j799846
37275E201163l813691k916418N09476J380692q50508r57076K433107L932058R50380
37266E869183j605475k14160J054263j587636m261361k170638J959721L038611
$$ plain form
37258 2082508 4400400 7964359 12662895 14096459 10415931 6138598 5589699 7093440
37250 7093440 7173356 6040068 5164516 3848020 2274559 3438168 7450198 8668853 4064058
37241 4064058 -176257 2841335 9624350 11577146 8218278 6186040 6989727 5739070
37233 5739070 2032310 1718515 5701013 6869207 2010929 -2229734 -367842 3087014
37225 3087014 2051851 -931406 -243543 2647697 2569086 349892 1119942 5044765 7123130
37216 7123130 5317231 2643377 1681299 2312692 4222328 6717067 6997759 3598832 648899
37207 648899 3608714 11370950 17476286 18473726 16065608 11818048 5598094 -583996
37199 -583996 -2951012 -1366543 208277 -509227 -1997856 -2705923 -2469238 -270074 4398495
$$ packed form
37258B082508K317892L563959M698536J433564l680528m277333n48899J503741
37250G093440P9916j133288q75552j316496j573461J163609M012030J218655m604795
37241D064058m240315L017592O783015J952796l358868k032238Q03687j250657
37233E739070l706760l13795L982498J168194m858278m240663J861892L454856
37225C087014j035163k983257O87863K891240p8611k219194P70050L924823K078365
37216G123130j805899k673854r62078O31393J909636K494739K80692l398927k949933
37207F48899K959815P762236O105336R97440k408118m247560o219954o182090
37199e83996k367016J584469J574820p17504j488629p08067K36685K199164M668569
$$ plain form
37190 4398495 7987502 6373075 2207891 2576234 8381503 12754076 11690480 9052616
37182 9052616 8186666 6244806 1511829 -815772 3269714 8371319 7166602 2126250
37174 2126250 1613459 6518052 9193843 5573116 511689 -565005 1340308 2960563
37166 2960563 4401569 6643026 7217379 3020276 -4108918 -8495260 -7095740 -2103389
37158 -2103389 2841619 6305896 8197778 7821447 4848129 960429 -1680799 -3095194
37150 -3095194 -4448494 -4805822 -1969729 2899998 5099547 2853172 697247 3171689
37142 3171689 7757674 8343916 4203779 744532 1472306 3782629 3764204 1404267 -732873
37133 -732873 -1453032 -1837123 -3414258 -6069520 -7179287 -3854838 2641780 6714055 5135192
$$ packed form
37190D398495L589007j614427m165184L68343N805269M372573j063596k637864
37182I052616q65950j941860m732977k327601M085486N101605j204717n040352
37174B126250n12791M904593K675791l620727n061427j076694J905313J620255
37166B960563J441006K241457N74353m197103p129194m386342J399520M992351
37158b103389M945008L464277J891882l76331k973318l887700k641228j414395
37150c095194j353300l57328K836093M869727K199549k246375k155925K474442
37142C171689M585985N86242m140137l459247P27774K310323j8425k359937k137140
37133g32873p20159l84091j577135k655262j109767L324449O496618M072275j578863
$$ plain form
37124 5135192 1780860 2329112 6443031 9453211 9752944 9351978 8605149 6224401 3774695
37115 3774695 4198937 6150055 5597456 2620557 476187 -1272333 -5431886 -9429119
37107 -9429119 -7219353 389488 5798318 6117454 5838651 6877504 5891114 3531175 5546670
37098 5546670 11648262 14700673 14494922 19429946 30434460 39509312 51399207 86141415
37090 86141415 143941927 185883596 174168817 121888663 77460328 64268549 62040994
37083 62040994 48164266 28873437 19745110 19052430 16468077 12609191 13738119 17010143
37075 17010143 15545471 11708912 12884770 18634647 22743173 24228119 26502455 28653049
37067 28653049 27017669 23666378 24663000 30430050 35072834 35082316 32470769 29397982 25563121
$$ packed form
37124E135192l354332N48252M113919L010180K99733m00966p46829k380748k449706
37115C774695M24242J951118n52599k976899k144370j748520m159553l997233
37107i429119K209766P608841N408830L19136k78803J038853r86390k359939K015495
37098E546670O101592L052411k05751M935024J1004514R074852J1889895L4742208
37090H6141415N7800512M1941669j1714779n2280154m4428335j3191779k227555
37083F2040994j3876728j9290829r128327o92680k584353l858886J128928L272024
37075A7010143j464672l836559J175858N749877M108526J484946K274336K150594
37067B8653049j635380l351291R96622N767050M642784R482k611547l072787l834861
$$ plain form
37058 25563121 21523863 19608453 20234672 20672393 18411164 13717448 8922314 6746230
37050 6746230 8367747 11609060 12599052 10743550 9713372 11635554 13392737 11620840
37042 11620840 8367346 7889065 10151892 11850184 12297096 13699876 16152132 16666079
37034 16666079 13571441 8596854 4190375 1411687 568745 1394172 2378619 2057112 1003338
37025 1003338 824221 1738450 3086068 5255009 8524705 10869078 10104197 7904296 8194590
37016 8194590 11225467 12885534 11019111 8772208 9408319 10845451 8655928 2814049
37008 2814049 -2078257 -2957380 -1644792 -1555191 -3468148 -5486759 -5450960 -2512872 2207330
36999 2207330 5754489 5663231 2997800 1381954 2064381 2208982 -251562 -2730683 -1940837
$$ packed form
37058B5563121m039258j915410O26219M37721k261229m693716m795134k176084
37050F746230J621517L241313R89992j855502j030178J922182J757183j771897
37042A1620840l253494m78281K262827J698292M46912J402780K452256N13947
37034A6666079l094638m974587m406479k778688q42942Q25427R84447l21507j053774
37025A003338j79117R14229J347618K168941L269696K344373p64881k199901K90294
37016H194590L030877J660067j866423k246903O36111J437132k189523n841879
37008B814049m892306q79123J312588Q9601j912957k018611L5799K938088M720202
36999B207330L547159r1258k665431j615846O82427J44601k460544k479121P89846
$$ plain form
36990 -1940837 503667 545518 -1599684 -2054192 -302006 -177504 -2801568 -4053556 -1553478
36981 -1553478 872534 -702562 -3920072 -4162289 -1805240 -864619 -2530465 -4435420
36973 -4435420 -5002423 -4641038 -3591763 -1845560 -264068 771567 2269899 3924555
36965 3924555 3085324 -688059 -3180521 -1441713 992283 -577996 -4369133 -5110072
36957 -5110072 -2222827 787253 3069602 6289611 9247378 9158145 7299545 6787943 5761633
36948 5761633 247383 -6607416 -6671498 567594 5908287 3473403 -2048114 -4597825
36940 -4597825 -5415038 -7548304 -8475636 -4663478 1038926 2964234 865359 -911217
36932 -911217 -610236 -430161 -1567712 -2086150 49655 4263175 7821464 7997633 4508554
$$ packed form
36990a940837K444504M1851k145202m54508J752186J24502k624064j251988K500078
36981a553478K426012j575096l217510k42217K357049R40621j665846j904955
36973d435420n67003L61385J049275J746203J581492J035635J498332J654656
36965C924555q39231l773383k492462J738808K433996j570279l791137p40939
36957e110072K887245L010080K282349L220009K957767q9233j858600n11602j026310
36948E761633n514250o854799o4082P239092N340693k434884n521517k549711
36940d597825q17213k133266r27332L812158N702404J925308k098875j776576
36932i11217L00981J80075j137551n18438K135805M213520L558289J76169l489079
$$ plain form
36923 4508554 286103 -1326264 23884 2740498 6514697 11216138 13549054 9621051
36915 9621051 1271357 -4868803 -5571737 -3751698 -2281228 -431756 1889632 1866015 -1562274
36906 -1562274 -5354888 -7173465 -8078284 -8323658 -5642528 -499720 2276651 646070
36898 646070 -848486 1725546 5583798 6611025 6134651 7362461 9179370 8809128 7260518
36889 7260518 6883324 6529656 4361242 2599183 3963881 5865167 4022116 142261
36881 142261 -26427 4389857 7945742 6350045 700928 -5703330 -10268832 -10663785 -6100824
36872 -6100824 -176818 1464535 -1963365 -4659986 -1262873 6297457 10839514 7981678
36864 7981678 571359 -5016138 -5722755 -3670494 -1799043 -508848 -27212 -2680793
$$ packed form
36923D508554m222451j612367J350148K716614L774199M701441K332916l928003
36915I621051q349694o140160p02934J820039J470470J849472K321388k3617l428289
36906a562274l792614j818577r04819k45374K681130N142808K776371j630581
36898F46070j494556K574032L858252J027227m76374J227810J816909l70242j548610
36889G260518l77194l53668k168414j762059J364698J901286j843051l879855
36881A42261j68688M416284L555885j595697n649117o404258m565502l94953M562961
36872f100824N924006J641353l427900k696621L397113P560330M542057k857836
36864G981678p410319n587497p06617K052261J871451J290195M81636k653581
$$ plain form
36856 -2680793 -8878922 -13159168 -9704276 -1158729 3773694 1889335 -1159258 -45363
36848 -45363 3791397 6679103 7536600 5742678 484732 -4664581 -3112307 4594417 8439096
36839 8439096 2197376 -6842481 -7857792 -1158798 4427566 4901672 3677751 2965213
36831 2965213 797722 -3229649 -6064376 -6271201 -6040242 -7032254 -8116072 -8081031 -7359848
36822 -7359848 -6272646 -4086948 -596685 2868682 4388796 3011551 9820 -1625335
36814 -1625335 -661556 -8016 -2672152 -6039865 -4686870 1149777 5512283 5909139 6036116
36805 6036116 7522634 6467801 1896972 197317 5477052 11718457 11073535 5147241
$$ packed form
36856b680793o198129m280246L454892Q545547M932423j884359l048593J113895
36848d5363L836760K887706Q57497j793922n257946n149313J552274P706724L844679
36839H439096o241720r039857j015311O698994N586364M74106j223921p12538
36831B965213k167491m027371k834727k06825K30959r92012j083818L5041P21183
36822g359848J087202K185698L490263L465367J520114j377245l001731j635155
36814a625335R63779O53540k664136l367713J352995N836647M362506L96856J26977
36805F036116J486518j054833m570829j699655N279735O241405o44922n926294
$$ [...]
##END NTUPLES=NMR SPECTRUM
##END=
