##TITLE=31Pdec_SR_136_rm1cl
 , 124 sc
 28.7.2022
##JCAMPDX= 6.0         $$ Bruker NMR JCAMP-DX V2.0
##DATA TYPE= NMR SPECTRUM
##DATA CLASS= NTUPLES
##ORIGIN= UXNMR, Bruker Analytische Messtechnik GmbH
##OWNER= root
$$ XWIN-NMR		Version 3.5
$$ Thu Jul 28 14:19:44 2022 Russian Standard Time (UT+4h)  she@DPX200
##.OBSERVE FREQUENCY= 81.013821
##.OBSERVE NUCLEUS= ^31P
##.ACQUISITION MODE= SIMULTANEOUS
##.ACQUISITION SCHEME= undefined
##.AVERAGES= 124
##.DIGITISER RES= 16
##SPECTROMETER/DATA SYSTEM= spect
##.PULSE SEQUENCE= zgpg30
##.SOLVENT NAME= DMSO
##.SHIFT REFERENCE= (INTERNAL, DMSO, 0, 248.564)
##AUDIT TRAIL= $$ (NUMBER, WHEN, WHO, WHERE, WHAT)
$$ ##TITLE= Audit trail, XWIN-NMR		Version 3.5
$$ ##JCAMPDX= 5.01
$$ ##ORIGIN= Bruker BioSpin GmbH
$$ ##OWNER= she
$$ F:/spectra/data/she/nmr/P31/1/pdata/1/auditp.txt
$$ ##AUDIT TRAIL=  $$ (NUMBER, WHEN, WHO, WHERE, WHAT)
(   1,<2022-07-28 14:18:33.35 +0400>,<she>,<DPX200>,
      <continue with go, POWCHK disabled, PULCHK disabled
       configuration hash MD5:
       00 E9 B6 7A A2 85 ED C7 34 08 36 98 17 FE 4E 26
       data hash MD5: 32K
       9D 3C 49 D2 22 A1 9F 70 84 5E 76 8C 47 FC 4B 52>)
(   2,<2022-07-28 14:18:36.34 +0400>,<she>,<DPX200>,
      <Start of raw data processing
       efp BC_mod = 2 LB = 1 FT_mod = 6 PKNL = 1 PHC0 = -10366.46 PHC1 = 328.0567 SI = 64K 
       data hash MD5: 64K
       45 3A 88 F2 ED 11 CC 32 04 2C 98 F4 62 6D 2D DC>)
(   3,<2022-07-28 14:18:51.92 +0400>,<she>,<DPX200>,
      <pk PHC0 = -10.72892 PHC1 = 2 
       data hash MD5: 64K
       69 30 CC B3 0E CC D3 F5 F7 0C 47 EF 88 13 41 60>)
$$ ##END=
$$ 
$$ hash MD5
$$ 6B 4A E9 B2 1F 29 24 1B 89 DF 32 E6 94 03 94 E5
##$RELAX= 
##$RELAX= 
##$RELAX= 
##$RELAX= 
##$RELAX= 
##$RELAX= 
##$RELAX= 
##$RELAX= 
$$ Bruker specific parameters
$$ --------------------------
##$DU= <F:/spectra>
##$EXPNO= 1
##$NAME= <P31>
##$PROCNO= 1
##$TYPE= <nmr>
##$USER= <she>
##$AMP= (0..31)
100 100 100 100 100 100 100 100 100 100 100 100 100 100 100 100 100 100 
100 100 100 100 100 100 100 100 100 100 100 100 100 100 
##$AQSEQ= 0
##$AQ_mod= 1
##$AUNM= <au_zg>
##$AUTOPOS= <>
##$BF1= 81.014009
##$BF2= 200.13
##$BF3= 200.13
##$BF4= 200.13
##$BF5= 200.13
##$BF6= 200.13
##$BF7= 200.13
##$BF8= 200.13
##$BYTORDA= 1
##$CFDGTYP= 0
##$CFRGTYP= 5
##$CHEMSTR= <none>
##$CNST= (0..31)
1 1 145 1 1 1 1 1 1 1 1 1 1 1 1 1 1 1 1 1 1 1 1 1 1 1 1 1 1 1 1 1 
##$CPDPRG= <waltz16>
##$CPDPRG1= <>
##$CPDPRG2= <waltz16>
##$CPDPRG3= <>
##$CPDPRG4= <mlev>
##$CPDPRG5= <mlev>
##$CPDPRG6= <mlev>
##$CPDPRG7= <mlev>
##$CPDPRG8= <mlev>
##$CPDPRGB= <>
##$CPDPRGT= <>
##$D= (0..31)
0 1 0 0 0 0 0 0 0 0 0 0.03 2e-05 3e-06 0 0 0 0 0 0 0 0 0 0 0 0 0 0 0 0 
0 0 
##$DATE= 1659003323
##$DBL= (0..7)
120 120 120 11 120 120 24 19 
##$DBP= (0..7)
150 150 150 150 150 150 150 150 
##$DBP07= 0
##$DBPNAM0= <>
##$DBPNAM1= <>
##$DBPNAM2= <>
##$DBPNAM3= <>
##$DBPNAM4= <>
##$DBPNAM5= <>
##$DBPNAM6= <>
##$DBPNAM7= <>
##$DBPOAL= (0..7)
0.5 0.5 0.5 0.5 0.5 0.5 0.5 0.5 
##$DBPOFFS= (0..7)
0 0 0 0 0 0 0 0 
$$ [...]
##$SUBNAM2= <"">
##$SUBNAM3= <"">
##$SUBNAM4= <"">
##$SUBNAM5= <"">
##$SUBNAM6= <"">
##$SUBNAM7= <"">
##$SUBNAM8= <"">
##$SUBNAM9= <"">
##$SW= 501.771253377433
##$SWIBOX= (0..15)
0 1 3 0 0 0 0 0 0 0 0 0 0 0 0 0 
##$SW_h= 40650.406504065
##$TD= 32768
##$TD0= 1
##$TE= 0
##$TE2= 300
##$TE3= 300
##$TEG= 300
##$TL= (0..7)
0 120 53 12 22 120 120 120 
##$TP= (0..7)
150 150 150 150 150 150 150 150 
##$TP07= 0
##$TPNAME0= <>
##$TPNAME1= <>
##$TPNAME2= <>
##$TPNAME3= <>
##$TPNAME4= <>
##$TPNAME5= <>
##$TPNAME6= <>
##$TPNAME7= <>
##$TPOAL= (0..7)
0.5 0.5 0.5 0.5 0.5 0.5 0.5 0.5 
##$TPOFFS= (0..7)
0 0 0 0 0 0 0 0 
##$TUNHIN= 0
##$TUNHOUT= 0
##$TUNXOUT= 0
##$USERA1= <user>
##$USERA2= <user>
##$USERA3= <user>
##$USERA4= <user>
##$USERA5= <user>
##$V9= 5
##$VALIST= <valist>
##$VCLIST= <CCCCCCCCCCCCCCC>
##$VD= 0
##$VDLIST= <DDDDDDDDDDDDDDD>
##$VPLIST= <PPPPPPPPPPPPPPP>
##$VTLIST= <TTTTTTTTTTTTTTT>
##$WBST= 1024
##$WBSW= 4
##$XGAIN= (0..3)
0 0 0 0 
##$XL= 0
##$YL= 0
##$YMAX_a= 20950
##$YMIN_a= -30960
##$ZGOPTNS= <>
##$ZL1= 120
##$ZL2= 120
##$ZL3= 120
##$ZL4= 120
##$ABSF1= 0
##$ABSF2= 0
##$ABSG= 0
##$ABSL= 0
##$ALPHA= 0
##$AQORDER= 0
##$ASSFAC= 0
##$ASSFACI= 0
##$ASSFACX= 0
##$ASSWID= 0
##$AUNMP= <proc_1d>
##$AZFE= 0.1
##$AZFW= 0.5
##$BCFW= 0
##$BC_mod= 2
##$BYTORDP= 0
##$COROFFS= 0
##$CY= -3
##$DATMOD= 1
##$DC= 0
##$DFILT= <>
##$DTYPP= 0
##$F1P= 0
##$F2P= 0
##$FCOR= 1
##$FTSIZE= 65536
##$FT_mod= 6
##$GAMMA= 0
##$GB= 0
##$INTBC= 1
##$INTSCL= 5.30512e-09
##$ISEN= 30
##$LB= 1
##$LEV0= 0
##$LPBIN= 0
##$MAXI= 10000
##$MC2= 0
##$MEAN= 0
##$ME_mod= 0
##$MI= 50
##$NCOEF= 0
##$NC_proc= -6
##$NLEV= 6
##$NOISF1= 182.463
##$NOISF2= 159.3651
##$NSP= 0
##$NTH_PI= 0
##$NZP= 0
##$OFFSET= 248.5645
##$PC= 4
##$PHC0= -10377.19
##$PHC1= 330.0567
##$PH_mod= 1
##$PKNL= yes
##$PPARMOD= 0
##$PSCAL= 0
##$PSIGN= 0
##$REVERSE= no
##$SF= 81.014009
##$SI= 65536
##$SIGF1= 159.3651
##$SIGF2= -187.1042
##$SINO= 113.3802
##$SIOLD= 16384
##$SREGLST= <1H.CDCl3>
##$SSB= 0
##$STSI= 65536
##$STSR= 0
##$SW_p= 40650.406504065
##$SYMM= 0
##$S_DEV= 0
##$TDeff= 32768
##$TDoff= 0
##$TI= <>
##$TILT= no
##$TM1= 0
##$TM2= 0
##$TOPLEV= 0
##$USERP1= <user>
##$USERP2= <user>
##$USERP3= <user>
##$USERP4= <user>
##$USERP5= <user>
##$WDW= 1
##$XDIM= 65536
##$YMAX_p= 314602838
##$YMIN_p= -17159888
$$ End of Bruker specific parameters
$$ ---------------------------------
##NTUPLES= NMR SPECTRUM
##VAR_NAME=  FREQUENCY,     SPECTRUM/REAL,   SPECTRUM/IMAG
##SYMBOL=    X,             R,               I
##VAR_TYPE=  INDEPENDENT,   DEPENDENT,       DEPENDENT
##VAR_FORM=  AFFN,          ASDF,            ASDF
##VAR_DIM=   65536,         65536,           65536
##UNITS=     HZ,            ARBITRARY UNITS, ARBITRARY UNITS
##FACTOR=    0.620285442955139, 1,           1
##FIRST=     20137.2065510759, 0,            0
##LAST=      -20513.1999529892, 0,           0
##MIN=       -20513.1999529892, -17159888,   0
##MAX=       20137.2065510759, 314602838,    0
$$ Real data points
##PAGE= N=1
##DATA TABLE= (X++(R..R)), XYDATA
$$ [...]
$$ plain form
40665 4566489 3442812 2640183 2376486 1734016 1226296 1984270 3549270 4289749 3335588
40656 3335588 1175291 -854388 -1280462 200162 1953285 2182686 1362928 1407494 2733091
40647 2733091 4057843 4854965 5793005 6818018 7136053 7113937 7730732 8086226 6185195
40638 6185195 2484357 -199610 -788902 -952230 -1377969 -383309 2495585 4784069 4753561
40629 4753561 3998806 4426525 5364203 5763418 6653592 8925107 10984109 11330200 11527106
40620 11527106 13809297 17400515 20098494 22046759 24773604 27543316 28074109 26544620
40612 26544620 25605720 26104195 25748297 22901564 19276335 17508082 17644437 17437603 15332592
40603 15332592 12045488 9311683 7688168 5980493 3089078 53280 -808065 978801
$$ packed form
40665D566489j123677q02629k63697o42470n07720P57974J565000P40479r54161
40656C335588k160297k029679m26074J480624J753123K29401q19758M4566J325597
40647B733091J324752P97122R38040J025013L18035k2116O16795L55494j901031
40638F185195l700838k683967n89292j63328m25739R94660K878894K288484l0508
40629D753561p54755M27719R37678L99215Q90174K271515K059002L46091J96906
40620A1527106K282191L591218K697979J948265K726845K769712N30793j529489
40612B6544620r38900M98475l55898k846733l625229j768253J36355k06834k105011
40603A5332592l287104k733805j623515j707675k891415l035798q61345J786866
$$ plain form
40595 978801 3053830 3099624 1601567 857015 2232983 5241115 8230280 9178655 7213557
40586 7213557 4432608 4593779 8461396 12030387 11301949 7415695 4779941 5266956 6839597
40577 6839597 7211517 6174112 4498074 2998204 2758981 4166070 5721704 5792799 5276427
40568 5276427 6329780 8725244 9966534 8974567 7029612 4976787 2430211 217871
40560 217871 464110 3088581 5058869 4574380 3424131 3625998 4295084 3816976 2810632
40551 2810632 2618496 2723117 2042466 1255508 1493580 2077696 1931299 1998767 3717082
40542 3717082 6073767 6829111 5954035 5195832 4810244 3658109 2367065 3186569 6046359
40533 6046359 7669951 5885606 2490561 346918 -368751 -1166844 -1994544 -1269531 1244719
$$ packed form
40595I78801K075029M5794j498057p44552J375968L008132K989165R48375j965098
40586G213557k780949J61171L867617L568991p28438l886254k635754M87015J572641
40577F839597L71920j037405j676038j499870k39223J407089J555634P1095n16372
40568E276427J053353K395464J241290r91967j944955k052825k546576k212340
40560B17871K46239K624471J970288m84489j150249K01867O69086m78108j006344
40551B810632j92136J04621o80651p86958K38072N84116j46397O7468J718315
40542C717082K356685P55344q75076p58203l85588j152135j291044Q19504K859790
40533F046359J623592j784345l395045k143643p15669p98093q27700P25013K514250
$$ plain form
40524 1244719 3590438 4137948 3753860 4572060 7003204 8952807 8453047 6324356 5085877
40515 5085877 5535491 6125152 6001649 6393040 7730950 7887294 5748205 4401829 7132457
40506 7132457 11490446 11790099 7480722 4280149 5759972 8520710 8203560 5935124
40498 5935124 5073026 5128206 3760144 2515068 5064549 10354643 12835594 10268431 6693946
40489 6693946 6168748 7710145 8694536 9595564 12053948 14633986 14187683 10638380 7434490
40480 7434490 7293785 9633930 12229461 13580242 13450145 12599836 12375685 13493202 14992912
40471 14992912 15284244 14266392 13406032 13554428 13792123 13019238 11888583 12240006 14704716
40462 14704716 17536112 18209115 16080999 13095140 11634118 12022007 12686436 12554476 12331517
$$ packed form
40524A244719K345719N47510l84088Q18200K431144J949603m99760k128691j238479
40515E085877M49614N89661j23503L91391J337910J56344k139089j346376K730628
40506G132457M357989K99653m309377l200573J479823K760738l17150k268436
40498E935124q62098N5180j368062j245076K549481N290094K480951k567163l574485
40489F693946n25198J541397R84391R01028K458384K580038m46303l549303l203890
40480G434490j40705K340145K595531J350781j30097q50309k24151J117517J499710
40471A4992912K91332j017852q60360J48396K37695p72885j130655L51423K464710
40462A4704716K831396O73003k128116k985859j461022L87889O64429j31960k22959
$$ plain form
40453 12331517 13110640 14634519 15708081 15822474 15509337 15256579 14896713 14261281 13850915
40444 13850915 14328683 15366737 15464497 13479130 10342420 8443140 8774220 9563658 8828120
40435 8828120 7514032 8299482 11433903 13894784 13265900 10455433 7565274 5103591
40427 5103591 2972810 2417760 4544223 7776057 9230780 8428818 7535331 7915460 8493526
40418 8493526 7876281 6243406 4469662 2897235 1791137 1829890 3241844 5123995 6235624
40409 6235624 6119519 5328478 4950922 5658518 6686740 6425095 4877402 4412719 6439795
40400 6439795 8520187 7373892 4051815 2777971 4550609 5767098 4411759 3548998
40392 3548998 6051647 9379838 9406073 7039235 6692211 9376715 11724588 11595323 10344389
$$ packed form
40453A2331517P79123J523879J073562J14393l13137k52758l59866o35432m10366
40444A3850915M77768J038054R7760j985367l136710j899280L31080P89438p35538
40435H828120j314088P85450L134421K460881o28884k810467k890159k461683
40427E103591k130781n55050K126463L231834J454723q01962q93487L80129N78066
40418H493526o17245j632875j773744j572427j106098L8753J411954J882151J111629
40409F235624j16105p91041l77556P07596J028222k61645j547693m64683K027076
40400F439795K080392j146295l322077j273844J772638J216489j355339q62761
40392C548998K502649L328191K6235k366838l47024K684504K347873j29265j250934
$$ plain form
40383 10344389 8984367 6316953 2451585 538790 2633830 6449128 8542163 8527570
40375 8527570 7778171 6177597 3296082 1275217 2829702 6611381 8011094 5282101
40367 5282101 1974460 2012127 4757392 6778210 6760753 6413350 7262119 8677076 9143523
40358 9143523 7993165 5673653 3479418 3146160 5410106 8508443 9324713 6834121
40350 6834121 3478880 2213722 3092681 4053750 4327671 5168732 7170476 8849885 8791108
40341 8791108 7685718 6999746 6720129 5853989 4399561 3290072 2847797 2820781 3580323
40332 3580323 5525338 7405034 7247766 5392789 4657155 6623562 9496567 10745464
40324 10745464 10202375 9070626 7400356 4582714 1483693 49321 1061433 3708932
$$ packed form
40383A0344389j360022k667414l865368j912795K095040L815298K093035j4593
40375H527570p49399j600574k881515k020865J554485L781679J399713k728993
40367E282101l307641L7667K745265K020818j7457l47403Q48769J414957M66447
40358I143523j150358k319512k194235l33258K263946L098337Q16270k490592
40350F834121l355241j265158Q78959R61069K73921Q41061K001744J679409n8777
40341H791108j105390o85972k79617q66140j454428j109489m42275k7016P59542
40332C580323J945015J879696j57268j854977p35634J966407K873005J248897
40324A0745464n43089j131749j670270k817642l099021j434372J012112K647499
$$ plain form
40316 3708932 6714045 8339400 6422266 933077 -4072916 -4064394 198026 3469731 3142590
40307 3142590 2184241 3577485 5452346 4628630 2193267 1723803 3510450 4562279 3840708
40298 3840708 3560851 4943111 6316934 6497956 6815989 8205723 9039641 7828593 5906040
40289 5906040 5355999 5990836 6376174 6307837 6236077 5676860 4393407 3860120 5175242
40280 5175242 6677720 6272254 5118197 5942391 8288186 8910908 6946771 5038807 4595729
40271 4595729 3716255 1463581 578080 3240652 6964660 7928145 6396227 5458581 5826857
40262 5826857 5543342 4154064 3430544 3824405 3674419 2615290 2599799 4410971 6008117
40253 6008117 5802202 5066443 5427716 6254351 6442418 6682617 7684047 7947868 5962402
$$ packed form
40316C708932L005113J625355j917134n489189n005993Q522M262420L271705l27141
40307C142590r58349J393244J874861q23716k435363m69464J786647J051829p21571
40298C840708k79857J382260J373823J81022L18033J389734Q33918j211048j922553
40289E906040n50041O34837L85338o8337p1760n59217j283453n33287J315122
40280E175242J502478m05466j154057Q24194K345795O22722j964137j907964m43078
40271D595729q79474k252674q85501K662572L724008R63485j531918r37646L68276
40262E826857k83515j389278p23520L93861j49986j059129j5491J811172J597146
40253F008117k05915p35759L61273Q26635J88067K40199J001430K63821j985466
$$ plain form
40244 5962402 3389060 3325490 6066373 9084429 10648011 10876997 9670442 6607452 3175842
40235 3175842 2191225 4115123 6355276 7099956 7382826 8161215 7967861 5555748 2941980
40226 2941980 3256747 6408046 9058983 8673957 6056315 4036320 4707007 7663605 10243306
40217 10243306 10042146 7653440 5930887 6213923 7028754 7239922 7996922 9789074 10171186
40208 10171186 7386148 4277764 4903424 8434577 10510350 10165111 10834599 13862981
40200 13862981 15727676 13796299 10912962 11276428 14531501 17079429 17301858 16402783
40192 16402783 15404418 14341896 13776943 14389526 15231031 14648499 13040373 12862001 15639973
40183 15639973 20341167 25001237 29171165 34613455 43641416 56045413 67676670 73679986
$$ packed form
40244E962402k573342o3570K740883L018056J563582K28986j206555l062990l431610
40235C175842r84617J923898K240153P44680K82870P78389j93354k412113k613768
40226B941980L14767L151299K650937l85026k617642k019995O70687K956598K579701
40217A0243306k01160k388706j722553K83036Q14831K11168P57000J792152L82112
40208A0171186k785038l108384O25660L531153K075773l45239O69488L028382
40200A3862981J864695j931377k883337L63466L255073K547928K22429q99075
40192A6402783r98365j062522n64953O12583Q41505n82532j608126j78372K777972
40183A5639973M701194M660070M169928N442290R027961J2403997J1631257O003316
$$ plain form
40175 73679986 73596805 71249298 68836397 64011503 54670322 43575223 35007223 29186000
40167 29186000 23894016 19757196 19098039 20336263 18872120 14236899 11378075 13145264
40159 13145264 16036022 15938978 14139608 14304191 16557396 18265722 18574843 18424589 17521381
40150 17521381 15168749 13464659 15846825 22096851 27966065 30570320 31539498 33918969
40142 33918969 38579687 45323844 55295641 69536536 85658152 98321604 103747818 102606621
40134 102606621 97915865 91208557 81859646 69577578 56055160 43869006 34823661
40127 34823661 29644759 27871545 27258549 24891076 20502652 17454130 18418250 21148949
40119 21148949 21119467 17676724 14348126 13034191 11717255 9165185 8086429 10953057
$$ packed form
40175G3679986q3181k347507k412901m824894r341181j1095099q568000n821223
40167B9186000n291984m136820o59157J238224j464143m635221k858824J767189
40159A3145264K890758r7044j799370J64583K253205J708326L09121j50254r03208
40150A7521381k352632j704090K382166O250026N869214K604255R69178K379471
40142C3918969M660718O744157R971797J4240895J6121616J2663452N426214j141197
40134A02606621m690756o707308r348911j2282068j3522418j2186154r045345
40127C4823661n178902j773214o12996k367473m388424l048522R64120K730699
40119B1148949k9482l442743l328598j313935j316936k552070j078756K866628
$$ plain form
40111 10953057 15501665 17581047 16637395 15236773 14560572 13760867 13026463 13826989 16045912
40102 16045912 17856881 18773136 20061453 21624491 21306736 18460160 15789982 16000477
40094 16000477 18255954 19626734 18962525 17792711 17970675 19744515 22096413 24189464
40086 24189464 26269345 29277015 33711590 39291861 45773471 52968984 59221860 61383648
40078 61383648 58164789 52469688 48010835 44235027 37555781 27634673 19027647 15468454
40070 15468454 15630737 16346975 17149210 19046980 21088771 21332297 20008044 18778823 17696563
40061 17696563 15770035 13908032 14104111 15698213 15634169 13079721 10877842 11335010 13221938
40052 13221938 14363864 14743956 15232608 15443507 15043406 15293652 16717799 16817712 13235181
$$ packed form
40111A0953057M548608K079382r43652j400622o76201p99705p34404Q00526K218923
40102A6045912J810969R16255J288317J563038l17755k846576k670178K10495
40094A6000477K255477J370780o64209j169814J77964J773840K351898K093051
40086B4189464K079881L007670M434575N580271O481610P195513O252876K161788
40078F1383648l218859n695101m458853l775808o679246r921108q607026l559193
40070A5468454J62283P16238Q02235J897770K041791K43526j324253j229221j082260
40061A7696563j926528j862003J96079J594102o4044k554448k201879M57168J886928
40052A3221938J141926L80092M88652K10899m00101K50246J424147R9913l582531
$$ plain form
40043 13235181 8267051 6719006 9281022 11594287 10731766 9082452 9913173 12155135
40035 12155135 12568711 11099892 10598917 11886900 12423756 10320173 7056300 5231518
40027 5231518 5468678 6617840 7711970 8676108 9858136 11513592 13267923 14087351 13638585
40018 13638585 13369314 14729652 16438905 15605604 12045753 9178122 9439994 11025913
40010 11025913 10994736 9631914 9213155 9850508 9658080 8614252 9100724 11987766 14805323
40001 14805323 15022005 13206978 11543889 10680428 9669933 8196443 7244982 7669311 9174285
39992 9174285 10828804 11930126 12258375 11951415 11381128 11042037 11333346 12179317 12835935
39983 12835935 12511000 11439943 10828836 11277670 11893411 11711266 11316456 11890513 13129184
$$ packed form
40043A3235181m968130j548045K562016K313265q62521j649314Q30721K241962
40035A2155135M13576j468819n00975J287983N36856k103583l263873j824782
40027E231518K37160J149162J094130R64138J182028J655456J754331Q19428m48766
40018A3638585k69271J360338J709253q33301l559851k867631K61872J585919
40010A1025913l1177j362822m18759O37353j92428j043828M86472K887042K817557
40001A4805323K16682j815027j663089q63461j010495j473490r51461M24329J504974
39992I174285J654519J101322L28249l06960n70287l39091K91309Q45971O56618
39983A2835935l24935j071057o11107M48834O15741j82145l94810N74057J238671
$$ plain form
39974 13129184 13623631 13217416 13297848 14379428 15093053 14458770 13710497 14547685 16526347
39965 16526347 17610850 16825043 15053549 13481793 12551060 12511742 13745019 15988878 18037370
39956 18037370 18836521 18480647 17688392 16728173 15506177 14499251 14713676 16336098 18027711
39947 18027711 18248358 17063139 15931312 15769013 16078765 16220473 16590638 17833099 19508630
39938 19508630 20423745 20055035 19004802 18246024 18443900 19762638 21826765 24097331 26550622
39929 26550622 29398500 31865994 32437061 31286252 31299664 35079185 41630779 47711750
39921 47711750 51847097 54961171 57402497 57980031 56569673 55348556 56224579 58723407
39913 58723407 61564714 64795379 69134867 74640181 81448976 90654193 102828972 116389538
$$ packed form
39974A3129184M94447m06215Q0432J081580P13625o34283p48273Q37188J978662
39965A6526347J084503p85807j771494j571756r30733l9318J233277K243859K048492
39956A8037370P99151l55874p92255r60219j221996j006926K14425J622422J691613
39947A8027711K20647j185219j131827j62299L09752J41708L70165J242461J675531
39938A9508630R15115l68710j050233p58778J97876J318738K064127K270566K453291
39929B6550622K847878K467494N71067j150809J3412L779521O551594O080971
39921D7711750M135347L114074K441326N77534j410358j221117Q76023K498828
39913E8723407K841307L230665M339488N505314O808795R205217J2174779J3560566
$$ plain form
39905 116389538 128808939 139016357 147631249 155423181 162336299 167226832 167888940 162638753
39897 162638753 152927125 142888936 134767594 126266243 114466125 100991974 90481312
39890 90481312 84511740 80067006 74274531 67853533 63007631 60332443 59093676 58619003
39882 58619003 57924524 55439315 50689891 45420602 41889605 40714829 41023734 41611461
39874 41611461 41255518 39390464 37655942 39298929 45382587 52702884 57209148 58454953
39866 58454953 58689992 58690242 57424317 55632374 56398481 61021606 66995082 71818774 76638938
39857 76638938 83857659 92798192 100654630 107109532 114870291 124958702 134067945 138173828
39849 138173828 137138215 133953462 130449952 125819669 119189851 111540984 104220045 97029605
$$ packed form
39905A16389538J2419401J0207418Q614892P791932O913118M890533O62108n250187
39897A62638753r711628j0038189q121342q501351j1800118j3474151j0510662
39890I0481312n969572m444734n792475o420998m845902k675188j238767m74673
39882E8619003o94479k485209m749424n269289l530997j174776L08905N87727
39874D1611461l55943j865054j734522J642987O083658P320297M506264J245805
39866E8454953K35039K50j265925j791943P66107M623125N973476M823692M820164
39857G6638938P218721Q940533P856438O454902P760759J0088411R109243M105883
39849A38173828j035613l184753l503510m630283o629818p648867p320939p190440
$$ plain form
39841 97029605 89209642 81583696 76030557 72695176 69308586 64157358 58562021 55040379
39833 55040379 53688592 52110461 48891254 45320373 43107787 42107534 41369923 40961270
39825 40961270 41319652 42091806 43339090 46747053 53473578 61738825 69328093 77983367
39817 77983367 91548273 108571234 120227824 118527926 105199874 90138929 81799314
39810 81799314 80699742 81222267 77523802 67900647 55288115 44175371 36712592 32070276
39802 32070276 29225151 28388874 28979317 28702305 26614365 24975279 25539841 25996730 23413545
39793 23413545 19717228 19634807 23648670 27249738 27564232 26494279 26157858 25413747 23053095
39784 23053095 20835391 20550270 20846591 19942772 19235289 21059733 24524252 26747353 27111139
$$ packed form
39841I7029605p819963p625946n553139l335381l386590n151228n595337l521642
39833E5040379j351787j578131l219207l570881k212586j000253p37611m08653
39825D0961270L58382P72154J247284L407963O726525Q265247P589268Q655274
39817G7983367J3564906J7022961J1656590j699898j3328052j5060945q339615
39810H1799314j099572N22525l698465r623155j2612532j1112744p462779m642316
39802C2070276k845125q36277N90443k77012k087940j639086N64562M56889k583185
39793B3413545l696317q2421M013863L601068L14494j069953l36421p44111k360652
39784B3053095k217704k85121K96321r03819p07483J824444L464519K223101L63786
$$ plain form
39775 27111139 27229985 27532171 27072911 26516520 28245272 33130375 39775361 47441968 57072538
39766 57072538 68166671 76740949 78341711 72457548 62782188 53481268 46053582 39699855
39758 39699855 33896147 29814247 28847459 30231972 31299451 30452141 28817692 28266370
39750 28266370 28858599 29334578 29279098 29453833 30376492 31709205 32820788 33141735 32429846
39741 32429846 31482049 31885920 34059050 36255282 36696638 36024315 36310809 38187964 40351251
39732 40351251 41497837 41345757 40018278 37804638 35441226 33543294 31988853 30738522
39724 30738522 30570775 31816870 33165584 33201520 32411935 32129786 32407850 32885662 34823430
39715 34823430 39655099 45810464 49647242 49773837 48115645 46569054 45183080 44038970
$$ packed form
39775B7111139J18846L02186m59260n56391J728752M885103O644986P666607R630570
39766E7072538J1094133Q574278J600762n884163r675360r300920p427686o353727
39758C9699855n803708m081900r66788J384513J067479q47310j634449n51322
39750B8266370N92229M75979n5480J74735R22659J332713J111583L20947p11889
39741C2429846r47797M03871K173130K196232M41356o72323K86494J877155K163287
39732D0351251J146586j52080j327479k213640k363412j897932j554441j250331
39724C0738522j67747J246095J348714L5936p89585k82149K78064M77812J937768
39715C4823430M831669O155365L836778J26595j658192j546591j385974j144110
$$ plain form
39707 44038970 44072245 44920986 44404356 41541797 38193768 36547084 36794447 38270223 40773019
39698 40773019 43517913 44904436 44897992 45809014 49207297 53928318 58714880 64909608 74797301
39689 74797301 89135108 107710115 129295834 148295384 154743378 142929833 119602105
39682 119602105 99294637 90977165 92211472 95617247 96313680 92377848 83530679 72806682
39674 72806682 66124666 66557255 71146105 76480834 84933239 100932314 122343625 140717796
39666 140717796 150635878 153968518 153257543 146271732 131748350 116990644 112738377 119684323
39658 119684323 125607957 118800693 100794857 82507269 70703675 62962140 54863945
39651 54863945 46625814 40843231 37674257 35366270 33480214 32632480 32111034 30513469
$$ packed form
39707D4038970L3275Q48741n16630k862559l348029j646684K47363J475776K502796
39698D0773019K744894J386523o444R11022L398283M721021M786562O194728R887693
39689G4797301J4337807J8575007K1585719J8999550O447994j1813545k3327728
39682A19602105k0307468q317472J234307L405775O96433l935832q847169j0723997
39674G2806682o682016M32589M588850N334729Q452405J5999075K1411311J8374171
39666A40717796R918082L332640p10975o985811j4523382j4757706m252267O945946
39658A19684323N923634o807264j8005836j8287588j1803594p741535q098195
39651E4863945q238131n782583l168974k307987j886056q47734n21446j597565
$$ plain form
39643 30513469 28441632 28101784 29947119 31743606 31591963 30234470 29488363 29653504 29582982
39634 29582982 28617250 27396350 26986959 27966018 30311347 33557926 36804009 38849635
39626 38849635 38752181 36536981 33353669 30628520 28871167 27502747 25988342 24823749
39618 24823749 25092734 27185421 30117143 31968230 31127233 27750322 24145315 22847395
39610 22847395 23776933 24139842 21939271 18696928 17397348 18361668 18939202 17310882 14733573
39601 14733573 13371986 13661784 15051327 17774411 21795410 24793486 23885177 19924061
39593 19924061 17777960 20880659 27257310 32931530 37739047 44526640 52757477 56806649
39585 56806649 52672094 43741150 37075152 35549557 36612842 37648719 39020421 42080577
$$ packed form
39643C0513469k071837l39848J845335J796487j51643j357493p46107J65141p0522
39634B9582982r65732j220900m09391R79059K345329L246579L246083K045626
39626C8849635r7454k215200l183312k725149j757353j368420j514405j164593
39618B4823749K68985K092687K931722J851087q40997l376911l605007j297920
39610B2847395R29538L62909k200571l242343j299580R64320N77534j628320k577309
39601A4733573j361587K89798J389543K723084M020999K998076r08309l961116
39593A9924061k146101L102699O376651N674220M807517O787593Q230837M049172
39585E6806649m134555q930944o665998j525595J063285J035877J371702L060156
$$ plain form
39577 42080577 47795193 57518116 70900571 81828773 81242879 67341973 49498064 38098046
39569 38098046 33330661 28574174 22179835 19269450 22149735 25986492 26393885 25600599
39561 25600599 27361825 30349045 31526844 32993000 39516390 49924925 56325797 53151825
39553 53151825 43296364 33802054 28445374 26404278 25806721 25898687 26360872 26431984 25098185
39544 25098185 21809455 17321799 13749078 12698791 13108957 12299993 9805399 8619982
39536 8619982 11339135 16263958 19146357 18270712 15943342 14924931 15237024 15239879 14464351
39527 14464351 14096936 15184365 17457050 19952822 22096363 23870027 25157427 25251072
39519 25251072 23382886 19964491 16832752 15446779 14979110 13367126 10573868 9342346
$$ packed form
39577D2080577N714616R722923J3382455J0928202n85894j3900906j7843909j1400018
39569C8098046m767385m756487o394339k910385K880285L836757M07393p93286
39561B5600599J761226K987220J177799J466156O523390J0408535O400872l173972
39553E3151825r855461r494310n356680k041096n97557R1966M62185P1112j333799
39544B5098185l288730m487656l572721j050287M10166q08964k494594j185417
39536H619982K719153M924823K882399q75645k327370j018411L12093K855p75528
39527A4464351l67415J087429K272685K495772K143541J773664J287400R3645
39519B5251072j868186l418395l131739j385973m67669j611984k793258j231522
$$ plain form
39511 9342346 11570255 15166567 16397545 14774254 13330181 13924033 14838055 14143009 12975372
39502 12975372 13283850 14140934 13296493 11578465 12312281 15962436 18703394 17877896 16018453
39493 16018453 16891343 19568370 19804962 16653243 14190121 15858452 19916746 22219518
39485 22219518 21553677 19954934 18736841 16857020 13647670 11021278 11378934 14157614
39477 14157614 16113593 15191443 12846002 11875400 12900639 14081870 13855872 12668328
39469 12668328 11955690 12593629 14595574 17155012 18618570 17833099 16234038 16965084 20592050
39460 20592050 23308656 21526848 17075068 15041544 16845961 18642480 17257990 14593797
39452 14593797 14354932 16785318 19016390 19213640 18040459 16820446 16430415 17665665
$$ packed form
39511I342346K227909L596312J230978j623291j444073N93852R14022o95046j167637
39502A2975372L08478Q57084q44441j718028P33816L650155K740958q25498j859443
39493A6018453Q72890K677027K36592l151719k463122J668331M058294K302772
39485B2219518o65841j598743j218093j879821l209350k626392L57656K778680
39477A4157614J955979r22150k345441r70602J025239J181231k25998j187544
39469A2668328p12638O37939K001945K559438J463558p85471j599061P31046L626966
39460B0592050K716606j781808m451780k033524J804417J796519j384490k664193
39452A4593797k38865K430386K231072J97250j173181j220013l90031J235250
$$ plain form
39444 17665665 20783921 24690819 27959626 30380884 32169537 32277316 29446327 24771381
39436 24771381 21140416 19769508 19086153 17539678 15756816 15079446 15452460 15826693 15659740
39427 15659740 15130880 14619273 14592628 15339471 16506780 17671473 19224056 21288845 21984358
39418 21984358 19159788 14503791 13056511 16720046 20794947 19924725 15647894 14192660
39410 14192660 17436013 20470578 19205615 16303932 16828178 20748826 23434719 22533152
39402 22533152 20687962 20956989 22626391 23230870 22654621 22855527 24280821 24938882 23384931
39393 23384931 20709292 18559604 16723664 14353643 12686217 14238431 18954049 23149979
39385 23149979 23484638 20689400 18015544 16998218 16530676 15687188 15382913 16655100 18795703
$$ packed form
39444A7665665L118256L906898L268807K421258J788653J07779k830989m674946
39436B4771381l630965j370908o83355j546475j782862o77370L73014L74233j66953
39427A5659740n28860n11607k6645P46843J167309J164693J552583K064789O95513
39418B1984358k824570m655997j447280L663535M074901q70222m276831j455234
39410A4192660L243353L034565j264963k901683N24246L920648K685893r01567
39402B2533152j845190K69027J669402O04479n76249K00906J425294O58061j553951
39393B3384931k675639k149688j835940k370021j667426J552214M715618M195930
39385B3149979L34659k795238k673856j017326m67542q43488l04275J272187K140603
$$ plain form
39376 18795703 20159134 19995157 18720224 17095575 15915275 15819128 16405917 15974374 13304208
39367 13304208 9608190 7580587 8320539 10283662 11658071 12535631 13781953 14834441
39359 14834441 14292324 12444914 11460499 12516278 14080352 13951601 12089068 10404716
39351 10404716 10355487 11759177 13584991 14836834 14770179 13235136 11028265 9357522 8865406
39342 8865406 9416227 10477548 11274328 11115233 10254014 9894801 10580909 11264162 11003414
39333 11003414 10836371 12497600 15722776 18397518 19118584 18018362 15407841 11691894
39325 11691894 8741100 9039454 12561839 16199094 17227848 16054105 14883888 15065671
39317 15065671 16384370 17637901 17365807 15322159 13474800 13916996 15687800 15821216
$$ packed form
39376A8795703J363431j63977j274933j624649j180300r6147N86789m31543k670166
39367A3304208l696018k027603P39952J963123J374409Q77560J246322J052488
39359A4834441n42117j847410r84415J055779J564074j28751j862533j684352
39351A0404716m9229J403690J825814J251843o6655j535043k206871j670743m92116
39342H865406N50821J061321P96780j59095q61219l59213O86108O83253k60748
39333A1003414j67043J661229L225176K674742P21066j100222k610521l715947
39325A1691894k950794K98354L522385L637255J028754j173743j170217J81783
39317A5065671J318699J253531k72094k043648j847359M42196J770804J33416
$$ plain form
39309 15821216 13813893 12347427 12790037 12964818 10849664 7663497 5468998 4459262
39301 4459262 4651455 7326619 12127782 15485095 15085900 13528998 14228254 16093792 16126583
39292 16126583 15025793 15542462 16782050 15296899 11355852 9085914 10080341 11537443
39284 11537443 11483740 11413498 12531250 13398826 12877983 12044641 11825144 11817302 12448252 14976956
39274 14976956 18325540 19432402 17980641 17163280 18373459 19008432 17409180 16094782
39266 16094782 17657933 20966394 24051442 27427398 31784465 35728992 38967627 44625957
39258 44625957 55103046 68866991 85155849 108050386 139686403 171004005 186328975
39251 186328975 179485030 161687659 151179450 156330763 169197404 173749717 159894389
$$ packed form
39309A5821216k007323j466466M42610J74781k115154l186167k194499j009736
39301D459262J92193K675164M801163L357313l99195j556902O99256J865538L2791
39292A6126583j100790N16669J239588j485151l941047k269938R94427J457102
39284A1537443n3703p0242J117752Q67576n20843q33342k19497p842O30950K528704
39274A4976956L348584J106862j451761q17361J210179O34973j599252j314398
39266A6094782J563151L308461L085048L375956M357067L944527L238635N658330
39258D4625957J0477089J3763945J6288858K2894537L1636017L1317602J5324970
39251A86328975o843945j7797371j0508209N151313J2866641M552313j3855328
$$ plain form
39244 159894389 131065191 99419677 74490193 57608440 46188975 39078918 35591366
39237 35591366 33044412 29145508 24873271 21763662 18453741 13471333 9209642 8676933
39229 8676933 9916049 8595036 5216185 4448168 7358661 9735510 9041811 7851650
39221 7851650 8547863 9211425 7297136 3724991 769903 -1051478 -1661582 -19334 3336987
39212 3336987 5021926 3029252 246339 902975 4966502 8644201 9283014 7380618
39204 7380618 4681534 2577342 1889035 2422506 3109644 3718991 5460410 8701941 11460881
39195 11460881 11828736 10665479 10018276 9976262 9215099 7808215 7128497 7294954 7011033
39186 7011033 6040707 5774203 6872330 8052330 7877606 6510550 5109619 4450740 4569966
$$ packed form
39244A59894389k8829198l1645514k4929484j6881753j1419465p110057l487552
39237C5591366k546954l898904m272237l109609l309921m982408m261691n32709
39229H676933J239116j321013l378851p68017K910493K376849o93699j190161
39221G851650O96213O63562j914289l572145k955088j821381o10104J642248L356321
39212C336987J684939j992674k782913O56636M063527L677699O38813j902396
39204G380618k699084k104192o88307N33471O87138O09347J741419L241531K758940
39195A1460881L67855j163257o47203m2014p61163j406884o79718J66457k83921
39186G011033r70326k66504J098127J180000j74724j367056j400931o58879J19226
$$ plain form
39177 4569966 4929468 4650348 3422348 2391283 3168707 5597901 7501216 7268580 5848761
39168 5848761 5315469 6054817 6485126 5489888 4030509 3800375 4926484 5837957 5289595
39159 5289595 3680761 2113971 1004048 413297 1133393 3992710 7837062 9593825
39151 9593825 7448760 3283016 739900 1156941 2743332 3793766 4922657 7077531
39143 7077531 8917924 8335949 6112715 5573615 7963208 10441127 10127923 8159755 7489692
39134 7489692 8158602 7779546 6138825 5830014 7697673 8978241 7579893 5378515 4976237
39125 4976237 5495796 4528109 2724457 3025260 5669037 7242722 5444908 2248533 981779
39116 981779 1973855 2739709 1741996 406983 1076414 3732959 5647341 4602597 1781302
$$ packed form
39177D569966L59502k79120j228000j031065P77424K429194J903315k32636j419819
39168E848761n33292P39348M30309r95238j459379k30134J126109R11473n48362
39159E289595j608834j566790j109923n90751P20096K859317L844352J756763
39151I593825k145065m165744k543116M17041J586391J050434J128891K154874
39143G077531J840393n81975k223234n39100K389593K477919l13204j968168o70063
39134G489692O68910l79056j640721l08811J867659J280568j398348k201378m02278
39125D976237N19559r67687j803652L00803K643777J573685j797814l196375j266754
39116I81779R92076P65854r97713j335013O69431K656545J914382j044744k821295
$$ plain form
39107 1781302 370522 1504967 3099116 3070250 2055097 1936063 3104161 4532341 5506674
39098 5506674 5899133 5488183 4230824 2628101 1058287 -355061 -755555 886294 3375460
39089 3375460 3604564 790021 -1758240 -1067349 1485301 3014971 3719774 5408940 7290223
39080 7290223 7061266 5169017 4171580 4458692 4341184 3939885 5003684 6907347 6937543
39071 6937543 5028451 4229599 5656819 6848099 6214519 5305201 5242719 4630168 2794418
39062 2794418 1670923 2452462 3496144 3570182 4074834 5850266 6873673 5701631 4376767
39053 4376767 5077800 6368054 5765713 3882457 2908040 2838840 2449507 2515480 4622307
39044 4622307 7573963 8280346 6166391 4091104 4677805 7632977 10783210 12325885
$$ packed form
39107A781302j410780J134445J594149k8866j015153j19034J168098J428180R74333
39098E506674L92459m10950j257359j602723j569814j413348m00494J641849K489166
39089C375460K29104k814543k548261O90891K552650J529670P04803J689166J881283
39080G290223k28957j892249r97437K87112j17508m01299J063799J903663L0196
39071F937543j909092p98852J427220J191280o33580r09318o2482o12551j835750
39062B794418j123495P81539J043682P4038N04652J775432J023407j172042j324864
39053D376767P01033J290254o02341j883256r74417o9200l89333O5973K106827
39044D622307K951656P06383k113955k075287N86701K955172L150233J542675
$$ plain form
39036 12325885 12148127 11913458 13355060 15786829 16458010 14297795 11750342 11519221 13063747
39027 13063747 14003503 13494336 12252719 10531152 8259960 6375594 6022344 6945230 8125839
39018 8125839 9256006 10350404 11009859 11344661 12255032 13406018 12589389 8850571 4596068
39009 4596068 2618575 2627389 2783483 2889700 3598092 4167988 3881638 4281514 6940693
39000 6940693 10112932 10727020 8861688 7168991 6699520 6566450 7012875 9196674 12197076
38991 12197076 13797843 14214225 15587927 17951518 19581617 21336511 26078066 33277973
38983 33277973 39697539 47309308 64158285 92119781 117991707 123821626 105812747
38976 105812747 77867475 56063700 44369931 36838953 28659259 20747378 15640131
$$ packed form
39036A2325885j77758k34669J441602K431769O71181k160215k547453k31121J544526
39027A3063747R39756n09167j241617j721567k271192j884366l53250R22886J180609
39018H125839J130167J094398O59455L34802R10371J150986q16629l738818m254503
39009D596068j977493Q814J56094J06217P08392N69896k86350L99876K659179
39000F940693L172239O14088j865332j692697m69471j33070M46425K183799L000402
38991A2197076J600767M16382J373702K363591J630099J754894M741555P199907
38983C3277973O419566P611769J6848977K7961496K5871926N829919j8008879
38976A05812747k7945272k1803775j1693769p530978q179694p911881n107247
$$ plain form
38969 15640131 13499205 12876647 12685488 12180582 10587555 7945808 5384391 3735373
38961 3735373 2832233 2880717 5031346 9114429 12169739 11468521 8273110 6145130 5948601
38952 5948601 5439021 3886200 3609381 5676016 7382482 6255025 3976926 3697457 5403955
38943 5403955 6780222 7153135 7550898 7742110 6347154 3855331 2878508 4839998 8140995
38934 8140995 10039888 9228936 6556425 4173017 3782884 5023094 5982952 5606115 4454104
38925 4454104 2867347 426088 -1916871 -1713584 1303443 3931236 4060105 3997865 6461069
38916 6461069 9707850 10241510 8458191 7527678 7817962 6679322 3414528 484343 -409374
38907 -409374 47213 1322854 3940488 7333798 9578382 9705930 8170208 5441536 2577882
$$ packed form
38969A5640131k140926o22558j91159n04906j593027k641747k561417j649018
38961C735373r03140M8484K150629M083083L055310p01218l195411k127980j96529
38952E948601n09580j552821k76819K066635J706466j127457k278099k79469J706498
38943E403955J376267L72913L97763J91212j394956k491823r76823J961490L300997
38934H140995J898893q10952k672511k383408l90133J240210R59858l76837j152011
38925D454104j586757k441259k342959K03287L017027K627793J28869o2240K463204
38916F461069L246781N33660j783319r30513K90284j138640l264794k930185q93717
38907d09374M56587J275641K617634L393310K244584J27548j535722k728672k863654
$$ plain form
38898 2577882 2266142 6074943 11202442 13177848 11341334 8711674 7632855 9041032
38890 9041032 14194206 22461673 29475363 33780787 43476045 67165529 97269325 112264161
38882 112264161 100351843 73225939 50761039 39211636 31810907 24484512 20448440
38875 20448440 21184848 22737573 22425130 22114906 22866685 22077382 18303815 14234881 12224336
38866 12224336 10600647 7218560 3738886 3268875 5519179 7219519 6629129 5350228
38858 5350228 5790386 8452033 11821584 13741026 12705504 8877076 4436067 2329453
38850 2329453 3812193 7169539 9377932 9049194 7186653 5194767 3344017 1583336
38842 1583336 396023 -215804 -1276511 -2945801 -3338933 -1026932 2406052 4338520
$$ packed form
38898B577882l11740L808801N127499J975406j836514k629660j078819J408177
38890I041032N153174Q267467P013690M305424R695258K3689484L0103796J4994836
38882A12264161j1912318k7125904k2464900j1549403p400729p326395m036072
38875B0448440P36408J552725l12443l10224P51779p89303l773567m068934k010545
38866A2224336j623689l382087l479674m70011K250304J700340n90390j278901
38858E350228M40158K661647L369551J919442j035522l828428m441009k106614
38850B329453J482740L357346K208393l28738j862541j991886j850750j760681
38842A583336j187313o11827j060707j669290l93132K312001L432984J932468
$$ plain form
38834 4338520 4528627 4238588 3269706 1008558 -568936 1143428 4580031 5277557 2471660
38825 2471660 261348 1106481 2441760 1656936 346022 816194 1764483 733675 -1526855
38816 -1526855 -2341057 -1128368 523625 1565481 2159887 2755176 3898851 5591158 6043915
38807 6043915 3355708 -692429 -1536235 1986484 5534033 5223425 2413832 407985
38799 407985 -26642 818416 3733377 7758100 8725761 4738904 118920 -338535 1843543
38790 1843543 2383806 1701457 3230174 6307377 6886971 4639920 3551197 5300616 7216173
38781 7216173 7273182 6391892 5150942 2728524 2933 -436853 1590891 3398414 3857206
38772 3857206 4629586 6226692 6644564 5121783 3832901 4474852 5974969 6570851 5613195
$$ packed form
38834D338520J90107k90039r68882k261148j577494J712364L436603O97526k805897
38825B471660k210312Q45133J335279p84824j310914M70172R48289j030808k260530
38816a526855q14202J212689J651993J041856N94406N95289J143675J692307M52757
38807F043915k688207m048137q43806L522719L547549l10608k809593k005847
38799D07985m34627Q45058K914961M024723R67661l986857m619984m57455K182078
38790A843543N40263o82349J528717L077203N79594k247051j088723J749419J915557
38781G216173N7009q81290j240950k422418k725591m39786K027744J807523M58792
38772C857206P72380J597106M17872j522781j288882O41951J500117N95882r57656
$$ plain form
38763 5613195 2915471 -841220 -2951311 -1235378 2082394 2612275 87956 -1549801
38755 -1549801 -623503 380857 305665 1617998 5186278 7592280 6597878 5164834 6647976
38746 6647976 9463015 10194887 9198847 9264020 10640808 11000569 9187308 6141621 3093087
38737 3093087 1129805 1382932 3505202 5100316 4463741 2615241 1182115 146691
38729 146691 -641737 -31382 2029491 2822519 454307 -2522463 -2109404 1612053 4848140
38720 4848140 5239273 3879935 2584957 1687928 640592 -1059186 -3493594 -5517340
38712 -5517340 -4914486 -940273 3866490 6026453 4870477 2632393 1422373 1492082 1967083
38703 1967083 2037301 1814262 2669149 5710107 9327510 10015878 6852595 3267582 2647365
$$ packed form
38763E613195k697724l756691k110091J715933L317772N29881k524319j637757
38755a549801R26298J004360p5192J312333L568280K406002r94402j433044J483142
38746F647976K815039P31872r96040O5173J376788L59761j813261l045687l048534
38737C093087j963282K53127K122270J595114o36575j848500j433126j035424
38729A46691p88428O10355K060873P93028k368212k976770M13059L721457L236087
38720D848140L91133j359338j294978q97029j047336j699778k434408k023746
38712e517340O02854L974213M806763K159963j155976k238084j210020O9709M75001
38703A967083P0218k23039Q54887L040958L617403O88368l163283l585013o20217
$$ plain form
38694 2647365 3968803 3835009 1189268 -2270172 -4801212 -5217211 -2318366 3184792
38686 3184792 7164104 5824303 776312 -2532133 -1440130 1558997 3082768 2651263
38678 2651263 1684494 1233671 1632413 2591317 2965493 1889659 386671 324925 1778137
38669 1778137 3125521 3643406 3965334 3983444 2660901 369987 -935755 -725574 -919427
38660 -919427 -2767790 -4577376 -4013582 -1332432 1177790 2176722 2383264 3022511 4105616
38651 4105616 4433855 3184195 1337489 829295 1863982 2167231 -9893 -3269470 -4999621
38642 -4999621 -4764216 -3666459 -1507479 2392870 6022770 5887053 1975642 -1713104
38634 -1713104 -2574882 -2132260 -2085041 -1151659 1782005 4402765 4054672 2020668 1404747
$$ packed form
38694B647365J321438j33794k645741l459440k531040m15999K898845N503158
38686C184792L979312j339801n047991l308445J092003K999127J523771m31505
38678B651263r66769m50823L98742R58904L74176j075834j502988o1746J453212
38669A778137J347384N17885L21928J8110j322543k290914j305742K10181j93853
38660i19427j848363j809586N63794K681150K510222R98932K06542O39247J083105
38651D105616L28239j249660j846706n08194J034687L03249k177124l259577j730151
38642d999621K35405J097757K158980L900349L629900j35717l911411l688746
38634a713104q61778M42622M7219R33382K933664K620760l48093k034004o15921
$$ plain form
38625 1404747 2158476 1681822 -331348 -1166981 577632 2964937 3822790 3501215 3475940
38616 3475940 3988632 4225658 3704287 2595953 1421723 875098 1187929 1476486 652103
38607 652103 -829266 -1201274 272060 2231655 3011783 2559708 1938738 1754098 1951191
38598 1951191 2677831 4311147 6502255 7896362 7343845 5305762 3563530 3222931 3416731
38589 3416731 2659505 1168879 635256 1567742 2466826 2476990 3205179 6182476 9671738
38580 9671738 10288928 7499436 4316307 3366970 4292735 5432060 5984318 5675748 4241203
38571 4241203 2481220 2219974 3845904 5324540 5113340 4593476 5732543 7625223 7813083
38562 7813083 6369167 5887966 7226869 7953217 6042426 2877925 974325 357557 -806430
$$ packed form
38625A404747P53729m76654k013170q35633J744613K387305Q57853l21575k5275
38616C475940N12692K37026n21371j108334j174230n46625L12831K88557q24383
38607F52103j481369l72008J473334J959595P80128m52075o20970j84640J97093
38598A951191P26640J633316K191108J394107n52517k038083j742232l40599J93800
38589C416731p57226j490626n33623R32486Q99084J0164P28189K977297L489262
38580I671738O17190k789492l183129r49337R25765J139325N52258l08570j434545
38571D241203j759983k61246J625930J478636k11200n19864J139067J892680J87860
38562G813083j443916m81201J338903P26348j910791l164501j903600o16768j163987
$$ plain form
38553 -806430 -2884719 -4160711 -3382675 -1101097 1794738 5128258 8185679 8933398 6145050
38544 6145050 1793003 -359071 1156206 4018468 5125254 3943986 2197759 1406119
38536 1406119 1949054 3640431 5529206 5555113 2396141 -2061879 -3928407 -1699496 2031356
38527 2031356 3930844 3389020 1765752 66518 -1104035 -936155 251238 379424 -1510732
38518 -1510732 -2945695 -1185906 2260468 3487563 2164382 1910020 4097602 5258363
38510 5258363 2655260 -929646 -1003219 2289809 4952337 4978390 4057268 3896589 4078428
38501 4078428 3977493 4063522 4365227 3827319 2341607 1590043 2479944 3252296 1899676
38492 1899676 -530376 -1137104 544208 1618687 -64912 -2700504 -3000446 -787525
$$ packed form
38553h06430k078289j275992P78036K281578K895835L333520L057421P47719k788348
38544F145050m352047k152074J515277K862262J106786j181268j746227p91640
38536A406119N42935J691377J888775K5907l158972m458020j866528K228911L730852
38527B031356J899488n41824j623268j699234j170553J67880J187393J28186j890156
38518a510732j434963J759789L446374J227095j323181k54362K187582J160761
38510E258363k603103l584906p3573L293028K662528K6053r21122j60679J81839
38501D078428j00935Q6029L01705n37908j485712p51564Q89901P72352j352620
38492A899676k430052o06728J681312J074479j683599k635592k99942K212921
$$ plain form
38484 -787525 1023510 810809 201086 900351 1973825 2058196 2259361 4156116 6249236
38475 6249236 5785547 3703596 3920910 6963097 8211495 4510770 -849587 -2725467
38467 -2725467 -1156213 -229300 -1466442 -2312472 -969174 930052 1318501 608354 336248
38458 336248 743073 928353 314222 -859793 -1760472 -1360093 616792 3062613 4566161
38449 4566161 4948672 4910541 4710248 4456514 5089956 7224474 9177638 8230609 4343530
38440 4343530 875349 808687 3524544 6005912 6121184 4051930 1501433 333275 1398783
38431 1398783 3995113 6545214 7832781 7430602 5507547 2952749 1179259 858200
38423 858200 1221931 1393346 1637098 2245031 2241535 844419 -653885 -429844 1080286
$$ packed form
38484g87525J811035k12701o09723O99265J073474Q4371K01165J896755K093120
38475F249236m63689k081951K17314L042187J248398l700725n360357j875880
38467b725467J569254R26913j237142q46030J343298J899226L88449p10147k72106
38458C36248M06825J85280o14131j174015r00679M00379J976885K445821J503548
38449D566161L82511l8131k00293k53734O33442K134518J953164r47029l887079
38440D343530l468181o6662K715857K481368J15272k069254k550497j168158J065508
38431A398783K596330K550101J287567m02179j923055k554798j773490l21059
38423H58200L63731J71415K43752O07933l496j397116j498304K24041J510130
$$ plain form
38414 1080286 2011863 2070142 2279303 2229058 499561 -2104174 -2866024 -1407214 -628928
38405 -628928 -2204790 -3853712 -2742535 590260 3376801 3905685 2280657 -323204
38397 -323204 -1861978 -735589 1802919 2527943 853831 185997 2778069 5719838 4857005
38388 4857005 904693 -1609257 -622008 1414252 1643387 158561 -1246231 -1471913 -448166
38379 -448166 1410364 3240016 4091492 3865601 3498257 3997840 5445653 6802675 6666106
38370 6666106 4649234 1969375 47878 -1116448 -2034951 -1759228 1056756 5107175
38362 5107175 7071072 6081936 4924146 5539287 6138899 4692755 2568159 2069378 2632472
38353 2632472 2529513 2535897 4462570 7210821 7799649 5765076 3279169 1273721 -1175043
$$ packed form
38414A080286R31577N8279K09161n0245j729497k603735p61850J458810P78286
38405f28928j575862j648922J111177L332795K786541N28884j625028k603861
38397c23204j538774J126389K538508P25024j674112o67834K592072K941769q62833
38388D857005l952312k513950R87249K036260K29135j484826j404792k25682J023747
38379d48166J858530J829652Q51476k25891l67344M99583J447813J357022j36569
38370F666106k016872k679859j921497j164326r18503K75723K815984M050419
38362E107175J963897r89136j157790O15141N99612j446144k124596m98781N63094
38353B632472j02959O384J926673K748251N88828k034573k485907k005448k448764
$$ plain form
38344 -1175043 -3548979 -3457249 -422688 2677994 3141754 1370458 -602803 -1646169 -1727788
38335 -1727788 -1200514 -718796 -670924 -302598 1367080 3642603 4605915 3628875 2025725
38326 2025725 1129099 1135926 1803615 2721646 2943582 1998093 1219529 2367239 4975649
38317 4975649 6821924 6885523 5956972 4566400 2604754 1008912 1318588 3123071 4218704
38308 4218704 3733060 2899142 2529504 2281001 2663575 4691051 6868331 6004563 2399148
38299 2399148 642424 3084128 5906887 4676046 841414 -1005423 -111814 534431
38291 534431 91505 976112 3806453 5424351 3482532 -4020 -1541078 -538608 979696
38282 979696 1607371 1684431 1912735 2359820 2684099 2411521 1133376 -841978 -2151444
$$ packed form
38344a175043k373936R1730L034561L100682M63760j771296j973261j043366q1619
38335a727788N27274M81718M7872L68326J669678K275523R63312r77040j603150
38326B025725q96626O827O67689R18031K21936r45489p78564J147710K608410
38317D975649J846275O3599r28551j390572j961646j595842L09676J804483J095633
38308D218704m85644q33918l69638k48503L82574K027476K177280q63768l605415
38299B399148j756724K441704K822759j230841l834632j846837Q93609O46245
38291E34431m42926Q84607K830341J617898j941819l486552j537058J002470J518304
38282I79696O27675P7060K28304M47085L24279k72578j278145j975354j309466
$$ plain form
38273 -2151444 -1395769 1350766 4466696 6385911 6970212 7076889 7112404 6635599 5476267
38264 5476267 4514749 4700387 5660761 6110655 5634457 5295764 6230425 8174840 9674540
38255 9674540 9440980 7411061 4813274 3251777 3405995 4558755 5490076 5563616 4783723
38246 4783723 3386432 1864579 827288 277812 -322743 -743366 230755 2803570 5152708
38237 5152708 5707277 5220067 4970288 4369586 2693682 1828022 4024973 7531831 8120549
38228 8120549 5190846 2697904 3272574 5145087 6170380 6997659 8117663 7516299 4337942
38219 4337942 1787924 2751209 4893791 4127949 1322030 1208863 5125723 8983853 9007530
38210 9007530 6123885 3593837 2900529 3375719 4191377 5278448 6800750 8378090 8960896
$$ packed form
38273b151444P55675K746535L115930J919215N84301J06677L5515m76805j159332
38264E476267r61518J85638R60374M49894m76198l38693R34661J944415J499700
38255I674540k33560k029919k597787j561497J54218J152760R31321P3540p79893
38246D783723j397291j521853j037291n49476o00555m20623R74121K572815K349138
38237E152708N54569m87210k49779o00702j675904q65660K196951L506858N88718
38228H120549k929703k492942N74670J872513J025293Q27279J120004o01364l178357
38219D337942k550018R63285K142582p65842k805919j13167L916860L858130K3677
38210I007530k883645k530048o93308M75190Q15658J087071J522302J577340N82806
$$ plain form
38201 8960896 7998382 6765278 7167749 8780408 9041769 7370235 6563281 8335187 10314448
38192 10314448 10270367 10493560 13976919 18405406 18834450 15358683 13197544 15378645 20029062
38183 20029062 24993326 30435954 36558351 43393894 53033040 67256633 84004013 103452633
38175 103452633 136641444 195462062 267904590 314602838 302933763 241418149 170460729
38168 170460729 121481254 95144481 77391149 62116419 52045828 47577442 44684164
38161 44684164 40972991 37312916 34476470 32149236 30243326 28445638 25729313 22265982
38153 22265982 19988064 19512193 18872164 17191825 16732569 18765607 20385416 18734035
38145 18734035 15790460 15099831 15875039 14749215 11971179 11037818 12517301 12969979 10699475
$$ packed form
38201H960896r62514j233104M02471J612659K61361j671534q06954J771906J979261
38192A0314448m4081K23193L483359M428487M29044l475767k161139K181101M650417
38183B0029062M964264N442628O122397O835543R639146J4223593J6747380J9448620
38175A03452633L3188811N8820618P2442528M6698248j1669075o1515614p0957420
38168A70460729m8979475k6336773j7753332j5274730j0070591m468386k893278
38161D4684164l711173l660075k836446k327234j905910j797688k716325l463331
38153B2265982k277918m75871o40029j680339m59256K033038J619809j651381
38145A8734035k943575o90629P75208j125824k778036r33361J479483M52678k270504
$$ plain form
38136 10699475 8426387 8892683 11177951 12925312 13443942 13010294 11418634 8905842
38128 8905842 6866860 6359235 7154151 8880453 11559163 14558078 16759205 18156115
38120 18156115 19484597 20186445 19076930 17266298 17617641 20534713 23012259 22839811
38112 22839811 21147113 19984469 20298610 23049995 28816939 35321791 39553283 43687378
38104 43687378 53765813 70660198 89573980 112818724 153609959 215726814 274054707
38097 274054707 290333362 252131663 186448662 130433408 97397496 76996722 58922532
38090 58922532 44381567 36884470 33422526 28733475 22554925 18597580 18597164 20019244
38082 20019244 19023315 14552089 9474671 7478820 8803329 10285603 10024198 9765173
$$ packed form
38136A0699475k273088M66296K285268J747361N18630m33648j591660k512792
38128H905842k038982n07625P94916J726302K678710K998915K201127J396910
38120A8156115J328482P01848j109515j810632L51343K917072K477546j72448
38112B2839811j692698j162644L14141K751385N766944O504852M231492M134095
38104D3687378J0078435J6894385J8913782K3244744M0791235O2116855N8327893
38097B74054707J6278655l8201699o5683001n6015254l3035912k0400774j8074190
38090E8922532j4540965p497097l461944m689051o178550l957345m16J422080
38082B0019244r95929m471226n077418j995851J324509J482274k61405k59025
$$ plain form
38074 9765173 11197280 12385770 10671830 7320688 5862972 6726335 7051427 5604876
38066 5604876 4325317 4536422 4969027 4584118 4379592 4946515 4845691 3213603 1805717
38057 1805717 2405886 3931108 4314679 3939668 4724993 6466215 6688028 4460737 2267777
38048 2267777 3007407 6258454 8697585 7983970 5357868 3960200 4891161 5833291 4195498
38039 4195498 841928 -800306 712422 3020091 3419729 2351473 1937632 2493883 2650516
38030 2650516 2212563 2475487 3635961 4157179 3317659 2415001 2520677 2793184 2190512
38021 2190512 1320245 1226167 1667753 2054545 2790074 4018927 4332589 2782666 1041556
38012 1041556 1095455 1735480 372957 -2156278 -2222946 833341 3449971 3564873 3604699
$$ packed form
38074I765173J432107J188490j713940l351142j457716Q63363L25092j446551
38066E604876j279559K11105M32605l84909k04526N66923j00824j632088j407886
38057A805717O00169J525222L83571l75011P85325J741222K21813k227291k192960
38048B267777P39630L251047K439131p13615k626102j397668R30961R42130j637793
38039D195498l353570j642234J512728K307669L99638j068256m13841N56251J56633
38030B650516m37953K62924J160474N21218q39520r02658J05676K72507o02672
38021B190512q70267r4078M41586L86792P35529J228853L13662j549923j741110
38012A041556N3899O40025j362523k529235o6668L056287K616630J14902L9826
$$ plain form
38003 3604699 5490194 6536119 3956763 465888 816980 4449049 6398164 4973644
37995 4973644 3706030 5113680 7042963 6784862 5102269 4066846 3810740 3608406 3786888
37986 3786888 4364608 3845651 1638032 -44827 982214 3535139 4885040 4748522 4898141
37977 4898141 5491417 4579833 1549838 -1262443 -1381557 770838 2721289 3128238 2999560
37968 2999560 3584306 3975531 2070254 -1952869 -4828187 -4285499 -2474943 -2892834 -4844247
37959 -4844247 -4355387 -671093 2062828 975032 -1390942 -1494570 -106075 -12586 -993982
37950 -993982 -845875 278395 455483 -31788 854203 2854640 3535470 2582378 2402646
37941 2402646 3816706 4488229 2800272 449644 -268284 480782 1117473 957337 294746
$$ packed form
38003C604699J885495J045925k579356l490875L51092L632069J949115j424520
37995D973644j267614J407650J929283k58101j682593j035423k56106k02334J78482
37986C786888N77720n18957k207619j682859J027041K552925J349901j36518J49619
37977D898141N93276r11584l029995k812281j19114K152395J950451M06949j28678
37968B999560N84746L91225j905277m023123k875318N42688J810556m17891j951413
37959d844247M88860L684294K733921j087796k365974j03628J388495R3489r81396
37950i93982J48107J124270J77088m87271Q85991K000437O80830r53092j79732
37941B402646J414060O71523j687957k350628p17928P49066O36691j60136o62591
$$ plain form
37932 294746 -298636 67004 1779383 3302940 2470517 -152742 -1365995 242277 2268321
37923 2268321 2282291 1316331 1557999 2586790 2544606 1732582 2073890 3417563 3313421
37914 3313421 1002627 -828045 434757 3686358 5565149 4726145 3023576 2565622
37906 2565622 3197536 3576596 3459846 3535919 3627823 2832568 1467069 973075 1372809 954054
37896 954054 -351446 351812 4625828 9075473 9193935 5665014 3200457 3520421 3597187
37887 3597187 1541324 -29888 1405270 3797630 3664211 1427230 498247 2309476
37879 2309476 5037673 6586790 6515343 5432184 4391928 4509456 5658287 6203162 5410338
37870 5410338 4991816 6432602 8037848 7120896 4292227 2715425 3367893 4060442 3514081
$$ packed form
37932B94746n93382L65640J712379J523557q32423k623259j213253J608272K026044
37923B268321J3970r65960K41668J028791m2184q12024L41308J343673j04142
37914C313421k310794j830672J262802L251601J878791q39004j702569m57954
37906B565622O31914L79060j16750P6073R1904p95255j365499m93994L99734m18755
37896I54054j305500P03258M274016M449645J18462l528921k464557L19964P6766
37887C597187k055863j571212J435158K392360j33419k236981r28983J811229
37879B309476K728197J549117p1447j083159j040256J17528J148831N44875p92824
37870E410338m18522J440786J605246r16952k828669j576802O52468O92549n46361
$$ plain form
37861 3514081 3335178 4744098 6002545 4997988 2606264 1485096 2539755 4243419
37853 4243419 4743710 3263472 142218 -3057439 -4039575 -1917666 1331435 2907710
37845 2907710 2523021 2286912 3341177 4392730 4174674 3624994 4272025 5649552 6092488
37836 6092488 5564667 5720574 6954345 7281676 5093901 1627246 -529406 -387773 1218270
37827 1218270 3343311 5163709 5253473 2918426 348022 1126517 5711810 10283350 11311733
37818 11311733 9637132 8451446 8708164 8764766 7837079 7226262 7763333 8235537 7451237
37809 7451237 6315612 6350767 7024711 6313584 3931111 2352781 3676816 6433666 6998194
37800 6998194 4114212 513362 -661606 263641 574736 -729684 -1887313 -1391492 32501
$$ packed form
37861C514081j78903J408920J258447j004557k391724j121168J054659J703664
37853D243419N00291j480238l121254l199657r82136K121909L249101J576275
37845B907710l84689k36109J054265J051553k18056n49680O47031J377527M42936
37836F092488n27821J55907J233771L27331k187775l466655k156652J41633J606043
37827A218270K125041J820398Q9764k335047k570404P78495M585293M571540J028383
37818A1311733j674601j185686K56718N6602r27687o10817N37071M72204p84300
37809G451237j135625L5155O73944p11127k382473j578330J324035K756850N64528
37800F998194k883982l600850j174968R25247L11095j304420j157629M95821J423993
$$ plain form
37791 32501 1270526 2799522 5301024 7493960 7271635 4740253 2504047 2625048 4394172
37782 4394172 5575808 5145173 4181211 4204190 5121898 5293551 3729906 1525139 322648
37773 322648 -11395 -729923 -1500063 -467764 2374744 4090514 2571863 -276960 -974682
37764 -974682 1174158 4040917 5856129 6307055 5422419 3791969 3276691 4921147 6509889
37755 6509889 4964990 1099232 -1068214 -99809 1090064 301929 -575648 704458 2733438
37746 2733438 3059194 2492053 3413478 5280937 5485176 4085707 3952965 5803587 6561015
37737 6561015 4006291 311718 -963143 523583 2368545 3230013 3910701 5044946
37729 5044946 5777004 5195371 3737594 2479504 1780960 1241423 509658 -460170 -1652145
$$ packed form
37791C2501J238025J528996K501502K192936k22325k531382k236206J21001J769124
37782D394172J181636m30635r63962K2979R17708J71653j563645k204767j202491
37773C22648l34043p18528p70140J032299K842508J715770j518651k848823o97722
37764i74682K148840K866759J815212M50926q84636j630450n15278J644456J588742
37755F509889j544899l865758k167446R68405J189873p88135q77577J280106K028980
37746B733438L25756n67141R21425J867459K04239j399469j32742J850622P57428
37737F561015k554724l694573j274861J486726J844962Q61468O80688J134245
37729E044946P32058n81633j457777j258090o98544n39537p31765r69828j191975
$$ plain form
37720 -1652145 -2826292 -3227436 -2256340 -633864 22839 -531119 -222967 2673669 6432463
37711 6432463 7338261 4522845 1284079 567742 1162620 246006 -1986719 -2954821 -2079532
37702 -2079532 -1366293 -1470888 -408405 2668543 5276584 5134817 3651377 3483503 4284582
37693 4284582 3682410 1545169 253353 807881 1497008 993982 265951 375871 577267
37684 577267 58858 -146608 1245242 3418131 4455443 4027963 3531392 3991173 5214104
37675 5214104 6613149 7490533 6888847 4707769 2740102 2854270 4056047 3234762 -582742
37666 -582742 -4471992 -5104000 -2560997 539711 2485568 3526261 4372491 5317387 6469775
37657 6469775 7372508 6667643 3675601 172120 -1104617 83777 1235940 830774 401576
$$ packed form
37720a652145j174147m01144R71096J622476O56703n53958L08152K896636L758794
37711F432463R05798k815416l238766p16337N94878r16614k232725r68102Q75289
37702b079532P13239j04595J062483L076948K608041j41767j483440j67874Q01079
37693D284582o02172k137241j291816N54528O89127n03026p28031J09920K01396
37684E77267n18409k05466J391850K172889J037312m27480m96571M59781J222931
37675E214104J399045Q77384o01686k181078j967667J14168J201777q21285l817504
37666e82742l889250o32008K543003L100708J945857J040693Q46230R44896J152388
37657F469775R02733p04865k992042l503481j276737J188394J152163m05166m29198
$$ plain form
37648 401576 1723235 3613530 3528903 1558466 619784 2460678 5279529 6205631 4971872
37639 4971872 3893252 4592938 5966329 5842831 4030865 2829799 4303064 7691775
37631 7691775 10203674 10023839 7620420 4218168 407571 -3119779 -4869667 -4069824
37623 -4069824 -2298350 -2043018 -3600518 -4603966 -2875833 1117773 4854944 6117795
37615 6117795 4702934 2396289 1231374 1363838 1163139 -3044 -200146 2302445 5635655
37606 5635655 6191397 3815185 2378903 4351241 7447280 8253919 6852837 5590032
37598 5590032 5011814 3809140 1991053 1343368 2608264 4325716 4890340 4228947 3141734
37589 3141734 2294515 2152756 2818656 3653711 3825970 3255737 2465088 1919629 2174425
$$ packed form
37648D01576J321659J890295q4627j970437r38682J840894K818851R26102j233759
37639D971872j078620O99686J373391j23498j811966j201066J473265L388711
37631G691775K511899j79835k403419l402252l810597l527350j749888P99843
37623d069824J771474K55332j557500j003448J728133L993606L737171J262851
37615F117795j414861k306645j164915J32464k00699j166183j97102K502591L333210
37606E635655N55742k376212j436282J972338L096039Q06639j401082j262805
37598E590032n78218j202674j818087o47685J264896J717452N64624o61393j087213
37589C141734q47219j41759O65900Q35055J72259n70233p90649n45459K54796
$$ plain form
37580 2174425 3818530 6214904 7290664 6049289 4323650 4256770 5080537 4735993 3816113
37571 3816113 4802407 7467002 8397241 5963375 2734240 1547805 1858973 1800664 1513419
37562 1513419 2091630 2849205 2097489 -143056 -2195666 -2993651 -2708069 -1578052 400134
37553 400134 2784242 4759692 5818107 5846781 4999503 3846242 2936531 1954712 282517
37544 282517 -1485780 -2059580 -1758585 -2410071 -4272957 -5178710 -3878615 -2126227 -1880592
37535 -1880592 -2440753 -2198220 -1330536 -612108 669278 3083395 4780738 3597729 533035
37526 533035 -1418959 -1155375 146614 1557870 2722048 2588963 744890 -680060 447568
37517 447568 2325154 1297876 -2210339 -3712353 -1318745 1475926 1258084 -549393
$$ packed form
37580B174425J644105K396374J075760j241375j725639o6880Q23767l44544r19880
37571C816113R86294K664595R30239k433866l229135j186435L11168n8309k87245
37562A513419N78211P57575p51716k240545k052610p97985K85582J130017J978186
37553D00134K384108J975450J058415K8674q47278j153261r09711r81819j672195
37544B82517j768297n73800L00995o51486j862886r05753J300095J752388K45635
37535a880592n60161K42533Q67684P18428J281386K414117J697343j183009l064694
37526E33035j951994K63584J301989J411256J164178j33085j844073j424950J127628
37517D47568J877586j027278l508215j502014K393608K794671k17842j807477
$$ plain form
37509 -549393 -798700 287172 145776 -1632191 -2871566 -2338203 -1191010 -755764 -711857
37500 -711857 -109416 910450 1194705 90776 -1663247 -2799917 -3030211 -3105945 -3392029
37491 -3392029 -3364690 -2898103 -2754697 -2951440 -2120838 120917 1722825 1103115 61058
37482 61058 1160663 3325864 3331101 1276453 907063 3839622 6830084 6182126 2272686
37473 2272686 -1750963 -3609888 -2892646 -428953 1877492 2102741 326681 -1546660
37465 -1546660 -2278193 -1945885 -314648 2713263 4807016 2893787 -1663395 -3212076
37457 -3212076 751104 5652933 6168897 3458170 2448360 4111700 4721087 2023831
37449 2023831 -1787993 -3625436 -3059102 -1596970 -442626 296674 1289591 3077611 4943267
$$ packed form
37509e49393k49307J085872j41396j777967j239375N33363J147193M35246M3907
37500g11857O02441J019866K84255j103929j754023j136670k30294p5734k86084
37491c392029K7339M66587J43406j96743Q30602K241755J601908o19710j042057
37482F1058J099605K165201N237k054648l69390K932559K990462o47958l909440
37473B272686m023649j858925P17242K463693K306445K25249j776060j873341
37465a546660p31533L32308J631237L027911K093753j913229m557182j548681
37457c212076L963180M901829N15964k710727j009810J663340O09387k697256
37449B023831l811824j837443N66334J462132J154344P39300R92917J788020J865656
$$ plain form
37440 4943267 5414961 4633759 4759775 6562248 7188151 3615682 -2631974 -6674246 -5807639
37431 -5807639 -1767458 2140549 3976126 3421120 1435265 97125 989692 3207560
37423 3207560 4291986 3385834 2085671 1865858 2082154 1275988 -439174 -1189060 508319
37414 508319 3721364 5592129 4246954 930751 -1552932 -2103604 -1589356 -297740 2324835
37405 2324835 4893207 4122669 -496053 -4599499 -4016853 2802 3246303 4396447
37397 4396447 5247126 6356163 6184284 4402134 2765147 2240725 1893261 1119478 688222
37388 688222 1012383 1365811 1298160 1136159 850646 85644 -629317 -425713 171265 -132987
37378 -132987 -1113708 -1297327 -487941 23390 -176413 -191465 89755 -283254 -1157249 -1120936
$$ packed form
37440D943267M71694p81202J26016J802473O25903l572469o247656m042272Q66607
37431e807639M040181L908007J835577n55006j985855j338140Q92567K217868
37423C207560J084426r06152j300163k19813K16296q06166j715162p49886J697379
37414E08319L213045J870765j345175l316203k483683n50672N14248J291616K622575
37405B324835K568372p70538m618722m103446N82646M019655L243501J150144
37397D396447Q50679J109037j71879j782150j636987n24422l47464p73783m31256
37388F88222L24161L53428o7651j62001k85513p65002p14961K03604N96978l04252
37378a32987r80721j83619Q09386N11331j99803j5052K81220l73009q73995L6313
$$ plain form
37368 -1120936 -89130 236704 -696162 -1157709 -145828 491745 -1384296 -4824476 -6594150
37359 -6594150 -4806903 -754459 2503969 2851216 809506 -1240162 -1738474 -1337677 -1112048
37350 -1112048 -643233 630383 1444504 483354 -661276 799559 4339890 6372333 5378307
37341 5378307 3687463 3304347 3098128 1615681 -165744 -845402 -994402 -1470116 -1387109
37332 -1387109 28067 1337166 999856 116602 587270 1681144 1137888 -895273 -1756352
37323 -1756352 -242490 1679319 1852562 820716 634091 1841904 2940671 2644812 1690489
37314 1690489 1709333 2616955 2320609 -205348 -2608867 -1663627 2175506 4785287 3535800
37305 3535800 584645 -161764 2043358 4454330 4633962 3041622 1864975 2319264 3536199
$$ packed form
37368a120936J031806L25834r32866m61547J011881O37573j876041l440180j769674
37359f594150J787247M052444L258428L47247k041710k049668m98312M00797K25629
37350a112048M68815J273616Q14121r61150j144630J460835L540331K032443r94026
37341E378307j690844l83116k06219j482447j781425o79658j49000m75714Q3007
37332a387109J415176J309099l37310q83254M70668J093874n43256k033161q61079
37323a756352J513862J921809J73243j031846j86625J207813J098767k95859r54323
37314A690489J8844R07622k96346k525957k403519R45240L839133K609781j249487
37305C535800k951155p46409K205122K410972J79632j592340j176647M54289J216935
$$ plain form
37296 3536199 3954124 3464045 3466406 4459093 4779949 3134072 1327358 2182886 5099137
37287 5099137 6430307 4686353 2479510 2179140 2494506 1376581 -92493 543066 2919921
37278 2919921 4289374 3581741 2471041 2373061 2608645 2084685 1115630 714762 1049961
37269 1049961 1426522 1414442 1365368 1715136 2105268 1730585 693796 199841 719595 924315
37259 924315 -205885 -1109300 421979 3429050 4472127 2432867 40605 -171825 1140984
37250 1140984 2360645 3539110 5095140 6130391 6040933 5935689 6497683 6273720 4180119
37241 4180119 1881950 1322907 1584462 815128 -232476 500243 2699617 4299372 4946132
37232 4946132 5869343 6950337 6952073 6160523 5668294 4484023 896829 -3332466 -4052675
$$ packed form
37296C536199M17925m90079K361R92687L20856j645877j806714Q55528K916251
37287E099137J331170j743954k206843l00370L15366j117925j469074O35559K376855
37278B919921J369453p07633j110700r7980K35584n23960r69055m00868L35199
37269A049961L76561j2080m9074L49768L90132l74683j036789m93955N19754K04720
37259I24315j130200r03415J531279L007071J043077k039260k392262k12430J312809
37250A140984J219661J178465J556030J035251q9458j05244N61994k23963k093601
37241D180119k298169n59043K61555p69334j047604P32719K199374J599755O46760
37232D946132R23211J080994J736p91550m92229j184271l587194m229295p20209
$$ plain form
37223 -4052675 -700261 2630845 3356162 3798703 6376951 9044781 8669755 6301344 5452963
37214 5452963 6685127 7449973 6565106 5389237 4524900 2587750 -808995 -3370980 -2909544
37205 -2909544 -271038 1920637 2517844 2593516 3374974 4499201 4499106 2694779 416279
37196 416279 -48658 1834242 3697437 2909084 145638 -1207509 439194 2769305 3064553
37187 3064553 2096600 2483128 4227510 4556219 2202554 -708665 -1809303 -1317343 -593306
37178 -593306 111933 886134 808133 -704132 -2328867 -2419122 -1171350 407768 2387203
37169 2387203 4711016 5535647 3575445 1141485 1569581 4046355 4615400 2495929 1363579
37160 1363579 3162787 4707023 2902594 57334 634218 4717141 8072722 7768665
$$ packed form
37223d052675L352414L331106P25317M42541K578248K667830l75026k368411q48381
37214E452963J232164P64846q84867j175869q64337j937150l396745k561985M61436
37205b909544K638506K191675N97207P5672P81458J124227r5j804327k278500
37196D16279m64937J882900J863195p88353k763446j353147J646703K330111K95248
37187C064553r67953L86528J744382L28709k353665k911219j100638M91960P24037
37178e93306P05239P74201p8001j512265j624735r0255J247772J579118J979435
37169B387203K323813Q24631j960202k433960M28096K476774N69045k119471j132350
37160A363579J799208J544236j804429k845260N76884M082923L355581l04057
$$ plain form
37152 7768665 4871427 2034179 907350 1866916 4196268 6183751 6373705 4960353
37144 4960353 3267611 2200463 1854529 1984222 2104906 1826732 1645752 2437719 3728985
37135 3728985 3897312 2688793 1739309 1752480 1356885 71442 -135119 1665410 2811247
37126 2811247 928503 -1664386 -1017785 2242562 3700549 1803816 -163038 645201
37118 645201 2821697 3498145 2348619 1229673 1531779 3218215 5383799 6855760 6992642
37109 6992642 6267671 5426390 4333242 2666451 1242435 1186572 2119331 2639283 2229447
37100 2229447 1248679 -192710 -1449214 -383171 4086320 8871180 9271296 5045991
37092 5045991 1015008 845725 3108486 4637805 4844002 4715617 4010661 2110785 257314
$$ packed form
37152G768665k897238k837248j126829R59566K329352J987483J89954j413352
37144D960353j692742j067148l45934J29693J20684k78174j80980P91967J291266
37135C728985J68327j208519r49484J3171l95595j285443k06561J800529J145837
37126B811247j882744k592889O46601L260347J457987j896733j966854Q08239
37118F45201K176496O76448j149526j118946L02106J686436K165584J471961J36882
37109F992642p24971q41281j093148j666791j424016n5863R32759N19952m09836
37100B229447r80768j441389j256504J066043M469491M784860M00116m225305
37092E045991m030983j69283K262761J529319K06197j28385p04956j899876j853471
$$ plain form
37083 257314 288711 1672375 2041163 725795 -93299 1647221 4956545 6754054 5502744
37074 5502744 3097280 2644269 4710376 6782248 6685249 5212311 4379473 4357821 3840823
37065 3840823 2626165 1784926 1613069 1539875 2054459 4461265 8187483 10379662 9163584
37056 9163584 5867266 3185870 2359621 2816535 3371053 3032496 1636216 333858 674898
37047 674898 2796724 5213917 6456031 6095369 4400351 2198596 964777 1691352 3620760
37038 3620760 5218362 6102176 6694619 6561975 4989550 2874966 2003367 2609436 3694774
37029 3694774 5372427 8337161 11188795 11327622 8948533 7147898 7317726 7443501 5991575
37020 5991575 4385492 4140464 4448178 4364115 4696108 5838328 6332770 5595897 5492352
$$ packed form
37083B57314L1397J383664L68788j315368q19094J740520L309324J797509j251310
37074E502744k405464m53011K066107K071872r6999j472938q32838k1652n16998
37065C840823j214658q41239j71857p3194N14584K406806L726218K192179j216078
37056I163584l296318k681396q26249M56914N54518l38557j396280j302358L41040
37047F74898K121826K417193J242114l60662j695018k201755j233819P26575J929408
37038C620760J597602Q83814N92443j32644j572425k114584q71599O06069J085338
37029C694774J677653K964734K851634J38827k379089j800635J69828J25775j451926
37020E991575j606083k45028L07714q4063L31993J142220M94442p36873j03545
$$ plain form
37011 5492352 7006912 7997070 6819144 5584127 6707987 8506834 7810376 5280117
37003 5280117 4324576 5710186 6965942 6754247 6425780 7205409 8737349 10456770 11835532
36994 11835532 11509493 8879293 6339545 6992795 10145643 11993425 10848792 8607533
36986 8607533 6851810 5054733 3460657 3996018 6574399 7847575 5995473 3933225
36978 3933225 4992189 7792456 8654680 7358169 6805617 7794080 8000802 6459970 5456860
36969 5456860 6676920 8374490 8278680 7149022 7173820 8312611 8765109 8340076 8708702
36960 8708702 10238390 11081063 10197192 9115793 9347784 9829433 8801110 7051700 7084577
36951 7084577 9361150 11355503 10646610 7562947 4477535 3580126 5418528 8441537
$$ packed form
37011E492352J514560R90158j177926j235017J123860J798847o96458k530259
37003E280117r55541J385610J255756k11695l28467P79629J531940J719421J378762
36994A1835532l26039k630200k539748O53250L152848J847782j144633k241259
36986H607533j755723j797077j594076N35361K578381J273176j852102k062248
36978C933225J058964K800267Q62224j296511n52552R88463K06722j540832j003110
36969E456860J220060J697570r5810j129658K4798J138791M52498m25033L68626
36960H708702J529688Q42673q83871j081399K31991M81649j028323j749410L2877
36951G084577K276573J994353p08893l083663l085412q97409J838402L023009
$$ plain form
36943 8441537 9845119 8075225 4699902 2698240 2893233 3485508 3186833 2945612 3855575
36934 3855575 5132337 5479400 5236754 5685142 6857505 7403729 6535185 5219783 5275227
36925 5275227 7461350 10362636 11351695 9188900 5453949 2727664 1803721 1759180 2208146
36916 2208146 3747196 6216996 8320258 9260627 9233584 8266431 6404577 5061087 5898273
36907 5898273 8009833 8660408 7425217 6935726 8603357 10507568 10939247 11020119 11752813
36898 11752813 11369771 8383999 4951849 4107783 5332578 5879893 5135547 4628399 4764392
36889 4764392 4596994 4232831 4688837 5706349 6035158 5423915 4323260 2539648 372969
36880 372969 -109502 2451737 6038338 7783840 7985350 8559969 8880053 7041122 4423302
$$ packed form
36943H441537J403582j769894l375323k001662J94993N92275k98675k41221R09963
36934C855575J276762L47063k42646M48388J172363N46224q68544j315402N5444
36925E275227K186123K901286R89059k162795l734951k726285r23943m4541M48966
36916B208146J539050K469800K103262R40369k7043r67153j861854j343490Q37186
36907E898273K111560O50575j235191m89491J667631J904211M31679Q0872P32694
36898A1752813l83042k985772l432150q44066J224795N47315p44346n07148J35993
36889D764392j67398l64163M56006J017512L28809o11243j100655j783612k166679
36880C72969m82471K561239L586601J745502K01510N74619L20084j838931k617820
$$ plain form
36871 4423302 4479138 6875076 7362313 4367106 1381406 1242057 2067028 1120844 -745684
36862 -745684 -1260884 -671769 -640794 -1074034 -751346 157801 644406 1109854 2916100 5968697
36852 5968697 8315868 8208402 5834220 3155558 2182691 2952514 3502028 2619090 1713588
36843 1713588 2358551 3176189 1984735 302865 1904060 6563027 9371787 7655098
36835 7655098 4607459 3973119 4933632 5103421 5023822 5980438 6269127 3967242 1421404
36826 1421404 2403466 5912563 7344403 5427802 3525691 3728914 4049409 2735660 1484833
36817 1484833 2263565 3854068 3977287 2911651 2678765 3775926 4729585 4379137 3101831
36808 3101831 1927652 1393624 1288378 1183707 1282505 2431473 4659757 6231618 5473084
$$ packed form
36871D423302N5836K395938M87237k995207k985700j39349Q24971r46184j866528
36862g45684n15200N89115L0975m33240L22688R09147M86605M65448J806246L052597
36852E968697K347171j07466k374182k678662r72867P69823N49514q82938r05502
36843A713588O44963Q17638j191454j681870J601195M658967K808760j716689
36835G655098l047639o34340R60513J69789p9599R56616K88689k301885k545838
36826A421404R82062L509097J431840j916601j902111K03223L20495j313749j250827
36817A484833P78732J590503J23219j065636k32886J097161R53659l50448j277306
36808C101831j174179n34028j05246j04671R8798J148968K228284J571861p58534
$$ plain form
36799 5473084 3306476 2273593 2891205 2928795 1023443 -928959 -350104 2535890 5414106
36790 5414106 7007192 7715238 7794468 6837836 5060548 3441035 2240668 732232 -1134214
36781 -1134214 -2055335 -1144210 581665 1417748 980887 -24247 -1425956 -3481899 -5236193
36772 -5236193 -4779350 -2013696 311373 -134573 -1897117 -1622201 1068748 3064044 2653450
36763 2653450 2179302 3890682 5420700 2664158 -3629231 -7747746 -6189180 -1809861
36755 -1809861 710776 755997 687245 1112285 753884 187920 1875530 5793775 8343811
36746 8343811 7264972 5039977 5170233 7042119 7336942 5445420 4263867 5550405
36738 5550405 7515099 8046909 7790724 8208373 8402489 6328901 2572625 529132 2236994
$$ packed form
36799E473084k166608j032883O17612L7590j905352j952402N78855K885994K878216
36790E414106J593086P08046P9230r56632j777288j619513j200367j508436j866446
36781a134214r21121R11125J725875Q36083m36861j005134j401709k055943j754294
36772e236193M56843K765654K325069m45946j762544K74916K690949J995296m10594
36763B653450m74148J711380J530018k756542o293389m118515J558566M379319
36755a809861K520637M5221o8752M25040l58401n65964J687610L918245K550036
36746H343811j078839k224995J30256J871886K94823j891522j181553J286538
36738E550405J964694N31810k56185M17649J94116k073588l756276k043493J707862
$$ plain form
36729 2236994 5577238 6679173 4426273 1475727 772556 2020319 2453012 763777
36721 763777 -1099695 -728634 1350100 2541770 1824590 660442 314266 314488 124175
36712 124175 278170 753341 146402 -1881025 -2975298 -1014266 2438976 3839316 2159264
36703 2159264 -491543 -2235455 -3010798 -2930532 -1680985 -116836 -114639 -1866594 -3271075
36694 -3271075 -3043763 -2500166 -2894438 -2893570 -755658 2264683 3184820 1664710 739528
36685 739528 2608489 5577550 6439542 4734814 3021463 3230574 4470881 5019542 4958261
36676 4958261 5334967 5604622 4084742 1080054 -707785 123339 1577117 1372859 282561
36667 282561 196678 479033 -765458 -2639682 -2159894 770643 2525977 1074618 -859172
$$ packed form
36729B236994L340244J101935k252900k950546p03171J247763M32693j689235
36721G63777j863472L71061K078734J191670p17180j164148l46176K22j90313
36712A24175J53995M75171o06939k027427j094273J961032L453242J400340j680052
36703B159264k650807j743912p75343Q0266J249547J564149K197j751955j404481
36694c271075K27312N43597l94272Q68K137912L020341R20137j520110r25182
36685G39528J868961K969061Q61992j704728j713351K09111J240307N48661o1281
36676D958261L76706K69655j519880l004688j787839Q31124J453778k04258j090298
36667B82561q5883K82355j244491j874224M79788K930537J755334j451359j933790
$$ plain form
36658 -859172 153987 3334829 5116291 4019736 1914148 1214927 2619623 5063196
36650 5063196 6501696 5379755 2613765 1317487 3111748 5538295 4943501 1422772
36642 1422772 -1151775 -122364 2861658 4417007 3594798 2337671 2505591 3633378
36634 3633378 3793106 2083847 -239001 -1183029 -164884 1715566 3265965 4214378 4555704
36625 4555704 3940121 2346204 638674 -295156 -532624 -673310 -913096 -1164681 -1529713
36616 -1529713 -1813183 -997115 1691498 5113442 6646839 4959021 1929951 962239 3119592
36607 3119592 5649686 5214096 2242862 606155 2534076 5586844 6069785 4021821
36599 4021821 2630567 3480659 4978053 5480887 5406937 5603794 5880496 6026221 6316800
$$ packed form
36658h59172J013159L180842J781462j096555k105588o99221J404696K443573
36650E063196J438500j121941k765990j296278J794261K426547n94794l520729
36642A422772k574547J029411K984022J555349q22209j257127J67920J127787
36634C633378J59728j709259k322848r44028J018145J880450J550399R48413L41326
36625D555704o15583j593917j707530r33830k37468j40686k39786k51585l65032
36616a529713k83470Q16068K688613L421944J533397j687818l029070r67712K157353
36607C119592K530094m35590k971234j636707J927921L052768M82941k047964
36599D021821j391254Q50092J497394N02834p3950J96857K76702J45725K90579
$$ plain form
36590 6316800 6218460 4654230 2409743 1935075 3542632 4290700 2360157 43053 32138
36581 32138 992088 -134908 -2956241 -4096193 -2146153 935697 3144339 4299574 4517439
36572 4517439 3520945 2031324 1625751 2508904 3129883 2478893 1211367 206375 -396120
36563 -396120 -414882 553939 2138881 3318343 3743353 3720466 3045428 1445583 55340
36554 55340 507215 2290957 2918847 1244690 -1089677 -2076959 -1566853 -435202 892547
36545 892547 2302371 3630756 5010277 6431614 6814801 5101867 2497059 1685304 3231877
36536 3231877 4671825 3915473 1608840 -714490 -2643183 -3861918 -3362450 -1331153
36528 -1331153 186641 313053 988927 3465772 5296419 3754423 541630 -513267
$$ packed form
36590F316800r8340j564230k244487m74668J607557P48068j930543k317104j0915
36581C2138R59950j126996k821333j139952J950040L081850K208642J155235K17865
36572D517439r96494j489621m05573Q83153O20979o50990j267526j004992o02495
36563c96120j8762R68821J584942J179462M25010k2887o75038j599845j390243
36554E5340M51875J783742O27890j674157k334367r87282N10106J131651J327749
36545H92547J409824J328385J379521J421337L83187j712934k604808q11755J546573
36536C231877J439948p56352k306633k323330j928693j218735M99468K031297
36528a331153J517794J26412O75874K476845J830647j541996l212793j054897
$$ plain form
36520 -513267 486973 -234804 -3756289 -6433489 -5472066 -2892245 -1807568 -1649553 100031
36511 100031 3318041 5396316 5110174 3667118 2292984 1231987 1068706 2543059 4531480
36502 4531480 4473026 1822887 -757379 -873990 548900 1165580 696487 550120 936293
36493 936293 706349 -147346 -148861 1115092 2187640 2247322 2492263 3840354 4955933
36484 4955933 4216097 2420882 1708945 2529223 3499949 3773216 3642502 3012894 1319295
36475 1319295 -689617 -955669 1285138 4263170 5846186 5811077 5175795 4415524 3410680
36466 3410680 2359520 1623699 1115191 718905 870841 1829094 2785262 2690841 1718572
36457 1718572 888525 401947 -416556 -1317524 -688612 2096324 4885153 4893941 2496526
$$ packed form
36520e13267J000240p21777l521485k677200R61423K579821J084677J58015J749584
36511A00031L218010K078275k86142j443056j374134j060997j63281J474353J988421
36502D531480n8454k650139k580266j16611J422890O16680m69093j46367L86173
36493I36293k29944q53695j515J263953J072548N9682K44941J348091J115579
36484D955933p39836j795215p11937Q20278R70726K73267j30714o29608j693599
36475A319295k008912k66052K240807K978032J583016l5109o35282p60271j004844
36466C410680j051160p35821n08508l96286J51936R58253R56168r4421r72269
36457A718572q30047m86578q18503r00968O28912K784936K788829Q788k397415
$$ plain form
36448 2496526 1176974 3023248 5759943 5715085 2751105 198200 131082 1116843 1334638
36439 1334638 1481813 2821552 4276862 4043807 3050026 3888522 6462797 7662002 6086933
36430 6086933 4334600 5025216 6821452 6681556 4649141 3681974 4983475 6082163 4427223
36421 4427223 1123126 -393245 1348286 4357651 6031863 6170475 6319947 6971538 6927831
36412 6927831 5534519 3967180 3409494 3185246 2028289 308437 -605535 -563059 -375905
36403 -375905 220419 2118903 4317779 4348308 1960521 3758 408642 1529000 1172042
36394 1172042 194657 765156 2567535 3400002 2725519 2016492 1961372 1890736 1926365 3082822
36384 3082822 4772399 4706664 2309162 172577 801733 3470160 5649699 6271044 6121273
$$ packed form
36448B496526j319552J846274K736695m4858k963980k552905o7118R85761K17795
36439A334638J47175J339739J455310k33055r93781Q38496K574275J199205j575069
36430F086933j752333O90616J796236j39896k032415r67167J301501J098688j654940
36421D427223l304097j516371J741531L009365J674212J38612J49472O51591m3707
36412F927831j393312j567339n57686k24248j156957j719852r13972M2476J87154
36403c75905N96324J898484K198876L0529k387787j956763M04884J120358l56958
36394A172042r77385N70499J802379Q32467o74483p09027n5120p0636L5629J156457
36384C082822J689577o5735k397502k136585O29156K668427K179539O21345j49771
$$ plain form
36375 6121273 5953629 5737084 5419551 5296403 5710491 6886898 8609582 9768805 9213680
36366 9213680 7630822 7312442 9021898 10416689 9210194 6812671 6605397 9040655
36358 9040655 10998293 10446399 9311628 10386650 13198285 14837998 13975613 12112747
36350 12112747 11002228 10552179 9847329 9038175 9110776 10042285 10201927 8201190 5026879
36341 5026879 3461453 5016187 8141476 10146328 10192653 9312170 8139317 6431183 4758289
36332 4758289 4512199 5547547 5915847 5149017 5672821 8999797 12406049 12184310 9057611
36323 9057611 7134729 7834565 8347905 6767196 5278498 6448716 9049047 10034865 8927931
36314 8927931 7638673 6940744 5760140 3827811 2760878 3914370 6577206 8886741
$$ packed form
36375F121273j67644k16545l17533j23148M14088J176407J722684J159223n55125
36366I213680j582858l18380J709456J394791j206495k397523k07274K435258
36358I040655J957638n51894j134771J075022K811635J639713q62385j862866
36350A2112747j110519m50049p04850q09154P2601R31509J59642k000737l174311
36341E026879j565426J554734L125289K004852M6325q80483j172853j708134j672894
36332D758289k46090J035348L68300p66830N23804L326976L406252k21739l126699
36323I057611j922882O99836N13340j580709j488698J170218K600331R85818j106934
36314H927931j289258o97929j180604j932329j066933J153492K662836K309535
$$ plain form
36306 8886741 9632817 8774871 6953715 5020282 3713039 3383751 3890132 4655443 4981215
36297 4981215 4700425 4450893 4785713 5188064 4796851 3964521 3884298 4558408 4610765 3632694
36287 3632694 3187820 4543843 6717434 7920415 7867901 7422377 6820667 5544140 3471995
36278 3471995 1249697 -94201 435116 2818792 5173469 5303555 3581636 2563987
36270 2563987 3157645 3397021 2046886 825058 1381421 2697719 3592437 5005165 7069271
36261 7069271 6888020 2965744 -729128 326995 4197703 5456366 3745338 3550984
36253 3550984 5886639 6575062 3854994 1600310 2758174 4961986 5447930 5440209 6324339
36244 6324339 5856475 2104859 -2357603 -4159419 -4091180 -4550015 -4841231 -3189334 -1082728
$$ packed form
36306H886741P46076q57946j821156j933433j307243l29288N06381P65311L25772
36297D981215k80790k49532L34820M02351l91213q32330q0223O74110N2357r78071
36287C632694m44874J356023K173591J202981n2514m45524o01710j276527k072145
36278C471995k222298j343898N29317K383676K354677J30086j721919j017649
36270B563987N93658K39376j350135j221828N56363J316298Q94718J412728K064106
36261G069271j81251l922276l694872J056123L870708J258663j711028j94354
36253C550984K335655O88423k720068k254684J157864K203812M85944p721Q84130
36244F324339m67864l751616m462462j801816O8239m58835k91216J651897K106606
$$ plain form
36235 -1082728 -1147210 -2278564 -1248464 1817011 3602328 2660440 699989 -668398 -1106210
36226 -1106210 -46259 2550427 4325645 2812165 -536866 -1756356 314022 3099184
36218 3099184 4341216 3928398 2089750 -659104 -1887206 563493 4419436 4969214
36210 4969214 1967910 423327 3109879 6489971 6427771 4205336 3615110 4867556 5108887
36201 5108887 3443929 1908755 1943732 2738069 3063638 2549488 996884 -1723171 -4650456
36192 -4650456 -5919454 -4561023 -1548210 1207992 2605418 3057555 3622974 4523742 4892687
36183 4892687 4254497 3491671 3416542 3141201 1385022 -1069279 -2133449 -1522765 -956612
36174 -956612 -963640 107716 2897608 5114400 4536775 2425663 2037551 4425160 7220006
$$ packed form
36235a082728o4482j131354J030100L065475J785317r41888j960451j368387m37812
36226a106210J059951K596686J775218j513480l349031j219490K070378K785162
36218C099184J242032m12818j838648k748854j228102K450699L855943N49778
36210D969214l001304j544583K686552L380092o2200k222435n90226J252446K41331
36201E108887j664958j535174L4977P94337L25569n14150j552604k720055k927285
36192d650456j268998J358431L012813K756202J397426M52137N65419R00768L68945
36183D892687o38190p62826p5129k75341j756179k454301j064170O10684N66153
36174i56612p028J071356K789892K216792n77625k111112l88112K387609K794846
$$ plain form
36165 7220006 7362532 4182611 9030 -1922466 -614768 1652885 2145722 1001614
36157 1001614 262045 251741 -494326 -1704175 -1083028 1331896 1906277 -1276117 -4697106
36148 -4697106 -3957774 100452 3147388 3744600 4344001 6460408 8307355 7619506 4270998
36139 4270998 -248144 -3883918 -4596068 -2133564 742848 1073416 -250452 306871 3543091
36130 3543091 6166075 5560948 3147732 1658741 1490474 1525492 1677431 2631856 4282747
36121 4282747 6107499 8058911 9618603 9154619 6036654 2559884 1816332 3943033
36113 3943033 6127628 6164657 4437390 2430766 1009490 654016 1876485 4320368 6256573
36104 6256573 6129688 4451831 3293443 3759634 4693309 4339303 2770311 1849107 2916792
$$ packed form
36165G220006J42526l179921m173581j931496J307698K267653M92837j144108
36157A001614p39569j0304p46067j209849O21147K414924N74381l182394l420989
36148d697106P39332M058226L046936N97212N99401K116407J846947o87849l348508
36139D270998m519142l635774p12150K462504K876412L30568j323868N57323L236220
36130C543091K622984o05127k413216j488991j68267L5018J51939R54425J650891
36121D282747J824752J951412J559692m63984l117965l476770p43552K126701
36113C943033K184595L7029j727267k006624j421276l55474J222469K443883J936205
36104F256573j26885j677857j158388M66191R33675l54006j568992r21204J067685
$$ plain form
36095 2916792 5464046 8233224 10456408 11430452 10241319 7193452 4408048 3331165
36087 3331165 2578582 330557 -1994821 -1363370 1761752 3395170 1973644 779082
36079 779082 2578507 5212935 5357203 3792043 3251998 3189610 1096874 -2046056 -2347010
36070 -2347010 899172 4086437 4997877 5364419 6368878 5871583 2565330 -716597 -971398
36061 -971398 433492 467565 -549146 -219457 1248091 1474860 320974 185461 1862023
36052 1862023 3301409 2972491 1787841 1131799 1253312 2058161 3367898 4092535 3321819
36043 3321819 2427147 3616345 6092333 6503805 3998918 1769245 2118069 3035588 1960826
36034 1960826 323797 1240653 4316538 6102445 5210450 3959422 4624280 6402163 6888271
$$ packed form
36095B916792K547254K769178K223184R74044j189133l047867k785404j076883
36087C331165p52583k248025k325378O31451L125122J633418j421526j194562
36079G79082J799425K634428J44268j565160n40045o2388k092736l142930l00954
36070b347010L246182L187265R11440L66542J004459m97295l306253l281927k54801
36061i71398J404890L4073j016711L29689J467548K26769j153886j35513J676562
36052A862023J439386l28918j184650o56042J21513Q04849J309737P24637p70716
36043C321819q94672J189198K475988M11472k504887k229673L48824R17519j074762
36034A960826j637029R16856L075885J785907q91995j251028O64858J777883M86108
$$ plain form
36025 6888271 5091650 2283943 634183 1247363 3069098 3964226 3280386 2525711 2806451
36016 2806451 2903907 1386190 -554048 -557754 1213507 2348235 2184820 2893287 5628520
36007 5628520 7934579 6820799 3116429 744807 1941742 4812500 6014121 4769091
35999 4769091 3307591 3582461 4623232 3974846 1272806 -1048441 -978589 609224 1725344
35990 1725344 2104513 2634871 3024934 2293143 1170481 1522858 3121856 3497358 1894694
35981 1894694 977618 2986909 6174666 7236990 5987659 5103426 5735910 5976940 4116253
35972 4116253 1229190 -590801 -1038630 -1218935 -1414081 -868923 427762 1315518 1233563
35963 1233563 1171790 2017717 2904878 2472142 1272998 1316495 3008150 4194586 3202424
$$ packed form
36025F888271j796621k807707j649760O13180J821735Q95128o83840p54675K80740
36016B806451R7456j517717j940238l706J771261J134728j63415P08467K735233
36007E628520K306059j113780l704370k371622J196935K870758J201621j245030
35999D769091j461500K74870J040771o48386k702040k321247O9852J587813J116120
35990A725344L79169N30358L90063p31791j122662L52377J598998L75502j602664
35981A894694r17076K009291L187757J062324j249331q84233O32484K41030j860687
35972D116253k887063j819991m47829j80305j95146N45158J296685Q87756q1955
35963A233563o1773Q45927Q87161m32736j199144M3497J691655J186436r92162
$$ plain form
35954 3202424 1529329 1977263 4710181 6822745 5911650 2745203 26418 -425859 1240566
35945 1240566 3728895 5684849 6341235 5769883 4655550 3765565 3603616 4222921 4976758
35936 4976758 4783765 3335474 1914011 2206641 4204256 6048472 6239861 5286392 4684539
35927 4684539 4832201 4712754 3580812 2260159 2275225 3879416 5608590 6127430 5899659
35918 5899659 6216226 7030625 7109112 6346961 6258529 7460609 8271596 7082384 4823778
35909 4823778 3470281 3067398 2135774 533331 -48484 1427815 3828497 5082920 4064855
35900 4064855 1447278 -515259 289421 3272111 5208330 4173861 2186546 2052626
35892 2052626 2979678 2111994 -525630 -2072669 -1624745 -1272951 -1797792 -1096135 1721020
$$ packed form
35954C202424j673095M47934K732918K112564r11095l166447k718785m52277J666425
35945A240566K488329J955954O56386n71352j114333q89985j61949O19305P53837
35936D976758j92993j448291j421463K92630J997615J844216J91389r53469o01853
35927D684539J47662j19447j131942j320653J5066J604191J729174N18840k27771
35918E899659L16567Q14399P8487p62151q8432J202080Q10987j189212k258606
35909D823778j353497m02883r31624j602443n81815J476299K400682J254423j018065
35900D064855k617577j962537Q04680K982690J936219j034469j987315j33920
35892B052626R27052q67684k637624j547039M47924L51794n24841P01657K817155
$$ plain form
35883 1721020 4159381 4270524 3722916 4602447 5759381 4961927 2575902 496748 -727685
35874 -727685 -1148556 314752 3933473 7066555 7122582 5419779 4927599 5276721 3690023
35865 3690023 384783 -951024 1346299 4446858 5204703 3902403 2464071 1469075
35857 1469075 632722 309861 762653 1274266 1438643 2155062 3993909 5647304 5471404
35848 5471404 3885284 2883671 3497942 4827561 5465482 5054828 4345549 4108495 4097227
35839 4097227 3227504 1119315 -841757 -839586 977947 2467436 2181108 1101076 1073069
35830 1073069 2324420 3431218 3397078 2915673 3431843 5351622 7459797 8202884 7445523
35821 7445523 6543134 6505867 6736775 6200617 5214068 4983492 5622409 5919072 5274063 4635712
$$ packed form
35883A721020K438361J11143n47608Q79531J156934p97454k386025k079154j224433
35874g27685m20871J463308L618721L133082N6027j702803m92180L49122j586698
35865C690023l305240j335807K297323L100559P57845j302300j438332r94996
35857A469075q36353l22861M52792N11613J64377P16419J838847J653395j75900
35848E471404j586120j001613O14271J329619O37921m10654p09279k37054j1268
35839D097227q69723k108189j961072K171J817533J489489k86328j080032k8007
35830A073069J251351J106798l4140m81405N16170J919779K108175P43087p57361
35821G445523r02389l7267K30908n36158r86549k30576O38917K96663o45009o38351
$$ plain form
35811 4635712 4876333 5174876 3986827 1321761 -765414 -193570 2850500 5858901 6460578
35802 6460578 4922566 3727197 4443302 5786705 5534256 3622946 2002743 1693074 1659609
35793 1659609 998997 574699 1372412 2482445 2370565 1581314 2232287 4513459 5571299
35784 5571299 3167835 -816884 -2462521 -916244 862969 831265 699700 2374501 3932194
35775 3932194 2283334 -1286315 -2063362 1247538 4300461 3232362 -170482 -1754306
35767 -1754306 -923652 -366735 -1466193 -2967682 -3386342 -2134172 1070880 5384157 7968274
35758 7968274 6552492 2644300 -150175 -645688 -464572 -483131 -51185 291644 -1084186
35749 -1084186 -3233189 -2544607 2045485 6732976 7779602 6211212 5248499 5320065 4603466
$$ packed form
35811D635712K40621K98543j188049k665066k087175N71844L044070L008401O01677
35802F460578j538012j195369P16105J343403k52449j911310j620203l09669l3465
35793A659609o60612m24298P97713J110033j11880p89251O50973K281172J057840
35784E571299k403464l984719j645637J546277J779213l1704j31565J674801J557693
35775C932194j648860l569649p77047L310900L052923j068099l402844j583824
35767a754306Q30654N56917j099458j501489m18660J252170L205052M313277K584117
35758G968274j415782l908192k794475m95513J81116j8559M31946L42829j375830
35749a084186k149003O88582M590092M687491J046626j568390r62713P1566p16599
$$ plain form
35740 4603466 3141946 3244638 5968314 9595668 11793411 11596035 9276378 5900275
35732 5900275 3251016 2885123 4817207 7708673 10171043 11279785 10493248 8320570
35724 8320570 6736041 7515024 10035050 11864289 11689590 10537599 9789911 9219725 7881735
35715 7881735 6163242 5680791 7054966 8730842 8587216 6319205 3662800 2475242
35707 2475242 3188510 4940539 6326607 6037931 3997502 2266265 3420513 7163064
35699 7163064 9972930 9399884 7212808 6427776 6687540 5376953 2536246 1274876 2953529
35690 2953529 5135516 5415599 4532015 4196300 4227587 3662088 2859207 2721415 3261747
35681 3261747 4341964 6225933 8104304 8079820 6270531 5681755 7741125 9247241 6905382
$$ packed form
35740D603466j461520J02692K723676L627354K197743j97376k319657l376103
35732E900275k649259l65893J932084K891466K462370J108742p86537k172678
35724H320570j584529P78983K520026J829239j74699j151991p47688n70186j337990
35715G881735j718493m82451J374175J675876j43626k268011k656405j187558
35707B475242P13268J752029J386068k88676k040429j731237J154248L742551
35699G163064K809866n73046k187076p85032K59764j310587k840707j261370J678653
35690B953529K181987K80083q83584l35715L1287n65499q02881j37792N40332
35681C261747J080217J883969J878371k4484j809289n88776K059370J506116k341859
$$ plain form
35672 6905382 3129184 3342994 8076443 11822448 10414971 6041003 3528001 4460489
35664 4460489 6853227 8646992 9373606 9301511 8723368 7950070 7100594 6029223 4802823
35655 4802823 3821745 3236845 2750343 2102539 1233211 114126 -806574 -286176 2380969
35646 2380969 5764853 7440926 6988662 6410256 7066548 7766420 6920601 5210458 4525288
35637 4525288 4974582 4719300 2828602 844734 900766 3175051 5952118 7685945 8109441
35628 8109441 7385103 5205980 1492057 -2451209 -4455598 -3439394 -321364 3159444
35620 3159444 5975729 7995688 9350557 10074579 9915923 8282695 5086459 1885169
35612 1885169 1043434 2953458 5159506 5417871 4652470 5235630 7026128 7317517 4873490
$$ packed form
35672F905382l776198K13810M733449L746005j407477m373968k513002R32488
35664D460489K392738J793765P26614p2095n78143p73298q49476j071371j226400
35655D802823r81078n84900m86502o47804q69328j119085r20700N20398K667145
35646B380969L383884J676073m52264n78406O56292O99872q45819j710143o85170
35637D525288M49294k55282j890698j983868N6032K274285K777067J733827M23496
35628H109441p24338k179123l713923l943266k004389J016204L118030L480808
35620C159444K816285K019959J354869P24022j58656j633228l196236l201290
35612A885169q41735J910024K206048K58365p65401N83160J790498K91389k444027
$$ plain form
35603 4873490 1837031 735224 1422970 2396677 3593743 5735245 7584705 6492808
35595 6492808 2382084 -948579 -204582 2914978 3717952 677841 -2706320 -2786149 -269451
35586 -269451 1676809 2040676 2330620 3244676 3691428 3258861 3245961 4511434 6215505
35577 6215505 7525923 8840087 10363239 11078174 10257049 8688911 7391812 6346969
35569 6346969 5397515 5022533 5244294 5147547 4429364 3953370 3909439 3259776 2053331 2088419
35559 2088419 3791536 4802256 3621845 2238049 2656774 3314227 2128949 828018
35551 828018 2202412 4695695 4350943 1440492 351488 2638429 4840763 4256173 2625463
35542 2625463 2415489 3157446 3538635 4024906 5169227 5782645 4915305 3726325 3658267
$$ packed form
35603D873490l036459j101807O87746R73707J197066K141502J849460j091897
35595F492808m110724l330663P43997L119560Q02974l040111l384161p9829K516698
35586b69451J946260L63867K89944R14056M46752m32567j2900J265473J704071
35577F215505J310418J314164J523152P14935q21125j568138j297099j044843
35569F346969r49454l74982K21761r6747p18183m75994m3931o49663j206445L5088
35559B088419J703117J010720j180411j383796M18725O57453j185278j300931
35551H28018J374394K493283l44752k910451j089004K286941K202334n84590j630710
35542B625463k09974P41957L81189M86271J144321O13418q67340j188980o8058
$$ plain form
35533 3658267 4489161 5479669 6536149 7133251 6269119 4629849 4404367 5710745 5848677
35524 5848677 3606577 1477845 1650112 2610243 2151556 1158234 1597959 2944765 3527370
35515 3527370 3575320 4017513 3982007 2496026 1100595 1674168 3094628 3283026 3165941
35506 3165941 4974745 7612929 7685453 4901930 2697795 3153148 4554387 4500661 2625381
35497 2625381 -126221 -2350254 -2249991 512084 3201874 3128618 1932139 3212273 6227490
35488 6227490 6523149 3467664 2075324 5279429 9177384 9155440 6619271 5577673 5859812
35479 5859812 4587091 2260650 2120570 4137062 4665622 2602739 1446498 3747279
35471 3747279 7042893 7344138 4175229 197759 -2259272 -2419950 -436573 2363726
$$ packed form
35533C658267Q30894R90508J056480N97102q64132j639270k25482J306378J37932
35524E848677k242100k128732J72267R60131m58687r93322M39725J346806N82605
35515C527370M7950M42193l5506j485981j395431N73573J420460J88398j17085
35506C165941J808804K638184P2524k783523k204135M55353J401239n3726j875280
35497B625381k751602k224033J00263K762075K689790p3256j196479J280134L015217
35488F227490K95659l055485j392340L204105L897955k1944k536169j041598K82139
35479E859812j272721k326441j40080K016492N28560k062883j156241K300781
35471C747279L295614L01245l168909l977470k457031j60678J983377K800299
$$ plain form
35463 2363726 3598374 2217411 378080 1246378 4997373 8366015 8275537 4852384 758451
35454 758451 -1485116 -1310913 -78377 466982 164979 736375 3428727 6755337 7930372
35445 7930372 6623487 5621354 7009265 9269782 9519981 7422599 5167117 4342872
35437 4342872 4695370 5557368 6533253 6841874 5970997 5130104 5987638 7634269 7136621
$$ packed form
35463B363726J234648j380963j839331Q68298L750995L368642r0478l423153m093933
35454G58451k243567J74203J232536N45359l02003N71396K692352L326610J175035
35445G930372j306885j002133J387911K260517K50199k097382k255482q24245
35437D342872L52498Q61998R75885L08621q70877q40893Q57534J646631m97648
$$ [...]
##END NTUPLES=NMR SPECTRUM
##END=
