##TITLE=31Pdec_SR_135_rm2d
 , 24 sc
 27.7.2022
##JCAMPDX= 6.0         $$ Bruker NMR JCAMP-DX V2.0
##DATA TYPE= NMR SPECTRUM
##DATA CLASS= NTUPLES
##ORIGIN= UXNMR, Bruker Analytische Messtechnik GmbH
##OWNER= root
$$ XWIN-NMR		Version 3.5
$$ Wed Jul 27 15:29:47 2022 Russian Standard Time (UT+4h)  she@DPX200
##.OBSERVE FREQUENCY= 81.013821
##.OBSERVE NUCLEUS= ^31P
##.ACQUISITION MODE= SIMULTANEOUS
##.ACQUISITION SCHEME= undefined
##.AVERAGES= 24
##.DIGITISER RES= 16
##SPECTROMETER/DATA SYSTEM= spect
##.PULSE SEQUENCE= zgpg30
##.SOLVENT NAME= CDCl3
##.SHIFT REFERENCE= (INTERNAL, CDCl3, 0, 248.564)
##AUDIT TRAIL= $$ (NUMBER, WHEN, WHO, WHERE, WHAT)
$$ ##TITLE= Audit trail, XWIN-NMR		Version 3.5
$$ ##JCAMPDX= 5.01
$$ ##ORIGIN= Bruker BioSpin GmbH
$$ ##OWNER= she
$$ F:/spectra/data/she/nmr/P31/1/pdata/1/auditp.txt
$$ ##AUDIT TRAIL=  $$ (NUMBER, WHEN, WHO, WHERE, WHAT)
(   1,<2022-07-27 15:27:59.12 +0400>,<she>,<DPX200>,
      <created by zg, POWCHK disabled, PULCHK disabled
       configuration hash MD5:
       00 E9 B6 7A A2 85 ED C7 34 08 36 98 17 FE 4E 26
       data hash MD5: 32K
       15 BF 0C D7 D1 25 2D AB 69 32 C7 D0 DA 63 E3 9B>)
(   2,<2022-07-27 15:28:20.15 +0400>,<she>,<DPX200>,
      <Start of raw data processing
       efp BC_mod = 2 LB = 1 FT_mod = 6 PKNL = 1 PHC0 = -10220.91 PHC1 = -22.94316 SI = 64K 
       data hash MD5: 64K
       B3 20 2E 71 13 54 9A 53 BC F4 AD B2 6B BA 54 9A>)
(   3,<2022-07-27 15:28:45.65 +0400>,<she>,<DPX200>,
      <pk PHC0 = -81.26733 PHC1 = 151.9999 
       data hash MD5: 64K
       DB 00 8B 17 2A 51 D3 E7 68 9F 46 D5 BC 8B 73 6F>)
$$ ##END=
$$ 
$$ hash MD5
$$ B3 CF 6D 78 70 78 90 E4 74 07 80 6E A4 52 FE D0
##$RELAX= 
##$RELAX= 
##$RELAX= 
##$RELAX= 
##$RELAX= 
##$RELAX= 
##$RELAX= 
##$RELAX= 
$$ Bruker specific parameters
$$ --------------------------
##$DU= <F:/spectra>
##$EXPNO= 1
##$NAME= <P31>
##$PROCNO= 1
##$TYPE= <nmr>
##$USER= <she>
##$AMP= (0..31)
100 100 100 100 100 100 100 100 100 100 100 100 100 100 100 100 100 100 
100 100 100 100 100 100 100 100 100 100 100 100 100 100 
##$AQSEQ= 0
##$AQ_mod= 1
##$AUNM= <au_zg>
##$AUTOPOS= <>
##$BF1= 81.014009
##$BF2= 200.13
##$BF3= 200.13
##$BF4= 200.13
##$BF5= 200.13
##$BF6= 200.13
##$BF7= 200.13
##$BF8= 200.13
##$BYTORDA= 1
##$CFDGTYP= 0
##$CFRGTYP= 5
##$CHEMSTR= <none>
##$CNST= (0..31)
1 1 145 1 1 1 1 1 1 1 1 1 1 1 1 1 1 1 1 1 1 1 1 1 1 1 1 1 1 1 1 1 
##$CPDPRG= <waltz16>
##$CPDPRG1= <>
##$CPDPRG2= <waltz16>
##$CPDPRG3= <>
##$CPDPRG4= <mlev>
##$CPDPRG5= <mlev>
##$CPDPRG6= <mlev>
##$CPDPRG7= <mlev>
##$CPDPRG8= <mlev>
##$CPDPRGB= <>
##$CPDPRGT= <>
##$D= (0..31)
0 1 0 0 0 0 0 0 0 0 0 0.03 2e-05 3e-06 0 0 0 0 0 0 0 0 0 0 0 0 0 0 0 0 
0 0 
##$DATE= 1658921278
##$DBL= (0..7)
120 120 120 11 120 120 24 19 
##$DBP= (0..7)
150 150 150 150 150 150 150 150 
##$DBP07= 0
##$DBPNAM0= <>
##$DBPNAM1= <>
##$DBPNAM2= <>
##$DBPNAM3= <>
##$DBPNAM4= <>
##$DBPNAM5= <>
##$DBPNAM6= <>
##$DBPNAM7= <>
##$DBPOAL= (0..7)
0.5 0.5 0.5 0.5 0.5 0.5 0.5 0.5 
##$DBPOFFS= (0..7)
$$ [...]
##$SUBNAM2= <"">
##$SUBNAM3= <"">
##$SUBNAM4= <"">
##$SUBNAM5= <"">
##$SUBNAM6= <"">
##$SUBNAM7= <"">
##$SUBNAM8= <"">
##$SUBNAM9= <"">
##$SW= 501.771253377433
##$SWIBOX= (0..15)
0 1 3 0 0 0 0 0 0 0 0 0 0 0 0 0 
##$SW_h= 40650.406504065
##$TD= 32768
##$TD0= 1
##$TE= 0
##$TE2= 300
##$TE3= 300
##$TEG= 300
##$TL= (0..7)
0 120 53 12 22 120 120 120 
##$TP= (0..7)
150 150 150 150 150 150 150 150 
##$TP07= 0
##$TPNAME0= <>
##$TPNAME1= <>
##$TPNAME2= <>
##$TPNAME3= <>
##$TPNAME4= <>
##$TPNAME5= <>
##$TPNAME6= <>
##$TPNAME7= <>
##$TPOAL= (0..7)
0.5 0.5 0.5 0.5 0.5 0.5 0.5 0.5 
##$TPOFFS= (0..7)
0 0 0 0 0 0 0 0 
##$TUNHIN= 0
##$TUNHOUT= 0
##$TUNXOUT= 0
##$USERA1= <user>
##$USERA2= <user>
##$USERA3= <user>
##$USERA4= <user>
##$USERA5= <user>
##$V9= 5
##$VALIST= <valist>
##$VCLIST= <CCCCCCCCCCCCCCC>
##$VD= 0
##$VDLIST= <DDDDDDDDDDDDDDD>
##$VPLIST= <PPPPPPPPPPPPPPP>
##$VTLIST= <TTTTTTTTTTTTTTT>
##$WBST= 1024
##$WBSW= 4
##$XGAIN= (0..3)
0 0 0 0 
##$XL= 0
##$YL= 0
##$YMAX_a= 13586
##$YMIN_a= -17039
##$ZGOPTNS= <>
##$ZL1= 120
##$ZL2= 120
##$ZL3= 120
##$ZL4= 120
##$ABSF1= 0
##$ABSF2= 0
##$ABSG= 0
##$ABSL= 0
##$ALPHA= 0
##$AQORDER= 0
##$ASSFAC= 0
##$ASSFACI= 0
##$ASSFACX= 0
##$ASSWID= 0
##$AUNMP= <proc_1d>
##$AZFE= 0.1
##$AZFW= 0.5
##$BCFW= 0
##$BC_mod= 2
##$BYTORDP= 0
##$COROFFS= 0
##$CY= -3
##$DATMOD= 1
##$DC= 0
##$DFILT= <>
##$DTYPP= 0
##$F1P= 0
##$F2P= 0
##$FCOR= 1
##$FTSIZE= 65536
##$FT_mod= 6
##$GAMMA= 0
##$GB= 0
##$INTBC= 1
##$INTSCL= 5.30512e-09
##$ISEN= 30
##$LB= 1
##$LEV0= 0
##$LPBIN= 0
##$MAXI= 10000
##$MC2= 0
##$MEAN= 0
##$ME_mod= 0
##$MI= 50
##$NCOEF= 0
##$NC_proc= -7
##$NLEV= 6
##$NOISF1= 182.463
##$NOISF2= 159.3651
##$NSP= 0
##$NTH_PI= 0
##$NZP= 0
##$OFFSET= 248.5645
##$PC= 4
##$PHC0= -10302.18
##$PHC1= 129.0567
##$PH_mod= 1
##$PKNL= yes
##$PPARMOD= 0
##$PSCAL= 0
##$PSIGN= 0
##$REVERSE= no
##$SF= 81.014009
##$SI= 65536
##$SIGF1= 159.3651
##$SIGF2= -187.1042
##$SINO= 113.3802
##$SIOLD= 16384
##$SREGLST= <1H.CDCl3>
##$SSB= 0
##$STSI= 65536
##$STSR= 0
##$SW_p= 40650.406504065
##$SYMM= 0
##$S_DEV= 0
##$TDeff= 32768
##$TDoff= 0
##$TI= <>
##$TILT= no
##$TM1= 0
##$TM2= 0
##$TOPLEV= 0
##$USERP1= <user>
##$USERP2= <user>
##$USERP3= <user>
##$USERP4= <user>
##$USERP5= <user>
##$WDW= 1
##$XDIM= 65536
##$YMAX_p= 306420273
##$YMIN_p= -91928794
$$ End of Bruker specific parameters
$$ ---------------------------------
##NTUPLES= NMR SPECTRUM
##VAR_NAME=  FREQUENCY,     SPECTRUM/REAL,   SPECTRUM/IMAG
##SYMBOL=    X,             R,               I
##VAR_TYPE=  INDEPENDENT,   DEPENDENT,       DEPENDENT
##VAR_FORM=  AFFN,          ASDF,            ASDF
##VAR_DIM=   65536,         65536,           65536
##UNITS=     HZ,            ARBITRARY UNITS, ARBITRARY UNITS
##FACTOR=    0.620285442955139, 1,           1
##FIRST=     20137.2065510759, 0,            0
##LAST=      -20513.1999529892, 0,           0
##MIN=       -20513.1999529892, -91928794,   0
##MAX=       20137.2065510759, 306420273,    0
$$ Real data points
##PAGE= N=1
##DATA TABLE= (X++(R..R)), XYDATA
$$ [...]
38550a231409j229775J56181K659822K433438J44947o54099K57602J19543j364737
38541A291513j603864Q7898J316848N46531j025697j869185j709587n73985J261392
38532b278136K307863J242937o86611r31710O58948J710542J005871m5450j3779
38523B970475O23178P87625L08161m44517j042172q24418M65521J777460J774399
38514F395712P04780m0564k8556l0890m43839r72717j626935k484830k773580
38505a301419j774179k67237N63839J091858K166776K743019J092261j812016
38497B502902k802384p80454J874183K614199J292062r15139k855148l213070
38489b282849j320929J191712J764284M70247j32604Q19930J325878M03855n6062
$$ plain form
38550 -1231409 -2461184 -2305003 354819 2788257 2933204 2279105 2536707 2656250 1291513
38541 1291513 -312351 -224453 1092395 1638926 613229 -1255956 -2965543 -3539528 -2278136
38532 -2278136 29727 1272664 586053 -345657 313291 2023833 3029704 2984254 2970475
38523 2970475 3593653 4381278 4689439 4244922 3202750 2378332 2843853 4621313 6395712
38514 6395712 7100492 7059928 7031372 7000482 6556643 5583926 3956991 1472161 -1301419
38505 -1301419 -3075598 -3342835 -2778996 -1687138 479638 3222657 4314918 2502902
38497 2502902 -299482 -1079936 794247 3408446 4700508 3785369 930221 -2282849
38489 -2282849 -3603778 -2412066 -647782 -177535 -310139 509791 1835669 2239524 2183462
38480B183462J017276J460945m14234k366524j489591J016918J616307k28858
38472B795701j745062j334019k92982J8064O681K77522L98947N9119q6377N08332
38462F05926J379996J735987J312326M01535l20808j25942Q86518J546446J104074
38453H526058N16831J117593K345637K200289L1648k378165k908360j422193L71541
38444H400879Q50612K0681p09541l92752k3836j236955l357096l385229p0609
38435I6154L557219L668994O27645j762687j406760J96273J093200J179909Q09984
38426H059931l26128j809935k117889r05110K11468L97248J090993L109530M318985
38417A2029093K564105n83757j763581o76473j14354j297766k081377n40983J995811
$$ plain form
38480 2183462 3200738 4661683 4247449 1880925 391334 1408252 3024559 2795701
38472 2795701 1050639 -283380 -576362 -558298 -551617 -274095 124852 183971 97594 605926
38462 605926 1985922 3721909 5034235 5435770 5114962 4989020 5875538 7421984 8526058
38453 8526058 9042889 10160482 12506119 14706408 14738056 12359891 9451531 8029338 8400879
38444 8400879 9251491 9272172 8562631 8169879 8146043 6909088 3551992 166763 96154
38435 96154 3653373 7322367 7950012 6187325 4780565 4976838 6070038 7249947 8059931
38426 8059931 7733803 5923868 3805979 2900869 3112337 3509585 4600578 7710108 12029093
38417 12029093 14593198 14009441 12245860 11569387 11455033 10157267 8075890 7534907 9530718
38408I530718K784091J078763j414013k612358j823018q4051Q52349M03437j26059
38399H589859M79250J258717N43900r76026r55862P41975J532080K36549r76664
38390A0473778k20005J128172J089851M30692P79488J282067J11988j928435k384223
38381A0763373j021970J35000J46706j90287n07287q76654k31076K151787M135762
38372A4505354L205582J028407J393816L641324L099690r93440l489196j528318
38364B0863219O80458j018250l676214k305571J684437K831936J04643k678262
38356A6486396l540112l837927l726570j756217Q72951J048931n90567J1005L213531
38347H181421M283173J083768k124682j598921n147j315059l728211k720357J237560
$$ plain form
38408 9530718 12314809 13393572 11979559 9367201 7544183 7460132 8312481 8715918 8589859
38399 8589859 9069109 10327826 10871726 9895700 8939838 9681813 11213893 11450442 10473778
38390 10473778 10253773 11381945 12471796 12902488 13681976 14964043 15076031 13147596 10763373
38381 10763373 9741403 9876403 10023109 9832822 9325535 8448881 8217805 10369592 14505354
38372 14505354 17710936 18739343 20133159 23774483 26874173 25880733 22391537 20863219
38364 20863219 21543677 20525427 16849213 14543642 16228079 19060015 19164658 16486396
38356 16486396 12946284 9108357 5381787 3625570 4498521 5547452 4956885 4967890 8181421
38347 8181421 12464594 13548362 11423680 9824759 9819612 8504553 4776342 2055985 3293545
38338C293545L236534J351705j198413j513757n91746m37375q32939o29238j08404
38329B569912k85929r62507r23457K85066J687933J992389R78021l39385q84186
38320D117857o33768k76352r4843P4974R487o43789j221147n05452J283725K335680
38310D446372J692107M92694M1038O1310j06369K3989J061992K252740K381269
38301A2347142J370509j38538j842315l232965l113440j167846Q72817J226756
38293F322120M89221M52401J203038J263101K76966l37297M67859K082229L270892
38284A5490530L306453K072699K06979q82970k67893J246637K088132J940436
38276B5201003J730561J856455J664969O15235j149132l254718n065955n502605
$$ plain form
38338 3293545 6530079 7881784 6683371 5169614 4577868 4140493 3307554 2678316 2569912
38329 2569912 2283983 1321476 398019 683085 2371018 4363407 5341428 5002043 4117857
38320 4117857 3484089 3207737 3112894 3187868 3197355 2553566 1332419 826967 2110692 4446372
38310 4446372 6138479 6631173 6672211 6733521 6627152 6651141 7713133 9965873 12347142
38301 12347142 13717651 13579113 11736798 8503833 5390393 4222547 5095364 6322120
38293 6322120 6811341 7263742 8466780 9729881 10006847 9669550 10137409 12219638 15490530
38284 15490530 18796983 20869682 21076661 20193691 19925798 21172435 23260567 25201003
38276 25201003 26931564 28788019 30452988 31068223 29919091 26664373 21598418 16095813
38268A6095813m128103k167337j172283j006839n60467K2778k91524j082740p52383
38259D956915N80233Q07358p32403j795554n53552J544736J971963P48166p0560
38250G457302L87680J051821R62199L48298k79401o98779n99945J92196J119225
38241I940596J556714J939776L044417M293787M253329K945676K002339J947552
38233C1924186J109695j547477m086401l987695j917676q43173j674278k251364
38225A6725817j137965P1018m09919j517726j236528j01275k85246j834157k445642
38216G828377j115870M28031N52918j85313o82581j028128j387295r73975K92116
38207C728280O80696q88656k495614j515605J439737L144743K098826K6667j126858
$$ plain form
38268 16095813 11967710 9800373 8628090 7621251 7060784 7083562 6792038 5709298 4956915
38259 4956915 5537148 6344506 5612103 3816549 3262997 4807733 6779696 7527862 7457302
38250 7457302 7844982 8896803 9859002 10207300 9927899 9229120 8629175 8821371 9940596
38241 9940596 11497310 13437086 16481503 20775290 25028619 27974295 29976634 31924186
38233 31924186 33033881 31486404 27400003 23412308 21494632 20651459 18977181 16725817
38225 16725817 15587852 15658870 15248951 13731225 12494697 12393422 12108176 10274019 7828377
38216 7828377 6712507 7140538 7693456 7508143 6825562 5797434 4410139 3436164 3728280
38207 3728280 4408976 3520320 1024706 -490899 948838 4093581 6192407 6219074 5092216
38198E092216j463349j631803j093651O31235K243214J896317k20329j861746
38190C592104j332428P71282K509449K578487J195736l61147p96235J46160J281448
38181I584856J004919q40904k443553j988284O3127J478282J001963m20004j365185
38172F075217j616331j461171o48316P22297J325283K03959j440085j655142l87946
38163A117765R22205J762350K552793K762155J486390j76986j1040J720619K305288
38154A4441539Q98304r1249Q68860J830210P51462j048769j137558K66266J119467
38145A7898532P08373j44511q39266j169297r15628p11079j780129l470236l119718
38136F457041j29540K174473J028727j692749k540001j444675o16629n00304j45274
$$ plain form
38198 5092216 3628867 1997064 903413 1534648 3777862 5674179 5453850 3592104
38190 3592104 2259676 3030958 5540407 8118894 9314630 8953483 8157248 8303408 9584856
38181 9584856 10589775 9748871 7305318 5317034 5380161 6858443 7860406 7440402 6075217
38172 6075217 4458886 2997715 2349399 3071696 4396979 4600938 3160853 1505711 1117765
38163 1117765 2039970 3802320 6355113 9117268 10603658 10426672 10415632 12136251 14441539
38154 14441539 15339843 15248594 16117454 17947664 18699126 17650357 16512799 16779065 17898532
38145 17898532 18606905 18462394 17623128 16453831 15538203 14827124 13046995 9576759 6457041
38136 6457041 6327501 8501974 9530701 7837952 5297951 3853276 3236647 2736343 2591069
38127B591069J09486l10040j22863J457017K171127K73913j488992K4071K328012
38118G032800Q40539l090222l974914j316161k1769j306158o40773L274516M886413
38109E684271P79813m110799l990030p06415M42878p41619o48506J171450J924959
38100a93998R43722K35206M19114J72510o93939r30621k85763L57707P23719R42963
38090A690620O11006j09538P9398J253274J314039n24641j665138j15596J912998
38081D446422J495406k61005m95167M43488J78406j195039j743454j489275j667490
38072b87708j451892N42314K627099K130684J43559k03818P15467N4722j532246
38063B738181m31802L067788M068860O75247k792649k367633J92642J161512K32222
$$ plain form
38127 2591069 2700555 2390515 2267652 3724669 5895796 6169709 4680717 4704788 7032800
38118 7032800 7873339 4783117 808203 -507958 -529727 -1835885 -2476658 797858 5684271
38109 5684271 6464084 2353285 -1636745 -2343160 -1900282 -2641901 -3290407 -2118957 -193998
38100 -193998 749724 984930 1404044 1576554 882615 -48006 -333769 23938 747657 1690620
38090 1690620 2301626 2192088 2271486 3524760 4838799 4314158 2649020 2533424 4446422
38081 4446422 5941828 5680823 5185656 5629144 5807550 4612511 2869057 1379782 -287708
38072 -287708 -1739600 -1197286 1429813 3560497 3704056 3500238 4215705 4270427 2738181
38063 2738181 2306379 5374167 9443027 10118274 7325625 4957992 5150634 6312146 6544368
38054F544368o35963q10919p58006m48680j25397o76435j692540j343813M75811
38045E28426J382927K69082q75437m60983K30948p3378j87933Q53816J391606
38036C059074J4247j524427j026173N27752Q60029J62324J55247Q15908Q26598
38027C870579J98395j11606k61603q67364j230952m78835M50079J42080q43334
38018H67439r39273p5539P37801J224253J246677j91690k953090m191851j685866
38009e961139K286540L516925J666247K63708J130316K098201P77036k164139
38001C613695m234933l670812n07759L072764L803394Q95119k050626j314632
37993c93790J520201J849695p37894j907532K07589K012142N68435j725905j550136
$$ plain form
38054 6544368 5908405 5097486 4339480 3890800 3765403 3088968 1396428 52615 528426
38045 528426 1911353 2180435 1304998 844015 1074963 1001585 813652 1667468 3059074
38036 3059074 3073321 1548894 522721 1050473 1910502 2072826 2228073 3043981 3870579
38027 3870579 4068974 3957368 3695765 2828401 1597449 1118614 1568693 1710773 867439
38018 867439 -71834 -147373 590428 1814681 3061358 2869668 -83422 -4275273 -5961139
38009 -5961139 -3674599 -157674 1508573 1772281 2902597 5000798 5777834 3613695
38001 3613695 -621238 -4292050 -4799809 -1727045 2076349 2971468 920842 -393790
37993 -393790 1126411 2976106 2238212 330680 538269 2550411 3118846 1392941 -157195
37984a57195j7399Q8130m81513P31994K707985K071215j245101l521869k591980
37975b415733k43889J151222J398460J186725O99885L86103Q79077J408981M34225
37966D885056j486130j808464P8156J540655P42448m36467L83878J995630J493440
37957G388202r51506k220328r36368P23968M61214j109672j842127r25499O93280
37948A281164J721086J449507N0426j314494j336257j05008Q80863P74819N09858
37939C911964J043063J512046N80945r96895j031454P80384K117583J505340P71561
37930A0194537K255188M637948M088026k28309m258134m081518r81039O43653
37922A2270352o68536k190889j743034p19340j159391k223338j759519L6217R25350
$$ plain form
37984 -157195 -174594 -86464 -567977 164017 2872002 4943217 3698116 176247 -2415733
37975 -2415733 -2659622 -1508400 -109940 1076785 1776670 2162773 3041850 4450831 4885056
37966 4885056 3398926 1590462 1668618 3209273 3951721 3515254 3899132 5894762 7388202
37957 7388202 6436696 4216368 3280000 4003968 4465182 3355510 1513383 587884 1281164
37948 1281164 3002250 4451757 4502183 3187689 1851432 1746424 2627287 3402106 3911964
37939 3911964 4955027 6467073 7048018 6051123 5019669 5800053 7917636 9422976 10194537
37930 10194537 12449725 17087673 21175699 20947390 16689256 12607738 11626699 12270352
37922 12270352 11601816 9410927 7667893 6948553 5789162 3565824 1806305 1842522 2767872
37913B767872N4945j045925q53323M83257J897086K385691J363068n22513j234261
37904E295897L20258K236366J983433M01818N60543K608511L153144O77139j977981
37895A5259128k313401j884668k714478l271777j591364K91856o03117k559864
37887F12315j490271J957248K884415N1170j983171j94816K287073J616974p28043
37878E012894r39139Q95191J507336m9386j294096l65518J733581L143432L307192
37869A2951487K776734K228996J899760J292999k26223k068045k582452j322497
37861A4950759M7708Q4054n46071p21085q79789j687474k136728j145531L9656
37852H005499n28966k133297k167071k4967K257629L292480L782732M270525L927902
$$ plain form
37913 2767872 2822817 1776892 923569 1406826 3303912 5689603 7052671 6530158 5295897
37904 5295897 5616155 7852521 9835954 10237772 10798315 13406826 16559970 17237109 15259128
37895 15259128 12945727 11061059 8346581 5074804 3483440 3775296 3172179 612315
37887 612315 -877956 1079292 3963707 4014877 2031706 1836890 4123963 5740937 5012894
37878 5012894 4073755 4968946 6476282 6426896 5132800 4767282 6500863 9644295 12951487
37869 12951487 15728221 17957217 19856977 21149976 20923753 18855708 16273256 14950759
37861 14950759 14998467 15082521 14536450 13815365 12935576 11248102 9111374 7965843 8005499
37852 8005499 7476533 5343236 3176165 3151198 5408827 8701307 12484039 16754564 20682466
37843B0682466K619084K049247L282315M445280K599684k473469p470901q641166
37835A7092540n365185p63247J310325L6094j989202k295621j325391p87966o60992
37826E251355K09714J381581J180585k83904r24695P0574J053725O76868k99401
37817H316402q38590j155911j275025j50313K215743L613615K457743L68423M562
37808A3556649J433370K591756K449324J674272P41544n62859j897116k374263
37800A7612677j865381r69732J32900J514977K522773K377238J457146N99991
37792B3382589l84787j835620k446899o37283K349743L241827J221220q00045
37784B4090745m18646J071466J306381O01675Q64544K117530K541643J389058
$$ plain form
37843 20682466 23301550 25350797 28633112 33078392 35678076 33204607 25733706 17092540
37835 17092540 11727355 10964108 12274433 12310527 10321325 8025704 6700313 5912347 5251355
37826 5251355 5461069 6842650 8023235 7739331 6814636 6885210 7938935 8615803 8316402
37817 8316402 7477812 6321901 5046876 4896563 7112306 10725921 13183664 13552087 13556649
37808 13556649 14990019 17581775 20031099 21705371 22446915 21884056 19986940 17612677
37800 17612677 15747296 14777564 14910464 16425441 18948214 21325452 22782598 23382589
37792 23382589 22997802 21162182 18715283 18078000 20427743 23669570 24890790 24090745
37784 24090745 23672099 24743565 26049946 26651621 27516165 29633695 32175338 33564396
37776C3564396l81962k166136m226786n919563n506035k673222K55712Q16368
37768A3762772p45348k166520k129251j401611j143751j176756n29289P67514
37760E237760J318837J81981j496495j553599M20008K336038K160877L84361r22964
37751H066804q82635m69698o53119j127047j106557m25506M94543J090975Q71621
37742E859381j83384j275629j426911n46875O14727J368404J315035K06951j333528
37733D598171j535253M53910K596668K177930o0502o49817J176223J932054n71436
37724A0117948l234143k094730J634173L566136K653956J682468J914281J572484
37716A7812573J10824k10081J462215K373871L99300k331401k541319m31878J328806
$$ plain form
37776 33564396 33182434 31016298 26789512 20869949 15363914 12690692 12946404 13762772
37768 13762772 13017424 10850904 8721653 7320042 6176291 4999535 4470246 5237760
37760 5237760 6556597 6738578 5242083 3688484 4108492 6444530 8605407 8989768 8066804
37751 8066804 7184169 6714471 6061352 4934305 3827748 3402242 3896785 4987760 5859381
37742 5859381 5675997 4400368 2973457 2426582 3041309 4409713 5724748 5931699 4598171
37733 4598171 3062918 3516828 6113496 8291426 8230924 7581107 8757330 10689384 10117948
37724 10117948 6883805 4789075 6423248 9989384 12643340 14325808 16240089 17812573
37716 17812573 17923397 17713316 19175531 21549402 21948702 19617301 17075982 16644104 17972910
37707A7972910J595270J129357J89053j564213l223959l106355j182699O29014
37699A2438378P39286o43596k107572k192794m62217J724579K262490R35487j49364
37690A2544677K84330P35082l76285j930898k236303k121103k987979l299940
37682F11581p25839L001898L577805O08744j634351p89954N78955J39261m30651
37673D937449N21917Q79288j180890k695902j84438L817853L763837k83163k514055
37664G061896l23697J939714J38342l320761l554733m23163K068548J811774M39774
37655E837694j46392Q5598O19838J203457J025930o66829k695702k769505q04083
37646A690006O08208n3293j057758m07237Q66120M99329j128336j453398K63628
$$ plain form
37707 17972910 19568180 20697537 20886590 19322377 16098418 12992063 11809364 12438378
37699 12438378 13177664 12534068 10426496 8233702 7771485 9496064 11758554 12694041 12544677
37690 12544677 12829007 13564089 13187804 11256906 9020603 6899500 3911521 611581
37682 611581 -114258 2887640 6465445 7074189 5439838 4649884 5228839 5368100 4937449
37673 4937449 5459366 6338654 5157764 2461862 2277424 6095277 9859114 9575951 7061896
37664 7061896 6738199 8677913 8816255 5495494 1940761 1517598 3586146 5397920 5837694
37655 5837694 5691302 5776900 6396738 7600195 8626125 7959296 5263594 2494089 1690006
37646 1690006 2298214 2244921 1187163 779926 1646046 2145375 1017039 -436359 -172731
37637a72731J847193J539581L00661j31481K47484L77743N2964k03428l33553
37628C524433m83583j36472J161049K509891K354312M80147j591126k211481j005087
37619D602083J017746K063500Q36957j799943l014614j095102K093467L172994
37611G877088J428266p18980j201212l56486N96054J039128M84267j213561k453345
37602E481219j030525K203786L327370P17733k061178j201450J792791K737426
37594A1967172J185047J90207N66230j6344j845758j774662J289358L627719K106756
37585A7295725r83745j643771o0070P68131K59621J18189K16775j140822l186410
37576A1643623l104468q88836K37462p78924j042029R30228K037122l35886l383327
$$ plain form
37637 -172731 1674462 3214043 3514704 3383223 3630707 4008450 4061414 3857986 3524433
37628 3524433 3040850 2904378 4065427 6575318 8929630 9409777 7818651 5607170 4602083
37619 4602083 5619829 7683329 8520286 6720343 3705729 2610627 4704094 7877088
37611 7877088 9305354 8586374 7385162 7028676 7624730 8663858 9148125 7934564 5481219
37602 5481219 4450694 6654480 9981850 10699583 8638405 7436955 9229746 11967172
37594 11967172 13152219 13342426 13908656 13892312 12046554 10271892 11561250 15188969 17295725
37585 17295725 16311980 14668209 14608139 15376270 15635891 15754080 15970855 14830033 11643623
37576 11643623 8539155 7650319 7887781 7108857 6066828 6997056 9034178 8698292 5314965
37567E314965k803686N45055K095061N70542p20521M11939K050749J884969N64655
37558I913728k98379r09638k101645l123270k604052p82856P39269Q91911j45655
37549A579413j391508j563562j08834J647043J596706j95199j157232J09985J537211
37540B054023O77774j396844j619936M84573K276288J931552M97935l84478o37228
37531C883659p59977n18453J76880M29182k86347q94634k37850Q49093N37607
37522C179160j104677j861689n08728J198604Q58146j078192j795138j32661J632799
37513C87624R62087j368757k440958j151995Q55383J922290K000517J393192L0927
37504B590310j292320j035190O27880J387474K01300q55811N7922J312510M10290
$$ plain form
37567 5314965 2511279 3056334 5151395 5721937 5001416 5413355 7464104 9349073 9913728
37558 9913728 9615349 8705711 6604066 3480796 876744 93888 833157 1725068 1579413
37549 1579413 187905 -1375657 -1484491 162552 1759258 1564059 406827 516812 2054023
37540 2054023 2731797 1334953 -284983 199590 2475878 4407430 4905365 4520887 3883659
37531 3883659 3123682 2605229 2782109 3211291 2924944 2030310 1792460 2641553 3179160
37522 3179160 2074483 212794 -295934 902670 1760816 682624 -1112514 -1245175 387624
37513 387624 1349711 -19046 -2460004 -3611999 -2756616 -834326 1166191 2559383 2590310
37504 2590310 1297990 262800 890680 2278154 2479454 1623643 1681565 2994075 3404365
37495C404365j712133k040615l29144O67700k62539j204327o63513K24274J82488
37486a733444J752P28488J568100J255924J69465m34435l02457k9795J61619L65984
37476A751201L60928j8492l60433k14597K87763P30624P90819K04549q50611j335410
37466A346341l93664J119662J422106K52783q53339q87719l66251J94130Q91980
37457B726029J111649k41955k353939k619187l84832J673850J476984N20249Q36912
37448B745760J250644l94233k859847k855831k02316J731819J048039k42139K31628
37439D53524J666163J642332k95743k177218k137863m09936J084315P88698p29259
37430a14987j315779N8981J709270J326912p84444j981266q30835J076269J456515
$$ plain form
37495 3404365 1692232 -348383 -677527 -9827 -272366 -1476693 -2140206 -1915932 -1733444
37486 -1733444 -1731692 -1003204 564896 1820820 1990285 1555850 1253393 1223598 1385217 1751201
37476 1751201 2112129 2093637 1733204 1518607 1806370 2536994 3327813 3532362 2681751 1346341
37466 1346341 952677 2072339 3494445 3747228 2893889 2006170 1639919 1834049 2726029
37457 2726029 3837678 3595723 1241784 -1377403 -1762235 -88385 1388599 1908848 2745760
37448 2745760 3996404 3602171 742324 -2113507 -2315823 -584004 464035 221896 453524
37439 453524 2119687 3762019 3466276 1289058 -848805 -1258741 -174426 614272 -114987
37430 -114987 -1430766 -1371785 337485 1664397 879953 -1101313 -1932148 -855879 600636
37421F00636L14990m08648L83173J604645J547497L8397j511091j904017j253459
37412e87877k27092Q12740J383511P48367o50120p48255J362290L171660J760535
37403G025759j455983k169854M13735K255217P75315j311042q05494P60935J12854
37394E601442k128331k691069r90307O14401J008371J168591J325755O73404l11696
37385D270561l60878L777o59619j680347j275962q8112j50438o93513R00713L823242
37375D089424M044308P19349k135635j941916j049906j700546j947035J32080
37367B10123K011780O38466k028020j830831R50637K166310K51816j896121j593269
37358a119109M04281J910543K027218J180169J94650k35612k92074j016030k463089
$$ plain form
37421 600636 915626 506978 890151 2494796 4042293 4080690 2569599 665582 -587877
37412 -587877 -814969 -2229 1381282 2129649 1479529 731274 2093564 5265224 7025759
37403 7025759 5569776 3399922 3813657 6068874 6844189 5533147 4727653 5488588 5601442
37394 5601442 3473111 782042 -208265 406136 1414507 2583098 3908853 4582257 4270561
37385 4270561 3909683 3913460 3253841 1573494 297532 209420 58982 -634531 266182 4089424
37375 4089424 8133732 8853081 6717446 4775530 3725624 2025078 78043 210123
37367 210123 2221903 2860369 832349 -998482 -47845 2118465 2370281 474160 -1119109
37358 -1119109 -714828 1195715 3222933 4403102 4597752 4362140 4070066 3054036 590947
37349E90947k722929m13819K658287L348411J239012j109055j697747r49960j32846
37340H10301K02637N4730k41069K980Q17183R08788n47787k015683j374483P64435
37330f17968J670447M12183j054753j053154k46191J75634L59922P93268J049571
37321A488959O69984P3562l31372p81296j107114l76031J404367K502178J641137
37312E184374q8726q45992o20707o42802r44580m02818R57124J589368P43871
37303D929112m49150q60775q70968j050052p21311O66349J736634P36017j464461
37294B651395k097661n34674O71187k12076j278708p9231K254682K655868R26793
37285D957575j44586O12416J125356j72440j771389j709403n27418J01634n0873
$$ plain form
37349 590947 -2131982 -2545801 112486 3460897 4699909 3590854 1893107 943147 810301
37340 810301 1012938 1067668 826599 829579 1646762 2555550 2007763 -7920 -1382403 -617968
37330 -617968 1052479 1464662 409909 -643245 -889436 -713802 -353880 439388 1488959
37321 1488959 2158943 2232505 1901133 1119837 12723 -363308 1041059 3543237 5184374
37312 5184374 5095648 4249656 3628949 2986147 2041567 1638749 2595873 4185241 4929112
37303 4929112 4479962 3619187 2748219 1698167 976856 1643205 3379839 4115856 2651395
37294 2651395 553734 19060 690247 478171 -800537 -879768 1374914 4030782 4957575
37285 4957575 4812989 5425405 6550761 6378321 4606932 2897529 2370111 2471745 2420872
37276B420872k55817m01379m63912J61650J196193R07418j151366k490566j068969
37267a145876J202867J142073p29555j190310L19284J030331j82434q55017P76867
37258C68230K715762K370663M02549p72447o51392o31183j327490j853410j360192
37249g38910M3246J584511K229864J410531o723l78489M35400O58589o64649j959529
37239B613841j490144p7513L50306j04212K68650J756012K781664K451671J574268
37230A0124543R53032N14495M98360J678968L720094M934671M515137L572974
37222C0512274L154749K754166J800987R82076O34566o20726l691341o664214
37214B8862537o951374n036108l607199l397287k694082j071765m59542j522996
$$ plain form
37276 2420872 2165055 1763676 1299764 1461414 2657607 3565025 2413659 -76907 -1145876
37267 -1145876 56991 1199064 469509 -720801 -401517 628814 446380 -408637 368230
37258 368230 3083992 5454655 5857204 5084757 4433365 3802182 2474692 621282 -738910
37249 -738910 -695664 888847 3118711 4529242 4522519 4144030 4579430 5238019 4573370 2613841
37239 2613841 1123697 1046184 1396490 1292278 1560928 3316940 6098604 8550275 10124543
37230 10124543 11077575 11592070 12090430 13769398 17489492 22424163 26939300 30512274
37222 30512274 33667023 36421189 38222176 39204252 39838818 39218092 35526751 28862537
37214 28862537 21911163 16875055 13267856 9870569 7176487 6104722 5645180 4122184
37206D122184j980288k61942J705966J558379J80698j69625L60387J59350n05008
37197E170101j79086O40331K72827p60515m34266Q86482P53821r17606j408721
37188D023368k4230M19793j489791k947878j363224J406607K038122O47706j92036
37179B518437L30289Q33249M44434m19353j138199j018045N15748K393479K261267
37170F721306k3871j409921j73847J099203k05422k088881j243627J170296J450597
37161E295833l52264q26529P07377J351981Q6609o29041M12459J163265L78636
37152G588326k60097L38236O62806j37332l77951Q28989J548914M58343o58036
37143I992198j53184N02368m40638j621564q40639J159052J968392J223401N44980
$$ plain form
37206 4122184 2141896 1879954 3585920 5144299 5324997 5155372 5515759 5675109 5170101
37197 5170101 4991015 5631346 5904173 5143658 4709392 5595874 6349695 5432089 4023368
37188 4023368 3999138 4418931 2929140 -18738 -1381962 24645 2062767 2710473 2518437
37179 2518437 2848726 3681975 4126409 3707056 2568857 1550812 2066560 4460039 6721306
37170 6721306 6697435 5287514 5113667 6212870 6007448 3918567 2674940 3845236 5295833
37161 5295833 4943569 4117040 4824417 6176398 6263007 5633966 6046425 7209690 7588326
37152 7588326 7328229 7666465 8329271 8191939 7813988 8642977 10191891 10650234 9992198
37143 9992198 9839014 10341382 9900744 8279180 7438541 8597593 10565985 11789386 12334366
37134A2334366P86108J427552J815135J374684k65354j984812j578992J024220
37126A4932907K809627J759259j09026k7986J188436R19980p30635j362292l16510
37117A9063760P86468J072806J113084Q69898k84566j527857j175994N29779J622586
37108B2069964J519684J469183J677088P27437j386190k369679j155695M5164
37100B2596956q72900k380916j627483Q63841J701422j94865j838726q36510O95997
37091A8106816n98484l622264l939510o62032J681095q2137k726764j640642J913760
37082H429838K961723N75065j580667j839696k195495k956988j564480J650937
37074C480237K346156n04924j818930J377557M412909K469452j415101j793153
$$ plain form
37134 12334366 13120474 14548026 16363161 17737845 17472491 15487679 13908687 14932907
37126 14932907 17742534 19501793 19392767 19364781 20553217 21473197 20742562 19380270 19063760
37117 19063760 19850228 20923034 22036118 22906016 22621450 21093593 19917599 20447378 22069964
37108 22069964 23589648 25058831 26735919 27463356 26077166 23707487 22551792 22596956
37100 22596956 21724056 19343140 17715657 18579498 20280920 20086055 18247329 17410819 18106816
37091 18106816 17508332 13886068 9946558 9284526 10965621 10883484 8156720 6516078 8429838
37082 8429838 11391561 11966626 10385959 8546263 6350768 3393780 1829300 3480237
37074 3480237 5826393 5321469 3502539 4880096 9293005 11762457 10347356 8554203
37066H554203M3177o50708k890476j911836J566059K216518k88511p64557J776321
37057G650190K126444j496950l754434j288442J711720J157460k75819R20639
37049F750808K305224M62524j971437p06866K243372J686438j890324l207211
37041E672528q95760R98278K18275p89162p2361P63168K70520j94549N74227J300466
37031G845630P19556j84194j79858P7297m50138j202546j035537l1231Q28933
37022F387912R07090J58443r50769j413062o03369N68594O14315l16186n92933
37013D760035K93369Q78447R714j490028k188044j832282r97133p183R54416J448750
37003A830061J191980L47138q29252j900816j849853l0347K242756K591136P12899
$$ plain form
37066 8554203 8597380 7946672 5056196 3144360 4710419 6926937 6638426 5873869 7650190
37057 7650190 9776634 8279684 4525250 3236808 4948528 6105988 5830169 6750808
37049 6750808 9056032 9518556 7547119 6840253 9083625 10770063 8879739 5672528
37041 5672528 4776768 5775046 5993321 5204159 5131798 5894966 6165486 5970937 6545164 7845630
37031 7845630 8565186 8380992 8201134 8278431 7828293 6625747 5590210 5558979 6387912
37022 6387912 7295002 7453445 6502676 5089614 4486245 5054839 5669154 5352968 4760035
37013 4760035 5053404 5931851 5941565 4451537 2263493 431211 -565922 -573105 381311 1830061
37003 1830061 3022041 3369179 2539927 639111 -1210742 -1241089 1001667 3592803 4305702
36994D305702r27609n50966L97775k48710j695011j284271J262800L202383K700245
36985G162338J148816N71672O68597N3475r97020j113629m36851m18225j084816
36976E554357p47281R92862K068838R72485q24376j107905k09028p3369r29345
36967E697238j099934P3762J180608Q99143m01953j585977j977206j428518l27186
36958A029977L63916J53946o5695O28314J423475J020758J14912M26122J543441
36949F639166J335563l99207j509206j099240n33755k18213J137770K893837K043476
36940A0290191j511492l215994m50311K823606J937640j234732j771126J24231
36932F992013K41358j667762j401598J887635L531735Q29490k511315k173309
$$ plain form
36994 4305702 3378093 2827127 3224902 2976192 1281181 -3090 1259710 4462093 7162338
36985 7162338 8311154 8882826 9551423 9604898 8607878 7494249 7057398 6639173 5554357
36976 5554357 4807076 5799938 7868776 8841261 8016885 6908980 6699952 6626583 5697238
36967 5697238 4597304 4671066 5851674 6750817 6348864 4762887 2785681 1357163 1029977
36958 1029977 1393893 1547839 1482144 2110458 3533933 4554691 4669603 5095725 6639166
36949 6639166 7974729 7575522 6066316 4967076 4433321 4215108 5352878 8246715 10290191
36940 10290191 8778699 5562705 5112394 7936000 9873640 8638908 6867782 6992013
36932 6992013 7233371 5565609 4164011 6051646 9583381 10412871 7901556 5728247
36924E728247O18784J876467O93687q62611j504991j422265p35484K80958O05133
36915E277925j3212k33853N84311R69213k600n77552Q10550K357454J479824p30494
36905I921566r79939Q94033J618896j50726j612237l28056J882920J768625n02134
36896A2512948j911144j211048k92641o52249r45474N08981K466211K210040k97387
36887A2388237k121234j588846m82440p98917j479249m66024J546981K110150
36879I108658R82569K62809P15219Q31201m8014m79176K60132O20934n86853k087847
36869I579632k124494q79065L60150R25342O50129k97496o22132R75369K966617
36860A1534052J967954j966555m093147j463249K303386K148020r69120k028644
$$ plain form
36924 5728247 6347031 8223498 8917185 8054574 6549583 5127318 4391834 4672792 5277925
36915 5277925 5264713 5030860 5615171 6584384 6581784 6004232 6814782 9172236 10652060 9921566
36905 9921566 8941627 9835660 11454556 11303830 9691593 9363537 11246457 13015082 12512948
36896 12512948 10601804 9390756 9098115 8445866 7500392 8009373 10475584 12685624 12388237
36887 12388237 10267003 8678157 8195717 7396800 5917551 5451527 6998508 9108658
36879 9108658 10091227 10354036 11069255 11900456 11852442 11373266 11633398 12254332 11667479 9579632
36869 9579632 7455138 6576073 6936223 7861565 8511694 8214198 7592066 8567435 11534052
36860 11534052 13502006 11535451 7442304 5979055 8282441 10430461 9461341 7432697
36852G432697J26637J688592N52879o91866L46654J987457J590318l01103j261174
36843A1471091o37473K09888L27516J27799L15091R48836J583823K020394K825360
36834A9192325M573298O355256O394455N175832O206438J1512771J7781334J9769094
36826I6960803J6556001J1211661N144748k926919j2104095j8055546j8448184
36819G8338469j5904695j3460091j0558504o158253k528146k407002m500026n279708
36811A7542044l916984k312276j358667l35134O07685L64636p63184j038014K40518
36802I030624J972873K825188K181027J50616j978291k259830n71882O73518m8231
36793A1975612r79622k96387L95034j015691k606708j064167K182897K333043
$$ plain form
36852 7432697 7559334 9247926 9800805 9108939 9455593 11443050 13033368 12732265 11471091
36843 11471091 10833618 11043506 11371022 11498821 11813912 12762748 14346571 16366965 19192325
36834 19192325 23765623 30120879 36515334 41691166 47897604 59410375 77191709 96960803
36826 96960803 113516804 124728465 129873213 126946294 114842199 96786653 78338469
36819 78338469 62433774 48973683 38415179 32256926 29728780 27321778 22821752 17542044
36811 17542044 13625060 11312784 9954117 9618983 10226668 10591304 9828120 8790106 9030624
36802 9030624 11003497 13828685 16009712 16160328 14182037 11922207 11350325 12023843 11975612
36793 11975612 10995990 10699603 11094637 10078946 7472238 6408071 8590968 10924011
36785A0924011j202651l544893j802083R38954J107737j27022O0174J365344J889299
36776I608870J726983J732004R31626j430586l073867j486382J640761K356474
36768A2005883J96573j464088o73463P97444Q61231j18199q57573j075017q39031
36759H833760J29719J522359K292296K178342J986331J827549P20408j274696
36751A8216068k216658q28492J407019K113449J116888K59797O41703J473050
36743B2182824J637517J184943Q73692R43381Q66681J39664r72267j550914r33047
36734B4372474M74627J436660J147772K63428M46899K619792N697568P480580
36726D3939800P003013N468444M372415L417548J435572j088438k190215j406498
$$ plain form
36785 10924011 9721360 6176467 4374384 5313338 6421075 6294053 6354227 7719571 9608870
36776 9608870 11335853 13067857 13999483 12568897 9495030 8008648 9649409 12005883
36768 12005883 12202456 10738368 10064905 10862349 11723580 11605381 10747808 9672791 8833760
36759 8833760 8963479 10485838 12778134 14956476 16942807 18770356 19490764 18216068
36751 18216068 15999410 15170918 16577937 18691386 19808274 20068071 20709774 22182824
36743 22182824 23820341 25005284 25878976 26822357 27689038 27828702 26856435 25305521 24372474
36734 24372474 24847101 26283761 27431533 27694961 28141860 30761652 36459220 43939800
36726 43939800 50942813 56411257 60783672 64201220 65636792 64548354 62358139 60951641
36718F0951641p30380j665785l002842k922426j892994j668584k386664k591218
36710D4090748j527637M12482K911297N348618N757227K692941j754299l355607
36702E4575770q08328K802301M360405M220716M119362L834590J984948j180230
36694G3909534l874334n105635n316494n002036l990030k065616M47100K651319
36686E1653808L475163K814524K467518M756337R624240J4157209J5486146J2974233
36678A17409178P360872n0072o340301p755183l953565J87726l57852m957201
36670A01543602q989819j0086639r653635q982658p533777n425251m211470m090052
36662D2570301l153782o94555J252774J046266k04743q96712j297179k000652
$$ plain form
36718 60951641 60221261 58555476 55552634 52630208 50737214 49068630 46681966 44090748
36710 44090748 42563111 42975593 45886890 51235508 56992735 59685676 57931377 54575770
36702 54575770 53767442 56569743 60930148 65150864 69270226 73104816 75089764 73909534
36694 73909534 70035200 64929565 59613071 54611035 50621005 48555389 49002489 51653808
36686 51653808 55128971 57943495 60411013 65167350 74791590 88948799 104434945 117409178
36678 117409178 124770050 124719978 118379677 110624494 106670929 106858655 106500803 101543602
36670 101543602 92553783 82467144 72813509 63830851 56297074 50871823 46660353 42570301
36662 42570301 39416519 38721964 39974738 41021004 40816261 39919549 38622370 36621718
36654C6621718k253838j762373j987403l371174l478790p91200J681129L02816
36646B4960885l039487l143024M44221K403976j81376l308792k290431J317208
36638A7163180K682275J009158l18690L52676J155725Q05872O04239J363681J608950
36629B6427066M75773k10025J198930L222313L536770K837688L752601O404852
36621D7645968P703631N505396J445228j258863j403141k53356N55042N02466
36613F0442371L5584k91025o27148j867586m309818o313521n568452k342398j37343
36604C9020664j695512n154060n979514k616698J641842K967108J479009J91174
36596B9854013P04224J845490K390789L160224N380712Q075236Q634167O026894
$$ plain form
36654 36621718 34367880 32605507 30618104 27246930 23768140 22976940 24658069 24960885
36646 24960885 21921398 18778374 19222595 21626571 21445195 18136403 15845972 17163180
36638 17163180 19845455 20854613 20535923 20888599 22044324 22850196 23454435 24818116 26427066
36629 26427066 26902839 26692814 27891744 31114057 34650827 37488515 41241116 47645968
36621 47645968 55349599 60854995 62300223 61041360 59638219 59384863 59939905 60442371
36613 60442371 60477955 60186930 59559782 57692196 53382378 47068857 41500405 39158007 39020664
36604 39020664 37325152 32171092 26191578 23574880 25216722 28183830 29662839 29854013
36596 29854013 30558237 32403727 34794516 37954740 43335452 51410688 60044855 66071749
36588F6071749K261850L1683l52552p36896k165355l425201l003952j385928k53696
36579E7041702N2827P99649K466061L664235L404430L280574N793174J0735282
36571H7237934J4729319J4679773J0580615M589466j288844n639147p056730n090516
36563A12741870j737702l12294k102246n130021o829480o911194o623402o158536
36555G6936995m500721j755773J38344j48129j383983j448980k47741M51359j53302
36546F7888069q33547n27179r4945q19131k279968l224321l810166n065945o308932
36537D4923935n434629k520437q38423k523702m992888m174108l69521K023858
36529B6094085P09771j520526j057441J785233M122425M715569M466099L727717
$$ plain form
36588 66071749 68333599 68365282 68012730 67275834 65110479 61685278 58681326 57295398 57041702
36579 57041702 57094529 57894178 60360239 64024474 67428904 70709478 76502652 87237934
36571 87237934 101967253 116647026 127227641 131817107 130528263 124889116 117832386 112741870
36563 112741870 111004168 110691874 108589628 103459607 96630127 89718933 83095531 76936995
36555 76936995 72436274 70680501 70818845 70670716 69286733 67837753 67590012 68041371 67888069
36546 67888069 67054522 66527343 66432398 65613267 63333299 60108978 56298812 51232867 44923935
36537 44923935 39489306 36968869 36130446 33606744 28613856 24439748 24070227 26094085
36529 26094085 26803856 25283330 24225889 26011122 30133547 34849116 39315215 43042932
36521D3042932J787372q89484k197795j112205O22957P07792o50621j157046L27300
36512D0481202K222237K420277J149637N25101J466376K522043K369522K058307
36504E5214702L332414N700397P084491O896203O318493N678006M004915J517626
36496I5747247j69936j143741l566713p498597r381438p029873l385188k307891
36488F1263870l033134k446911r18095j420901l769543m425845k271284k45868
36480D2732289l48127r16104k09055Q53557J191872J638707K621932K560995O46062
36471E0772128j133934q27871N50423Q37716k41609j546362k401030k476340j387517
36462D2145604J93463O07207m37311j280962j005390o08219o18451j59540M78827
$$ plain form
36521 43042932 44830304 43940820 41743025 40630820 41253777 41961569 41310948 40153902 40481202
36512 40481202 42703439 45123716 46273353 46798454 48264830 50786873 53156395 55214702
36504 55214702 58547116 64247513 71332004 78228207 84546700 90224706 94229621 95747247
36496 95747247 95577311 94433570 90866857 83368260 73986822 66956949 63571761 61263870
36488 61263870 58230736 55783825 54865730 53444829 49675286 45249441 42978157 42732289
36480 42732289 42384162 41468058 41259003 42112560 43304432 44943139 47565071 50126066 50772128
36471 50772128 49638194 48810323 49360746 50198462 49956853 48410491 46009461 43533121 42145604
36462 42145604 42339067 42946274 42508963 41228001 40222611 39614392 38995941 38836401 39315228
36453C9315228n66878k891184k888642R76321N105516N673194L533697J300539
36445D9557791j110327m267563n757832l571148n08076l33883j584408l91261
36437C2033293K341025K535673O93646J489711N313760O693642K789650k265909
36429E1624491l854248k752717j881698j556049j032721j191074k503351l077130
36421C3775503j488405P55628J863804K522482L886558N158431N277612M817968
36413E6569581M273515K688210k09467k831862m311954n616018o533689m903827
36405C9124489j016460R11235j233141l456538j572579K035855K257184o03212
36397C6446833j906242n32407N5553j488957k185554m38017Q36340j013723m060763
$$ plain form
36453 39315228 38748350 35857166 32968524 33944845 39050361 44723555 48257252 49557791
36445 49557791 48447464 44179901 38422069 34850921 34342845 34008962 32424554 32033293
36437 32033293 34374318 36909991 37603637 39093348 44407108 51100750 53890400 51624491
36429 51624491 47770243 45017526 43135828 41579779 40547058 39355984 36852633 33775503
36421 33775503 32287098 33042726 34906530 37429012 41315570 46474001 51751613 56569581
36413 56569581 60843096 63531306 63321839 60489977 56178023 50562005 44028316 39124489
36405 39124489 38108029 39019264 37786123 34329585 32757006 34792861 37050045 36446833
36397 36446833 34540591 34008184 34063737 32574780 30389226 29951209 30787549 29773826 25713063
36388B5713063m767606k796507n49847L64744J72156m29005r60450j086763r23603
36379A4736182r85102j318062j345162q83280n05905n81524p19333m15614L77985
36370H360185J312242J650182O36817j208923j813728k2253K162476J742222r97180
36361A1822040k618808j391857L74750P9746j269389r99015P93481J390574j93308
36352G988214j565339n25006J653336K101841M31385j011844p27249J00157n0464
36343H395031o07404j66980J010631J433206O91996k51135p08766o57508J30576
36334I269647J628983K549289J744409M19133P15866K145005K057006K549j367416
36325A9164471o83531j514r36135j684924k54920J944109K545087K208533L154610
$$ plain form
36388 25713063 20945457 18148950 17599103 17963847 18136003 17706998 16746548 15659785 14736182
36379 14736182 13751080 12433018 11087856 10204576 9698671 9117147 8397814 7982200 8360185
36370 8360185 9672427 11322609 11959426 10750503 8936775 8914522 11076998 12819220 11822040
36361 11822040 9203232 7811375 8186125 8265871 6996482 5997467 6790948 8181522 7988214
36352 7988214 6422875 5897869 7551205 9653046 10084431 9072587 8345338 8445495 8395031
36343 8395031 7787627 7620647 8631278 10064484 10756480 10505345 9796579 9139071 9269647
36334 9269647 10898630 13447919 15192328 15611461 16327327 18472332 20529338 20531887 19164471
36325 19164471 18480940 18479426 17543291 15858367 15603447 17547556 20092643 22301176 25455786
36316B5455786N250785O542024O455536N553229L242106j071014n304379o493136
36308C9630937m998008l836613l965117l485231j818924j234884l006071m878947
36300A2407142m146447j365213P15555P81391J5130M5375R21732J250805P2734
36291A0698204j694109k246859j267042j59755K52749N78254Q55198k888j562741
36282E451011j336438J107243K306232M7075k403500j028336K329616K790574
36274I263477K60121r08326N85237J457988J84149o89498J71294M88711q58827
36265I954326j463924q4275P32025o77754j950670j098020m1404n21676l59958
36256D488670K333136M655644L077426n40037j738484l32240K63174o96499n38339
$$ plain form
36316 25455786 30706571 37248595 43704131 49257360 52499466 51428452 46124073 39630937
36308 39630937 34632929 30796316 26831199 23345968 21527044 20292160 17286089 12407142
36300 12407142 8260695 6895482 7611037 8392428 8407558 8452933 9374665 10625470 10698204
36291 10698204 9004095 6757236 5490194 5330439 5583188 6161442 7016640 7013752 5451011
36282 5451011 4114573 5221816 7528048 7575123 5171623 4143287 6472903 9263477
36274 9263477 9523598 8615272 9200509 10658497 10842646 10153148 10324442 10813153 9954326
36265 9954326 8490402 8406127 9138152 8460398 6509728 5411708 5370304 4848628 4488670
36256 4488670 6821806 11477450 14554876 14014839 12276355 11944115 12207289 11510790 10972451
36247A0972451J587207L165516K497530P57691p55697k209263l342379k936242
36239I736814j159736N4651k9083J10511J280588J753798q187k494836k942919
36230F301601j152193L86544J07742o16590J00102J487292J140972r90542j919126
36221D845802j0915K141625J520346m77741l81526J322297R20535j750057k344000
36212E786366O55529K771371O87422k127854j220746J345059O90273k365863k648405
36203C573152N92702K438652L26269k258966j751979M51080J239526N10702O0085
36194E181223K74230L84849L59158N24742M60973k18271q79226p50234n319P01521
36184F033646R56715M92631o32875j534294j249156j31241N81880N42666M32995
$$ plain form
36247 10972451 12559658 15725174 18222704 18980395 18224698 16015435 12673056 9736814
36239 9736814 8577078 8631729 8602646 8713157 9993745 11747543 11739356 9244520 6301601
36230 6301601 5149408 5535952 5643694 5027104 5127206 6614498 7755470 6764928 4845802
36221 4845802 4834887 6976512 8496858 8019117 7637591 8959888 9880423 8130366 5786366
36212 5786366 6441895 9213266 9900688 7772834 6552088 7897147 8587420 6221557 3573152
36203 3573152 4165854 6604506 6930775 4671809 2919830 3370910 4610436 5121138 5181223
36194 5181223 5455453 5840302 6199460 6724202 7185175 6966904 6087678 5337444 5332125 6033646
36184 6033646 6990361 7482992 6850117 5315823 4066667 3935426 4517306 5059972 5492967
36175E492967M99968L32542k1035p2534J65386N12957J318982K355409J980824
36166A2565466n43936k871705k269830K64340J506882R75283R93935K173282K772300
36157A5566017K769306M251300O801784O896176L531562J82470r52869k268293
36149C6777453n504433p616065n804055k851409k705265l780225k020497J512942
36141H008446K029819q73910k412004l58290J813345R44566j309756k013525j177764
36132D650927k41953N77073J235848P63214p41185j287707p151J276354J200229
36123G425649J058649J817287J690031n31001k238172o18488K362943K569815
36115A3536713J64985q14854R21072K180506R32772n43089J35591J783584K510618
$$ plain form
36175 5492967 5992935 6325477 6304442 6231908 6397294 6910251 8229233 10584642 12565466
36166 12565466 12021530 9149825 6879995 7144335 8651217 9626500 10620435 12793717 15566017
36157 15566017 18335323 22586623 29388407 36284583 39816145 39998615 39045746 36777453
36149 36777453 31273020 23656955 17852900 15001491 12296226 8516001 6495504 8008446
36141 8008446 10038265 9164355 6752351 6394061 8207406 9151972 7842216 5828691 4650927
36132 4650927 4408974 4986047 6221895 6985109 6243924 4956217 4949066 6225420 7425649
36123 7425649 8484298 10301585 11991616 11460615 9222443 8603955 10966898 13536713
36115 13536713 13701698 12886844 13807916 15988422 16921194 16378105 16513696 18297280 20807898
36106B0807898L082647M526085M983638K478209q65333j093040J823902M053316
36098C9797322L587303K430448K607763L231946K816093J912165J799801K311935
36090F0494776K371713J388730p53675l628997n536137m721972k196541j233788
36082D6184109k935669m583892l917643k541719k849122l903040l353053j684205
36074B0415766j182559j765433j346786J18349M15185j007604k075984j519637
36066A2051297m60216k3980P0440L4044m16741o12123M05021J496345N83340j467546
36056A1659881j463024Q50734J858397j61494k204115j663756n00891j228291
36048G147441k149431n34766K034116J915292n83838j858219q39217R7129j76848
$$ plain form
36106 20807898 23890545 28416630 33400268 35878477 35013144 33920104 35744006 39797322
36098 39797322 43384625 45815073 48422836 51654782 54470875 56383040 58182841 60494776
36090 60494776 62866489 64255219 63501544 59872547 54336410 49614438 47417897 46184109
36082 46184109 43248440 38664548 34746905 32205186 29356064 25453024 22099971 20415766
36074 20415766 19233207 17467774 16120988 16239337 16654522 15646918 13570934 12051297
36066 12051297 11591081 11567101 11637541 11671585 11254844 10642721 11047742 12544087 13127427 11659881
36056 11659881 10196857 11047591 12905988 12744494 10540379 8876623 8375732 7147441
36048 7147441 4998010 4463244 6497360 8412652 7828814 5970595 5131378 5228507 5051659
36039E051659r3588R50041J332700N61774M84152J837044K551012J084684r94078
36030A2765400j446030m22527N19201Q46934R45137Q13910K60721m36981r31348
36021A2914417j062703m13002J114081K102815R03422j420176j713392O59958
36013A3085420K289559N65937k240370k304543K8458R79345q74909k732154j904285
36004F892458N91277J902462J067926m37721r88275n07382m9800k60647n48958
35995G661340j01569M66218l63599k293291k560265M29989M043814M295378J231526
35986A2809541j183986o44421Q93886J008008L16211M31812Q98524O62268P60213
35977A5952056K568489M511954L874968J658751K215926P282822J3341809J6238737
$$ plain form
36039 5051659 4958071 5908112 7240812 7802586 8286738 10123782 12674794 13759478 12765400
36030 12765400 11319370 10896843 11416044 12262978 13208115 14022025 14282746 13845765 12914417
36021 12914417 11851714 11438712 12552793 14655608 15559030 14138854 12425462 13085420
36013 13085420 15374979 15940916 13700546 11396003 11424461 12403806 11528897 8796743 6892458
36004 6892458 7483735 9386197 10454123 10016402 9028127 8520745 8470945 8210298 7661340
35995 7661340 7559771 8025989 7662390 5369099 2808834 3238823 7282637 11578015 12809541
35986 12809541 11625555 10981134 11875020 12883028 13199239 13631051 14529575 15191843 15952056
35977 15952056 18520545 23032499 26907467 28566218 30782144 38064966 51406775 67645512
35969F7645512J5877256J4678170J3765415J3018260J3155547J4977837J7250474
35962A70368471J7676073J5571007J1705717O319503l35393o160535q870111r481221
35954A96793511j1181417j4373334j6107966j5382579j5361265j8158608k0654250
35947H5574092j8742760j3520632r585999q476825p570739n059485k328726j020313
35939A9268613r51932j685654l238416m292676k614565J260559L370460J319527
35931A2435916k154922k822891n66292J103154J71767j734308k207982j000349
35923C224093L61350O20775r4344p02974m97102K1219O3044N1228R37848J977159
35913E962296J128579j486497k671109m00218K811950L050842K50349k151769
$$ plain form
35969 67645512 83522768 98200938 111966353 124984613 138140160 153117997 170368471
35962 170368471 188044544 203615551 215321268 221640771 221305378 215144843 206274732 196793511
35954 196793511 185612094 171238760 155130794 139748215 124386950 106228342 85574092
35947 85574092 66831332 53310700 43724701 35247876 27677137 22617652 20288926 19268613
35939 19268613 18316681 16631027 13392611 9099935 6485370 7745929 11116389 12435916
35931 12435916 10280994 7458103 6891811 7994965 8166732 6432424 4224442 3224093
35923 3224093 3585443 4206218 4111874 3408900 2911798 2933017 2996061 3047289 3985137 5962296
35913 5962296 7090875 5604378 2933269 2533051 5345001 8395843 8646192 6494423
35905F494423j979419k19628J350850J887534R84046j063144k399019j328252
35897C727391R85041J791500P25994m3714K86778J19336j100880j556806l55380
35888D579260Q11073P59396O93811J325569J110465n28459j222750M51118J971539
35879I951022R41552n20730P04944L100462K865565L58705p35022P1729m09917
35870A6328310k773337l531239j254387O39328n09011k345458j735651J04394
35862D922949O7238j570938j773097M93141K948365L108287Q86552j628616k085211
35853E368670k30793J333263J25097k464157k666957J09428K261182J496154m8904
35844E282983L6673O31099m9582r81678p50126n19600j315645j221851R97708
$$ plain form
35905 6494423 4515004 4295376 5646226 7533760 8517806 7454662 5055643 3727391
35897 3727391 4712432 6503932 7229926 7186212 7472990 7592326 6491446 4934640 4579260
35888 4579260 5390333 6149729 6843540 8169109 9279574 8751115 7528365 7979483 9951022
35879 9951022 10892574 10371844 11076788 14177250 17042815 17401520 16666498 16738227 16328310
35870 16328310 13554973 10023734 8769347 9408675 8899664 6554206 4818555 4922949
35862 4922949 4990187 3419249 1646152 2139293 5087658 8195945 9082497 7453881 5368670
35853 5368670 5137877 6471140 6596237 4132080 1465123 1574551 3835733 5331887 5282983
35844 5282983 5319656 5950755 5901173 4919495 4169369 3649769 2334124 1112273 2109981
35835B109981K373900K49273k342802j028223K315756K281683j074417k489114
35827B396037m51927R15889k23255n00831J615600K393710l85158l014522k061638
35818F83905J06559K01147k25602J391346L168410K405789J230043K913461N290455
35809A7165513L946202R3951j122716P15947Q74391k114016l974872k066267N09307
35800A4027440M69038q58664j094122r93167j866454k206837m31654J482463O91090
35791I219133j773814k332669j52711J856081J266070r10448j829731n4641L038814
35782H326084M586357L331131J437539J923298M098579L823442n51403n048328
35774B1926699n163623k015785k59687j200969j794804l38336Q56272k36245j758853
$$ plain form
35835 2109981 4483881 4733154 2390352 1362129 3677885 5959568 4885151 2396037
35827 2396037 1944110 2859999 2636744 2135913 3751513 6145223 5760065 2745543 683905
35818 683905 790464 991611 766009 2157355 5325765 7731554 8961597 11875058 17165513
35809 17165513 21111715 21205666 20082950 20798897 21673288 19559272 15584400 13518133 14027440
35800 14027440 14496478 13637814 12543692 11550525 9684071 7477234 7045580 8528043 9219133
35791 9219133 7445319 5112650 4959939 6816020 8082090 7171642 5341911 5287270 8326084
35782 8326084 12912441 16243572 17681111 19604409 23702988 27526430 26975027 21926699
35774 21926699 16763076 14747291 14487604 13286635 11491831 11153495 12009767 11773522 10014669
35765A0014669j040220R90217J252275p16487k185053j305915N71511J226107
35757H807104M13799n52168q21369m85843K07653R97018J319647R16638N86894
35748A1389373J364510K901707L651186K942924J973324K258818L944941O267253
35740C6694036Q788128J1145770J2273062J1313028R167216P678816P033868N431598
35732A09525522K029372j155213j604139K04829J158024q37719m959070r289527
35724I5072079j2898358j5265833j5092880j1521337o253238k660583k202237
35717B9177613k983406k621726j316364q26719j398634j583852q77980n29495
35709A7039437j229846j787468j106520n6493p5519r58488j413273j036351l55349
$$ plain form
35765 10014669 8974449 9964666 11216941 10500454 8315401 7009486 7580997 8807104
35757 8807104 9220903 8668735 7847366 7361523 7569176 8566194 9885841 10802479 11389373
35748 11389373 12753883 15655590 19306776 22249700 24223024 26481842 30426783 36694036
35740 36694036 45482164 56627934 68900996 80214024 89381240 97060056 104093924 109525522
35732 109525522 111554894 110399681 108795542 109000371 110158395 109320676 104361606 95072079
35724 95072079 82173721 66907888 51815008 40293671 34040433 31379850 29177613
35717 29177613 26194207 23572481 22256117 21429398 20030764 18446912 17568932 17039437
35709 17039437 15809591 14022123 12915603 12859110 12783591 11825103 10411830 9375479 9020130
35700I020130M11904J150787J000083n67062k159432j868455k29330K55822j060466
35691E953981j757593L3139K682498L333900J835303N69231R86099K098298K403244
35682A8138100J785571J031638M63599k16616j098024j705928j641523j304675
35674A5452142j506047k206974k270083j090543J47766q908r21688o55820Q28864
35665G768709J309299j52810j413059n20918J057036P37807r22652j043745R22198
35656G741865K261297J253745k62142J23332J841320K520433J470503J72184j84573
35647A6937964m5259l37314j121343j736276j708249j187936n91704M6989J037580
35638A1294452K056538J837240j09297j852388q40756K354381M040532K205975
$$ plain form
35700 9020130 9432034 10582821 11582904 11015842 8856410 6987955 6758625 7014447 5953981
35691 5953981 4196388 4229527 6912025 10245925 12081228 12650459 13636558 15734856 18138100
35682 18138100 19923671 20955309 21418908 21202292 20104268 18398340 16756817 15452142
35674 15452142 13946095 11739121 9469038 8378495 8526261 8517353 7595665 6939845 7768709
35665 7768709 9078008 8925198 7512139 6991221 8048257 8786064 7863412 6819667 7741865
35656 7741865 10003162 11256907 10994765 11118097 12959417 15479850 16950353 17122537 16937964
35647 16937964 16892705 16555391 15434048 13697772 11989523 10801587 10209883 10256872 11294452
35638 11294452 13350990 15188230 15078933 13226545 12385789 14740170 18780702 20986677
35630B0986677n05817l56563K431657M517307M494538M435402O416382J0076993
35622E2496576J4113043J7595113J8626147J4244260M139814o648819j1237089
35615A03329045p364113P15851O480718O172457K64095p995530j4702120j7170155
35607F9730248j5090575j0320346n565612k966837l057610m374334m536145k592281
35599B1226508j89396K96212j372267l094056l046741j577060k34688K09975J39790
35590A2358277l0319m84419j338950j929078j394242N5041J128549J045324M56407
35581I866590J74984j87015j153834j722608o16589J099391R87534q55351j470670
35572F122432L50622J854935N83783j669246j757049n359R18363M37942L7110
$$ plain form
35630 20986677 20480860 20124297 22555954 27073261 31567799 36003201 42419583 52496576
35622 52496576 66609619 84204732 102830879 117075139 121214953 114566134 103329045
35615 103329045 95964932 96680783 103161501 109333958 109598053 101602523 86900403 69730248
35607 69730248 54639673 44319327 38753715 35786878 32729268 28354934 23818789 21226508
35599 21226508 21037112 21333324 19961057 16867001 13820260 12243200 12008512 12218487 12358277
35590 12358277 12327958 11843539 10504589 8575511 7181269 7236310 8364859 9410183 9866590
35581 9866590 10041574 9854559 8700725 6978117 6361528 7460919 8448453 7593102 6122432
35572 6122432 6473054 8327989 8911772 7242526 5485477 5480118 6398481 6836423 6873533
35563F873533r1300p66698q99792J239207L966292L464924l65061l281388k827308
35554G312409j185289o67610l94108O47704J087816J33252m35680K16342o9018
35545F645818k109035k632944M64619L500842K135082j581486k341739J39328
35537D220485J416467p5309j250255l18231O91670K83289j81183J71357L5101
35528D993391r43778r13778P53626K001478J555700P85479N94055m37973k944936
35519E443264m620653l293045j2293K640817L334092J853019j335350l996267
35511A3584l295029K27223K454570J258352n37594J62740K077869K336922J189998
35502E888635O30997M80946o40210k024225j965052q89403k55274L33265J694641
$$ plain form
35563 6873533 6782233 6015535 5115743 6354950 10321242 13786166 13421105 10139717 7312409
35554 7312409 6127120 5459510 5065402 5713106 6800922 6934174 6498494 6714836 6645818
35545 6645818 4536783 1903839 2368458 5869300 8004382 6422896 4081157 4220485
35537 4220485 5636952 5561643 4311388 3993157 4684827 4968116 4786933 4958290 4993391
35528 4993391 4049613 3135835 3889461 5890939 7446639 8232118 8826173 8388200 5443264
35519 5443264 822611 -2470434 -2482727 158090 3492182 5345201 4009851 13584
35511 13584 -3281445 -3054222 -599652 658700 121106 283846 2361715 4698637 5888635
35502 5888635 6519632 7000578 6360368 4336143 2371091 1481688 1226414 1559679 3254320
35493C254320K273450M68518j619365r69367R15604J69955k375149j887058K081742
35484B312650L845686M21938l417326k478507J130920K170327N51373R5131J264875
35475E897067R54640j123904j500122Q16817K158403J20107k490596k226475k46399
35466B359538J41681j117481j312840L34243J720187J359507J52602n50919n70269
35457B516249l00901j40676n55076j246721o59269J819816L730992K238476j204066
35448F198824k099556N83199K676406J125059j506923j433287N60295J234275
35440G338292N06080Q20875K173687K041894R4269r55363K79440J946156K186521
35431A6431851J494204J115485J525253K930861M851365N026566J571596l460046
$$ plain form
35493 3254320 5527770 5996288 4376923 3407556 4323160 4493115 2117966 230908 2312650
35484 2312650 6158336 6580274 3162948 684441 1815361 3985688 4537061 4632192 5897067
35475 5897067 6851707 5727803 4227681 5044498 7202901 7323008 4832412 2605937 2359538
35466 2359538 2501219 1383738 70898 405141 2125328 3484835 3637437 3086518 2516249
35457 2516249 2215348 2074672 1519596 272875 -386394 1433422 5164414 7402890 6198824
35448 6198824 4099268 4682467 7358873 8483932 6977009 5543722 6104017 7338292
35440 7338292 7844372 8665247 10838934 12880828 12975097 12019734 12299174 14245330 16431851
35431 16431851 17926055 19041540 20566793 23497654 28349019 33375585 34947181 31487135
35423C1487135n689815m083796j883136j387789j427519r45097j118463k226092
35415A2725428k195990m17668N57750n56696j247910K47252J495711J95612j494248
35406I309241p07711J094397R43265m19157m58184K79479l00721j308907m21401
35397H010301J577395K265502K113295K997510L701343J802686j257139k162929
35389A9047964j606730k654600m310970k918402N81774J526734k70646l68255
35381I026869J616445J036380k357989k477260K354277N212947K018849j057235
35373A5373283J879381O282155N882017M579409Q966742J4624972J3862597J4843669
35365H6294225L5001413O8896377P9198233L7030025l3435291o9165636l4780692
$$ plain form
35423 31487135 25797320 21713524 19830388 18442599 17015080 16069983 14951520 12725428
35415 12725428 10529438 10111770 10669520 10112824 8864914 9112166 10607877 10803489 9309241
35406 9309241 8601530 9695927 10639192 10220035 9761851 10041330 9740609 8431702 8010301
35397 8010301 9587696 11853198 13966493 16964003 20665346 22468032 21210893 19047964
35389 19047964 17441234 14786634 10475664 7557262 8139036 9665770 9395124 9026869
35381 9026869 10643314 11679694 9321705 6844445 9198722 14411669 16430518 15373283
35373 15373283 17252664 23534819 29416836 33996245 42962987 57587959 71450556 86294225
35365 86294225 121295638 190192015 269390248 306420273 272984982 203819346 169038654
35358A69038654L4671891O8017806L2457227l5866360p6245818o6584329l4312938
35351I1176133j3986425j1362562j1777045p485025l554919l564283l629351j291833
35343C4524690j11495k391246m475481k804794M89913J439838j32787j879365
35335B4659273k811454l147219k599405j255262m52196r54381j735902j728462
35327I974992j085705j036J528631K115260l7267l501757m109355p56135K381442
35318F509070J706918p07213q68516Q57578R58979j266922k901311k159773m91895
35309A636915L80795O40222Q73775P08863q9376p85252q00197n10681l26247n813
35299A723004N76283Q87744N21943j26361m23974k53518J27473N40948Q31584
$$ plain form
35358 169038654 203710545 271728351 304185578 268319218 192073400 125489071 91176133
35351 91176133 77189708 65827146 54050101 46565076 43010157 39445874 35816523 34524690
35343 34524690 34413195 32021949 27546468 24741674 25231587 26671425 26538638 24659273
35335 24659273 21847819 18700600 16101195 14845933 14393737 13439356 11703454 9974992
35327 9974992 8889287 8888251 10416882 12532142 12494875 8993118 4883763 4127628 6509070
35318 6509070 8215988 7508775 6640259 7497837 8456816 7189894 4288583 2128810 1636915
35309 1636915 2017710 2657932 3531707 4240570 4151194 3365942 2565745 2055064 1728817 1723004
35299 1723004 2299287 3187031 3708974 3582613 3158639 2905121 3032594 3573542 4405126
35290D405126O48412k52964j405876j670382l85617J417184J648746l35051k411545
35281A658033j944451Q56860L083062K732539Q66213k55826N8514P66951P69150
35272H591045m2743q91096q51173N0436N40864k20247r43794K61963K640221L104622
35262A2240098N19688k376278k606537p41917N77822M44167P3839L54527R17109
35253I402518J212689R75860n1555j643621k771612k775515k226857j734482q94085
35244e06660M83888J349037J056899P49627J335896J421554m96099k870122k832676
35235c08656m95685J256054J046314K46357j16970o47929j196119k51916K049360
35226A580810L085125J557150k91304k31609L98906p86434k840244k654596J23642
$$ plain form
35290 4405126 5053538 4800574 3394698 1724316 1338699 2755883 4404629 4069578 1658033
35281 1658033 -286418 570442 3653504 6386043 7252256 6996430 7054944 7821895 8591045
35272 8591045 8548302 7657206 6806033 6856469 7397333 7177086 6233292 6495255 9135476 12240098
35262 12240098 12759786 10383508 7776971 7035054 7612876 8057043 8130882 8485409 9402518
35253 9402518 10615207 11591067 11539512 9895891 7124279 4348764 2121907 387425 -506660
35244 -506660 -22772 1326265 2383164 3132791 4468687 5890241 5394142 2524020 -308656
35235 -308656 -804341 451713 1498027 1744384 1627414 979485 -216634 -468550 1580810
35226 1580810 4665935 6223085 5931781 5700172 6099078 5312644 2472400 -182196 -58554
35217e8554K299124J552789p33959j892530j344126l87169J07349L53491N48889
35208D45304M44903O7304j14466l1261k42289q35856q23627N10538K110802K145101
35198C676453M52176j204210j532940j074591o81424n7559J213135K371421K432603
35189E595064J579558N47703m61746j228524j052393j18025j3432j333136k193209
35180A321860j055209N13470L53404n35674J27282J533940J098125n71861l89267
35171B396070J445506J140877k142785m167337k092764J226502K113176J329137
35163A248382J242220J246212j57231j501242o60058J078449J177775K52612L55641
35154D282760O54710q08068k487503j321734J441925J549748j138789k112146
$$ plain form
35217 -58554 2240570 3793359 3059400 1166870 -177256 -564425 -457076 -103585 445304
35208 445304 890207 957511 843045 811784 569495 -266361 -1089988 -579450 1531352 3676453
35198 3676453 4128629 2924419 1391479 316888 -364536 -422095 791040 3162461 5595064
35189 5595064 7174622 7722325 7260579 6032055 4979662 4861637 4848205 3515069 1321860
35180 1321860 266651 780121 1133525 597851 725133 2259073 3357198 2785337 2396070
35171 2396070 3841576 4982453 2839668 -1327669 -3420433 -2193931 -80755 1248382
35163 1248382 2490602 3736814 3579583 2078341 1418283 2496732 3674507 3927119 4282760
35154 4282760 4937470 4129402 1641899 320165 1762090 3311838 2173049 60903
35146F0903L15418K212076O93898j384392m58423J810972J431348j465643k937488
35137B78669j074467J695903K234964M27339j271201r53524O29106J143328j27683
35128B982434j075106J72862K091562J831309k66609j159692n0547N52312n58473
35119D520052j211412N222R34348m16406k213360j752095J87950R98873M85201
35110A538373L13527N68087O2625p71965m43681N98591M62203q21744j176619
35101C29397J09131J299284R09237n18881j622108j539377j03740J651733J617598
35092B132274q53842l167027k570095l33670J20952j159552o72982K408549M224100
35083A28707K131774j020597j279003O23852J184721j51961q99563k36590j19245
$$ plain form
35146 60903 376321 2588397 3282295 1897903 1439480 3250452 4681800 3216157 278669
35137 278669 -795798 900105 3135069 3562408 2291207 1337683 1966789 3110117 2982434
35128 2982434 1907328 2080190 4171752 6003061 5736452 4576760 4526213 5078525 4520052
35119 4520052 3308640 3313862 4248210 3831804 1618444 -133651 54299 1053172 1538373
35110 1538373 1851900 2419987 2482612 1710647 1266966 1865557 2327760 1506016 329397
35101 329397 438528 1737812 2647049 2128168 506060 -1033317 -1137057 514676 2132274
35092 2132274 1278432 -1888595 -4458690 -4792360 -4671408 -5830960 -6503942 -4095393 128707
35083 128707 2260481 1239884 -39119 584733 1769454 1617493 717930 481340 362095
35074C62095j486992k489647j475923N24894J490303J002682R1410l52205o0984
35065b394367P83444J396686Q76763m19003q45899K95249J377654N82690j195781
35056D57436j309076P17889K098153N98788k078192k466294j01675K004506J722484
35047A644019M27834L18919J051099Q28252l86355r38872l30218J47116k51445
35038B510349o95075n57566m06184m62334J59624J530786J844926q5267k459150
35029A380109k572891o34580N91487j09639p74402N54249K740511L033330P96938
35020E005112j652792j913404k05787J159071N32941j353841k412594j540623
35012b381917L63867J563014J184301k97373j757480k297245j789875q47939M730
$$ plain form
35074 362095 -1124897 -3614544 -5090467 -4565573 -3075270 -2072588 -1981178 -2333383 -2394367
35065 -2394367 -1610923 -214237 662526 243523 -602376 -307127 1070527 1653217 457436
35056 457436 -851640 -133751 1964402 2563190 484998 -1981296 -2082971 -78465 1644019
35047 1644019 2071853 2390772 3441871 4270123 3883768 2944896 2614678 2761794 2510349
35038 2510349 1815274 1257708 851524 389190 548814 2079600 3924526 3839259 1380109
35029 1380109 -1192782 -1827362 -1235875 -1345514 -2119916 -1565667 1174844 4208174 5005112
35020 5005112 3352320 1438916 1233129 2392200 2925141 1571300 -841294 -2381917
35012 -2381917 -2018050 -455036 729265 431892 -1325588 -3622833 -5412708 -6260647 -6255917
35003f255917J083430K757186L919180K647049q23937l275886k263395M12963
34995a799327J123785l94350r77957P72398K332351J460358k70854k58019R83100
34986B971485J090901j12769o83129K3391O49612L67119k75947r64126j769997
34977A296540j737071K14454K735365K966533N69658j646372j792919r67705m07505
34968A230978M46720J595610J250537q88557j930172n7236J996176R01324j952360
34959B593020k733712j144329r7014m01822o5728J263105J395658k27127j272304
34950f90253m61403N78044N33619L24168N82731L01040o47105o21933O69639J164228
34940A732775J14951l80487O22976P78708j236778k647599j006945J342363J033392
$$ plain form
35003 -6255917 -5172487 -2415301 1503879 4150928 3326991 51105 -2212290 -1799327
34995 -1799327 -675542 -1069892 -2047849 -1275451 1056900 2517258 2246404 1988385 2971485
34986 2971485 4062386 3949617 3266488 3289879 3939491 4306610 4030663 3066537 1296540
34977 1296540 -440531 -226077 2509288 5475821 6045479 4399107 2606188 1638483 1230978
34968 1230978 1677698 3273308 4523845 3635288 1705116 1647880 3644056 4545380 2593020
34959 2593020 -140692 -1285021 -1382035 -1783857 -1849585 -586480 809178 582051 -690253
34950 -690253 -1151656 -573612 -39993 284175 866906 1167946 520841 -101092 568547 1732775
34940 1732775 1847726 1467239 2090215 2868923 1632145 -1015454 -2022399 -680036 353356
34931C53356o84236m10651J327455J381452J38344R41423L364366K653720k537508
34922F527721o774736n047713K82639L145396J923447K30402O66933J617878Q54196
34913C426163o64413n44897R08189Q20285j711069l514093j630814J792140J957450
34904H38941j449922l328505p20172K500374J513444j971630k489315O91968K834150
34895a580667J264884j176922j267513K04554R85805R44005R37855O64190k04133
34886G72058o52486L8842R03208J017951R21013R19355o0438k209437l297282
34877a647216j517664J526241K823705J904278P28030M43519L61265j76254p63117
34868C682787q59231m94648R826K43181j33490q14846r25427k18957M57894M19412
$$ plain form
34931 353356 -330880 -741531 585924 1967376 2105720 3047143 6411509 9065229 6527721
34922 6527721 -247015 -5294728 -5012089 -1866693 56754 287156 954089 2571967 3426163
34913 3426163 2761750 2216853 3125042 3945327 2234258 -1279835 -2910649 -1118509 838941
34904 838941 -610981 -3939486 -4659658 -2159284 -645840 -2617470 -5106785 -4414817 -1580667
34895 -1580667 -315783 -1492705 -2760218 -2555664 -1569859 -625854 312001 976191 772058
34886 772058 119572 158414 1061622 2079573 3000586 3919941 3859503 1650066 -1647216
34877 -1647216 -3164880 -1638639 1185066 3089344 3817374 4260893 4622158 4445904 3682787
34868 3682787 2823556 2328908 2338734 2581915 2448425 1633579 708152 489195 947089 1366501
34858A366501L1255j51573j30304J39470Q37399J231371J63543j610621j536673
34849C40368R20708K630485J017261j874406k196711J14536J677953J000891J01371
34840C732456M55205N93060q75785k427945j874145J32577J003931o5806j251164
34831e77616r30235K76445Q20007L96981r3379j62213k60698p33332j158587j070146
34821c492773o55106l12843j33316k36859q48555j438270p80791J171242K558645
34812d168626K105358J183929J533356K076343O72519j668348j686322Q35926
34804H84135K232005M76406j796572j531108M55060J536234J076368r1056j612754
34795A628718k685285j527693J581210L049784P64266k088426j481906J184805
$$ plain form
34858 1366501 1397756 1246183 1115879 1255349 2092748 3324119 3487662 1877041 340368
34849 340368 1261076 3891561 4908822 3034416 837705 952241 2630194 3631085 3732456
34840 3732456 4187661 4780721 3904936 1476991 -397154 -264577 739354 673548 -577616
34831 -577616 -1507851 -1231406 -411399 -14418 -107797 -270010 -530708 -1264040 -2422627 -3492773
34821 -3492773 -4147879 -4460722 -4594038 -4830897 -5679452 -7117722 -7898513 -6727271 -4168626
34812 -4168626 -2063268 -879339 654017 2730360 3402879 1734531 48209 884135
34804 884135 3116140 3592546 1795974 264866 719926 2256160 3332528 3241472 1628718
34795 1628718 -1056567 -2584260 -1003050 2046734 2811000 722574 -759332 425473
34787D25473J432647j126634k621634j369892K60468P08805J291061K362648J788149
34778C151091r26572k722268j460100P83772J258363O59481J083892K075058J625477
34769E528194k42194j600206j589580j037624n81652q9934L01902J56579l75464
34760D70021q00385j168543j692022j821696q25852Q10300J555428O27093r22355
34751c768011j209287M11496K387676K487485N20945j164933o35644J018089J315069
34742A362885l0187r33841j48659J239984J698624R14734o31116k097075k168090
34733g92741l45892J534737J127863r54791j869144r32585l58996r66320o40525
34724d198394J344700K080066k19111k322706m44788L594347M654999J536685
$$ plain form
34787 425473 1858120 731486 -1890148 -3260040 -2999572 -2290767 -999706 1362942 3151091
34778 3151091 2224519 -497749 -1957849 -1174077 84286 743767 1827659 3902717 5528194
34769 5528194 5286000 3685794 2096214 1058590 476938 387004 688906 845485 470021
34760 470021 -330364 -1498907 -3190929 -5012625 -5838477 -5028177 -3472749 -2845656 -3768011
34751 -3768011 -4977298 -4565802 -2178126 309359 830304 -334629 -970273 47816 1362885
34742 1362885 1332698 398857 250198 1490182 3188806 4103540 3472424 1375349 -792741
34733 -792741 -1138633 396104 1523967 569176 -1299968 -2232553 -2591549 -3557869 -4198394
34724 -4198394 -2853694 -773628 -992739 -3315445 -3760233 -165886 4489113 6025798
34716F025798j991275k986747k346091j689005p65843P99185J811276J144248
34708A546m24399j162138k82881J534676K671861J667169j128414l267952k872009
34699c262541j109219l75043n67259M82140K881035L714747J241066k146154k792620
34690a933848l86763J867386J242272j400145k608567l10388L347819L980964
34682C798730L65826l507428l338920j09771J760180R03291J83213J280301J986407
34673C321829M12384j503032j145226O09967J132460J81451m81769m29797p35272
34664A362995j429917j386680n73773j92049n14238n30154R3506M37000J1268
34655b722042m35920j60466O32953J311069J427036Q46780J2733k31351J49937
$$ plain form
34716 6025798 4034523 1047776 -1298315 -2987320 -3753163 -2953978 -1142702 1546
34708 1546 -422853 -1584991 -1867872 -333196 2338665 4005834 2877420 -390532 -3262541
34699 -3262541 -4371760 -4746803 -5314062 -4831922 -1950887 1763860 3004926 858772 -1933848
34690 -1933848 -2320611 -453225 789047 -611098 -3219665 -3530053 -182234 3798730
34682 3798730 4164556 657128 -2681792 -2791563 -1031383 -128092 55121 1335422 3321829
34673 3321829 3734213 2231181 1085955 1695922 2828382 3009833 2528064 2098267 1362995
34664 1362995 -66922 -1453602 -2027375 -2219424 -2733662 -3263816 -3170310 -2733310 -2722042
34655 -2722042 -3157962 -3318428 -2685475 -1374406 52630 899410 912143 680792 830729
34646H30729j5073j293712k293772j527798J62300P70323J12432k48389L59987
34637c142973J160482J721656K211741K036697M62320j432520j758805q18637
34629D39961n94803j175078o55758R76784J285299k33467p95191Q58547J893914
34620B000208K03297j613890n02058J702464J274102j176246j973399n39026L83950
34611b40598L9638M30943J685848J389778o19618j324802J94734R06001p88951
34602A672973k014999m68280J369279N20580j242338n62055J532701J418139p69573
34593A456427j346140O54663K017424Q39028o72999m16719J69003q68375k312128
34584d79816j872151j68474K62317r18912j458207j45206J538438J910439J247749
$$ plain form
34646 830729 815656 -478056 -2771828 -4299626 -4137326 -3367003 -3254571 -3502960 -3142973
34637 -3142973 -1982491 -260835 1950906 3987603 4449923 3017403 1258598 439961
34629 439961 -154842 -1329920 -1985678 -1008894 276405 42938 -752253 106294 2000208
34620 2000208 2203505 589615 87557 1790021 3064123 1887877 -85522 -624548 -240598
34611 -240598 -200960 229983 1915831 3305609 2685991 1361189 1555923 2461924 1672973
34602 1672973 -342026 -810306 558973 1079553 -162785 -724840 807861 2226000 1456427
34593 1456427 110287 764950 2782374 3621402 2948403 2531684 2700687 1832312 -479816
34584 -479816 -2351967 -2520441 -2258124 -3177036 -4635243 -4780449 -3242011 -1331572 -83823
34575h3823N36702k95643j524821k173067j182203M66257O89679n81154j147332
34566e295405L5362J180649O62447k19658N04502J921382J626407j02803o32007
34557c19124N03066P09727j061137k029426J47384L384404L988871J735877n21002
34548F538640j184259j189242j478730j720445j612677j459388j176864k55425
34540c538390J093248J948285J845192R80633l47937j460833j186745N33792J686173
34531A553418O05846j262777j163823P52030J478107l05144k204131j611172P42024
34522a415622K087518J204833n86157j321144l60850J167849J506164K18726j070646
34513A430671o14312J059653J805763P59092p98731j523238j452200j036967k30169
$$ plain form
34575 -83823 452879 157236 -1367585 -3540652 -4722855 -4256598 -3566919 -4148073 -5295405
34566 -5295405 -5260043 -4079394 -3416947 -3636605 -3132103 -1210721 415686 312883 -319124
34557 -319124 183942 893669 -167468 -2196894 -2049510 1334894 5323765 7059642 6538640
34548 6538640 5354381 4165139 2686409 965964 -646713 -2106101 -3282965 -3538390
34540 -3538390 -2445142 -496857 1348335 2328968 1981031 520198 -666547 -132755 1553418
34531 1553418 2159264 896487 -267336 484694 1962801 1657657 -546474 -2157646 -1415622
34522 -1415622 671896 1876729 1290572 -30572 -391422 776427 2282591 2501317 1430671
34513 1430671 816359 1876012 3681775 4440867 3642136 2118898 666698 -370269 -600438
34504f00438P79679J121945L43156q08476j267763p73531J23076O09965K00371
34495b72016o29274p04898K13918P45627q5900j053988n53361P25273J038977
34486e75642O34966R15059J244010j31560k151391j696035J164464K600104R06336
34477B910311j021504q59289l44473j063413r77903J270405K514989J18932k450624
34468I7431o34543L103815K594598j830978l491747j35148K547120L72929k884143
34459b60666k263922N41269R84862o20924o21771J156397J578113J63932k14990
34450D42300J335149K197526Q62971o94099n42320L72509L89594l47881r98558
34441C017191j565917j923669j145605P49401J976235J314891j25310p40263o03654
$$ plain form
34504 -600438 179241 1301186 1644342 835866 -431897 -1205428 -1082352 -472387 -272016
34495 -272016 -901290 -1606188 -1392270 -646643 -732543 -1786531 -2339892 -1614619 -575642
34486 -575642 59324 974383 2218393 2086833 -64558 -1760593 -596129 2003975 2910311
34477 2910311 1888807 1029518 685045 -378368 -1356271 -85866 2429123 2548055 97431
34468 97431 -537112 2566703 5161301 3330323 -161424 -296572 2250548 2623477 -260666
34459 -260666 -2524588 -1983319 -998457 -1619381 -2241152 -1084755 493358 657290 442300
34450 442300 1777449 3974975 4837946 4143847 3601527 3974036 4363630 4015749 3017191
34441 3017191 1451274 -472395 -1618000 -868599 1107636 2422527 2297217 1556954 953300
34432I53300m90107k06886N50011R88468M93221q8047p932j22059j058485j413543
34422d02059l9440J326329N19532j163424q53606R20501J012455p56247j101232
34413e37191Q80554J848927L563j567878j62186J689826L94762k559971k927537
34404b937131l48921J673494J488318P57693M81983l74321j806958j902848l9559
34395c008250J881286K316782J745260P85935p51407k100887j488307Q66192K065091
34386B311695M47496j788186j667250L69808J314926j68951k142747k016248L12996
34377c026461K377520K065102K30720m50920O86745J318110m172j145383J30201
34368B181462J907912Q56026j930179k112880Q75349K555831K97306k798547k984395
$$ plain form
34432 953300 463193 256307 806318 1794786 2288007 2199960 2192028 2069969 1011484 -402059
34422 -402059 -441499 884830 1404362 240938 -612668 307833 1320288 564041 -537191
34413 -537191 343363 2192290 2195853 627975 465789 2155615 2550377 -9594 -2937131
34404 -2937131 -3286052 -1612558 -124240 633453 1115436 741115 -1065843 -2968691 -3008250
34395 -3008250 -1126964 1189818 2935078 3721013 2969606 868719 -619588 246604 2311695
34386 2311695 2759191 971005 -696245 -326437 988489 819538 -1323209 -3339457 -3026461
34377 -3026461 -648941 1416161 1646881 1195961 1882706 3200816 3196644 2051261 2181462
34368 2181462 4089374 4945400 3015221 902341 1777690 4333521 4630827 1832280 -1152115
34359a152115j117218j10248j59184L68518J382965J444392M16798o24773j091513
34350f42378p92795M37643J574323P66192j519907k035589N13016K781504J537117
34341B619126j317565j848266k35379J55081j344949j973690m71964J184274J454878
34332a778454J215789J251805P77946m40279j048641m17386J59205j69283j65925
34323f15223J287669K845968K265715m38243k873458l099338j508731J83323R62739
34314i89579R89322N23724n18565j568255j200611P85924K100678P84270j359278
34305d52370q66916J973320L191675J311242l98736L60260R36166j401822m103558
34296E49261l145717K18415J363337l49974j106693P00043K167841J071493q38705
$$ plain form
34359 -1152115 -2269333 -2379581 -2538765 -2170247 -787282 657110 1073908 449135 -642378
34350 -642378 -1435173 -997530 576793 1342985 -176922 -2212511 -1699495 1082009 2619126
34341 2619126 1301561 -546705 -782084 -627003 -1971952 -3945642 -4417606 -3233332 -1778454
34332 -1778454 -562665 689140 1467086 1026807 -21834 -439220 -280015 -449298 -615223
34323 -615223 672446 3518414 5784129 5345886 2472428 -626910 -2135641 -1952318 -989579
34314 -989579 -257 523467 4902 -1563353 -2763964 -1978040 122638 906908 -452370
34305 -452370 -1319286 654034 3845709 5156951 4758215 5118475 6054641 4652819 549261
34296 549261 -2596456 -2378041 -1014704 -1364678 -2471371 -1771328 396513 1468006 629301
34287F29301j233257n64137k97247l43427N8454P38395J176374J271458Q19964
34278B255878l11450j149286m65534J049803J340269K1639j096256r01441l37416
34269D06206l36634m47035k61014l38552q60609r70057k17217P17965J230855
34260a076092J325893P27709q62202k326293j801709O28700K580815K335621P06181
34251B238623n49802p42643j85016N76076R86030Q86104P25701N63280m57579
34242D040774k382771l304005j851093K86581P05751K6576L94311J333889O79738
34233g0249j052385j300043k34578m53732j661790o11788K605374L468211L07098
34224I96118k404984j049633J541375J280348n68132n42396O44734O4008j428581
$$ plain form
34287 629301 -603956 -1168093 -1465340 -1808767 -1750313 -1011918 164456 1435914 2255878
34278 2255878 1944428 795142 329608 1379411 2719680 2741319 1645063 743622 406206
34269 406206 69572 -377463 -638477 -977029 -1837638 -2807695 -3024912 -2306947 -1076092
34260 -1076092 249801 977510 115308 -2210985 -4012694 -3383994 -803179 1532442 2238623
34251 2238623 1688821 946178 761162 1337238 2323268 3209372 3935073 4498353 4040774
34242 4040774 1658003 -1646002 -3497095 -3210514 -2504763 -2478187 -2083876 -749987 -70249
34233 -70249 -1122634 -2422677 -2657255 -3110987 -4772777 -5384565 -2779191 689020 996118
34224 996118 -1408866 -2458499 -917124 363224 -204908 -747304 -102570 -38562 -1467143
34215a467143n67287K095560K539913k50582k743125k296799k62678J131109J589339
34206b31693J430860M07352r07407r06277O08844J616498O34985j195297j803195
34197c45330q06312M44002O50742k16644j031721o54901O68476J381569O53529
34188G43410l35508j29629P15765N24853p36833j256265n2202J569665J726320
34179B769576J99981j504163j864743q43564J88575R3402o25607o94152j60351
34170b441046k75563j046884p36134J228024K693367J755326l15745j144019q58251
34161a140925j138784j692480p17926J389546K025001O04586k96217P34167J437653
34152A204621k25783k230549j517091Q09276R98460j124519j556005J264115L238971
$$ plain form
34215 -1467143 -2034430 61130 2601043 2350461 -392664 -2689463 -2952141 -1821032 -231693
34206 -231693 1199167 1606519 699112 -207165 401679 2018177 2653162 1457865 -345330
34197 -345330 -1151642 -707640 -56898 -273542 -1305263 -1960164 -1291688 89881 743410
34188 743410 407902 278273 994038 1518891 782058 -474207 -526409 1043256 2769576
34179 2769576 2969557 1465394 -399349 -1242913 -1054338 -960936 -1586543 -2280695 -2441046
34170 -2441046 -2716609 -3763493 -4499627 -3271603 -578236 1177090 861345 -282674 -1140925
34161 -1140925 -2279709 -3972189 -4690115 -3300569 -1275568 -670982 -967199 -233032 1204621
34152 1204621 978838 -1251711 -2768802 -1959526 -961066 -2085585 -3641590 -2377475 861496
34143H61496P50105l118409k642543J816953M000410Q56172l325327l596328r12881
34134e310352Q58399R90420J204694J438305M59159p94929n00804M62289P1242
34125a121577p05515M64771K322825J451984j547784k449589m36873O16293q72939
34116b278404j488854O93186K314785O65499j434582o39149J190404P10706q66361
34107a132770k84674J742599J890931n5990j316861q17957J51104R48045J633280
34098B757707J165019r01552k158615m96608J740497P81307k398076l285441p57210
34089c552972J636271J466587K81734m0513J0694l62428o53750o03830p98493
34080b616700r81129j79220J043427R90748r9868k4578J788064L203851K637499
$$ plain form
34143 861496 1611601 -1506808 -4149351 -2332398 1668012 2524184 -801143 -4397471 -5310352
34134 -5310352 -4451953 -3461533 -2256839 -818534 -359375 -1154304 -1655108 -1192819 -1121577
34125 -1121577 -1827092 -1362321 960504 2412488 864704 -1584885 -2021758 -1405465 -2278404
34116 -2278404 -3767258 -3074072 -759287 -93788 -1528370 -2167519 -977115 -266409 -1132770
34107 -1132770 -1417444 325155 2216086 2160096 843235 25278 176382 1124427 2757707
34098 2757707 3922726 3021174 862559 365951 2106448 2887755 489679 -2795762 -3552972
34089 -3552972 -1916701 -450114 -168380 -208893 -198199 -560627 -1214377 -1818207 -2616700
34080 -2616700 -3597829 -3777049 -2733622 -1742874 -1842742 -1867320 -79256 3124595 5762094
34071E762094J049642m8778m54978m47735p4666R9702o92152j880702j972033
34062A340394p73858L68053O17753L58724J0732k45403P1448Q70971P37293j024261
34052B331846k450006j347597J145454J992334N39115j263897k136752k163839
34044c353342j114271Q36000J640719J1476j572092l10957J726589O27506k155550
34035c663922j484663K565957M044394P54715k053186m03188K194344J259431
34027C213882j294568j287418M12231J58697j721439j837363K72467J881315J827080
34018A624884J321595P32239n98300j803281j329492n1459k29751j476811j040382
34009b850758J557246L226026J624135j573926l009144j781240m069K06363o86909
$$ plain form
34071 5762094 6811736 6762958 6307980 5860245 5785579 5885281 5193129 3312427 1340394
34062 1340394 566536 934589 1552342 1911066 1921798 1676395 1747843 2618814 3356107 2331846
34052 2331846 -118160 -1465757 -320303 1672031 2211146 947249 -1189503 -3353342
34044 -3353342 -4467613 -3631613 -1990894 -1979418 -3551510 -3862467 -2135878 -1508372 -3663922
34035 -3663922 -5148585 -2582628 1461766 2216481 163295 -239893 1954451 3213882
34027 3213882 1919314 631896 1044127 1202824 -518615 -2355978 -2083511 -202196 1624884
34018 1624884 2946479 3678718 3080418 1277137 -52355 -103814 -333565 -1810376 -2850758
34009 -2850758 -1293512 1932514 3556649 1982723 -1026421 -2807661 -2811730 -2605367 -3292276
34000c292276m89858J431083K776567J394881j222059j781583j15671P74628j08050
33991f32338k22742J530026K218014j38277k515895j402700J396146J626218o50493
33982A207959j644916k10593R14467K12650n01740J24690P25839R6127o07618
33973C16865j56425N01695l7712j259813j652769r69708k05465R2007L31229Q19673
33963b220423J037140L65902o84832o82922P65354J925641J037409r24260j417582
33954g98573k03105L51408o23678r08180Q49152K352021J132827j464353k474492
33945a786973j668898q41552k70064R37665K017090J354177l83329r60941j33423
33936a736248L70257J44749M47284J286240J127152k06370j058881p66230m51822
$$ plain form
34000 -3292276 -3782134 -2351051 425516 1820397 598338 -1183245 -1298916 -524288 -632338
33991 -632338 -855080 674946 2892960 2754683 238788 -1163912 232234 1858452 1207959
33982 1207959 -436957 -647550 266917 479567 -22173 102517 828356 924483 316865
33973 316865 160440 662135 624423 -635390 -2288159 -3257867 -3463332 -3371325 -3040096 -2220423
33963 -2220423 -1183283 -817381 -1502213 -2185135 -1419781 505860 1543269 619009 -798573
33954 -798573 -1001678 -650270 -1273948 -2182128 -1332976 1019045 2151872 687519 -1786973
33945 -1786973 -3455871 -4297423 -4567487 -3629822 -1612732 -258555 -641884 -1602825 -1736248
33936 -1736248 -1365991 -1221242 -773958 512282 1639434 1433064 374183 -392047 -843869
33927h43869o67070o86652m40418o43484p35725O34002K678348K857786Q39898
33918B992816p72142m98941J28671k05555m99823n853M8095q41271q18198J030277
33908E58076K305893Q90276j270072r98995J071416J514724o66392k859861k718640
33899b173575p47561J049201J223927l08838j984036j580269R97145K856027J885692
33890A217713J09224O34792K404702J593394k024294m187161k500171K73261J020941
33881a457599O88651J268644J641804n9682k266856k039485J22740J354871J249323
33872E02411J564915J846684j5544k727957k149506J774834L627581N13500l212899
33863A724019k696869J08238M53933j211230q50685J510333J815856o79538j913399
$$ plain form
33927 -843869 -1510939 -2197591 -2638009 -3281493 -4017218 -3383216 -704868 2152918 2992816
33918 2992816 2220674 1721733 1850404 1644849 1145026 1139173 1187268 345997 -472201 558076
33908 558076 2863969 3754245 2484173 1485178 2556594 4071318 3404926 545065 -2173575
33899 -2173575 -2921136 -1871935 -648008 -956846 -2940882 -4521151 -3524006 -667979 1217713
33890 1217713 1326937 1961729 4366431 5959825 3935531 -251630 -2751801 -2478540 -1457599
33881 -1457599 -768948 499696 2141500 2081818 -185038 -2224523 -2101783 -746912 502411
33872 502411 2067326 3914010 3898466 1170509 -978997 795837 4423418 4936918 1724019
33863 1724019 -972850 -864612 -410679 -1621909 -2472594 -962261 853595 174057 -1739342
33854a739342J56096K319518J552699n55058j101627k11022L43362K23904r873
33845I78657m73083j145943j255361p83893p46487j078754n26205O14612M79779
33836c936678p03415k83392K086726L045190Q62462j535807j434250m62444p55837
33827c117445p77406J115805K449935O52601j670519o87010J830956J340593j519099
33818c81589j994832N33172J749501R1469j039784O0034N23709j205985k093573
33809c757878k668K205268J429711o46999q53774K70186K61633o36004l27936
33800b058461J115870J625266N46846p45234j150848p21604K30095J215361J288189
33791A345480O1188j462221j979430j180840M67375K059106K084374k67306l081448
$$ plain form
33854 -1739342 -1583246 736272 2288971 1733913 632286 421264 764626 988530 978657
33845 978657 505574 -640369 -1895730 -2679623 -3426110 -4504864 -5031069 -4416457 -3936678
33836 -3936678 -4640093 -4923485 -2836759 208431 1070893 -464914 -1899164 -2361608 -3117445
33827 -3117445 -3894851 -2779046 -329111 323490 -1347029 -2034039 -203083 1137510 -381589
33818 -381589 -2376421 -1843249 -93748 -2279 -1042063 -982029 -458320 -1664305 -3757878
33809 -3757878 -3760546 -1555278 -125567 -772566 -1626340 -1356154 -1094521 -1730525 -2058461
33800 -2058461 -942591 682675 1229521 484287 -666561 -1388165 -1158070 57291 1345480
33791 1345480 1406668 -55553 -2034983 -3215823 -2748448 -689342 1395032 1127726 -1953722
33782a953722l191225o12403R79934l44890j635881K85178L456687L429779m5705
33773C67752k642492j660070P00540J165143j24252o74094K88343R26213n1013
33764a703930j110696m4826K378236K921679M83095k015344j876966n92190q72157
33755b433099j597034K87923L679231L948809K60683k632359j663292J46042o98294
33746g01390k439298j695720O81934J656356J253411J365242J441068l1302j424618
33737A05683k30506J740013N99653k665137k989084N48394K836244P07563k301398
33728a648575j846212Q32932J803463N44489n12526m77176n09557r47304r30879
33719c691345l93241j09415j45322n9924r6570n18365m56223Q11420K043447J404343
$$ plain form
33782 -1953722 -5144947 -5757350 -4777416 -5122306 -6758187 -6473009 -3016322 413457 367752
33773 367752 -2274740 -3934810 -3234270 -2069127 -2193379 -2867473 -2579130 -1652917 -1703930
33764 -1703930 -2814626 -2859452 -481216 2440463 2923558 908214 -968752 -1560942 -2433099
33755 -2433099 -4030133 -3742210 -62979 3885830 4146513 1514154 -149138 -3096 -701390
33746 -701390 -3140688 -4836408 -4154474 -2498118 -1244707 120535 1561603 1530301 105683
33737 105683 -124823 1615190 2214843 -450294 -3439378 -2890984 -54740 652823 -1648575
33728 -1648575 -3494787 -2661855 -858392 -313903 -826429 -1303605 -1813162 -2760466 -3691345
33719 -3691345 -4084586 -4194001 -4339323 -4399247 -4495817 -5014182 -5470405 -4658985 -2615538 -1211195
33709a211195o65893j801472r04408O95035J421779J218722P18775N6534p46652
33700a218775j152078p02447J50526M31848k15044j062673j038116P3894J270440
33691c462425J432306O86377J23317J70403J25269m08405p10459k71138J55846
33682b158909r8119k22963O42043J421879M95575j327290j530102J56857R63652
33673a657377p23422k608860j724938J213030K897951J956096J18940p63593o73517
33664a965690k50779L19190O90887K63795o22163p25965K52299J099104Q93253
33655d6069J17775n30643r91835q96523N12473K530506K858446P47564j410227
33646B891467j401331m50528q93913k069564j510904N72664J427530M45274K15353
$$ plain form
33709 -1211195 -1877088 -3678560 -4582968 -3887933 -2466154 -1247432 -528657 -472123 -1218775
33700 -1218775 -2370853 -3073300 -2922774 -2490926 -2705970 -3768643 -4806759 -4732865 -3462425
33691 -3462425 -2030119 -1343742 -1220425 -1050022 -924753 -1333158 -2043617 -2314755 -2158909
33682 -2158909 -2257028 -2479991 -1837948 -416069 79506 -1247784 -2777886 -2621029 -1657377
33673 -1657377 -2380799 -4989659 -6714597 -5501567 -2603616 -647520 -528580 -1292173 -1965690
33664 -1965690 -2216469 -1897279 -1206392 -942597 -1564760 -2290725 -2038426 -939322 -46069
33655 -46069 71706 -458937 -1450772 -2347295 -1834822 695684 3554130 4301694 2891467
33646 2891467 1490136 1039608 145695 -1923869 -3434773 -2862109 -1434579 -989305 -773952
33637g73952J860446K611927J23380l286905l457714j24475K906963K945195J281495
33628D086360M23963N25568l9986j516690j989630k58657J790764J242189j652322
33619B611559l278904j496863J260504J501032l30170j033935J23457P04308l49580
33610b88592r83761P4350R39879j1580j059986N9540K239999K541119M31409j921229
33600B021148k790690k221931r05840L46562N85847j44779l68026O21473J252119
33591a604117K57518o04739R49211L482004L259623k44710l423008l544930j751341
33582c224489k24602P47091J476409J205322l10978j392847o37374P86675R47041
33573f27752J42480Q6414R19503J240914Q13127R51997J846754J599671r42334
$$ plain form
33637 -773952 1086494 3698421 3821801 534896 -2922818 -3047293 -140330 2804865 4086360
33628 4086360 4510323 5035891 4995905 3479215 1489585 1230928 3021692 4263881 2611559
33619 2611559 -667345 -2164208 -903704 597328 267158 -766777 -643320 60988 -288592
33610 -288592 -1272353 -1198003 -258124 -269704 -1329690 -1270150 969849 3510968 3942377 2021148
33600 2021148 -769542 -2991473 -3897313 -3550751 -2964904 -3109683 -3477709 -2856236 -1604117
33591 -1604117 -1346599 -1951338 -1002127 2479877 5739500 5494790 2071782 -1473148 -3224489
33582 -3224489 -3449091 -2702000 -1225591 -20269 -331247 -1724094 -2361468 -1574793 -627752
33573 -627752 -485272 -398858 520645 1761559 2574686 3526683 5373437 6973108 6030774
33564F030774l915946m552209k744321q21988k8756Q40034K664830L729999J959755
33555C162172j538901l340275k078348J20421J074849J245179J751602J736757
33547B133456j04820k570726l057061j292132L84620N97858N04554J192210J715290
33538d96751R82404j29839j96167L81895K06555n81022n05022N98018J038134
33529A298205n4677j172457p06732M68482L90240o92971n93457J050589J673238
33520A660460k65814k329599j403606J421492K230079J24764j567987n38093J231039
33511E62735R97858n95657j172388m84033j00367m16634m27086O5766J10454o76002
33501b135354j517304j423037O6444K291736L127444R46557k225015k064840J873261
$$ plain form
33564 6030774 2114828 -2437381 -5181702 -6003690 -6032446 -5192412 -2527582 1202417 3162172
33555 3162172 1623271 -1717004 -3795352 -3674931 -2600082 -1354903 396699 2133456
33547 2133456 2028636 -542090 -3599151 -4891283 -4506663 -3908805 -3404251 -2212041 -496751
33538 -496751 485653 355814 159647 541542 748097 167075 -337947 260071 1298205
33529 1298205 1243528 71071 -635661 -167179 223061 -469910 -1063367 -12778 1660460
33520 1660460 1394646 -934953 -2338559 -917067 1313012 1437776 -130211 -668304 562735
33511 562735 1560593 964936 -207452 -691485 -791852 -1208486 -1635572 -1569806 -1459352 -2135354
33501 -2135354 -3652658 -5075695 -5009251 -2717515 409929 1356486 -868529 -2933369 -1060108
33492a060108M393237J821970k265466k542380k05720k28952k369044j771357
33484d227820J791097K749781n99110k539089O20892M069498K226291k407499
33476A684041l806099j725527k93313k63573P87210K241389J029040j957876k217273
33467d521981J020939L348113K174010N6311n01105p03273j736520j828550J10397
33458b581659J579549L96323j390805p24184J612060K528833J257075n32726j762466
33449C82000k274287j469716N34778J582314K11877j398752m03371J780164J284525
33440B29532j782164k962521l17625K448613J694476q22176j168669P15543J574830
33431c90161J49341j365746r69626P09309J971408K057554J161194r7208q76175
$$ plain form
33492 -1060108 3333129 5155099 2889633 347253 141533 -87419 -2456463 -4227820
33484 -4227820 -2436723 313058 -286052 -2825141 -2204249 1865249 4091540 1684041
33476 1684041 -2122058 -3847585 -4140898 -4404471 -3617261 -1375872 -346832 -2304708 -4521981
33467 -4521981 -3501042 -152929 2021081 2077392 1576287 873014 -863506 -2692056 -2581659
33458 -2581659 -1002110 -605787 -1996592 -2720776 -1108716 1420117 2677192 2144466 382000
33449 382000 -1892287 -3362003 -2827225 -1244911 -1033034 -2431786 -2835157 -1054993 229532
33440 229532 -1552632 -4515153 -4832778 -2384165 -689689 -1511865 -2680534 -1964991 -390161
33431 -390161 -240820 -1606566 -2576192 -1866883 104525 2162079 3323273 3226065 2349890
33422B349890q89727r21274j478529j476319Q9099J711815R74963j471699k283047
33413c394828l72863J434305R95334M0138N82010J058734o51242k612186j430003
33404d350601J689213K131157q30516k649846o44621J964276J505883n52953p95969
33395b533977L96491L05023q71024n62856J127807J196197j143041k864812j725374
33386f675566O67204J806432J714757J687430J684383R54330j09089n73274n51760
33377F04847o90965q27439m89928m0215j3879N6658Q34991J663384J190670o72508
33367A615616k520004l013134j825468N20075K682650K864379N77356k084235
33359a182765k396515l39067J459596J348095N68412P93485J381534O22321j211742
$$ plain form
33422 2349890 1460163 538889 -939640 -2415959 -2326860 -615045 359918 -1111781 -3394828
33413 -3394828 -3767691 -2333386 -1338052 -1297914 -715904 342830 -308412 -2920598 -4350601
33404 -4350601 -2661388 -530231 -1360747 -4010593 -4655214 -2690938 -1185055 -1738008 -2533977
33395 -2533977 -2137486 -1832463 -2703487 -3266343 -2138536 -942339 -2085380 -4950192 -6675566
33386 -6675566 -6008362 -4201930 -2487173 -799743 884640 1838970 1729881 1156607 604847
33377 604847 -86118 -913557 -1403485 -1443700 -1457579 -1400921 -565930 1097454 2288124 1615616
33367 1615616 -904388 -3917522 -5742990 -5222915 -2540265 324114 901470 -1182765
33359 -1182765 -3579280 -3918347 -2458751 -1110656 -542244 251241 1632775 2255096 1043354
33350A043354j923056n10886J286252J207260o55860k024368j232550Q08047J718618
33341b83189N10721j180394j134247N21138J404924J96513j333843p28191J526940
33332d99628K493353Q53642j373192j869573j059395p73735j196079j000484J12789
33323d312302J007381J154720J207933J286846N55549q76533j429825m00558Q00007
33314a006782R32058Q25018J438561J613074q8248k423004k842452j207774M00924
$$ plain form
33350 1043354 -879702 -1390588 -104336 1102924 447064 -1577304 -2809854 -2001807 -283189
33341 -283189 227532 -952862 -2087109 -1565971 -161047 35466 -1298377 -2026568 -499628
33332 -499628 1993725 2847367 1474175 -395398 -1454793 -2228528 -3424607 -4425091 -4312302
33323 -4312302 -3304921 -2150201 -942268 344578 900127 23594 -1406231 -1806789 -1006782
33314 -1006782 -74724 750294 2188855 3801929 3713681 1290677 -1551775 -2759549 -2358625
$$ [...]
##END NTUPLES=NMR SPECTRUM
##END=
