##TITLE=31Pdec_SR_13
 CDCl3, 24 sc
 2.3.2020
##JCAMPDX= 6.0         $$ Bruker NMR JCAMP-DX V2.0
##DATA TYPE= NMR SPECTRUM
##DATA CLASS= NTUPLES
##ORIGIN= UXNMR, Bruker Analytische Messtechnik GmbH
##OWNER= root
$$ XWIN-NMR		Version 3.5
$$ Mon Mar  2 14:04:04 2020 Russian Standard Time (UT+4h)  she@DPX200
##.OBSERVE FREQUENCY= 81.013821
##.OBSERVE NUCLEUS= ^31P
##.ACQUISITION MODE= SIMULTANEOUS
##.ACQUISITION SCHEME= undefined
##.AVERAGES= 24
##.DIGITISER RES= 17
##SPECTROMETER/DATA SYSTEM= spect
##.PULSE SEQUENCE= zgpg30
##.SOLVENT NAME= Acetone
##.SHIFT REFERENCE= (INTERNAL, Acetone, 0, 182.463)
##AUDIT TRAIL= $$ (NUMBER, WHEN, WHO, WHERE, WHAT)
$$ ##TITLE= Audit trail, XWIN-NMR		Version 3.5
$$ ##JCAMPDX= 5.01
$$ ##ORIGIN= Bruker BioSpin GmbH
$$ ##OWNER= she
$$ F:/spectra/data/she/nmr/P31/1/pdata/1/auditp.txt
$$ ##AUDIT TRAIL=  $$ (NUMBER, WHEN, WHO, WHERE, WHAT)
(   1,<2020-03-02 14:03:16.14 +0400>,<she>,<DPX200>,
      <created by zg, POWCHK disabled, PULCHK disabled
       configuration hash MD5:
       00 E9 B6 7A A2 85 ED C7 34 08 36 98 17 FE 4E 26
       data hash MD5: 32K
       8C 29 E4 F9 A6 65 80 C5 04 D6 F7 7E 58 1F 55 B9>)
(   2,<2020-03-02 14:03:18.59 +0400>,<she>,<DPX200>,
      <Start of raw data processing
       efp BC_mod = 2 LB = 1 FT_mod = 6 PKNL = 1 PHC0 = -1543.62 PHC1 = 671.0013 SI = 64K 
       data hash MD5: 64K
       8E 93 D2 71 35 B4 B8 5E C3 AA 8C 23 E8 DD 05 71>)
(   3,<2020-03-02 14:03:30.98 +0400>,<she>,<DPX200>,
      <pk PHC0 = 38.88187 PHC1 = 0 
       data hash MD5: 64K
       24 E9 75 0B 21 81 31 72 DA FF 5A 7C 32 A1 AD 9C>)
(   4,<2020-03-02 14:03:35.81 +0400>,<she>,<DPX200>,
      <abs ABSG = 5 
       data hash MD5: 64K
       CE 51 04 7A 6B 31 3C 13 35 9C E6 74 46 76 02 78>)
$$ ##END=
$$ 
$$ hash MD5
$$ 72 46 A7 53 4E AF A1 D2 2F F7 3D 48 CE BD 61 A6
##$RELAX= 
##$RELAX= 
##$RELAX= 
##$RELAX= 
##$RELAX= 
##$RELAX= 
##$RELAX= 
##$RELAX= 
$$ Bruker specific parameters
$$ --------------------------
##$DU= <F:/spectra>
##$EXPNO= 1
##$NAME= <P31>
##$PROCNO= 1
##$TYPE= <nmr>
##$USER= <she>
##$AMP= (0..31)
100 100 100 100 100 100 100 100 100 100 100 100 100 100 100 100 100 100 
100 100 100 100 100 100 100 100 100 100 100 100 100 100 
##$AQSEQ= 0
##$AQ_mod= 1
##$AUNM= <au_zg>
##$AUTOPOS= <>
##$BF1= 81.014009
##$BF2= 200.13
##$BF3= 200.13
##$BF4= 200.13
##$BF5= 200.13
##$BF6= 200.13
##$BF7= 200.13
##$BF8= 200.13
##$BYTORDA= 1
##$CFDGTYP= 0
##$CFRGTYP= 5
##$CHEMSTR= <none>
##$CNST= (0..31)
1 1 145 1 1 1 1 1 1 1 1 1 1 1 1 1 1 1 1 1 1 1 1 1 1 1 1 1 1 1 1 1 
##$CPDPRG= <waltz16>
##$CPDPRG1= <>
##$CPDPRG2= <waltz16>
##$CPDPRG3= <>
##$CPDPRG4= <mlev>
##$CPDPRG5= <mlev>
##$CPDPRG6= <mlev>
##$CPDPRG7= <mlev>
##$CPDPRG8= <mlev>
##$CPDPRGB= <>
##$CPDPRGT= <>
##$D= (0..31)
0 1 0 0 0 0 0 0 0 0 0 0.03 2e-05 3e-06 0 0 0 0 0 0 0 0 0 0 0 0 0 0 0 0 
0 0 
##$DATE= 1583143395
##$DBL= (0..7)
120 120 120 11 120 120 24 19 
##$DBP= (0..7)
150 150 150 150 150 150 150 150 
##$DBP07= 0
##$DBPNAM0= <>
##$DBPNAM1= <>
##$DBPNAM2= <>
$$ [...]
##$SUBNAM3= <"">
##$SUBNAM4= <"">
##$SUBNAM5= <"">
##$SUBNAM6= <"">
##$SUBNAM7= <"">
##$SUBNAM8= <"">
##$SUBNAM9= <"">
##$SW= 369.568048894756
##$SWIBOX= (0..15)
0 1 3 0 0 0 0 0 0 0 0 0 0 0 0 0 
##$SW_h= 29940.119760479
##$TD= 32768
##$TD0= 1
##$TE= 0
##$TE2= 300
##$TE3= 300
##$TEG= 300
##$TL= (0..7)
0 120 53 12 22 120 120 120 
##$TP= (0..7)
150 150 150 150 150 150 150 150 
##$TP07= 0
##$TPNAME0= <>
##$TPNAME1= <>
##$TPNAME2= <>
##$TPNAME3= <>
##$TPNAME4= <>
##$TPNAME5= <>
##$TPNAME6= <>
##$TPNAME7= <>
##$TPOAL= (0..7)
0.5 0.5 0.5 0.5 0.5 0.5 0.5 0.5 
##$TPOFFS= (0..7)
0 0 0 0 0 0 0 0 
##$TUNHIN= 0
##$TUNHOUT= 0
##$TUNXOUT= 0
##$USERA1= <user>
##$USERA2= <user>
##$USERA3= <user>
##$USERA4= <user>
##$USERA5= <user>
##$V9= 5
##$VALIST= <valist>
##$VCLIST= <CCCCCCCCCCCCCCC>
##$VD= 0
##$VDLIST= <DDDDDDDDDDDDDDD>
##$VPLIST= <PPPPPPPPPPPPPPP>
##$VTLIST= <TTTTTTTTTTTTTTT>
##$WBST= 1024
##$WBSW= 4
##$XGAIN= (0..3)
0 0 0 0 
##$XL= 0
##$YL= 0
##$YMAX_a= 9515
##$YMIN_a= -9178
##$ZGOPTNS= <>
##$ZL1= 120
##$ZL2= 120
##$ZL3= 120
##$ZL4= 120
##$ABSF1= 182.463
##$ABSF2= -187.1042
##$ABSG= 5
##$ABSL= 3
##$ALPHA= 0
##$AQORDER= 0
##$ASSFAC= 0
##$ASSFACI= 0
##$ASSFACX= 0
##$ASSWID= 0
##$AUNMP= <proc_1d>
##$AZFE= 0.1
##$AZFW= 0.5
##$BCFW= 0
##$BC_mod= 2
##$BYTORDP= 0
##$COROFFS= 0
##$CY= -3
##$DATMOD= 1
##$DC= 0
##$DFILT= <>
##$DTYPP= 0
##$F1P= 0
##$F2P= 0
##$FCOR= 1
##$FTSIZE= 65536
##$FT_mod= 6
##$GAMMA= 0
##$GB= 0
##$INTBC= 1
##$INTSCL= 5.30512e-09
##$ISEN= 30
##$LB= 1
##$LEV0= 0
##$LPBIN= 0
##$MAXI= 10000
##$MC2= 0
##$MEAN= 0
##$ME_mod= 0
##$MI= 50
##$NCOEF= 0
##$NC_proc= -7
##$NLEV= 6
##$NOISF1= 182.463
##$NOISF2= 159.3651
##$NSP= 0
##$NTH_PI= 0
##$NZP= 0
##$OFFSET= 182.463
##$PC= 4
##$PHC0= -1504.738
##$PHC1= 671.0013
##$PH_mod= 1
##$PKNL= yes
##$PPARMOD= 0
##$PSCAL= 0
##$PSIGN= 0
##$REVERSE= no
##$SF= 81.0140089999434
##$SI= 65536
##$SIGF1= 159.3651
##$SIGF2= -187.1042
##$SINO= 113.3802
##$SIOLD= 16384
##$SREGLST= <1H.CDCl3>
##$SSB= 0
##$STSI= 65536
##$STSR= 0
##$SW_p= 29940.119760479
##$SYMM= 0
##$S_DEV= 0
##$TDeff= 32768
##$TDoff= 0
##$TI= <>
##$TILT= no
##$TM1= 0
##$TM2= 0
##$TOPLEV= 0
##$USERP1= <user>
##$USERP2= <user>
##$USERP3= <user>
##$USERP4= <user>
##$USERP5= <user>
##$WDW= 1
##$XDIM= 65536
##$YMAX_p= 375289173
##$YMIN_p= -51677823
$$ End of Bruker specific parameters
$$ ---------------------------------
##NTUPLES= NMR SPECTRUM
##VAR_NAME=  FREQUENCY,     SPECTRUM/REAL,   SPECTRUM/IMAG
##SYMBOL=    X,             R,               I
##VAR_TYPE=  INDEPENDENT,   DEPENDENT,       DEPENDENT
##VAR_FORM=  AFFN,          ASDF,            ASDF
##VAR_DIM=   65536,         65536,           65536
##UNITS=     HZ,            ARBITRARY UNITS, ARBITRARY UNITS
##FACTOR=    0.456856943014862, 1,           1
##FIRST=     14782.0589164792, 0,            0
##LAST=      -15158.0608439998, 0,           0
##MIN=       -15158.0608439998, -51677823,   0
##MAX=       14782.0589164792, 375289173,    0
$$ Real data points
##PAGE= N=1
##DATA TABLE= (X++(R..R)), XYDATA
$$ [...]
45659A6214j803148m49032J185324J181969o335l35294O13595J112812J83227
45650A699332r53597j141345j209084k213676l119600k030110Q96990L339844
45642d731246L396496J236416j394380k426692r48888J537970K153520O716k438090
45633c608178k531946o93616J042125K177763L179339L099851P87737k142805
45625A310270k731414j045607j655m92616o4119K458894M281259K622275r88765
45616E348522k782153j718253k54676p95353k921365l980294j853999K435664
45608f521907N086352L676986M76044n17832O27801K79577k109183k248137J904512
45599F54213N577469L637791j564203l708206j879717q31661k443611k953699
$$ plain form
45659 16214 -1786934 -2235966 -1050642 131327 124992 -210302 403293 1516105 1699332
45650 1699332 745735 -395610 -1604694 -3818370 -6937970 -8968080 -8071090 -4731246
45642 -4731246 -1334750 -98334 -1492714 -3919406 -4868294 -3330324 -1176804 -1170088 -3608178
45633 -3608178 -6140124 -6833740 -5791615 -3613852 -434513 2665338 3453075 1310270
45625 1310270 -1421144 -2466751 -2468406 -2961022 -3025141 -566247 3715012 6337287 5348522
45616 5348522 2566369 848116 593440 -201913 -3123278 -7103572 -8957571 -6521907
45608 -6521907 -1435555 2241431 2717475 2199643 2827444 3107021 997838 -1250299 654213
45599 654213 6231682 9869473 8305270 4597064 2717347 1885686 -557925 -3511624
45591c511624o7046K703295J831270l56417L78730L208907L669237P36841j895166
45582F698027j635951k49930k76008j278691j411440o15652k57479p17638j149053
45573h93815j130031j096806j279677j323140r64834k61864Q28866K311512L512170
45564b97619L300896J297363j456813l255275l130210j644550m27825o56832j748540
45555h019405j866224k8943K634949M089172L413257J221832j288419k918448
45547b762229k644560m18425K189357L124291J888777j19739j307070j305118
45539a354716p62021l89420k91969J04065J196242K073772J192027j119461k189780
45530a541261n64311J326405M46917j857005j417365K203506M395984K028973
$$ plain form
45591 -3511624 -3578670 -875375 955895 599478 978208 4187115 7856352 8593193 6698027
45582 6698027 5062076 4812146 4536138 3257447 1846007 1230355 972876 255238 -893815
45573 -893815 -2023846 -3120652 -4400329 -5723469 -6688303 -6950167 -6121301 -3809789 -297619
45564 -297619 3003277 4300640 2843827 -411448 -3541658 -5186208 -5614033 -6270865 -8019405
45555 -8019405 -9885629 -9914572 -7279623 -3190451 222806 1444638 156219 -2762229
45547 -2762229 -5406789 -5825214 -3635857 -511566 1377211 1257472 -49598 -1354716
45539 -1354716 -2116737 -2506157 -2798126 -2694061 -1497819 575953 1767980 648519 -1541261
45530 -1541261 -2105572 -779167 -332250 -2189255 -3606620 -1403114 2992870 5021843
45522E021843k048254l315174j758554p60310j431800j369507J148988M372939
45514a39829N167629K545127j394410l527406k731311r62524p97397k140908k711379
45505f692408j616033k68844N79119J934799L561402K951579n43883l307586k047202
45496e449057J360992K746268J547322M00639K57322k40478j176203r89205K41051
45487a301349N33928n39911j055849Q6020J660779K251983J792260Q12739K8378
45478D268978M01267J753135K091400L93697j303120j244236j457226m099746
45470H04149o247966l626384J483182K395285j544632l447743L03024M442734
45462e438351L502424L0103o85571Q24368O74641q31359k39124K387793L553048
$$ plain form
45522 5021843 2973589 -341585 -2100139 -2860449 -4292249 -5661756 -4512768 -139829
45514 -139829 5027800 7572927 6178517 2651111 -80200 -1042724 -1840121 -3981029 -6692408
45505 -6692408 -8308441 -8577285 -7998166 -6063367 -2501965 449614 -94269 -3401855 -5449057
45496 -5449057 -4088065 -1341797 205525 606164 863486 623008 -553195 -1542400 -1301349
45487 -1301349 -767421 -1307332 -2363181 -2277161 -616382 1635601 3427861 4240600 4268978
45478 4268978 4670245 6423380 8514780 8908477 7605357 6361121 4903895 804149
45470 804149 -5443817 -9070201 -7587019 -5191734 -6736366 -10184109 -9881085 -5438351
45462 -5438351 -1935927 -1905824 -2591395 -1767027 -1092386 -1923745 -2162869 224924 3777972
45453C777972K244576P24596j96008j879909l712721k898872M82463K211275l73797
45444C79575m257792m482401l44734M004191M457059J155709k153002k360177
45436c601572j33273J536177J337985P20560R62627J306434Q90679L98677L80977
45427C799271J5896p44347r641K760873M419203K073817k192168l877012k291288
45418C954604o88328p15284o37903M76482O49176j311553k990163j631327J488611
45409a405685K469305J24895k211552r51778K875826M539739J549692k922140
45401D068302m004795j337232J118105R76176r8901l53629p16212j833874j786188
45392c968248M72261K227160Q51913j723331j907431O5106J280181J215802J609126
$$ plain form
45453 3777972 6022548 6747144 6551136 4671227 958506 -1940366 -1457903 753372 379575
45444 379575 -3878217 -8360618 -8705352 -4701161 -244102 911607 -1241395 -3601572
45436 -3601572 -3734845 -2198668 -860683 -140123 822504 2128938 3019617 3418294 3799271
45427 3799271 3815167 3070820 3061179 5822052 10241255 12315072 10122904 6245892 3954604
45418 3954604 3266276 2550992 1913089 2389571 3038747 1727194 -1262969 -2894296 -1405685
45409 -1405685 1063620 1188515 -1023037 -1974815 901011 5440750 6990442 4068302
45401 4068302 63507 -1273725 -155620 820556 721655 368026 -348186 -2182060 -3968248
45392 -3968248 -3495987 -1268827 -416914 -2140245 -4047676 -3982570 -2702389 -1486587 122539
45383A22539K294993J384169q07099j928888j501022r87053m14424J075082J758841
45374I97138q48774m538440l972172J127867M580976K673082n44979r3466K281542
45365A662774J706739j685116l231663j021294J865918K391711J163880K06801
45357C059750j61106q33819j777446j867197p13557K53717o98042k981035l747595
45348i466330j523383J391603J872842L32224k71672Q38815J536572Q40252L96723
45339d052354J119077J529132P82086L72947J148176J415558N1491j100775k93763
45330I71575R58768M37842r21185n68833J554783L171286L027774J690900j99101
45321A0123809k099469k698130j307861K93821j96013j979729j893256Q43826
$$ plain form
45383 122539 2417532 3801701 2994602 1065714 -435308 -1422361 -1836785 -761703 997138
45374 997138 148364 -4390076 -8362248 -7234381 -2653405 19677 -525302 -618768 1662774
45365 1662774 3369513 1684397 -1547266 -2568560 -702642 1689069 2852949 3059750
45357 3059750 2898644 2064825 287379 -1579818 -2293375 -2039658 -2737700 -5718735 -9466330
45348 -9466330 -10989713 -9598110 -7725268 -7393044 -7664716 -6825901 -5289329 -4449077 -4052354
45339 -4052354 -2933277 -1404145 -622059 -249112 899064 2314622 2366113 1265338 971575
45330 971575 1930343 2368185 1447000 878167 2432950 5604236 8632010 10322910 10123809
45321 10123809 8024340 5326210 4018349 4312170 4116157 2136428 243172 1086998
45313A086998K845790P56053m022698o312942k993802L021114N654995K681048
45305B716556j571550j851357J188316K571319N93658j186910k37936J101659
45297C323755L84778l80299J375135L425115J883814k147731l910996k203988
45289A749583m91239p48253r95587o0324k18899k768246m638855k571990J737455
45280i006355L957847L174159K365819L274063L898988J868526j931043m444157
45272C157847l978189j422626J307252K726064K020426n76378l155763l191771
45264c113138l24225K656502K752396J57709k439718l287355k662103j070199
45256g330131J314527L160946K409885o88780k968841k167905L00127J789377
$$ plain form
45313 1086998 3932788 4688841 666143 -5646799 -8640601 -5619487 35508 2716556
45305 2716556 1145006 -706351 481965 3053284 3646942 2460032 2222096 3323755
45297 3323755 3708533 3328234 4703369 8128484 10012298 7864567 3953571 1749583
45289 1749583 1258344 510091 -485496 -545820 -764719 -3532965 -8171820 -10743810 -9006355
45280 -9006355 -5048508 -1874349 491470 3765533 7664521 9533047 7602004 3157847
45272 3157847 -820342 -2242968 -935716 1790348 3810774 3234396 78633 -3113138
45264 -3113138 -3437363 -780861 1971535 2129244 -310474 -3597829 -6259932 -7330131
45256 -7330131 -6015604 -2854658 -444773 -1133553 -4102394 -6270299 -5970172 -4180795
45248d180795J917206J813537J448987J25393j204440o80384J348606K121361
45240B709471N9659k902357l538359j217391J299353J057293j580458l404963
45232g517752k559968r79005j261414k291505o06752L973790P145541N647747
45224A550682J433462j319458j323890m70576n09229j253158j316344L20726K710052
45215a77733L032301Q9587k838406j794487J444322J297926k585774m030217m86030
45206f048511J937223j640225n833144k813691N014592Q327704M646964L51921
45198C942833m44299m87929j784055j588894J198810K628997M14276j695277l13181
45189A871281J724428L87273k645984k968927n82064P22516m02422j429267k42065
$$ plain form
45248 -4180795 -2263589 -450052 998935 1124328 -80112 -760496 588110 2709471
45240 2709471 2769130 -133227 -3671586 -4888977 -3589624 -2532331 -4112789 -7517752
45232 -7517752 -10077720 -11056725 -12318139 -14609644 -15216396 -11242606 -4097065 1550682
45224 1550682 2984144 1664686 340796 -129780 -639009 -1892167 -3208511 -2887785 -177733
45215 -177733 2854568 2944155 105749 -1688738 -244416 1053510 -1532264 -5562481 -6048511
45206 -6048511 -4111288 -5751513 -11584657 -14398348 -9383756 -1056052 3590912 3942833
45198 3942833 3498534 3010605 1226550 -362344 836466 3465463 3879739 2184462 1871281
45189 1871281 3595709 3982982 1336998 -1631929 -2213993 -1491477 -1893899 -3323166 -3565231
45180c565231K322053M144723L984170K180002M17883J46868O03649k70508k508283
45171G455326l743850k847768j475488r18737j11642J653878K698952J714494
45163D425165K51907K16584Q01905J84823j296083j813549p41327R93191K144226
45154E166842J646097o21786k711923k208814K14755J234085k34320j508556p59492
45145B16888K42116j15344l22869Q76251J532588m144j720961j449732p72319
45136a517526j699184k330017j63827K692181K414105j97825j156653J67159Q54909
45127i36678K2473l27915K44083R8713n22977K51745J433315j45879l738871m223753
45117g845744M08028N456135N875008K699361L90739N32086J068050J26907j931048
$$ plain form
45180 -3565231 -1243178 2901545 6885715 9065717 9483600 9630468 10234117 9963609 7455326
45171 7455326 3711476 863708 -611780 -1530517 -1642159 11719 2710671 4425165
45163 4425165 4677072 4893656 5695561 5880384 4584301 2770752 2029425 3022616 5166842
45154 5166842 6812939 6191153 3479230 1270416 1485171 2719256 2484936 976380 216888
45145 216888 459004 343660 20791 897042 2429630 2425486 704525 -745207 -1517526
45136 -1517526 -3216710 -5546727 -5710554 -3018373 -604268 -802093 -1958746 -1791587 -936678
45127 -936678 -914205 -1242120 -998037 -899324 -1422301 -1170556 262759 116880 -3621991 -7845744
45117 -7845744 -7437716 -1981581 3893427 6592788 6983527 7515613 8583663 8710570 6779522
45108F779522l531435l432390j766868p5909M71584O69067J717134K756238K153517
45099E740460N90882p0451n69021l142253o426779n852940o00134M059674L809134
45090b461428R90041K25528J600485K033631J052911Q04063J411857O38948j792366
45081D503670l283602k512494j339297j322000j050773J116076L618273L479410
45073C209263P15621j515590j327689l82832p37139j429418k82939K120745L014566
45064C384588J750039N67649N34185r5144k027239k743570p14738J119092m03857
45055A371005l170639k760015M51855J808746k74709k089023n11648K867756M682875
45046B376203L537851j57414m814985p132807m356542J542683N110756M178031
$$ plain form
45108 6779522 3248087 -184303 -1951171 -2027080 -1555496 -886429 830705 3586943 5740460
45099 5740460 6331342 6260891 5691870 2549617 -3877162 -9730102 -10330236 -6270562 -2461428
45090 -2461428 -1471387 -1245859 354626 2388257 3441168 4245231 5657088 6296036 4503670
45081 4503670 1220068 -1292426 -2631723 -3953723 -5004496 -3888420 -270147 3209263
45073 3209263 3924884 2409294 1081605 698773 -38366 -1467784 -1750723 370022 3384588
45064 3384588 5134627 5702276 6236461 6141317 4114078 1370508 655770 1774862 1371005
45055 1371005 -1799634 -4559649 -4107794 -2299048 -2573757 -4662780 -5174428 -2306672 2376203
45046 2376203 5914054 5756640 941655 -6191152 -10547694 -9005011 -3894255 283776
45038B83776K158258K200698K743525J157313j550177k645237j891172j063402
45030A393582r84225j277770j507412r34220R66621K547630J216932j979849k422792
45021b981503J245916M044983J642094k959207l840569o84880J737346J011670
45013g84150o06966p70725R9342O28482J62499j308306k655839j824847J308281
45004e752229L699486L171866J742632J940859K162726k22844l195162k623875
44996I23459N69719J286923j714231m050007k834595n08686J0090n54033o04742
44987g476103n99791r17092j65596K045952L534875K930725J997251K431910K866085
44978F648216J406910r55200j933944j420531j163146j967780k889374k524077
$$ plain form
45038 283776 2442034 4642732 7386257 8543570 6993393 4348156 2456984 1393582
45030 1393582 409357 -868413 -2375825 -3310045 -2343424 204206 1421138 -558711 -2981503
45021 -2981503 -1735587 2309396 3951490 992283 -2848286 -3533166 -1795820 -784150
45013 -784150 -1391116 -2161841 -2062499 -1434017 -1271518 -2579824 -5235663 -7060510 -5752229
45004 -5752229 -2052743 1119123 2861755 4802614 6965340 6742496 3547334 923459
44996 923459 1493178 2780101 1065870 -2984137 -5818732 -6327418 -6317328 -6871361 -7476103
44987 -7476103 -8075894 -8992986 -9158582 -7112630 -3577755 -647030 1350221 3782131 6648216
44978 6648216 8055126 7099926 5165982 3745451 2582305 614525 -2274849 -4798926
44970d798926k41598K923846M351638K391802j000873k284647j124597m61214
44962b44569j402716j480643P09484K640763J824231l29780j141190n90086K1917
44953G411R42682K528343K981700Q26587j813283j725584N32155J479714q3356
44944E676369j788566j627056m46201k0979o80821j490072j494399m54391Q86825
44935a439291J456535J289986J463524J982433J268390j031947k487118j052904
44927A449608J674929K666842J744928J125430J506432J375678l014j479415k070173
44918G991245j991541j484631n66888p4235j004663k581565k789300j144500P09887
44909b936191J383206J060970K95210p14296j250708l22158J505794K085954M03643
$$ plain form
44970 -4798926 -5040524 -2116678 2234960 4626762 3625889 1341242 216645 -244569
44962 -244569 -1647285 -3127928 -2418444 222319 2046550 1716770 575580 -14506 7411
44953 7411 950093 3478436 6460136 7286723 5473440 3747856 4280011 5759725 5676369
44944 5676369 3887803 2260747 1814546 1793567 1112746 -377326 -1871725 -2326116 -1439291
44935 -1439291 17244 1307230 2770754 4753187 6021577 4989630 2502512 1449608
44927 1449608 3124537 5791379 7536307 8661737 10168169 11543847 11540833 10061418 7991245
44918 7991245 5999704 4515073 3948185 3873950 2869287 287722 -2501578 -3646078 -2936191
44909 -2936191 -1552985 -492015 -196805 -911101 -2161809 -2483967 -978173 1107781 1511424
44900A511424j874565k410639q03242J530326L158672L470845K408469M29081
44892G420371j327746j642685m59713O72951L6756k050842l143284j633908Q59284
44883a268816J578706O01190M46263J606129J408455j414642l931783l085810
44875d060308k82244R06312r951n13463O07639K020830K477407K053644J020932
44866D220798k90415q99472m72726m61578j833172k829419j584968L46211L65716
44857c439025m22739J103061M153338M378997P52240k376024j639428Q29997J360336
44848D700753k7681q19804p8434J079314J552520R90421m35982j871512k408828
44839B680767k268404k047133j106759J155046K855186J450832j904919l126696
$$ plain form
44900 1511424 -363141 -2773780 -3577022 -2046696 1111976 4582821 6991290 7420371
44892 7420371 6092625 4449940 3990227 4663178 4699934 2649092 -494192 -2128100 -1268816
44883 -1268816 309890 911080 1357343 2963472 4371927 2957285 -974498 -4060308
44875 -4060308 -4342552 -3436240 -3446191 -3959654 -3352015 -1331185 1146222 3199866 4220798
44866 4220798 3930383 3030911 2558185 2096607 263435 -2565984 -4150952 -3804741 -3439025
44857 -3439025 -3861764 -2758703 1394635 5773632 6525872 4149848 2510420 3340417 4700753
44848 4700753 4673072 3853268 3774834 4854148 6406668 7397089 6961107 5089595 2680767
44839 2680767 412363 -1634770 -2741529 -1586483 1268703 2719535 814616 -2312080
44831b312080q25192K080546K899899J864496j90279k848911m043662j414423
44823d789606K958772L856081O34675j373651O54052K700555J197879j096718
44815D742039q37065k28799k047532l446435j052723J922918P16983k153264p31492
44806c115370L958862N332767J973603j039313j364200j973126l635086k678799
44798b540662J597144M343797K878812Q04494J264805J809935l30011k894346
44790F933968k672626r11595n41761j218371r73462j77013k99391q60237o86803
44781a407291k89524l64256N9184J512499K197409O66619j488415j919728p09278
44772a742781P25508J965379K872785K541348Q84657o40583j439926k586225l823132
$$ plain form
44831 -2312080 -3137272 -1056726 1843173 3707669 3517390 668479 -3375183 -4789606
44823 -4789606 -1830834 2025247 2659922 1286271 1940323 4640878 5838757 4742039
44815 4742039 3904974 3676175 1628643 -1817792 -2870515 -947597 -230614 -2383878 -3115370
44806 -3115370 843492 6176259 8149862 7110549 5746349 3773223 138137 -2540662
44798 -2540662 -943518 3400279 6279091 7083585 8348390 10158325 9828314 6933968
44790 6933968 4261342 3349747 2807986 1589615 616153 439140 139749 -720488 -1407291
44781 -1407291 -1696815 -2061071 -2001887 -489388 1708021 2374640 886225 -1033503 -1742781
44772 -1742781 -1017273 948106 3820891 6362239 7246896 6606313 5166387 2580162 -1242970
44763a242970k858952L28382J860285n38379l499709k788820O06737K769592K833666
44754b530168K731846K821968J834336M0275j169850j918048k810006k542442
44746c542089k3125K342774J361846j692161k468749M8062K340274J847147J14526
44737C28505m04889J57634O502j632023l534318l437284l46609L487541M382322
44728i92619K032958J76054Q03493R53548j755712l935558j473714K966071L370240
44719B144761j58948j762230N14272J980287m41547l255630k313452J067183K929127
44710G03823K116328J85758j367883j614825k72081J140524N16069j538802k295518
44701b426607j300330p29574p62009J061945M465820N158116J427501k346640
$$ plain form
44763 -1242970 -4101922 -3773540 -1913255 -2451634 -5951343 -8740163 -8133426 -5363834 -2530168
44754 -2530168 201678 3023646 4857982 4898257 3728407 1810359 -999647 -3542089
44746 -3542089 -3565214 -1222440 139406 -1552755 -4021504 -3973442 -1633168 213979 328505
44737 328505 -76384 81250 87752 -1544271 -5078589 -8515873 -8862482 -5374941 -992619
44728 -992619 1040339 1216393 2019886 2973434 1217722 -2717836 -4191550 -1225479 2144761
44719 2144761 1985813 223583 737855 2718142 2276595 -979035 -3292487 -2225304 703823
44710 703823 2820151 3005909 1638026 23201 -248880 891644 1407713 -131089 -2426607
44701 -2426607 -3726937 -4456511 -5218520 -4156575 309245 5467361 6894862 4548222
44693D548222j959335O68237J306600k44150j462282j783094j935413j088008
44685a949223J253750K636850J067717r30702n0947J761204O2960m149819m779640
44676e077850L50772N708509N355466N61846k458575n12258L219334L356928j427439
44667I076733o725651p142155k461905K258677L053104J259704Q1982l18344j443224
44658b361079k331156q17316J867086J950623r28352k402620M63853M608196M789654
44649D838889L64932m000006m068164q13830J277699R2716j431726L52673M041142
44640F54325M606837P30634k866640k090123R99422K140026J173557N01787j23786
44631E726039k282379l906284j302574L910381N477401J311156l394270l793368
$$ plain form
44693 4548222 2588887 3257124 4563724 4319574 2857292 1074198 -861215 -1949223
44685 -1949223 -695473 1941377 3009094 2078392 2027445 3788649 3851609 -298210 -5077850
44676 -5077850 -4727078 981431 6336897 6898743 4440168 3927910 7147244 10504172 9076733
44667 9076733 2351082 -4791073 -7252978 -4994301 -1941197 -681493 -599511 -917855 -2361079
44658 -2361079 -4692235 -5509551 -3642465 -1691842 -2620194 -5022814 -4558961 49235 4838889
44649 4838889 5203821 1203815 -2864349 -3678179 -2400480 -2307764 -3739490 -3386817 654325
44640 654325 5261162 5991796 3125156 1035033 2034455 4174481 5348038 5849825 5726039
44631 5726039 3443660 -462624 -1765198 2145183 7622584 8933740 5539470 1746102
44623A746102j581797q78843j851373j905316m86267Q40068J388332J386402L35474
44614a007218j832487k978535r57471K846549M687296L125994M13127r76146j198471
44605B122638j688450k465512k193860n52843Q24458N27788l06761N98133K892896
44596b41513L358153O28939k011382r86091K037764K287134j107132l919610k970949
44587b924687Q5342K153526K672558K674678K519952K169177J583344j93333l864334
44578F876223o946447n347755M72922M440340K447920k204870l919127k240271
44570f421065n03608K81690J651629L315540L170234J280034l1618P1032L86676
44561C200544M45912N58301k11412k451636l533180o90919L356937K950548j768225
$$ plain form
44623 1746102 164305 -714538 -2565911 -4471227 -4957494 -4117426 -2729094 -1342692 -1007218
44614 -1007218 -2839705 -5818240 -6775711 -3929162 758134 3884128 4297255 3321109 2122638
44605 2122638 434188 -2031324 -4225184 -4778027 -3953569 -3425781 -3732542 -3134409 -241513
44596 -241513 3116640 3745579 1734197 748106 2785870 5073004 3965872 46262 -2924687
44587 -2924687 -2839345 -685819 1986739 4661417 7181369 9350546 10933890 10740557 6876223
44578 6876223 -70224 -5417979 -4945057 -504717 1943203 -261667 -4180794 -6421065
44570 -6421065 -6924673 -6642983 -4991354 -1675814 1494420 2774454 2742836 2813868 3200544
44561 3200544 3646456 4204757 3993345 1541709 -1991471 -2682390 674547 3625095 1856870
44552A856870m149766q77192L001798K108153j190537j396415J148400J539346
44544B040657j327546l280979j562566J714212L405625K880215R64481j391331
44536C442768k561426j301004Q19689Q39040j051216j546771K33490R95112r99901
44527a130219k298084L27913L958977L414565q21341l343187j802714O39252J105283
44518E0445N24698J43175r96174k902484k953805k86366J508834m42804l207603
44509h562084k135618J962136M092205K420873m1202p41392l54822K266M15091
44500b942547M15123q08712j821750k95980K298077J565657k770380n124440j880213
44491a1365165L086045M119861J615443M3165P09071J075500j5752r11013p34984
$$ plain form
44552 1856870 -2292896 -3170088 -168290 1939863 749326 -647089 501311 2040657
44544 2040657 713111 -2567868 -4130434 -2416222 989403 3869618 4834099 3442768
44536 3442768 881342 -419662 400027 1239067 187851 -1358920 -1125430 -130318 -1130219
44527 -1130219 -3428303 -3100390 858587 4273152 3451811 108624 -1694090 -1054838 50445
44518 50445 575143 718318 -277856 -3180340 -6134145 -6420511 -4911677 -5354481 -8562084
44509 -8562084 -10697702 -8735566 -4643361 -2222488 -2263690 -3005082 -3359904 -3357638 -2942547
44500 -2942547 -2527424 -3336136 -5157886 -5453866 -3155789 -1590132 -4360512 -9484952 -11365165
44491 -11365165 -8279120 -4159259 -2543816 -2500651 -1791580 -716080 -731832 -1642845 -2377829
44482b377829o87708j399155j845510j286136j58599R12684J228413j31665k519115
44473h264620k938452K62575M023307M121924J275541n2684J386807K120944O3736
44464A999078k098606j407916R14671J791018N92786r89180j535708o56250J229251
44455a60856K562364J757038l72374j237440l95341l61635k235800l306375j103628
44446d854047K529311L860662J980265j147332l606105m267810k405486R13105
44438f997437K616441J348992j96229O65615K104525P87549k188750k709132l87771
44429d956197P31746j235835l136229j980350P87720K343151K659684L148890
44421a637420L543468K761251J197129j94176j714032l641643m463648k739770
$$ plain form
44482 -2377829 -3065537 -4464692 -6310202 -7596338 -7754937 -6842253 -5613840 -5745505 -8264620
44473 -8264620 -11203072 -10940497 -6917190 -2795266 -1519725 -1572409 -185602 1935342 1999078
44464 1999078 -99528 -1507444 -592773 1198245 1791031 801851 -733857 -1390107 -160856
44455 -160856 2401508 4158546 3786172 2548732 2153391 1791756 -444044 -3750419 -4854047
44446 -4854047 -2324736 1535926 3516191 2368859 -1237246 -5505056 -7910542 -6997437
44438 -6997437 -4380996 -3032004 -3228233 -2562618 -458093 329456 -1859294 -4568426 -4956197
44429 -4956197 -4224451 -5460286 -8596515 -10576865 -9789145 -7445994 -4786310 -1637420
44421 -1637420 1906048 4667299 5864428 5670252 3956220 314577 -4149071 -6888841
44413f888841J93822J699944J405442J101955J528495J496516K08823j513549
44405g67393k507780k225222n14797J911432L054231J681615k76265K26969K603579
44396C186369K728010j040338m741672m006878k23950J580193m4358j368595N75034
44387c356185L642554L821945P63675k115516k217473m08691R59312R78801L37272
44378B405694m14167j434676k463328k253425M1624L257465M850577L372104p1433
44369G290435k864595l020451n24057K604168L591720J367340j920273k954329
44361C569958j295964k190j345821l557047l506145j287681K58628O923j32489
44352g291828J344023L135592L161258J352798n70715j073238J3996J340739R73464
$$ plain form
44413 -6888841 -6695019 -4995075 -3589633 -2487678 -959183 537333 746156 -767393
44405 -767393 -3275173 -5500395 -6015192 -4103760 -1049529 632086 355821 582790 3186369
44396 3186369 5914379 4874041 132369 -3874509 -4098459 -2518266 -2562624 -3931219 -3356185
44387 -3356185 286369 4108314 4871989 2756473 539000 130309 1089621 2068422 2405694
44378 2405694 1991527 556851 -1906477 -4159902 -4118278 -860813 3989764 7361868 7290435
44369 7290435 4425840 1405389 881332 3485500 7077220 8444560 6524287 3569958
44361 3569958 2273994 2271804 925983 -2631064 -6137209 -7424890 -7166262 -7159339 -7291828
44352 -7291828 -5947805 -2812213 349045 1701843 1131128 57890 71886 1412625 2386089
44343B386089j299484k798570r16028K797650L918104J054559k132357j991069
44335A018894N30987K034971J227387o37920k053054k012877j70930J801744Q64410
44326B603612l112651n633461k998480K157046M052836J394557j775047k319919
44318e631507j252911l76597O19408K300792L457997K696142N38051j251128j509495
44309d09248m44875N42539M977j545216j610344P72751K797332J580957j177221
44300E11652j469673R57028K654980K247831J777268J867544K88888l151108m800471
44291H83939k602180N72016J627914J552367K027232J483487j549573m231877
44283b36675l116465N076O47557j249766j529399J196333L391817K176254q02166
$$ plain form
44343 2386089 1086605 -1711965 -2627993 169657 4087761 5142320 3009963 1018894
44335 1018894 1549881 3584852 4812239 4174319 2121265 108388 -62542 1739202 2603612
44326 2603612 -509039 -6142500 -9140980 -6983934 -2931098 -1536541 -3311588 -5631507
44318 -5631507 -6884418 -7261015 -6641607 -4340815 -882818 1813324 2351375 1100247 -409248
44309 -409248 -854123 -311584 -306607 -1851823 -3462167 -2689416 107916 1688873 511652
44300 511652 -958021 -993 2653987 4901818 6679086 8546630 8835518 5684410 883939
44291 883939 -1718241 -1146225 481689 2034056 4061288 5544775 3995202 -236675
44283 -236675 -3353140 -3348064 -2700507 -3950273 -5479672 -4283339 -891522 1284732 482566
44274D82566k389876j842586k69769J477001K781991K767065J316174k62060n99109
44265C461397J62617O30453l30430k401623l871732l241587j038282O90471R98637
44256d940079R77995J546435J967803J679910J781958K958257L508952J599358
44248A1080589j724391l940797m385511l933589k518721K88280K943916L089456
44240H99232R13659j162898j978760k280490k126444n47539J923419L165640K520153
44231A325972J450304O33721r41207l132203l646811j388365J423388K175248
44223b099953J165207L22161J34239k71866r73896j074093l91029J20336k41528
44214c310422r95351j154508m22917M93228P63494M71185L56197N00281J07555
$$ plain form
44274 482566 -1907310 -3749896 -4019665 -2542664 239327 3006392 4322566 4060506 3461397
44265 3461397 3624014 4254467 3924037 1522414 -2349318 -5590905 -6629187 -5938716 -4940079
44256 -4940079 -3962084 -2415649 -447846 1232064 3014022 5972279 9481231 11080589
44248 11080589 9356198 5415401 1029890 -2903699 -5422420 -5134140 -2190224 899232
44240 899232 1812891 649993 -1328767 -3609257 -5735701 -6283240 -4359821 -1194181 1325972
44231 1325972 2776276 3409997 2468790 -663413 -4310224 -5698589 -4275201 -2099953
44223 -2099953 -934746 -612585 -478346 -750212 -1724108 -2798201 -3189230 -3068894 -3310422
44214 -3310422 -4305773 -5460281 -5883198 -5389970 -4626476 -4155291 -3799094 -3298813 -3191258
44205c191258r83221j585530p96532O01514J374338J526305J619458J394812M17829
44196C77715p71287j437676j635388j295256K05067K150261K079285o77909l032044
44187d037232k297815l32048l16981j363394l60205K252807L238430K347401K333018
44178A463981L193262J686593k393841m512637j885624K502192M391126L147841
44170G592893M48269k323353l627430k292407j55098n61601k814677k383738J597170
44161d519972M009156J685674j382251o46015J824835J607816m16355k02034K190524
44152D151378K995999J065646j139369k155964k844177l460507k977008j173159
44144e537161J101143L000700L233798N73257l046116k915258J912699N725370
$$ plain form
44205 -3191258 -4174479 -5760009 -6556541 -5955027 -4580689 -3054384 -1434926 -40114 377715
44196 377715 -393572 -1831248 -3466636 -4761892 -4556825 -2406564 -327279 -1005188 -4037232
44187 -4037232 -6335047 -6667095 -6984076 -8347470 -8707675 -6454868 -3216438 -869037 1463981
44178 1463981 4657243 6343836 3949995 -562642 -2448266 53926 4445052 7592893
44170 7592893 8041162 5717809 2090379 -202028 -357126 -918727 -3733404 -6117142 -4519972
44161 -4519972 -510816 1174858 -207393 -853408 971427 2579243 2162888 1960854 4151378
44152 4151378 7147377 8213023 7073654 4917690 2073513 -1386994 -4364002 -5537161
44144 -5537161 -4436018 -1435318 1798480 2371737 -674379 -3589637 -1676938 4048432
44136D048432L668701j147003k755931j283453j007052k177751j523058O55201
44128a521914R25048l26338O02137L158995K568142j595346l784753j276293J858480
44119F08158J926566P08803N75637K03080j461273j988892J17656K066586J299411
44110D055732m66547q82856q43139j592424j785165o28909j81729j288302j165595
44101d778934J507724L251391J480794o81486R1137J158170j193330m259702k801033
44092f225269J975716M037243J889748j84361J92084Q80094N87068Q03215J356754
44083E312292l32773l847826m659248p13969L990777M781631J880301j443807
44075D967378l108007k577649k9098K597468K275029j189245m076569l475037
$$ plain form
44136 4048432 7717133 6570130 3814199 2530746 1523694 -654057 -2177115 -1521914
44128 -1521914 -596866 -923204 -321067 2837928 5406070 3810724 25971 -1250322 608158
44119 608158 2534724 3243527 3819164 4022244 2560971 572079 689735 2756321 4055732
44110 4055732 3589185 2706329 1863190 270766 -1514399 -2143308 -2325037 -3613339 -4778934
44101 -4778934 -3271210 -19819 1460975 779489 870626 2028796 835466 -3424236 -6225269
44092 -6225269 -4249553 -212310 1677438 1493077 1685161 2565255 3152323 3955538 5312292
44083 5312292 4979519 1131693 -3527555 -4241524 -250747 4530884 6411185 4967378
44075 4967378 1859371 -718278 -747376 1850092 4125121 2935876 -1140693 -4615730
44067d615730q82103P20167J007885J311029J619852J204363O77957R00073R76685
44058B920178k27651j532704q96727J082295J553845o28535l309866l721426j342159
44049f102750K089624M154624L272967J3930k765470k287879J034529L689473
44041C099048K877839l84274k649453k066887j01701P78374R2035p19772o75203
44032B50006l10794l88875q69079j548262k375329k507900o78556K361532L563789
44023b503468J586219o86359k08837J324606L38187k006516j073376K987985M009961
44014C768402o65469m903022k544706K898428L467701j014070l203937k24398
44006b421071K278793K9255l009119j874252R10873j4939l324678k890519K104709
$$ plain form
44067 -4615730 -5497833 -4777666 -3769781 -2458752 -838900 365463 1043420 1943493 2920178
44058 2920178 2692527 1159823 263096 1345391 2899236 2270701 -1039165 -4760591 -6102750
44049 -6102750 -4013126 141498 3414465 3428395 662925 -1624954 -590425 3099048
44041 3099048 5976887 5592613 2943160 876273 774572 1552946 1644981 925209 250006
44032 250006 -60788 -449663 -1318742 -2867004 -5242333 -7750233 -8428789 -6067257 -2503468
44023 -2503468 -917249 -1603608 -1812445 -487839 -149652 -2156168 -3229544 -241559 3768402
44014 3768402 3102933 -1800089 -4344795 -1446367 2021334 1007264 -2196673 -2421071
44006 -2421071 -142278 -113023 -3122142 -4996394 -4085521 -4100460 -7425138 -10315657 -8210948
43997h210948N615299L980277P70306K30868R81858k02518k104080j109440K311515
43988B263137L721272J167297k180752k650677n75223J063371O15495j021194
43980B402726k197357k348550k197778k524992k842143j846908M51240K124254
43972h979508J869920R81341J145048J503448L74405j021777N5471K766725K894512
43963A589585o25628l264547j420685K040224K217614n12778j904571r37617o30230
43954c448633j997919k181542R9955J620741k93473l056261k386139J379583L786956
43945f476732K279376j030384k450815m96343L353859N948615M666282O6265l721217
43936B138906l050685P24167K744778R51591j453445r36698J354194J770243j83357
$$ plain form
43997 -8210948 -2595649 1384628 2154934 2385802 3367660 3165142 1061062 -48378 2263137
43988 2263137 5984409 7151706 4970954 2320277 1745054 2808425 3423920 2402726
43980 2402726 205369 -2143181 -4340959 -6865951 -9708094 -11555002 -11103762 -8979508
43972 -8979508 -7109588 -6128247 -4983199 -3479751 -3105346 -4127123 -4071652 -1304927 1589585
43963 1589585 963957 -2300590 -3721275 -1681051 536563 23785 -1880786 -2818403 -3448633
43954 -3448633 -5446552 -7628094 -7528139 -5907398 -6200871 -9257132 -11643271 -10263688 -6476732
43945 -6476732 -4197356 -5227740 -7678555 -8174898 -4821039 1127576 5793858 5860123 2138906
43936 2138906 -911779 -187612 2557166 3508757 2055312 1118614 2472808 4243051 4059694
43927D059694j368980L946J820009J411008q10332k631463l299673l474539k856545
43918g146875k77016L591820N622816L514717j202734m529701m123594j327693
43910e878260Q91185J304568J165122J826583K640229K060774K86086o60404K99662
43901C935545J862339K272244J297900n03856k810529m511077l542825Q0556K686815
43892G67112J290335j612176j166981K348253L446318k57392m017228k733531
43884a935290J693657L305755L57074l075174l139566o51897J010871L58365q32446
43875b908651M3437K962432M630357K251344k374290m519865k594561L7962K99676
43866b172159n08896J51210J645844J798423P72705Q1056o64413k604498m416860
$$ plain form
43927 4059694 2690714 2694660 4514669 5925677 5115345 2483882 -815791 -4290330 -7146875
43918 -7146875 -7423891 -3832071 1790745 5305462 4102728 -426973 -4550567 -5878260
43910 -5878260 -4987075 -3682507 -2517385 -690802 1949427 4010201 4296287 3635883 3935545
43901 3935545 5797884 8070128 9368028 8864172 6053643 1542566 -2000259 -1919703 767112
43892 767112 2057447 445271 -721710 1626543 5072861 4815469 798241 -1935290
43884 -1935290 -241633 3064122 3421196 346022 -2793544 -3445441 -2434570 -2076205 -2908651
43875 -2908651 -2865214 97218 4727575 6978919 4604629 84764 -2509797 -2471835 -2172159
43866 -2172159 -2681055 -2529845 -884001 914422 1687127 1768183 1103770 -1500728 -5917588
43857e917588l726903r89848J336092K731113M190382M577955J691213k789596
43849A102820l817293J33843M338876L926891j08968l058613k491964n7850J293357
43840A261099J74843k323896l527324j612249K342574N280398M999323J511259
43832H106027l332719o305352m538815Q71001M471406K591620j526316k234510
43824a897658L86305J504529l39505j754620j294235j562447l109730k428834
43816a0496195J353568L675059J937785J78507J984400L927905J553431k408206
43808A706254k255018J179539K008797j152338l602998k334613L63357J654148
43800b432872J599826R27936m69815j711846j048582J203296K658364K312922
$$ plain form
43857 -5917588 -9644491 -10634339 -9298247 -6567134 -2376752 2201203 3892416 1102820
43849 1102820 -2714473 -2580630 1758246 5685137 5576169 2517556 25592 -32258 1261099
43840 1261099 1435942 -887954 -4415278 -6027527 -3684953 1595445 6594768 8106027
43832 8106027 4773308 -1532044 -6070859 -5199858 -728452 1863168 336852 -1897658
43824 -1897658 -1511353 -6824 -346329 -2100949 -3395184 -4957631 -8067361 -10496195
43816 -10496195 -9142627 -5467568 -3529783 -3351276 -1366876 2561029 4114460 1706254
43808 1706254 -548764 630775 2639572 1487234 -2115764 -4450377 -4087020 -2432872
43800 -2432872 -833046 94890 -374925 -2086771 -3135353 -1932057 726307 3039229
43792C039229J390069O83811j19062n26903K76860R74412o51383l668806m380238
43783b982011j516154J763329K010306n70718l029932k816154J05668K825864
43775d209802J952540j787124l160748O73543N184833M507618L61456o73692K342686
43766E191310L678875Q37497j637147m50791J034875p28117l355927l259223j678243
43757c66891j255456p23642J824680L803178J836430j915459k754849r65013o26717
43748a143739k043040j357918K127245M000736J579041j959813k408676n4047
43740a260211J804959J387059m60302j987833j921229k83811J349398J425020
43732E3050L58478l21235l34534k90800M59290K884228N198541L967118p28320
$$ plain form
43792 3039229 4429298 5113109 4994047 4467144 4744004 5718416 5067033 1398227 -2982011
43783 -2982011 -4498165 -2734836 -724530 -1295248 -4325180 -7141334 -7035666 -4209802
43775 -4209802 -2257262 -4044386 -7205134 -6531591 -1346758 3160860 3522316 2848624 5191310
43766 5191310 8870185 9707682 8070535 7619744 8654619 7926502 4570575 1311352 -366891
43757 -366891 -1622347 -2345989 -521309 3281869 5118299 3202840 447991 -517022 -1143739
43748 -1143739 -3186779 -4544697 -2417452 1583284 3162325 1202512 -1206164 -1260211
43740 -1260211 544748 1931807 1471505 -516328 -2437557 -2721368 -1371970 53050
43732 53050 411528 90293 -244241 -535041 -75751 2808477 8007018 11974136 11245816
43723A1245816m248675l268857j91684N13044j576629l049527j905991K17880
43715b264623J074252P10978N10442P91213O04702m89984j468099j053247M86744
43706a097622J419429O09174j095650j986213j418858J8441J550310K382856J506288
43697A888155j095402l279536k598963M11140K519620J864669m7444j146450j532411
43688c016622j911828j248459J544169M583732M520046J111083k169233k658944
43680G53944j405964n89781k70056N31233J182635K68925j635162k361259j311640
43671d837125j45095M6091K37246J339779K373376K048514Q23479o3770o03375
43662A219120j498039k350125k028278n58650Q72597J731583K498267L074078
$$ plain form
43723 11245816 6997141 3728284 3536600 4049644 2473015 -576512 -2482503 -2264623
43715 -2264623 -1190371 -479393 31049 822262 1426964 936980 -531119 -1584366 -1097622
43706 -1097622 321807 930981 -164669 -2150882 -3569740 -3551299 -2000989 381867 1888155
43697 1888155 792753 -2486783 -5085746 -4674606 -2154986 -290317 -337761 -1484211 -3016622
43688 -3016622 -4928450 -6176909 -4632740 -49008 4471038 5582121 3412888 753944
43680 753944 -652020 -1241801 -1511857 -980624 202011 470936 -1164226 -3525485 -4837125
43671 -4837125 -4982220 -4936129 -4698883 -3359104 -985728 1062786 1886265 1822495 1219120
43662 1219120 -278919 -2629044 -4657322 -5215972 -4343375 -2611792 -113525 2960553
43654B960553K283679l44571l193429l832737j654458J106547J401117j147937
43646b421236l236718j597346K439049M154392J773669j085438r44346M48391
43638d69583l79008k441006j971959R00153K077768K45953j151233R6585J516390
43629a575940N98468j005129o10755J209172K120034J359419n99418l145483m322881
43620e972513j653524L420170N350981J837227k157900j596568R75575N7459l441230
43611c180323l806289j07452K537782J510590J16666R60521J628071l79357k948104
43602c667895k710525R6173K839086M024852L446519J256336j044096j015779
43594C224671J320112K700872J109912j261405j556359l94122m7219n74400n68329
$$ plain form
43654 2960553 5244232 4899661 1706232 -2126505 -3780963 -2674416 -1273299 -2421236
43646 -2421236 -5657954 -7255300 -4816251 -661859 1111810 26372 -917974 -469583
43638 -469583 -848591 -3289597 -5261556 -4361403 -2283635 -2037682 -3188915 -3092330 -1575940
43629 -1575940 -977472 -1982601 -2593356 -1384184 735850 2095269 1495851 -1649632 -5972513
43620 -5972513 -7626037 -4205867 1145114 2982341 824441 -772127 203448 260907 -3180323
43611 -3180323 -6986612 -7094064 -4556282 -3045692 -2929026 -1968505 -340434 -719791 -3667895
43602 -3667895 -6378420 -6282247 -3443161 581691 4028210 5284546 4240450 3224671
43594 3224671 4544783 7245655 8355567 7094162 5537803 5143681 5096462 4522062 3953733
43585C953733k48181r28881k239713k434619j110994M00032J085298J120538J041615
43576F38828J244414J744222J575992m08201l113740l250251M40019M488363M489500
43567G849146O25761k879053l179187j367379O1330r558j226807k461916k180299
43558d767962L06951L507898M845184L355455L93913k168235l288667k593774
43550d09237m52597J619028K012733Q14919n34614j382193k249690k926721k006334
43541e514706O87308K711683J693559j263231k590285p53077J830712K099209
43533a098828K99024p83153J19556J386366J427357R04426Q70691N52714r74599
43524B703554k217531j032267J575572K288849K33142j966422k396011k089564
$$ plain form
43585 3953733 3705552 2776671 536958 -1897661 -3008655 -2608623 -1523325 -402787 638828
43576 638828 1883242 3627464 5203456 4795255 1681515 -1568736 -1128717 3359646 7849146
43567 7849146 8474907 5595854 2416667 1049288 1110618 1101060 -125747 -2587663 -4767962
43558 -4767962 -4461011 -953113 3892071 7247526 7641439 5473204 2184537 -409237
43550 -409237 -861834 757194 2769927 3584846 3050232 1668039 -581651 -3508372 -5514706
43541 -5514706 -4827398 -2115715 -422156 -1685387 -4275672 -5028749 -3198037 -1098828
43533 -1098828 -799804 -1582957 -1463401 -77035 1350322 2254748 3125439 3678153 2703554
43524 2703554 486023 -546244 1029328 3318177 3551319 1584897 -811114 -2900678
43516b900678j998871r35075J522694K943412J500510p24653p35911Q83230J400542
43507I55200K88357r76868k063363l236703k781574R74416N423630N727111J580262
43498E890468k140627k446443j771005k706226l402158j276858J948678K743585
43490c160586J297518P13422J743327K091988P85670k52881L42953J192162N70743
43481E324316j053131k050021j676131j74228J745146K666409J238852j674302
43473D346910l026322j198195J596264K133160L58840j203532j376657j172759
43465D57709j012906j9217J335786Q45925j690041l052885j108670J624372J713637
43456i06290J11775J87170J872215K046642L16770k86073R53672Q29111j799688
$$ plain form
43516 -2900678 -4899549 -5834624 -4311930 -1368518 131992 -592661 -1328572 -445342 955200
43507 955200 1243557 266689 -1796674 -5033377 -7814951 -6840535 -1416905 4310206 5890468
43498 5890468 3749841 1303398 -467607 -3173833 -6575991 -7852849 -5904171 -3160586
43490 -3160586 -1863068 -1149646 593681 2685669 3471339 3218458 3561411 4753573 5324316
43481 5324316 4271185 2221164 545033 370805 2115951 4782360 6021212 4346910
43473 4346910 1320588 122393 1718657 3851817 4210657 3007125 1630468 457709
43465 457709 -555197 -574414 761372 1607297 -82744 -3135629 -4244299 -2619927 -906290
43456 -906290 -794515 -607345 1264870 3311512 3628282 3342209 4295881 5124992 3325304
43447C325304l076853l46404K733474J466654k465865l699141j431128K15394
43439c278565n74337r71734Q81391K661196K109788P64800J039895K253578K091055
43430F977067K99495j353378j755147j207734j92460J037769J897611J648621
43422G351844K25255j517583k312915j386510O32262J957136J524813K63528l53710
43413F384120l46157n57371p34662q1706P93666N65636m38228p38311l86570o86969
43403C773448j270828l56023J585596J551428j354447l864811k899061L73939
43395b460759K689504K853510J802324L12725j208977j927929j458068o23103
43387b0773r2406N13021J171600Q80491k97834o51112L18021P32742k96596p99996
$$ plain form
43447 3325304 248451 -97953 2635521 4102175 1636310 -2062831 -3493959 -3278565
43439 -3278565 -3852902 -4824636 -3943245 -1282049 827739 1592539 2632434 4886012 6977067
43430 6977067 7276562 5923184 4168037 2960303 2767843 3805612 5703223 7351844
43422 7351844 7577099 6059516 3746601 2360091 2992353 4949489 6474302 6737830 6384120
43413 6384120 6037963 5480592 4745930 4664224 5457890 6023526 5585298 4846987 4460417 3773448
43403 3773448 2502620 2146597 3732193 5283621 3929174 64363 -2834698 -2460759
43395 -2460759 228745 3082255 4884579 5197304 3988327 2060398 602330 -20773
43387 -20773 -113179 399842 1571442 2451933 2154099 1502987 1821008 2553750 2257154 1457158
43377A457158L85814J004174n89628j735108K08966K425077N68002l542341l989121
43368c807007j03100K440711Q23484q30087R32715K923385J078769k251966j977602
43359g70698J467915K904629L33682k880859l692875k726758j215465J240540
43351e339889M157158M894731K361962n26341p88123J59928r22334l355004l165373
43342b523285M94442L418246K318861n45541j220786P1135L57613m70009K05886
43333B106562K216345J878374j808123m454272k512153J181759J756562k93417
43325G1637n65886J624213K142544q81425l543044j902040K152068L647431J161064
43316C906562k083664k774674p89507J726393K676940J447378o01148j110135
$$ plain form
43377 1457158 1842972 2847146 2257518 522410 731376 3156453 3724455 182114 -3807007
43368 -3807007 -3910107 -1469396 -645912 -1475999 -543284 2380101 3458870 1206904 -770698
43359 -770698 697217 3601846 3935528 1054669 -2638206 -5364964 -6580429 -5339889
43351 -5339889 -1182731 3712000 6073962 5547621 4759498 4919426 3997092 642088 -2523285
43342 -2523285 -2028843 1389403 3708264 3162723 1941937 2013072 2370685 1900676 2106562
43333 2106562 4322907 6201281 4393158 -61114 -2573267 -1391508 365054 71637
43325 71637 -494249 1129964 3272508 2391083 -1151961 -3054001 -901933 2745498 3906562
43316 3906562 1822898 -951776 -1741283 -14890 2662050 4109428 3508280 2398145
43308B398145P18707K780355K473277K07874j067567j25954N18999j853032n769684
43299B81120o770295l097393J826463L731280K689398J965052K648616K345378
43291E619619l79433l203973l406981j753892o79506k64857J085768K899766K851302
43282B767813Q09660m21395O72789J933511P82266k078345l800408k924780l98549
43273b657438J934355K648192J391546o29400j444025n05680N28425L4366j228894
43264G1447j056315J184207L444674L221267N43024j780374j382534M98457M32842
43255E176695k230435l815962j394430K530918L254032N26298j597629j118179
43247A331308k06229m63828l68396R82855J597626L84591l69642R12304J866769
$$ plain form
43308 2398145 3116852 5897207 8370484 8578358 7510791 7384837 7903836 6050804 281120
43299 281120 -6489175 -9586568 -7760105 -4028825 -1339427 625625 3274241 5619619
43291 5619619 5240186 2036213 -1370768 -3124660 -3804166 -4069023 -2983255 -83489 2767813
43282 2767813 3577473 3156078 3828867 5762378 6544644 4466299 665891 -2258889 -2657438
43273 -2657438 -723083 1925109 3316655 2687255 1243230 737550 1265975 1300341 71447
43264 71447 -984868 199339 3644013 6865280 7408304 5627930 4245396 4743853 5176695
43255 5176695 2946260 -869702 -2264132 266786 3520818 4047116 2449487 1331308
43247 1331308 1125079 661251 292855 1275710 2873336 3257927 2888285 3800589 5667358
43238E667358K76380j692321j096274O63984N86835l87701O04915K497255J763207
43229H883638j059668j760250N99026K413510J801792Q96386P71935n52665l146199
43220H847505l468550m31614J693459q4971k346507r67785J875015J406135j858017
43211D664670l278037j462277P90990K041185L530675N003125M081189O46097
43203A6017617k264137k940387k776973k672166j387786J157831K539864J625232
43195I299095O09923J224677J751304J61214k248007k956938j988704r24440J95795
43186E123919K133900L701038K675221p44348l700775l992941k038512L16386
43178C473888J599176J616656J654448L179013N401597N347627J782279k328934
$$ plain form
43238 5667358 5943738 4251417 3155143 3819127 4405962 4018261 4623176 7120431 8883638
43229 8883638 7823970 6063720 6662746 9076256 10878048 11774434 12546369 11993704 8847505
43220 8847505 5378955 4947341 6640800 6555829 4209322 3241537 5116552 6522687 4664670
43211 4664670 1386633 -75644 715346 2756531 6287206 11290331 15371520 16017617
43203 16017617 13753480 10813093 8036120 5363954 3976168 5133999 7673863 9299095
43195 9299095 9909018 11133695 12884999 13046213 10798206 7841268 5852564 4928124 5123919
43186 5123919 7257819 10958857 13634078 12889730 9188955 5196014 3157502 3473888
43178 3473888 5073064 6689720 8344168 11523181 16924778 22272405 24054684 21725750
43170B1725750l300483j482752j58963o68425j457627j482949j397796j114666
43162A0662089P16726L806158N349099L420524n03657l423287l729684j702637
43154A4595331J135006K555220J317648j081640k085178j683898k052001l364857
43146I335631l057430j89833K701633L618109L659751L680699K052462j410703
43138B0390319k953916k55747K778356J352571k467217k825721N45911K143560
43130A8708116k16480k334340r96640J289928J376885M37855P68942J588938J402579
43121B2025783J346372K731934L886397K880768J180091J118741J716489P30925
43113C7617500o77807N39418L772180M790022J808107j763496j675029K285373
$$ plain form
43170 21725750 18425267 16942515 16783552 16115127 14657500 13174551 11776755 10662089
43162 10662089 11378815 15184973 20534072 23954596 23450939 20027652 16297968 14595331
43154 14595331 15730337 18285557 19603205 18521565 16436387 14752489 12700488 9335631
43146 9335631 6278201 6088368 8790001 12408110 16067861 19748560 21801022 20390319
43138 20390319 17436403 17180656 19959012 21311583 18844366 16018645 16564556 18708116
43130 18708116 18491636 16157296 15160656 16450584 17827469 18265324 19034266 20623204 22025783
43121 22025783 23372155 26104089 29990486 32871254 34051345 35170086 36886575 37617500
43113 37617500 36939693 37479111 41251291 46041313 47849420 46085924 44410895 46696268
43105D6696268O660902Q042403N892646K763036J796968L297662M495381L619433
43097H3264699K645699M181019P266212Q997912R134957R861831J1609220J2636961
43089A49598510J2745105J3803669J6093861J7680421J8297315K0159053K3406849
43082B71784783K4453202K1209952J6703883J4530030J3418538R759750L429035
43075C75289173k770725q126265j4262693k0664792k4091916k3333317k1128717
43068B60910748j9984991j9015161j6760522j4588980j4649593j5943352j5305176
43061A44662973j1988233q797317q206889r311477r609156q402969p066359o673880
43053G4606693o856671o898417o581675n611455l497890q21350M74948o88640
$$ plain form
43105 46696268 53357170 61399573 67292219 70055255 71852223 75149885 79645266 83264699
43097 83264699 85910398 90091417 97357629 106355541 115490498 125352329 136961549 149598510
43089 149598510 162343615 176147284 192241145 209921566 228218881 248377934 271784783
43082 271784783 296237985 317447937 334151820 348681850 362100388 371860138 375289173
43075 375289173 372518448 364392183 350129490 329464698 305372782 282039465 260910748
43068 260910748 240925757 221910596 205150074 190561094 175911501 159968149 144662973
43061 144662973 132674740 123877423 115670534 106359057 96749901 88346932 81280573 74606693
43053 74606693 67750022 60851605 54269930 48658475 45160585 44339235 44814183 44125543
43045D4125543k686641l029079j692691r76485k041981l427317l490862k503261
43037B4277226j374026o6721J280926J206306j156930l992207m667984l084543
43029A2422047j201506J29604J469166K253146Q82198k058378l480745k006423
43021H409109n7477n5412q16739j5207J670937J763380J85879q27648n82444o05006
43011I069372j358093j319749o6446N83394k42977p13818N86985J994222J294024
43002I826914p76377j791491j201531m73648n15924r23427j115866n79573J065525
42993C514602K595730J286910l183089o545176m878471n06438J065931n32602
42985g182603k73453L544384N848487K801745j586779j244772K858868M518256
$$ plain form
43045 44125543 41438902 38409823 36717132 35740647 33698666 30271349 26780487 24277226
43037 24277226 22903200 22836479 24117405 25323711 24166781 20174574 15506590 12422047
43029 12422047 11220541 11350145 12819311 15072457 15954655 13896277 10415532 8409109
43021 8409109 8351632 8296220 7479481 7464274 9135211 10898591 11084470 10256822 9674378 9069372
43011 9069372 7711279 6391530 6325084 6908478 6665501 5951683 6538668 8532890 9826914
43002 9826914 9050537 7259046 6057515 5583867 5067943 4144516 3028650 2449077 3514602
42993 3514602 6110332 7397242 4214153 -2331023 -7209494 -7715932 -6650001 -7182603
42985 -7182603 -7456056 -3911672 1936815 4738560 3151781 1907009 4765877 9284133
42977I284133J545118k005745k724456k060656k319611k424380k12060L350938
42969B433281M961248L255024L03197j221816j036580p72987j168163r72456P37232
42960F517980K293718J308602j480164k581902n58049K004496K528115J853403
42952A1886199J645905R45569j752151m800988n142353k730904j41521J373233
42944A282989K334771K421689Q81151q91817p02849O88823O13082r40283j528106
42935D159450q72988j019090j642411j0946L332267L850446k3722l862799l695956
42926B14251j096857R68570K806143M886021M505306K54051l757812l273002n67077
42917D939594l28240j476771N18610M691439N057755L18885l689505k963885p31715
$$ plain form
42977 9284133 10829251 8823506 6099050 4038394 1718783 -705597 -917657 2433281
42969 2433281 7394529 10649553 10952750 9730934 8694354 7921367 6753204 5780748 6517980
42960 6517980 8811698 10120300 8640136 6058234 5500185 7504681 10032796 11886199
42952 11886199 13532104 14477673 12725522 7924534 2782181 51277 -90244 1282989
42944 1282989 3617760 6039449 6920600 6028783 5325934 6014757 6627839 5687556 4159450
42935 4159450 3286462 2267372 624961 614015 3946282 7796728 7773006 3910207 214251
42926 214251 -882606 85964 2892107 7778128 12283434 12537485 8779673 5506671 4939594
42917 4939594 4611354 3134583 3653193 8344632 13402387 13721272 10031767 7067882 6336167
42908F336167j115990k577024j510627J363930K480942J100225m13870q38113
42900D825640j138662j573855p52098J738612L697135K453664j880207n939990
42892A430239o139925k323177J983332L498193K768583K665802L892633M080921
42884A1856601J730931j156740j802313n03236J27477q22379j310264M15639K822004
42875A1357720K769062j99992k953206k894017j392140j255514j988698o72284
42867B770931K508467L542419R90206p85063K009201O124253N617662Q09074k177666
42858B1409484m10489K351110K042419l16799j518205r29962n162N91985J216372
42849B4430753K066569L128569M062913L693249J353093j151522j325239J03273
$$ plain form
42908 6336167 5220177 2643153 1132526 2496456 4977398 6077623 5663753 4825640
42900 4825640 3686978 2113123 1361025 3099637 6796772 9250436 7370229 1430239
42892 1430239 -4709686 -7032863 -5049531 -1551338 1217245 3883047 7775680 11856601
42884 11856601 13587532 12430792 10628479 10125243 10252720 9430341 8120077 8535716 11357720
42875 11357720 14126782 13926790 10973584 8079567 6687427 5431913 3443215 2770931
42867 2770931 5279398 8821817 9812023 9026960 11036161 17160414 22778076 23587150 21409484
42858 21409484 20998995 23350105 25392524 25075725 23557520 22627558 22622396 23214381 24430753
42849 24430753 26497322 29625891 33688804 37382053 38735146 37583624 36258385 36361658
42841C6361658K6792j837278k177715K94762K275591R98958j561983k308491j723947
42832C0348347j842006k165174j153626J66473l18004k035259k774580k477368
42824A7748803k770515l487584k837335p10970J019479J365610R31616K3462j514394
42815I768172k704165k031289J75510J814260J595174K01946q93620o99820N29003
42806G755171R57785r67314l437012k544216J700419L894495Q23808k922355j555289
42797C705492K577909K469710k213007m452979j003603L020215K889513R29250
42789G922500P37996N56574k444602n489233l758005J546954M264968J748837
42781E085989k317830l620418j943351K84594J168704L36523j171616j535864
$$ plain form
42841 36361658 36388450 34551172 32373457 32668219 34943810 35942768 34380785 32072294 30348347
42832 30348347 28506341 26341167 25187541 25354014 25036010 23000751 20226171 17748803
42824 17748803 14978288 11490704 8653369 7942399 8961878 10327488 11259104 11282566 9768172
42815 9768172 7064007 5032718 5208228 7022488 8617662 8819608 7925988 7226168 7755171
42806 7755171 8712956 7745642 4308630 1764414 3464833 7359328 8183136 5260781 3705492
42797 3705492 6283401 8753111 6540104 2087125 1083522 4103737 6993250 7922500
42789 7922500 8660496 9217070 6772468 1283235 -2474770 -927816 3337152 5085989
42781 5085989 2768159 -852259 -2795610 -2511016 -1342312 -1005789 -2177405 -3713269
42773c713269r4182J550598J670125Q30469M93696L60380n65674j318345l46793
42764a132995J046854J30920k250678j942251J957408M494163J479059l999625
42756b17145n193541n48573M632504N321733K255009o88026j708885j575615p57488
42747A519973J011848K606016J676781k004135n136085m327342j38663L574888
42739a216719L954928J754729p5816M16836K308411K781238N08990j950052p28473
42730G754072L740574O030581K618400k745490l749741j5243L226351L210989
42722B0070493K507019L271453L876104L255001L623637N646527N420928O25415
42714D8296577m132987l460197J78722J30705l769220n101289j532298J421058
$$ plain form
42773 -3713269 -3807451 -2256853 -586728 243741 737437 1097817 532143 -786202 -1132995
42764 -1132995 -86141 44779 -2205899 -4148150 -2190742 2303421 3782480 -217145
42756 -217145 -5410686 -5959259 -1326755 3994978 6249987 5561961 3853076 2277461 1519973
42747 1519973 2531821 5137837 6814618 4810483 -325602 -4652944 -4791607 -1216719
42739 -1216719 2738209 4492938 4417122 4833958 7142369 9923607 10432597 8482545 7754072
42730 7754072 11494646 17525227 20143627 17398137 13648396 13633153 16859504 20070493
42722 20070493 22577512 25848965 29725069 32980070 36603707 42250234 47671162 48296577
42714 48296577 44163590 40703393 40882115 41012820 37243600 32142311 30610013 32031071
42706C2031071o67867m588059n294560l331295k247621k280055j276965L93887
42698A2738536M55400r12729j346122l80294K48941K4363K3456O4296j096646
42689I819201k530044j692195R40095J428308j647199m041905j473372L971190
42681D774079O432518L992437K05647j756098k689661m033494m376879j809324
42673G39225K265012M503941L890829K007923l04638l449818o059211n020060
42665a426797k03436L736080K893079n96371j782470R4190J451082O00218R659
42656D775234J486671K841710J412659j733902l491077k870298j333176k88857
42648G98964k04528j060232j840055p01673K396511M321472K256078k173927m589868
$$ plain form
42706 32031071 31363204 26775145 21480585 18149290 15901669 13621614 12344649 12738536
42698 12738536 13193936 12281207 10935085 10554791 10803732 10828095 10851551 10915847 9819201
42689 9819201 7289157 5596962 6537057 7965365 6318166 2276261 802889 4774079
42681 4774079 11206597 15199034 15404681 13648583 10958922 6925428 2548549 739225
42673 739225 3004237 7508178 11399007 13406930 13102292 9652474 3593263 -1426797
42665 -1426797 -1630233 2105847 4998926 4402555 2620085 2714275 4165357 4765575 4775234
42656 4775234 6261905 9103615 10516274 8782372 5291295 2420997 1087821 798964
42648 798964 594436 -465796 -2305851 -3007524 -611013 3710459 5966537 3792610 -797258
42639g97258l296640p37454L93483J85354K25029J160910K268737K359017R29713
42630B690891p58157l95695K210542L716432J251491k931494l871554q77083J431358
42621B466731o3427k681780k437744J96215J768449J006521m43087j147743r86460
42612b322325O9717J658521K019312j27011k842736k704702L78251K546815J166648
42603a57510j487778j414931J520024L324804J258884k419489l436139j328710
42595d140845n2502k115556m472990k666986K381384N200284L264492j37520j489222
42586d229461j506974j868623j376918J083743K846708J148137j529394o31830
42578f064612L063667M300492J445974j345603q68399J063896J856719J979631
$$ plain form
42639 -797258 -4093898 -4831352 -4437869 -4252515 -4027486 -2866576 -597839 1761178 2690891
42630 2690891 1932734 1537039 3747581 7464013 8715504 5784010 1912456 1035373 2466731
42621 2466731 2403304 -278476 -2716220 -2520005 -751556 254965 -188122 -1335865 -2322325
42612 -2322325 -2252608 -594087 1425225 1298214 -1544522 -4249224 -3870973 -1324158 -157510
42603 -157510 -1645288 -3060219 -1540195 1784609 3043493 624004 -2812135 -4140845
42595 -4140845 -4193347 -6308903 -10781893 -13448879 -11067495 -5867211 -2602719 -2740239 -4229461
42586 -4229461 -5736435 -7605058 -8981976 -7898233 -5051525 -3903388 -5432782 -6064612
42578 -6064612 -3000945 1299547 2745521 1399918 531519 1595415 3452134 5431765
42570E431765K267915J287540j645490l784083k398162J072077K881629J429415
42562F542606k011450n093754n268081j317733L905367M915950L50384m286486
42554b263197l651492K50085J739893J09115l24062K058036L622517J610448j468938
42545A682405j591725J390036M123268L905544R50212k499168m244048l750531
42537c4007k116631m49572R93812J718999O71316j703071k743379q65509J875086
42528b652956K672015J880711J457028J108056o33693k630560k264708O4682J280567
42519B81142L67268q14887j330596j950024k122663l90664J791190J146744j695187
42510d717677k310131L75836K088236M07831j200774M10186K741344K405401Q65431
$$ plain form
42570 5431765 7699680 8987220 7341730 3557647 1159485 2231562 5113191 6542606
42562 6542606 4531156 -562598 -5830679 -7148412 -3243045 1672905 2023289 -2263197
42554 -2263197 -5914689 -5664604 -3924711 -3815596 -4139658 -2081622 1540895 3151343 1682405
42545 1682405 90680 1480716 5603984 9509528 10459740 7960572 3716524 -34007
42537 -34007 -2150638 -2600210 -1606398 112601 783917 -919154 -3662533 -4528042 -2652956
42528 -2652956 19059 1899770 3356798 4464854 3831161 1200601 -1064107 -999425 281142
42519 281142 648410 -166477 -1497073 -3447097 -5569760 -5960424 -4169234 -3022490 -4717677
42510 -4717677 -7027808 -6651972 -4563736 -4155905 -5356679 -4946493 -2205149 200252 1065683
42501A065683R05012J117310j031188l612245l010709q2383J623251J879214K727134
42492A581079L137378N78665l076821l315706m09878J000472p6374Q9458K011266
42483A519539J099101l597853n647717p74633N526098N653413R92543j142622
42475C627869R81529K139435k98651k329568m87777K506242K327639n09400k303623
42466E653695j980675j687694k506535k865963j551309K16312P39486K35473K0100
42457c727110L41874L86354r5893n17152o30788o83571l99960P30597J865418
42448b730231J180048j292308k733611q70044K839206M839525L512763J64773
42440D910121l087159m647956l465673K8084L126300L100309M98415j544383j391395
$$ plain form
42501 1065683 1970695 3088005 2056817 -1555428 -4566137 -4648520 -3025269 -1146055 1581079
42492 1581079 4718457 5297122 2220301 -1095405 -1505283 -504811 -581185 -491727 1519539
42483 1519539 2618640 -979213 -6626930 -7401563 -1875465 3777948 4770491 3627869
42475 3627869 4609398 6748833 6450182 4120614 3632837 6139079 8466718 7957318 5653695
42466 5653695 3673020 1985326 -521209 -3387172 -4938481 -4722169 -3982683 -3747210 -3727110
42457 -3727110 -3385236 -2998882 -3094775 -3611927 -4242715 -4926286 -5326246 -4595649 -2730231
42448 -2730231 -1550183 -2842491 -5576102 -6446146 -3606940 1232585 4745348 4910121
42440 4910121 1822962 -2824994 -6290667 -6262583 -3136283 -35974 462441 -1081942 -2473337
42431b473337m08722j72285l16377M5104O04813O79584M20792K37071L1115k81456
42421a633698m20200l33148j70932M17000J629701K183469M94992k497172l802743
42412d132731k382826n40671k89009n38569N61627K451165L243896K531253J252872
42403B157007k6565r97761r61871m3414J43748j136839j970894n25444J592749
42394a769284J315843j168087k495922j032189R88719J072439N0522N48410K964001
42385D74452M537746K622484j786884m602018l251796j9556P86349j286951k293471
42376d819645R5901L062506L085735J080844J28657M32950K28660j22903P46518
42367C919223J286458q64361l470476k005932K266690K746700k152899n521752
$$ plain form
42431 -2473337 -2882059 -3054344 -3370721 -3325617 -2720804 -2041220 -1620428 -1383357 -1352242 -1633698
42421 -1633698 -2053898 -2387046 -2557978 -2140978 -511277 1672192 2167184 -329988 -4132731
42412 -4132731 -6515557 -7056228 -7345237 -7883806 -7322179 -4871014 -1627118 904135 2157007
42403 2157007 2130442 1132681 170810 127396 271144 -865695 -2836589 -3362033 -1769284
42394 -1769284 -453441 -1621528 -4117450 -5149639 -4160920 -3088481 -3037959 -2489549 474452
42385 474452 5012198 7634682 5847798 1245780 -2006016 -2025572 -1239223 -2526174 -4819645
42376 -4819645 -4723744 -1661238 1424497 2505341 2633998 3066948 3295608 3172705 3919223
42367 3919223 5205681 4341320 870844 -1135088 1131602 3878302 1725403 -3796349
42359c796349k388814K362384J871586j814994j663058K629137M621914J970774
42351C792580m41903O83479K077401L23886k538707l285325k648457k360859j095395
42342e493300K256568M524525K444523j307390j452771J773179L148782P90063
42334F684179j483915r86831j47930j479929l009236j916076N21636J177577R5039
42325e45486k30968Q41293J863458K440731L263027L369667P97771l555065n756878
42316B487550l725352J3748J833686J427807J070698J761591K119074R25199q79068
42307G034933j497687q98103r84368k701718m002681k355794J000469J877015
42299b527934q03339k671810j39019L682692L348728k34747q59069L044172N340303
$$ plain form
42359 -3796349 -6185163 -3822779 -1951193 -3766187 -5429245 -2800108 1821806 3792580
42351 3792580 3350677 4034156 6111557 6435443 3896736 611411 -2037046 -4397905 -5493300
42342 -5493300 -3236732 1287793 3732316 2424926 972155 2745334 5894116 6684179
42334 6684179 5200264 4213433 4065503 2585574 -423662 -2339738 -1818102 -640525 -545486
42325 -545486 -776454 64839 1928297 4369028 7632055 11001722 11799493 8244428 2487550
42316 2487550 -1237802 -1224054 609632 2037439 3108137 4869728 6988802 7914001 7034933
42307 7034933 5537246 4639143 3654775 953057 -3049624 -5405418 -4404949 -2527934
42299 -2527934 -3331273 -6003083 -6142102 -2459410 889318 654571 -204498 2839674 8179977
42290H179977J483704m239718m911813q12427J950681O17624j663756j966144
42282a361872j290175j194587q03291R19302K666779K571068Q22814r84678j897370
42273e52010j887398j172367j50960P67565J668962K575510K463498L84173k305895
42264A791078k796583n67755J641567J607807M70845L74835J001428M86618j278486
42255B731354k472523k158359j360416j162251j216963n99453Q00360K122155
42247c316096K288823R38254r28239j544038l26873J103378P53115j140682k388705
42238d561063j656722J83305J652939K281822K050921N80549j858995l350148
42230d677392k004947J322107L395404K200890p68579k419779j459471P76916
$$ plain form
42290 8179977 9663681 5423963 512150 -300277 1650404 2268028 604272 -1361872
42282 -1361872 -2652047 -3846634 -4649925 -3730623 -1063844 1507224 2330038 1345360 -552010
42273 -552010 -2439408 -3611775 -3762735 -2995170 -1326208 1249302 3712800 4096973 1791078
42264 1791078 -1005505 -1573260 68307 1676114 2146959 2521794 3523222 4009840 2731354
42255 2731354 258831 -1899528 -3259944 -4422195 -5639158 -6238611 -5438251 -3316096
42247 -3316096 -1027273 -89019 -1017258 -2561296 -2888169 -1784791 -1031676 -2172358 -4561063
42238 -4561063 -6217785 -6034480 -4381541 -2099719 -48798 531751 -1327244 -4677392
42230 -4677392 -6682339 -5360232 -1964828 236062 -532517 -2952296 -4411767 -3634851
42222c634851K153946J530018o65585k608676k277049L68014K725225K383217
42214b5741L16478m20992Q71164J623081J76884j514640j039455N96436O69931
42205A253146q56938j415012n9972J078718K19717j371569j300360P29465K847836
42196A125031L406728K352729N53547j278438k702349l055879j673508Q29064
42188d43075K151424O64366j884349k045806L05793J126417j910350n232137m070644
42179a1338361M89470K992520J350590r86113p60249J190021K703249L287277
42171a071596K851721P27110k212284l226690j344437J116086K108567K205477
42163A153954J995820N13943j764929k045471J3511N18062k195019l402812Q27953
$$ plain form
42222 -3634851 -1480905 49113 -616472 -3225148 -5502197 -5134183 -2408958 -25741
42214 -25741 290737 -130255 740909 2363990 2540874 1026234 -13221 583215 1253146
42205 1253146 396208 -1018804 -1078776 -58 219659 -1151910 -2452270 -1722805 1125031
42196 1125031 4531759 6884488 7438035 6159597 3457248 401369 -1272139 -443075
42188 -443075 1708349 2372715 488366 -1557440 -1251647 -125230 -2035580 -7267717 -11338361
42179 -11338361 -10848891 -7856371 -6505781 -7491894 -8252143 -7062122 -4358873 -1071596
42171 -1071596 1780125 2507235 294951 -2931739 -4276176 -3160090 -1051523 1153954
42163 1153954 3149774 3663717 1898788 -146683 -133172 384890 -1810129 -5212941 -4384988
42154d384988N967726M906592q85336l481019r99153Q1500l553681o202021k602328
42145a1152708L282678M319316N58736k288846j946356j160119j279531q068L519623
42136f155275N851465L627212j494236m457987k584221J644967L593363J581195
42128A606483j680717k877357k043382j286444p49262J201598L827908L768570
42120A767397L67286k223029p65194K111653J856286j277549l010507j256438
42112b430095J857409L520140K837322M41868j944861k298868q99468p54686k915393
42103b586632l634018L9636M193293K905938k281518m079558m19915L150806L045712
42094C33744K298366L128422K253420j988742m512799j367582K726661J488685
$$ plain form
42154 -4384988 1582738 6489330 5603994 2122975 1123822 1205322 -2348359 -8550380 -11152708
42145 -11152708 -7870030 -3550714 -2991978 -5280824 -7227180 -8387299 -9666830 -9674898 -6155275
42136 -6155275 -303810 3323402 1829166 -2628821 -5213042 -3568075 25288 1606483
42128 1606483 -74234 -2951591 -4994973 -6281417 -7030679 -5829081 -2001173 1767397
42120 1767397 2134683 -88346 -853540 1258113 3114399 1836850 -1173657 -2430095
42112 -2430095 -572686 2947454 5784776 6226644 4281783 1982915 1083447 328761 -2586632
42103 -2586632 -6220650 -6181014 -1987721 918217 -1363301 -5442859 -5862774 -2711968 333744
42094 333744 2632110 5760532 8013952 6025210 1512411 144829 2871490 4360175
42086D360175k678716l101821k08791q9829l318413l936644R7105L570144K752789
42077b554001K89333q85157j874573l219018k151923J913704M468843K375705
42069a637087j307471k683896k672127l262705k631433J093246M870967M763895
42061c466611K058596M89865J72381o11421m66269K345413M492590J553446l874843
42052B693147m895546q33732J878323J522k228563r99751J312322J280775m6442
42043a837945k70812M0556l09626j21853J475166K420828J121769m15007k7491
42034B075585Q33149J11129q36562j5361Q48703r15099l446499k353669K334415
42025a364209N641937M475904J135056r83316j757659k631601l110178j544117
$$ plain form
42086 4360175 1681459 -1420362 -1629153 -1718982 -5037395 -8974039 -8876934 -5306790 -2554001
42077 -2554001 -2264668 -3149825 -5024398 -8243416 -10395339 -8481635 -4012792 -1637087
42069 -1637087 -2944558 -5628454 -8300581 -11563286 -14194719 -13101473 -8230506 -3466611
42061 -3466611 -1408015 -918150 -745769 -1357190 -1823459 521954 5014544 6567990 2693147
42052 2693147 -2202399 -3036131 -1157808 -1156286 -3384849 -4384600 -3072278 -1791503 -1837945
42043 -1837945 -2108757 -2068201 -2377827 -2499680 -1024514 1396314 2518083 2103076 2075585
42034 2075585 2908734 3019863 2183301 2167940 3016643 2101544 -1344955 -3698624 -1364209
42025 -1364209 4277728 8753632 9888688 8905372 7147713 4516112 1405934 -138183
42017a38183J509963L019925J065571k547543m274403k986197q14920L00070R99649
42008c866068K186542K425178L26671j960908j246081J395719J904411j96828
42000I68636j155598L12491Q02393j425432l063542j660938Q2172l19476l51053
41991e810347K157130L492836j05968m753187l949285J159602L783362K174635
41983a851222O91158P85854q81309m330883m339284O72750M909363L980603J241822
41974H78852J143391J842913k92808l212835k265129J781231L623755J363799
41966D863169j463456j812773q70953r65486j823875j470587O29343K640556K465927
41957B191865L75885j090447m14203O78620j59577k033445k149585m97207J48179
$$ plain form
42017 -138183 1371780 4391705 5457276 2909733 -1364670 -4350867 -5165787 -4865717 -3866068
42008 -3866068 -1679526 745652 1072323 -888585 -2134666 -738947 1165464 968636
42000 968636 -186962 125529 927922 -497510 -3561052 -5221990 -5139818 -5459294 -5810347
41991 -5810347 -3653217 -160381 -266349 -5019536 -8968821 -7809219 -4025857 -1851222
41983 -1851222 -1160064 -374210 -1255519 -5586402 -9925686 -9252936 -4343573 -362970 878852
41974 878852 2022243 3865156 3572348 359513 -1905616 -124385 3499370 4863169
41966 4863169 3399713 1586940 715987 -249499 -2073374 -3543961 -2914618 -274062 2191865
41957 2191865 2567750 1477303 1063100 1741720 1582143 -451302 -2600887 -3098094 -2949915
41948b949915q98744j037770R61954K754809K383679R93578j87734k067876m648261
41939d696280n146976j956440K257467M059876L407437K086823P94935M4712Q82165
41930A733719K273553J213762j955123k443613J443835M325069J867571j825668
41922F633105j025499J633344l75888n822134p185713k817843J096572J276466
41914f587590J453403L750281M178425L85784l123498k102160P34847Q91639p19292
41905a138161o95637O20574Q46095M48063J054202J353029m97205k351897q80069
41896a241006K424915K906864q3667k279458j054398J160674J030859j236943
41888A627840k914481k216466K18691K137480J785661R1241m3624K118421L229320
$$ plain form
41948 -2949915 -3848659 -4886429 -3924475 -1169666 1214013 2207591 2019857 -48019 -4696280
41939 -4696280 -9843256 -11799696 -9542229 -5482353 -2074916 11907 806842 851554 1733719
41930 1733719 4007272 5221034 3265911 822298 2266133 6591202 8458773 6633105
41922 6633105 5607606 7240950 6865062 1042928 -6142785 -8960628 -7864056 -6587590
41914 -6587590 -5134187 -1383906 2794519 3180303 56805 -2045355 -1310508 -418869 -1138161
41905 -1138161 -1833798 -1213224 -367129 80934 1135136 2488165 1990960 -360937 -1241006
41896 -1241006 1183909 4090773 4007106 1727648 673250 1833924 2864783 1627840
41888 1627840 -1286641 -3503107 -3284416 -1146936 638725 729966 686342 2804763 6034083
41879F034083L66183l920890m343091j83060L623073L111045k65438k749459k785943
41870a113497r46132J857232L977284L080011q43357l932425k599045J523222
41862A003293L412667J259543j511495j461398K81951M70449j081933j438783
41854I34294P36765L003456K523802k31390k517098k857327j989911r51695N3188
41845a295916Q98869J153789Q50890N86224M67556j40700j435222k550479k605042
41836d070031j771106q31644p2899R44911K555499M028077L697034P36733l078119
41827B138455m567850k849367n74358k66621q60325J61313K440303L296587K015947
41818I34084N24771k53660j472229l077941k721091M83469L779133M246050K406472
$$ plain form
41879 6034083 6400266 2479376 -1863715 -2046775 1576298 4687343 4421905 1672446 -1113497
41870 -1113497 -2059629 -202397 3774887 6854898 6011541 2079116 -519929 1003293
41862 1003293 4415960 5675503 4164008 2702610 2984561 3455010 2373077 934294
41854 934294 1671059 4674515 7198317 6966927 4449829 1592502 -397409 -1349104 -1295916
41845 -1295916 -397047 756742 1607632 2193856 2661412 2520712 1085490 -1464989 -4070031
41836 -4070031 -5841137 -6672781 -6745680 -5800769 -3245270 782807 4479841 5216574 2138455
41827 2138455 -2429395 -5278762 -5853120 -6119741 -6980066 -6818753 -4378450 -1081863 934084
41818 934084 1458855 1205195 -267034 -3344975 -6066066 -5582597 -1803464 2442586 4849058
41809D849058O39474j06019l10438l39167n47524j382382k106293j255954N33222
41800b6023O06585j428891k480664r83848K62305q81824j647899P34100L111424
41791b734735Q86342l638003l745170J295339M761613K526175j397327j756792
41783c802558N80708J554999L69906p58908q57510p05111n33342M137N59213Q30880
41773b757586J472038K542106K393518p1606l220720m531118l604088j825406
41765i602862j27697J344364K301427K498330K121820J119327o81767k142538
41757c169596j422121R34668J859362L01919p14179J065949K938159J332989k057757
41748A069393k606621r8674J042421j014558k850109j721056J98524l0327j173276
$$ plain form
41809 4849058 5488532 5382513 5072075 4732908 4185384 2803002 696709 -559245 -26023
41800 -26023 580562 -848329 -3328993 -4312841 -4050536 -4932360 -6580259 -5846159 -2734735
41791 -2734735 -1848393 -5486396 -9231566 -7936227 -3174614 -648439 -2045766 -3802558
41783 -3802558 -3221850 -1666851 -1296945 -2055853 -2913363 -3618474 -4151816 -4147679 -3588466 -2757586
41773 -2757586 -1285548 1256558 3650076 3578470 357750 -4173368 -7777456 -9602862
41765 -9602862 -9730559 -8386195 -6084768 -3586438 -1464618 -345291 -1027058 -3169596
41757 -3169596 -4591717 -3657049 -1797687 -1495768 -2209947 -1143998 1794161 3127150 1069393
41748 1069393 -1537228 -1635902 -593481 -1608039 -4458148 -6179204 -5980680 -6011007 -7184283
41739g184283k92568K066700K661764O11684j419391j093782R32516K599784K871049
41730A753473J951269M08405j139213k119425k310378j802404p17882N37959R82645
41721b455551n3812j588325j497125J013565M027728M734922K424553q69082k543014
41712C193859j714033M84574K125649J862174j94086k520216l489266k876104
41704c127449j648919l20151J410299K990114K576679k93280k792969j755282
41696b960958J833191L608454J389603k237561l609311k158792J92985J843611
41688b098778K167451R95681p79211j270921O4211J263950O39235n84179l70951
41679B6488O45871K94920j338858k014770r83097J90362N83766J024711J710377
$$ plain form
41739 -7184283 -7476851 -5410151 -2748387 -2136703 -3556094 -4649876 -3717360 -1117576 1753473
41730 1753473 3704742 4113147 2973934 854509 -1455869 -3258273 -3976155 -3438196 -2455551
41721 -2455551 -2509363 -4097688 -5594813 -4581248 -553520 4181402 6605955 5736873 3193859
41712 3193859 1479826 1964400 4090049 5952223 5758137 3237921 -251345 -3127449
41704 -3127449 -4776368 -5096519 -3686220 -696106 1880573 1587293 -1205676 -2960958
41696 -2960958 -1127767 2480687 3870290 1632729 -1976582 -4135374 -3942389 -2098778
41688 -2098778 68673 1064354 285143 -985778 -921567 342383 981618 397439 26488
41679 26488 672359 967279 -371579 -2386349 -3369446 -3179084 -2595318 -1570607 139770
41670A39770J313798n17827j971815j617187l87689J55957L779p815K83904O55801
41660a949324J149270J508932J069619n3879q02104p57215o09492o58212m85048
41651a587453m88483j593370k750800j344115K536723M903868L028810n94416
41643B110764j926843q38007O9759J47047N83699Q41190p78749l209040l088200
41634f088380K23603L301656L250678R99970q62247j152924j35934J295393J649665
41625B481480M0762k058607k277320q00467R6031J24569J347168L696231L903231
41616F553078P35735k275074j978448k94589n21447j736427q76769J516358K008121
41607C130538j39292k193228k477114j826601n83060J860991M006042K818798
$$ plain form
41670 139770 1453568 935741 -1036074 -2653261 -3040950 -2884993 -2881214 -2889029 -2605125 -1949324
41660 -1949324 -800054 708878 1778497 1724618 922514 165299 -444193 -1102405 -1587453
41651 -1587453 -2075936 -3669306 -6420106 -7764221 -5227498 -323630 2705180 2110764
41643 2110764 183921 -654086 -584327 -437280 146419 987609 208860 -3000180 -6088380
41634 -6088380 -5864777 -2563121 687557 1687527 825280 -327644 -463578 831815 2481480
41625 2481480 2522242 463635 -1813685 -2614152 -2518121 -2393552 -1046384 2649847 6553078
41616 6553078 7288813 5013739 3035291 2740702 2219255 482828 -393941 1122417 3130538
41607 3130538 2991246 798018 -1679096 -3505697 -4088757 -2227766 1778276 4597074
41599D597074j290192l764199k103206N20311K60939j718021j699876N62381J912319
41590b722470R70821k51770o8515N42405K42958k47077M98838K051500K376004
41581C392694M00940k567853m178373l398653j263578O29819J741262K208397
41573c035345J634444k65412j966770j135732J869564L509422J654448j109252
41565A155367j052111J222594J968469L66634l62451J316977K264745k16596l279560
41556C384068k168251K530347N230194K921138j246242k974949k193179j416593
41548D066533j294167o99559M7147p81613l066291m272578k839798j44429J746866
41539g237889K480329K480796J362569r64544k719446j883419Q27516K454991
$$ plain form
41599 4597074 3306882 -457317 -2560523 -2040212 -1779273 -3497294 -5197170 -4634789 -2722470
41590 -2722470 -1751649 -2003419 -2071934 -1529529 -1286571 -1533648 -1034810 1016690 3392694
41581 3392694 3793634 1225781 -2952592 -6351245 -7614823 -6985004 -5243742 -3035345
41573 -3035345 -1400901 -1666313 -3633083 -4768815 -2899251 610171 2264619 1155367
41565 1155367 103256 1325850 3294319 3660953 3298502 4615479 6880224 6663628 3384068
41556 3384068 1215817 3746164 8976358 11897496 10651254 7676305 5483126 4066533
41548 4066533 2772366 2072807 2119954 1338341 -1727950 -6000528 -8840326 -8984755 -7237889
41539 -7237889 -4757560 -2276764 -914195 -1878739 -4598185 -6481604 -5654088 -3199097
41531c199097J495427m30746j112209n75902m28815j261890j922475j234534M64801
41522h205440J803832J987841J552945J447804J609447R78031p83142k183771
41514a792453j494846O34780J435695l82974k370096j163744K745250M952387
41506B563999K558087j971202l903974k110676L49901J060129Q27279Q17371K68519
41497D59433r11173j81062L559978O050693K484592m471917o816751k232154K518703
41488D60342J635071j634431j170137K231832L106170O32225q26293L75341J053390
41479E863510m83935j744580j081804l43014o94040m77199P08374L92425j814689
41470C25048k246012O92194K821852N45314l078864l210367p56831J80592l91777
$$ plain form
41531 -3199097 -1703670 -2134416 -3246625 -3822527 -4251342 -5513232 -7435707 -8670241 -8205440
41522 -8205440 -6401608 -4413767 -2860822 -1413018 196429 1174460 391318 -1792453
41514 -1792453 -3287299 -2652519 -1216824 -1599798 -3969894 -5133638 -2388388 2563999
41506 2563999 5122086 3150884 -753090 -2863766 -2513865 -1453736 -626457 190914 459433
41497 459433 -451740 -632802 2927176 8977869 11462461 6990544 173793 -2058361 460342
41488 460342 2095413 460982 -709155 1522677 4628847 5261072 4434779 4810120 5863510
41479 5863510 5379575 3634995 2553191 2210177 1516137 1038938 1747312 2139737 325048
41470 325048 -1920964 -1228770 1593082 2138396 -940468 -4150835 -4907666 -4727074 -5118851
41461e118851N04710K189020J164671j904734k303496R72838L293478J749524
41453E47160o92523n51436J081586J427561M36674l17444l68501K45791J763691
41444C572559K989457J491766k564455n462608m715903k048609K02996K335970
41436d198827M550849M617235J631827j128191r77123m20395k528151m663974
41428c116750k496056J833379K248886j213356k104265J721165M377843J787874
41420C038720j477941J22391L954918L734060l61678k677966j501526r06942l068595
41411H55441m725607l016438n1374Q79936J50111P4693Q99163J312819J245176
41402b376080J472771J532033N09197p00903k53149J619268K441649P34493k049671
$$ plain form
41461 -5118851 -4614141 -2425121 -1260450 -3165184 -5468680 -4495842 -1202364 547160
41453 547160 -145363 -696799 384787 1812348 2249022 1931578 1563077 1808868 3572559
41444 3572559 6562016 8053782 5489327 26719 -4689184 -6737793 -6534797 -4198827
41436 -4198827 352022 4969257 6601084 5472893 4495770 4075375 1547224 -3116750
41428 -3116750 -5612806 -3779427 -1530541 -2743897 -4848162 -3126997 1250846 3038720
41420 3038720 1560779 1683170 5638088 9372148 9010470 6332504 4830978 3924036 855441
41411 855441 -3870166 -6886604 -6937978 -6058042 -5907931 -5833238 -4934075 -3621256 -2376080
41402 -2376080 -903309 628724 1137921 437018 183869 1803137 4244786 4979279 2929608
41393B929608l349992k304018k66020R02557O74834J09868L15518R34623Q26799
41384G73777P8488j3741O82245M76797j356366k771232j604803J199166K914808
41375C79139K615204J489492N27554K6141M65608J460625Q27577k388037m923357
41366D79946l047766J242368K304472n85756j959394R87455L750732J939025j646677
41357C464405j961264J81118M60641j163626j004985J320752K312870Q47749m31741
41348D025919m31084j102734k604913k041748J082517K747607L79511k869878
41340h14803k846035m50193K81281j759997l636643k422286J692096N733774O338852
41331B116046K918828r41397r84888K207115L545721L02617m037409m571946j232882
$$ plain form
41393 2929608 -420384 -2724402 -2990422 -2087865 -1413031 -1303163 -987645 -53022 773777
41384 773777 852265 838524 1520769 1997566 641200 -2130032 -3734835 -2535669 379139
41375 379139 2994343 4483835 5011389 5037530 5503138 6963763 7791340 5403303 479946
41366 479946 -2567820 -1325452 979020 393264 -1566130 -578675 3172057 5111082 3464405
41357 3464405 1503141 1684259 2144900 981274 -23711 1297041 3609911 4457660 4025919
41348 4025919 3594835 2492101 -112812 -2154560 -1072043 1675564 2055075 -814803
41340 -814803 -3660838 -4111031 -3829750 -5589747 -9226390 -11648676 -9956580 -4222806 2116046
41331 2116046 5034874 4093477 3108589 5315704 8861425 9164042 5126633 554687 -678195
41322f78195J998364K302196J92931k150457k685225p02575K125462K925800J077478
41313D405779q51180p03014M39495K83796j586003l898941n122221l703177O93650
41304a0041816N038518N018102R00051k016839q62945Q45483k78993j436430J138787
41295a696082M598220L321586j774250m357093k411291l65398j042003j715933
41287e442244J05460K393801K595297J627821J257967R20610l21221j425149j259187
41278D53155n97750m45271m59847m01100r12335j688532j281312J42841M56547
41269d733604q25108j383338O2090J613931J564263J081029J626440K361710K158571
41260C525984J678404J443175M32939j309368j496232N34381J682237k09618k329994
$$ plain form
41322 -678195 1320169 3622365 3815296 1664839 -1020386 -1722961 402501 3328301 4405779
41313 4405779 3554599 2851585 3291080 3574876 1988873 -1910068 -7032289 -10735466 -10041816
41304 -10041816 -5003298 14804 914855 -1101984 -1964929 -1119446 -1398439 -2834869 -1696082
41295 -1696082 2902138 6223724 4449474 92381 -2318910 -2684308 -3726311 -5442244
41287 -5442244 -5336784 -2942983 -347686 1280135 2538102 3458712 3137491 1712342 453155
41278 453155 -144595 -589866 -1049713 -1450813 -2363148 -4051680 -5332992 -5190151 -4733604
41269 -4733604 -5558712 -6942050 -6879960 -5266029 -3701766 -2620737 -994297 1367413 3525984
41260 3525984 5204388 6647563 7080502 5771134 4274902 4809283 6491520 6281902 3951908
41251C951908j171100J636736J954303k05756j237694k06059J64941j233519k081842
41242A571918r38748M58772M74525m6019n7444j52378o25922l06420R28702Q29552
41232B136538j828320m335140l137739J051289L771230K419967p89175k084620
41224b795970o71279J226219J884295J887888K222421K199591O54926j535482
41216E072609j965465K3605K166653K150806L92861j078083j435222j424860j605625
41207B297279j656916j285118o76006L604P42438J308137J372821J011770O09567
41198C727576L37878O4025l67051j002377j735806k259877k280438j745899o67112
41189e929081Q43884J906077J144861j252629k744180j490762O14214L93620j658762
$$ plain form
41251 3951908 2780808 4417544 6371847 6166091 4928397 4722338 4887279 3653760 1571918
41242 1571918 633170 1091942 1566467 1520448 1463004 1310626 684704 378284 1306986 2136538
41232 2136538 308218 -4026922 -7164661 -6113372 -2342142 77825 -711350 -2795970
41224 -2795970 -3467249 -2241030 -356735 1531153 3753574 5953165 6608091 5072609
41216 5072609 3107144 3130749 5297402 7448208 7841069 6762986 5327764 3902904 2297279
41207 2297279 640363 -644755 -1320761 -1317157 -574719 733418 2106239 3118009 3727576
41198 3727576 4065454 4129479 3762428 2760051 1024245 -1235632 -3516070 -5261969 -5929081
41189 -5929081 -5085197 -3179120 -2034259 -3286888 -6031068 -7521830 -6907616 -6513996 -8172758
41180h172758j967070M62161K509914K068106J083602J674731K596379K033869
41172B288934R03984N06934l75886k749419m173927k046234J604703K473579M6270
41163a521062k289525k344853r00217Q45428K164413J801402n11122k155882o49820
41154e561238K162813K565997Q18222L62395J674894J615196q01683k746798k652467
41145b562669k409630l063964k619459n6034K268429K334081J314841Q50806N59179
41136c384420n8384k83848j95209q17899j189002Q71177L909095L497677m27757
41127A921430k262571L92626K306989o83972m206153k477159J774660J713115
41119a521035k392736m070909j276589J459251J343273O72405J074876R10146
$$ plain form
41180 -8172758 -10139828 -9677667 -7167753 -5099647 -4016045 -2341314 255065 2288934
41172 2288934 3192918 3699852 3323966 574547 -3599380 -5645614 -4040911 -1567332 -1521062
41163 -1521062 -3810587 -6155440 -7055657 -6210229 -4045816 -2244414 -2755536 -4911418 -5561238
41154 -5561238 -3398425 -832428 -14206 348189 2023083 3638279 2836596 89798 -2562669
41145 -2562669 -4972299 -8036263 -10655722 -10711756 -8443327 -6109246 -4794405 -3943599 -3384420
41136 -3384420 -3442804 -3726652 -3921861 -4739760 -5928762 -5057585 -1148490 2349187 1921430
41127 1921430 -341141 51485 2358474 1674502 -2531651 -5008810 -3234150 -1521035
41119 -1521035 -3913771 -7984680 -9261269 -7802018 -6458745 -5786340 -4711464 -3801318
41111c801318j26898K70795J900210J258411j946203k956508N06238L954055K904678
41102A963460n20222j821682j119312j294523k050931q76165J681177K515401
41094a522797J165499K71771Q34825Q76217n41866j367598k971J803319J285544
41085B801943j428201l280564j844268J882034M349411L101194n69872l099379
41077A912298k716895r66144N2207L17702P67119J123333N50510n05059q63978
41068c28907l90205K55829R01838J365427N99051j680203l228220j529358K352217
41059a682531M526257L096723Q2689j760046j829486r16701J64036L95076q46877
41050A229140k162356j305517J179462K175785J014153Q83870L006527L243358
$$ plain form
41111 -3801318 -3928216 -3657421 -1757211 -498800 -2445003 -5401511 -4895273 -941218 1963460
41102 1963460 1443238 -378444 -1497756 -2792279 -4843210 -5719375 -4038198 -1522797
41094 -1522797 -357298 -85527 749298 1625515 1083649 -283949 -286920 1516399 2801943
41085 2801943 1373742 -1906822 -3751090 -1869056 2480355 5581549 5011677 1912298
41077 1912298 -804597 -1770741 -1718534 -1400832 -633713 489620 1040130 535071 -328907
41068 -328907 -719112 -463283 438555 1803982 2403033 722830 -2505390 -4034748 -1682531
41059 -1682531 2843726 5940449 6023138 4263092 2433606 1516905 1680941 2076017 1229140
41050 1229140 -933216 -2238733 -1059271 1116514 2130667 3014537 6021064 9264422
41042I264422j421332o263474m592085J437000K827774k763066o865258k687258
41034a1063277M789231O535745K327167r45181p85429j157829l639040m210299
41026h148912p17455K828352K495804J08589o64910J28611N79196Q40330J484921
41017a065474R79601j248929j963685J291616N056154M246599j12018k637922
41009D545942j939226j491445k392562j433624K268640M466504K169760j849500
41001D344489l805069m017964m148028l170086J84K844363K385643J9010o64445
40992f211903O41086J348337O82865L61197J211385K333176L141363L434789K169704
40983I111999r72967l656496l552692j993925j652661j696846N58350L794001
$$ plain form
41042 9264422 7843090 1579616 -3012469 -1575469 1252305 -1510761 -8376019 -11063277
41034 -11063277 -6274046 261699 2588866 1643685 858256 -299573 -3938613 -8148912
41026 -8148912 -8866367 -6038015 -3542211 -3433622 -4098532 -3969921 -3390725 -2550395 -1065474
41017 -1065474 -85873 -1334802 -3298487 -2006871 3049283 7295882 7183864 4545942
41009 4545942 2606716 1115271 -1277291 -2710915 -442275 4024229 6193989 4344489
41001 4344489 539420 -3478544 -7626572 -10796658 -10796474 -7952111 -5566468 -5547458 -6211903
40992 -6211903 -5570817 -4222480 -3539615 -3178418 -1967033 366143 3507506 6942295 9111999
40983 9111999 8139032 4482536 929844 -1064081 -2716742 -4413588 -3855238 -61237
40975f1237L528414n09663k915718m80475K947000K378095j101849k580093m47239
40966G57235K250620K430808P4180k726891l754209k209588K82069R93601n04571
40957b406746j553437k05456J855686J928818L42236k48681J258219L195412L394870
40948G560921J300335j763530l555038k861737r96368k03545m49834J05066J169980
40939C06250J07031l025511l951505l44049L900340M060306J293736j42787K81882
40930B485693J42824m63583L19083J209763m83462k863723j440440K656686L126934
40921D689775j436283m653829k262329J432461J003873j699971j646230J102662
40913c469871K635164J826001N42290o84064k303699k692898j87498K968844L199524
$$ plain form
40975 -61237 3467177 2957514 41796 -438679 2508321 4886416 3784567 1204474 757235
40966 757235 3007855 5438663 5512843 2785952 -968257 -3177845 -2895776 -1902175 -2406746
40957 -2406746 -3960183 -4165639 -2309953 -381135 -38899 -287580 970639 4166051 7560921
40948 7560921 8861256 7097726 3542688 680951 -315417 -518962 -968796 -863730 306250
40939 306250 413281 -2612230 -6563735 -6907784 -3007444 1052862 2346598 2203811 2485693
40930 2485693 2628517 2164934 2484017 3693780 3210318 346595 -1093845 1562841 4689775
40921 4689775 3253492 -1400337 -3662666 -2230205 -1226332 -2926303 -4572533 -3469871
40913 -3469871 -834707 991294 1533584 849520 -1454179 -4147077 -4334575 -1365731 1833793
40904A833793J215051O23175J634731R34172k075563l635140j418587J890406
40896A002038K505713K95848j890441j802953K90633J982978Q68983k502100m517642
40887c766943k904058J20405J305646J103440J620850J745379r14819m122785
40879e812885k682153L336910P460754N554524P72860k282953l385766l802912
40871h41621k488006P47569K259049l73310l227811j195105L677561M525040k85023
40862B798343m847411m191467l55272J751280Q58326o59588p89280N85031K722047
40853b127991M429953M156791J493944j619941k634757j425016m04567j245159
40845F23257k620052k200427j20897J195905O92651J88687J281623K648191K296305
$$ plain form
40904 1833793 3048844 3672019 5306750 6240922 4165359 530219 -888368 1002038
40896 1002038 3507751 3803599 1913158 110205 400838 2383816 3252799 750699 -3766943
40887 -3766943 -6671001 -6550596 -5244950 -4141510 -2520660 -775281 -1690100 -5812885
40879 -5812885 -8495038 -5158128 2302626 7857150 8630010 6347057 2961291 -841621
40871 -841621 -3329627 -2582058 -323009 -696319 -3924130 -5119235 -1441674 3083366 2798343
40862 2798343 -2049068 -6240535 -6595807 -4844527 -3986201 -4645789 -5435069 -4850038 -2127991
40853 -2127991 2301962 6458753 7952697 6332756 3697999 2272983 1868416 623257
40845 623257 -1996795 -4197222 -4318119 -3122214 -2429563 -2240876 -959253 1688938 3985243
40836C985243R83506Q30813J500618Q19967j099140j737893n84766k22427j854276
40827B621645l027881j618382P75058J542197P38803j39703q32371j472293j151455
40818b564382K71951Q62857m39043j472945q1986K221304K703828J689490J161262
40809D352336P93212r09235k790979k434424o65428n14504j904128j668949P78461
40800d963638K213095J152657L74627J861600L016777Q41040k865359l810788
40792b179989j239798J398070J246657j004199k967989l332436k260857m40060
40784a0780601J335782K186712J703622O93530O82069J963811K635374Q30030
40776A250329k211068l060226n86111K368358K728498P05293j561334k682032
$$ plain form
40836 3985243 4968749 5799562 7300180 8120147 7021007 5283114 4698348 4475921 2621645
40827 2621645 -406236 -2024618 -1249560 292637 1031440 891737 59366 -1412927 -2564382
40818 -2564382 -2292431 -1429574 -1868617 -3341562 -3423548 -1202244 1501584 3191074 4352336
40809 4352336 5145548 4236313 1445334 -989090 -1654518 -2169022 -4073150 -5742099 -4963638
40800 -4963638 -2750543 -1597886 -1223259 638341 3655118 4496158 1630799 -2179989
40792 -2179989 -3419787 -2021717 -775060 -1779259 -4747248 -8079684 -10340541 -10780601
40784 -10780601 -9444819 -7258107 -5554485 -4860955 -4178886 -2215075 420299 1250329
40776 1250329 -960739 -4020965 -4607076 -2238718 489780 1195073 -366261 -3048293
40768c048293j873244J211385M308630L156430k469104o150536k632913M037678
40760c459967N529455R79108k463390p27084K214385K020449K44264j77978l08232
40751C851010k019081l531235k458648l06464J79761k70714O05204J967072J292812
40742f90283r24761j901883j222365j028472j816019j519834Q26288L325862L782922
40733a168545K070262m21077k104666j891806m4453J613181J490647L2279j205385
40724a629563j587675j363145m63030J177145K716544L195648K665505J493650
40716F205079m19599k466927k741201m93175J906914J618905p83712k253802j554521
40707i82039l03588L6945j84480m66380j264133k596371l157681j884184M90482
$$ plain form
40768 -3048293 -4921537 -3710152 598478 3754908 1285804 -4864732 -7497645 -3459967
40760 -3459967 2069488 3048596 585206 -141878 2072507 4092956 4337220 4159242 3851010
40751 3851010 1831929 -1699306 -4157954 -4464418 -4284657 -4555371 -3950167 -1983095 -690283
40742 -690283 -1615044 -3516927 -4739292 -5767764 -7583783 -9103617 -8277329 -4951467 -1168545
40733 -1168545 901717 480640 -1624026 -3515832 -3560285 -1947104 -456457 -424178 -1629563
40724 -1629563 -3217238 -4580383 -5043413 -3866268 -1149724 2045924 4711429 6205079
40716 6205079 5785480 3318553 577352 84177 1991091 3609996 2826284 572482 -982039
40707 -982039 -1285627 -1248682 -1433162 -1899542 -3163675 -5760046 -8917727 -10801911 -10311429
40698a0311429K273817K752595K731148L238622L992007L531490J273498j105485
40690H376263j543767o15736q12338k476029k830562l49200K258483J686183j054874
40681B638423k152935n38710J023438L72668j213289j434310k49417N27285m9097
40672a075944q77854l27056J544888K693661J378126j552070l504627l157582
40664d878458j494877P1773J015008R37088n32238k350240k422443l21149J962249
40655h013287K734611K279595J213965n33680k173823j987128l0231J536574J852497
40646c120907K141246K123087l19993m044689l991698J048744M721020J823346
40638C80156l407655l513782R72010L204533Q65226j732665j642792n48524K20475
$$ plain form
40698 -10311429 -8037612 -5285017 -2553869 684753 4676760 8208250 9481748 8376263
40690 8376263 6832496 6216760 5404422 2928393 97831 -251369 2007114 3693297 2638423
40681 2638423 485488 -53222 970216 1342884 129595 -1304715 -1554132 -1026847 -1075944
40672 -1075944 -1953798 -2280854 -735966 1957695 3335821 1783751 -1720876 -4878458
40664 -4878458 -6373335 -6301562 -5286554 -4349466 -4881704 -7231944 -9654387 -9975536 -8013287
40655 -8013287 -5278676 -2999081 -1785116 -2318796 -4492619 -6479747 -6509978 -4973404 -3120907
40646 -3120907 -979661 1143426 823433 -3221256 -7212954 -6164210 -1443190 380156
40638 380156 -3027499 -6541281 -5569271 -2364738 -1499512 -3232177 -4874969 -5423493 -5203018
40629e203018J597007K922908K037505J05233O11607K630073J297980l442252
40621B557043n170068q63182L725395K485632k420200m768793k960505N1234K224767
40612e138677L307050K625788J29571j971636j809007m90869K88635R41933J760078
40603c57134Q97416k154924l888969j511681J959417J724234j360708k153076
40595f845425P16125L073821J974299k77383n48777K85629l70043j906567j196929
40586e095250K012934L479997N1948m900763m869525Q77227N518804L796327p88923
40577H2776j661434J066536K019998o3497j037662O29213J393938m36049j885223
40568A08596j556966k158978l948966k466499L173558O406271K869871k185141
$$ plain form
40629 -5203018 -3606011 -683103 1354402 1459635 2071242 4701315 5999295 2557043
40621 2557043 -2613025 -3476207 249188 2734820 314620 -4454173 -7414678 -7363444 -5138677
40612 -5138677 -1831627 794161 923732 -1047904 -2856911 -3347780 -3059145 -2117212 -357134
40603 -357134 540282 -1614642 -5503611 -7015292 -5055875 -3331641 -4692349 -6845425
40595 -6845425 -6129300 -3055479 -1081180 -1358563 -1907340 -1621711 -1991754 -3898321 -5095250
40586 -5095250 -3082316 397681 449629 -4451134 -9320659 -8443432 -2924628 871699 82776
40577 82776 -1578658 -512122 1507876 1444379 406717 1035930 2429868 1993819 108596
40568 108596 -1448370 -3607348 -7556314 -10022813 -6849255 -442984 2426887 241746
40560B41746k203406O92337J071133K61410K601179N627577L440821k310957m252216
40551E169624j287202M05599j408171j981225P20144K091306m43939k691450j399695
40542h25009R4596j679296l951801k579086J145698L153888K672834J558577M38709
40533B9110p52856p93200R40777K547381K202380P19600n46801j908986l367831
40524i30426l180058q49181J042384N68317l89236O53226K712358L244621K146374
40515E018379J123763P26617M93483N09222N99207l66030k227217k473198K07933
40506C612159L105542K781432l02224k894696l233629j758698Q94410L728553
40498E932849M335894J154986l463856n095893k398432J454454K701106R06832
$$ plain form
40560 241746 -1961660 -1269323 -198190 63220 2664399 8291976 11732797 9421840 5169624
40551 5169624 3882422 4288021 2879850 898625 1618769 3710075 3266136 574686 -825009
40542 -825009 -730413 -2409709 -6361510 -8940596 -7794898 -4641010 -1968176 -409599 29110
40533 29110 -723746 -1516946 -576169 1971212 4173592 4893192 4346391 2437405 -930426
40524 -930426 -4110484 -4959665 -3917281 -3348964 -3738200 -3084974 -372616 2872005 5018379
40515 5018379 6142142 6868759 7362242 7871464 8470671 8104641 5877424 3404226 3612159
40506 3612159 6717701 9499133 9196909 6302213 3068584 1309886 2204296 5932849
40498 5932849 10268743 11423729 7959873 2863980 465548 1920002 4621108 5527940
40490E527940j299079j457300Q0476P46647p67274k413244j590513P49991J332363
40481I10007l68927j475621n27403N91870N35461N25651J006795K96069j346639
$$ plain form
40490 5527940 4228861 2771561 2852037 3598684 2831410 418166 -1172347 -422356 910007
40481 910007 541080 -934541 -1461944 -870074 -334613 191038 1197833 1493902 147263
$$ [...]
##END NTUPLES=NMR SPECTRUM
##END=
